##TITLE=31Pdec_DE-23_1h30m_rm
 
  24 sc
 1.11.2023
##JCAMPDX= 6.0         $$ Bruker NMR JCAMP-DX V2.0
##DATA TYPE= NMR SPECTRUM
##DATA CLASS= NTUPLES
##ORIGIN= UXNMR, Bruker Analytische Messtechnik GmbH
##OWNER= root
$$ XWIN-NMR		Version 3.5
$$ Wed Nov  1 16:29:06 2023 Russian Standard Time (UT+4h)  she@DPX200
##.OBSERVE FREQUENCY= 81.013821
##.OBSERVE NUCLEUS= ^31P
##.ACQUISITION MODE= SIMULTANEOUS
##.ACQUISITION SCHEME= undefined
##.AVERAGES= 24
##.DIGITISER RES= 16
##SPECTROMETER/DATA SYSTEM= spect
##.PULSE SEQUENCE= zgpg30
##.SOLVENT NAME= CDCl3
##.SHIFT REFERENCE= (INTERNAL, CDCl3, 0, 248.564)
##AUDIT TRAIL= $$ (NUMBER, WHEN, WHO, WHERE, WHAT)
$$ ##TITLE= Audit trail, XWIN-NMR		Version 3.5
$$ ##JCAMPDX= 5.01
$$ ##ORIGIN= Bruker BioSpin GmbH
$$ ##OWNER= she
$$ F:/spectra/data/she/nmr/P31/1/pdata/1/auditp.txt
$$ ##AUDIT TRAIL=  $$ (NUMBER, WHEN, WHO, WHERE, WHAT)
(   1,<2023-11-01 16:27:42.78 +0400>,<she>,<DPX200>,
      <created by zg, POWCHK disabled, PULCHK disabled
       configuration hash MD5:
       00 E9 B6 7A A2 85 ED C7 34 08 36 98 17 FE 4E 26
       data hash MD5: 32K
       05 A2 1A 18 EF 32 DB D6 FF A9 94 37 04 A3 3A 12>)
(   2,<2023-11-01 16:27:45.25 +0400>,<she>,<DPX200>,
      <Start of raw data processing
       efp BC_mod = 2 LB = 5 FT_mod = 6 PKNL = 1 PHC0 = -10706.26 PHC1 = 166.8902 SI = 64K 
       data hash MD5: 64K
       57 A0 74 04 05 5D 74 C8 AB 1F 6C E5 18 2D 75 DC>)
(   3,<2023-11-01 16:28:11.06 +0400>,<she>,<DPX200>,
      <pk PHC0 = 47.31622 PHC1 = -104.4 
       data hash MD5: 64K
       B9 7D 26 BD 88 F3 D7 F3 62 82 6E 7F BA 49 5A D8>)
(   4,<2023-11-01 16:28:15.46 +0400>,<she>,<DPX200>,
      <abs ABSG = 5 
       data hash MD5: 64K
       72 46 C5 D5 A5 4D 9D 8C 15 8D 51 7A D9 C7 2C 18>)
$$ ##END=
$$ 
$$ hash MD5
$$ D0 81 C4 AF 3C 6D B6 14 67 EA 6D 1D 76 C5 87 7C
##$RELAX= 
##$RELAX= 
##$RELAX= 
##$RELAX= 
##$RELAX= 
##$RELAX= 
##$RELAX= 
##$RELAX= 
##$RELAX= 
$$ Bruker specific parameters
$$ --------------------------
##$DU= <F:/spectra>
##$EXPNO= 1
##$NAME= <P31>
##$PROCNO= 1
##$TYPE= <nmr>
##$USER= <she>
##$AMP= (0..31)
100 100 100 100 100 100 100 100 100 100 100 100 100 100 100 100 100 100 
100 100 100 100 100 100 100 100 100 100 100 100 100 100 
##$AQSEQ= 0
##$AQ_mod= 1
##$AUNM= <au_zg>
##$AUTOPOS= <>
##$BF1= 81.014009
##$BF2= 200.13
##$BF3= 200.13
##$BF4= 200.13
##$BF5= 200.13
##$BF6= 200.13
##$BF7= 200.13
##$BF8= 200.13
##$BYTORDA= 1
##$CFDGTYP= 0
##$CFRGTYP= 5
##$CHEMSTR= <none>
##$CNST= (0..31)
1 1 145 1 1 1 1 1 1 1 1 1 1 1 1 1 1 1 1 1 1 1 1 1 1 1 1 1 1 1 1 1 
##$CPDPRG= <waltz16>
##$CPDPRG1= <>
##$CPDPRG2= <waltz16>
##$CPDPRG3= <>
##$CPDPRG4= <mlev>
##$CPDPRG5= <mlev>
##$CPDPRG6= <mlev>
##$CPDPRG7= <mlev>
##$CPDPRG8= <mlev>
##$CPDPRGB= <>
##$CPDPRGT= <>
##$D= (0..31)
0 1 0 0 0 0 0 0 0 0 0 0.03 2e-05 3e-06 0 0 0 0 0 0 0 0 0 0 0 0 0 0 0 0 
0 0 
##$DATE= 1698841662
##$DBL= (0..7)
120 120 120 11 120 120 24 19 
##$DBP= (0..7)
150 150 150 150 150 150 150 150 
##$DBP07= 0
##$DBPNAM0= <>
##$DBPNAM1= <>
$$ [...]
##$SUBNAM3= <"">
##$SUBNAM4= <"">
##$SUBNAM5= <"">
##$SUBNAM6= <"">
##$SUBNAM7= <"">
##$SUBNAM8= <"">
##$SUBNAM9= <"">
##$SW= 501.771253377433
##$SWIBOX= (0..15)
0 1 3 0 0 0 0 0 0 0 0 0 0 0 0 0 
##$SW_h= 40650.406504065
##$TD= 32768
##$TD0= 1
##$TE= 0
##$TE2= 300
##$TE3= 300
##$TEG= 300
##$TL= (0..7)
0 120 53 12 22 120 120 120 
##$TP= (0..7)
150 150 150 150 150 150 150 150 
##$TP07= 0
##$TPNAME0= <>
##$TPNAME1= <>
##$TPNAME2= <>
##$TPNAME3= <>
##$TPNAME4= <>
##$TPNAME5= <>
##$TPNAME6= <>
##$TPNAME7= <>
##$TPOAL= (0..7)
0.5 0.5 0.5 0.5 0.5 0.5 0.5 0.5 
##$TPOFFS= (0..7)
0 0 0 0 0 0 0 0 
##$TUNHIN= 0
##$TUNHOUT= 0
##$TUNXOUT= 0
##$USERA1= <user>
##$USERA2= <user>
##$USERA3= <user>
##$USERA4= <user>
##$USERA5= <user>
##$V9= 5
##$VALIST= <valist>
##$VCLIST= <CCCCCCCCCCCCCCC>
##$VD= 0
##$VDLIST= <DDDDDDDDDDDDDDD>
##$VPLIST= <PPPPPPPPPPPPPPP>
##$VTLIST= <TTTTTTTTTTTTTTT>
##$WBST= 1024
##$WBSW= 4
##$XGAIN= (0..3)
0 0 0 0 
##$XL= 0
##$YL= 0
##$YMAX_a= 13819
##$YMIN_a= -11122
##$ZGOPTNS= <>
##$ZL1= 120
##$ZL2= 120
##$ZL3= 120
##$ZL4= 120
##$ABSF1= 248.5645
##$ABSF2= -253.2056
##$ABSG= 5
##$ABSL= 3
##$ALPHA= 0
##$AQORDER= 0
##$ASSFAC= 0
##$ASSFACI= 0
##$ASSFACX= 0
##$ASSWID= 0
##$AUNMP= <proc_1d>
##$AZFE= 0.1
##$AZFW= 0.5
##$BCFW= 0
##$BC_mod= 2
##$BYTORDP= 0
##$COROFFS= 0
##$CY= -3
##$DATMOD= 1
##$DC= 0
##$DFILT= <>
##$DTYPP= 0
##$F1P= 0
##$F2P= 0
##$FCOR= 1
##$FTSIZE= 65536
##$FT_mod= 6
##$GAMMA= 0
##$GB= 0
##$INTBC= 1
##$INTSCL= 6.047779e-11
##$ISEN= 30
##$LB= 5
##$LEV0= 0
##$LPBIN= 0
##$MAXI= 10000
##$MC2= 0
##$MEAN= 0
##$ME_mod= 0
##$MI= 50
##$NCOEF= 0
##$NC_proc= -7
##$NLEV= 6
##$NOISF1= 182.463
##$NOISF2= 159.3651
##$NSP= 0
##$NTH_PI= 0
##$NZP= 0
##$OFFSET= 248.5645
##$PC= 4
##$PHC0= -10658.94
##$PHC1= 62.4902
##$PH_mod= 1
##$PKNL= yes
##$PPARMOD= 0
##$PSCAL= 0
##$PSIGN= 0
##$REVERSE= no
##$SF= 81.0140089999694
##$SI= 65536
##$SIGF1= 159.3651
##$SIGF2= -187.1042
##$SINO= 113.3802
##$SIOLD= 16384
##$SREGLST= <1H.CDCl3>
##$SSB= 0
##$STSI= 65536
##$STSR= 0
##$SW_p= 40650.406504065
##$SYMM= 0
##$S_DEV= 0
##$TDeff= 32768
##$TDoff= 0
##$TI= <>
##$TILT= no
##$TM1= 0
##$TM2= 0
##$TOPLEV= 0
##$USERP1= <user>
##$USERP2= <user>
##$USERP3= <user>
##$USERP4= <user>
##$USERP5= <user>
##$WDW= 1
##$XDIM= 65536
##$YMAX_p= 290710982
##$YMIN_p= -21476464
$$ End of Bruker specific parameters
$$ ---------------------------------
##NTUPLES= NMR SPECTRUM
##VAR_NAME=  FREQUENCY,     SPECTRUM/REAL,   SPECTRUM/IMAG
##SYMBOL=    X,             R,               I
##VAR_TYPE=  INDEPENDENT,   DEPENDENT,       DEPENDENT
##VAR_FORM=  AFFN,          ASDF,            ASDF
##VAR_DIM=   65536,         65536,           65536
##UNITS=     HZ,            ARBITRARY UNITS, ARBITRARY UNITS
##FACTOR=    0.620285442955139, 1,           1
##FIRST=     20137.2065510682, 0,            0
##LAST=      -20513.1999529968, 0,           0
##MIN=       -20513.1999529968, -21476464,   0
##MAX=       20137.2065510682, 290710982,    0
$$ Real data points
##PAGE= N=1
##DATA TABLE= (X++(R..R)), XYDATA
$$ [...]
38741A8083760J175023J115285J069179J058022J082962J116829J105022J004504
38733B6810586Q27903O31134M53869K92227J37029J2371n0815o8450r5694j54853
38723B8795307j97218j61257n5627M8078J08915J69254K89720M52782N69792N84656
38713C0604402N33133M81052M35234L51547K16952P7942k4082j09656k26867l81608
38703C1958049n35250o62994p75673q73037r11027q49333p21027o20372o09101
38694B5400235o50146o44822n27595l19654j03277M2426Q8801O2449J2527l2146
38684B3328798p8622j44490k25425k99306l60679m34340n43854o74263p77906
38675A9789913q16092p86949p15767o33793n73507n68085o29079p16906p52697
$$ y = [18083760, 19258783, 20374068, 21443247, 22501269, 23584231, 24701060, 25806082, 26810586, 27638489, 28269623, 28723492, 29015719, 29152748, 29165119, 29114304, 29045854, 28950160, 28795307, 28598089, 28436832, 28381205, 28429283, 28538198, 28707452, 28997172, 29449954, 30019746, 30604402, 31137535, 31618587, 32053821, 32405368, 32622320, 32700262, 32676180, 32566524, 32339657, 31958049, 31422799, 30759805, 29984132, 29111095, 28200068, 27350735, 26629708, 26009336, 25400235, 24750089, 24105267, 23577672, 23258018, 23154741, 23197167, 23285968, 23348417, 23360944, 23328798, 23250176, 23105686, 22880261, 22580955, 22220276, 21785936, 21242082, 20567819, 19789913, 18973821, 18186872, 17471105, 16837312, 16263805, 15695720, 15066641, 14349735, 13597038]
38666A3597038o82118n27708l63214k35484j29254j3476J01961J76255J89326
38657A2113326J58315J11652P7183R2462J85558L28680M46816N03797N55008O75170
38647A5247967Q47887R74918R99149R71228R71539J002609R94075Q94752P23884
38638B3628008N38329L81179K62337J60276L7731j17312k55568k94449j97875
38629B4142656j4102J75060L23325M28416N03074N70580O69461Q14758R47345
38620B8560573R60903Q02375N25947K30349l8543l04019n97384r10773j205813
38611B8023615j440765j583560j619948j562391j442768j289627j118368r44673
38603A7021515p95189o95547o51558o47034o57658o65883o67252o65084o58072
$$ y = [13597038, 12914920, 12387212, 12023998, 11788514, 11659260, 11645784, 11747745, 11924000, 12113326, 12271641, 12383293, 12460476, 12552938, 12738496, 13067176, 13513992, 14017789, 14572797, 15247967, 16095854, 17070772, 18069921, 19041149, 20012688, 21015297, 22009372, 22904124, 23628008, 24166337, 24547516, 24809853, 24970129, 25007860, 24890548, 24634980, 24340531, 24142656, 24128554, 24303614, 24626939, 25055355, 25558429, 26129009, 26798470, 27613228, 28560573, 29521476, 30323851, 30849798, 31080147, 31041604, 30737585, 30140201, 29229428, 28023615, 26582850, 24999290, 23379342, 21816951, 20374183, 19084556, 17966188, 17021515, 16226326, 15530779, 14879221, 14232187, 13574529, 12908646, 12241394, 11576310, 10918238]
38594A0918238o36675n97363n54479n23750m93366m27993l10327j66155l5257
38585G172873P4281J86490L14686M36371N19385N62135N95661O50007P31731Q34029
38575A2077649R49774J061070J131378J135466J097082J067349J054302J004397
38567B0578467Q81355P39304O73278O98457P19763O34805M37119K04357J6771
38558B5583676q8735j11898p5813j6608M0438R7117J61906K20334K42218K12317
38548B6264952J37092K7901j02515k30685l31670m02254m62570n35243o32879
38539B3732129p57466q92999j004225j065734j091791j114977j135227j117292
38531A5552418j046148r57411q94932q55515p94444o77403n14932l53570k41582
$$ y = [10918238, 10281563, 9684200, 9129721, 8605971, 8112605, 7684612, 7374285, 7208130, 7172873, 7247154, 7433644, 7748330, 8184701, 8704086, 9266221, 9861882, 10511889, 11243620, 12077649, 13027423, 14088493, 15219871, 16355337, 17452419, 18519768, 19574070, 20578467, 21459822, 22199126, 22872404, 23570861, 24290624, 24925429, 25362548, 25566905, 25583676, 25494941, 25383043, 25307230, 25290622, 25331060, 25428177, 25590083, 25810417, 26052635, 26264952, 26402044, 26429945, 26327430, 26096745, 25765075, 25362821, 24900251, 24365008, 23732129, 22974663, 22081664, 21077439, 20011705, 18919914, 17804937, 16669710, 15552418, 14506270, 13548859, 12653927, 11798412, 11003968, 10326565, 9811633, 9458063, 9216481]
38522I216481j92855j74927j42437r1922p3115j33829k59689l77051m10372l34474
38512G025810j86714m1604L7040L7937O07l0592m5221n8873q1435j04098j09445
38501F443412q7418n2354m8462j16652k39942l41882l62469l18797k61428j87683
38491D426325m4547J77692L99592N24819N32067M73575M07866L65500L65594M23873
38481H052356N32573O55193P56369Q29495Q89063R44561R88223J002789R77062
38472A5627684R18549Q51646P94023P30695O22808M53427K59012J03852K6041
38463B0387737J9516O3350J46337K53739L48435L86477L51826K67608J76103J11873
38453B2513001Q2980O5104K1534n5236j26424j46758j16336p5139n2873n0376
$$ y = [9216481, 9023626, 8848699, 8706262, 8614340, 8541225, 8407396, 8147707, 7770656, 7360284, 7025810, 6839096, 6797492, 6834532, 6872469, 6873076, 6842484, 6797263, 6738390, 6656955, 6552857, 6443412, 6355994, 6303640, 6255178, 6138526, 5898584, 5556702, 5194233, 4875436, 4614008, 4426325, 4381778, 4559470, 4959062, 5483881, 6015948, 6489523, 6897389, 7262889, 7628483, 8052356, 8584929, 9240122, 9996491, 10825986, 11715049, 12659610, 13647833, 14650622, 15627684, 16546233, 17397879, 18191902, 18922597, 19545405, 19998832, 20257844, 20361696, 20387737, 20407253, 20470603, 20616940, 20870679, 21219114, 21605591, 21957417, 22225025, 22401128, 22513001, 22595981, 22661085, 22682619, 22627383, 22500959, 22354201, 22237865, 22162726, 22109853, 22059477]
38443B2059477o7330j09170j48852j14910M7723L14880O07007Q72923J132665
38434B4594413J442034J831588K279040K728942L135133L471916L672905L555613
38426D6711584K872227J520113k78502k049986l358604m039269m191035m016975
38418C3169553l693480l328047k959636k580581k187112j820368j543148j373238
38410A3683943j257216j121408r42756p62525o34054n66141n22866m73037m23871
38401F980069l97659l91119l81080l65867l71758m07532m36236m11155l26187
38392C491476k13335j03158q366O3730J09975J43433J81793K15800K10769J54754
38382D246871R0593P9554J36753K21363K94476L68128M79152O17551P00649O35587
$$ y = [22059477, 21992147, 21882977, 21734125, 21619215, 21666938, 21981818, 22588825, 23461748, 24594413, 26036447, 27868035, 30147075, 32876017, 36011150, 39483066, 43155971, 46711584, 49583811, 51103924, 50825422, 48775436, 45416832, 41377563, 37186528, 33169553, 29476073, 26148026, 23188390, 20607809, 18420697, 16600329, 15057181, 13683943, 12426727, 11305319, 10362563, 9600038, 8965984, 8399843, 7876977, 7403940, 6980069, 6582410, 6191291, 5810211, 5444344, 5072586, 4665054, 4228818, 3817663, 3491476, 3278141, 3174983, 3166617, 3230347, 3340322, 3483755, 3665548, 3881348, 4092117, 4246871, 4337464, 4417018, 4553771, 4775134, 5069610, 5437738, 5916890, 6534441, 7235090, 7870677]
38372G870677M11034J21996j00396j86807j66545j21745j14916j56806k25869
38363G330623k98695l58094l89356l87956l69743l59013l63561l70757l65392
38354D068056l35451k63797j43869j5791M3759j997r7568j47311j11719k8028
38344B966284N0019R4526Q9785K2536r4795k18414l06938l41258l05682j84036
38334A772027L513J86661K96585L18251K74327J81811N6895n2737q4755k5211
38324B927367O4864R8927L8620p8679j78188k16140k14826k25412k58811k71731
38314A685991k25822j36493m9346P765K9806J7955j0927j7363K0684O9556P7361
38303A469167M4299J7696J7486Q718m0289j11012j67166k04518k41203k75982
$$ y = [7870677, 8281711, 8403707, 8303311, 8116504, 7949959, 7828214, 7713298, 7556492, 7330623, 7031928, 6673834, 6284478, 5896522, 5526779, 5167766, 4804205, 4433448, 4068056, 3732605, 3468808, 3324939, 3309148, 3352907, 3350910, 3253342, 3106031, 2994312, 2966284, 3016303, 3110829, 3200614, 3223150, 3128355, 2909941, 2603003, 2261745, 1956063, 1772027, 1775540, 1962201, 2258786, 2577037, 2851364, 3033175, 3090070, 3037333, 2952578, 2927367, 2992231, 3091158, 3129778, 3051099, 2872911, 2656771, 2441945, 2216533, 1957722, 1685991, 1460169, 1323676, 1274330, 1282095, 1311901, 1329856, 1318929, 1301566, 1322250, 1391806, 1469167, 1513466, 1531162, 1548648, 1557366, 1517077, 1406065, 1238899, 1034381, 793178, 517196]
38293E17196k83386k46753j81278j26729j21592j71040k29448k25317j19263O0602
38283a127008K40044L47531L47022K47862J00970k3037p0579l1120O4487J64034
38273B60206K21293K23468J94377J56721R5092k0030j70664k85784l13103k72398
38263H9178k20375j87878j75693j86328k18978k40685k04471j07543m771M8556
38253a408988M9715L6517M2946Q0424J44507K16120K60116K44276J68484O6741
38243i9142k4499r2366j36702j43731q8688L0168J72705K83445L32787L24972
38233E58949K75445J97583J09156L0688l2084r1845j57765k19405k58516k65540
38223A46666k36845j68981p0083K9943R5423J11988R2856O3685M6604M9271N7760
$$ y = [517196, 233810, -12943, -194221, -320950, -442542, -613582, -843030, -1068347, -1187610, -1127008, -886964, -539433, -192411, 55451, 156421, 133384, 62805, 31685, 96172, 260206, 481499, 704967, 899344, 1056065, 1151157, 1131127, 960463, 674679, 361576, 89178, -131197, -319075, -494768, -681096, -900074, -1140759, -1345230, -1452773, -1457544, -1408988, -1359273, -1322756, -1279810, -1199386, -1054879, -838759, -578643, -334367, -165883, -99142, -123641, -216007, -352709, -496440, -585128, -554960, -382255, -98810, 233977, 558949, 834394, 1031977, 1141133, 1171821, 1139737, 1047892, 890127, 670722, 412206, 146666, -90179, -259160, -329243, -299300, -203877, -91889, 967, 64652, 111256, 160527, 218287]
38212B18287M5836K672n2774r4467j19113j39634j54827j45236j02538m6542l535
38201e91871K3945N7799J18707K03590K83709L20256K85573J78077K4621j29209
38191G75197k39081k86990k91896k86221k76857k41492j72376j07681r6688j37824
38181a361909j74576j58455r7989l6523L387M0261J06709K13475L35327M23826
38171g06467M39461L81950K88383J96124J13368L4881k2956k6600K8259R5992
38161H22395J27333J27348J43702J97302K50345K52954J96012R8615k9496j72241
38151B014269k66075k32297p6858P8857J06273k516j40862k07550j91188j47684
38141I34369j35252j77217k51699k98180k58129j32210J1956J01206J16298Q5369
$$ y = [218287, 264123, 266795, 214021, 119554, 441, -139193, -294020, -439256, -541794, -588336, -591871, -567926, -510127, -391420, -187830, 95879, 416135, 701708, 879785, 904406, 775197, 536116, 249126, -42770, -328991, -605848, -847340, -1019716, -1127397, -1224085, -1361909, -1536485, -1694940, -1792929, -1829452, -1826065, -1785804, -1679095, -1465620, -1130293, -706467, -267006, 114944, 403327, 599451, 712819, 747700, 724744, 698144, 726403, 822395, 949728, 1077076, 1220778, 1418080, 1668425, 1921379, 2117391, 2216006, 2186510, 2014269, 1748194, 1515897, 1439039, 1517896, 1624169, 1621653, 1480791, 1273241, 1082053, 934369, 799117, 621900, 370201, 72021, -186108, -318318, -306362, -205156, -88858, -3489]
38131c489M1305N257o222R484K2922j0270j00340k00748k43742j97855r1843J0849
38119g64692O0692N4661K8653J9978L8068O9230R9124J21646J31870J23144R2310
38108G4684M0351k8979r9128j30790q1269N2934K19675L47484L95868L66172K75395
38097A432397J38933j7383j44802j89813j32724p440J22019K11218K64637L12342
38087A989384L57120L55781K65918J08029l6705j00747r3935q2005j06761j43856
38077B512223j45421j09419q5570j09480j50881j47540q4966j8572r523o0081
38067A590770j28321j86634k36697k75117k80047k40324j70398q3263K7324J59007
38057A76300K73189L16544K64167J35079j6646j18366j19411m4297J5746n216
$$ y = [-3489, 37816, 43073, 36851, 46335, 69257, 58987, -41353, -242101, -485843, -683698, -775541, -764692, -704000, -649339, -620686, -600708, -562640, -493410, -394286, -272640, -140770, -17626, 74684, 115035, 86056, -13072, -143862, -225131, -172197, 47478, 394962, 790830, 1157002, 1432397, 1571330, 1553947, 1409145, 1219332, 1086608, 1079168, 1201187, 1412405, 1677042, 1989384, 2346504, 2702285, 2968203, 3076232, 3039527, 2938780, 2844845, 2762840, 2656079, 2512223, 2366802, 2257383, 2171813, 2062333, 1911452, 1763912, 1678946, 1660374, 1650851, 1590770, 1462449, 1275815, 1039118, 764001, 483954, 243630, 73232, -10031, 17293, 176300, 449489, 766033, 1030200, 1165279, 1148633, 1030267, 910856, 866559, 882305, 877089]
38047H77089q2227j53322k06144k58285k76463j95610l0238J07261J34858R0805
38037G724N6327M3449J5499k3723l3723j5371j8452o6666j26072j56130j49500
38026d66638j13079n0405K4043Q6445J31866J72351K00525J89986J44200J09891
38016D29185J21687J60407J83922J72542J25702M5181m8507j04939q4137l237
38006I97806P8326J14621J02307P0931O3599J10024J91920K43547K10768J04608
37996B288457k1510j34648k36123l23823l77421l86020l61222l13778k41739j52277
37986b60104p1389j4925L3504R7646J72095K27739K47416K39601K18836J89287
37976A079706J52616J18364R3686O7141J8485m7606q8357o0804K4823J03378J12941
$$ y = [877089, 794862, 641540, 435396, 177111, -99352, -294962, -325200, -217939, -83081, 7724, 64051, 107500, 122999, 99276, 65553, 50182, 31730, -34936, -161008, -317138, -466638, -579717, -630122, -606079, -519634, -387768, -215417, -14892, 175094, 319294, 429185, 550872, 711279, 895201, 1067743, 1193445, 1238626, 1190119, 1085180, 1001043, 997806, 1076132, 1190753, 1293060, 1363991, 1427590, 1537614, 1729534, 1973081, 2183849, 2288457, 2266947, 2132299, 1896176, 1572353, 1194932, 808912, 447690, 133912, -107827, -260104, -331493, -346418, -312914, -215268, -43173, 184566, 431982, 671583, 890419, 1079706, 1232322, 1350686, 1444372, 1511513, 1529998, 1482392, 1394035, 1333231, 1358054, 1461432, 1574373]
37965A574373M4612o9317j96858l17181m03660m26310l77919k80339j59089k7073
37955f38761J00974J97360K42387K49159K51306K64096K65998K21700J21631m09
37945A275441q9317j14971j01609j06477j62096k40673k81504k54477j91168j49517
37935d16368j50529j56758j16667k4399P2965J24811J19899P7747J7601m4943
37925d96641q1611o0662J7733J09371J58515J38003O1145k8845p9307o1823j335
37914c25457M2870M1992L1641O1805J22167J42335O8457p8828k24659l00503k83894
37903g02074k03924j22560r3192j16228j38676j09110k9112N6002J05281J08794
37893a244799Q2900O5336J07079K31911L90738M84419M54908L38070K08275R3903
$$ y = [1574373, 1618985, 1549668, 1352810, 1035629, 631969, 205659, -172260, -452599, -611688, -638761, -537787, -340427, -98040, 151119, 402425, 666521, 932519, 1154219, 1275850, 1275441, 1186124, 1071153, 969544, 863067, 700971, 460298, 178794, -75683, -266851, -416368, -566897, -723655, -840322, -864721, -791756, -666945, -547046, -469299, -451698, -496641, -578252, -638914, -621181, -511810, -353295, -215292, -154147, -182992, -262299, -324122, -325457, -282587, -240595, -208954, -147149, -24982, 117353, 185810, 106982, -117677, -418180, -702074, -905998, -1028558, -1121750, -1237978, -1376654, -1485764, -1514876, -1458874, -1353593, -1244799, -1161899, -1096563, -989484, -757573, -366835, 117584, 572492, 910562, 1118837, 1212740]
37883A212740j8163j10548j23714l6575Q0621J30317Q8547J2479l8232m9568k5990
37872A121914L7813J32121K06504K05979J33141N2691K9129P1432J39571J89844
37862B320139K04854J89817J57279J22920J09272J39573K18049L16640L86896
37853D165439L87613L04202J54982n840r8040n7722J10460L32359N29857O82747
37843F506057Q18970R60341J100103J226042J338665J444222J552521J681196
37835A6628117J823955J891083J713871J163623K88725o79697j472837j944659
37827A9412181k114599k089708j961546j761204j485248j148298q06840n34350
37819G510388l77361l34998l70169m30992m70605m68308m40706m22047m25949
$$ y = [1212740, 1194577, 1084029, 960315, 923740, 1004361, 1134678, 1223225, 1235704, 1197472, 1147904, 1121914, 1159727, 1291848, 1498352, 1704331, 1837472, 1890163, 1919292, 1990724, 2130295, 2320139, 2524993, 2714810, 2872089, 2995009, 3104281, 3243854, 3461903, 3778543, 4165439, 4553052, 4857254, 5012236, 5006396, 4908356, 4850634, 4961094, 5293453, 5823310, 6506057, 7325027, 8285368, 9385471, 10611513, 11950178, 13394400, 14946921, 16628117, 18452072, 20343155, 22057026, 23220649, 23509374, 22829677, 21356840, 19412181, 17297582, 15207874, 13246328, 11485124, 9999876, 8851578, 8044738, 7510388, 7133027, 6798029, 6427860, 5996868, 5526263, 5057955, 4617249, 4195202, 3769253]
37810C769253m33307m22255l98220l83237l84052l86695l80751l72592l68667
37801B39477l57118l14810k27163r5907O4252K25827L50633M07703L95771L41900
37791A030565K75677K12476J63834J49553J85354K62612L50612M14323M20454
37782C465460L37803J58681p3570k79146l96279m10679l31837j73427J9626J54879
37772B471511J53941L6800q9418j39746j28080j26946j77816k58105l13344k97910
37762A130887k01597o8389J5283j6387j43446k72254l21001k84070k10830j41712
37752e13516q3252l5493j5474l7893q2490j00062n7141L4584J37887K26441K89932
37741b36477L15914K91912K27770J53083Q2701L594r0850j70281j89544j32298
$$ y = [3769253, 3335946, 2913691, 2515471, 2132234, 1748182, 1361487, 980736, 608144, 239477, -117641, -432451, -659614, -755521, -691269, -465442, -114809, 292894, 688665, 1030565, 1306242, 1518718, 1682552, 1832105, 2017459, 2280071, 2630683, 3045006, 3465460, 3803263, 3961944, 3888374, 3609228, 3212949, 2802270, 2470433, 2297006, 2316632, 2471511, 2625452, 2662252, 2572834, 2433088, 2305008, 2178062, 2000246, 1742141, 1428797, 1130887, 929290, 860901, 876184, 859797, 716351, 444097, 123096, -160974, -371804, -513516, -596768, -632261, -647735, -685628, -768118, -868180, -925321, -890737, -752850, -526409, -236477, 79437, 371349, 599119, 752202, 834903, 838497, 747647, 577366, 387822, 255524]
37731B55524j9525J10385K09252K23014J27219l0703j50567j61464q1238Q997
37721D90894M0011L650n3064o7445l283J26613K68198L55777L43759K29619O1500
37710A796229q4350j54486j52583j15295o0255K1762J23651K00208K07910J51575
37700A934366P4167J0438l2503n6986n9620l9729j2395o339m4842j18002j70726
37689A477829j38353j5740J18562J73906J44594J09737J28085J60539J20110j7812
37679B261457j85732l02979l56638l93635m52494n20816n52753n14072m11819
37670a429481k89582j93428j37739j06738q8054q7076r5830o7938M2483K16384
37660b236999L72762M45270M34213L76099K91840J85372O8468m2589j40819k11053
$$ y = [255524, 235999, 346384, 555636, 778650, 905869, 875166, 724599, 563135, 481897, 490894, 530905, 534555, 481491, 414046, 410763, 537376, 805574, 1161351, 1505110, 1734729, 1796229, 1711879, 1557393, 1404810, 1289515, 1229260, 1251022, 1374673, 1574881, 1782791, 1934366, 2008533, 2018971, 1986468, 1929482, 1869862, 1830133, 1817738, 1811399, 1766557, 1648555, 1477829, 1339476, 1323736, 1442298, 1616204, 1760798, 1870535, 1998620, 2159159, 2279269, 2261457, 2075725, 1772746, 1416108, 1022473, 569979, 49163, -503590, -1017662, -1429481, -1719063, -1912491, -2050230, -2156968, -2245022, -2332098, -2427928, -2495866, -2453383, -2236999, -1864237, -1418967, -984754, -608655, -316815, -131443, -62975, -105564, -246383, -457436]
37650d57436k12958j19841K5684J32740J54850J38629J65557K62358L82423M60265
37640I32271M66411M15262L36801K48593J56221P7768N3743J16957K54758M14327
37630C473112N44398O23212O58132O81311P36649Q32343Q94524Q01270M92101
37621I737052L7716m08594p18227q48001q29890p30453o08565m86257l55613k15956
37611D573212r1222m140M6473O5889L6660o5905k34744m19295n48617n66202m64110
37600B327999k96519j41546l5154L9757R1506Q5890O254q6956j11260o8946n0001
37589A761024j24010k69008m11259m90643m71920l37824j11347J29592K90014
37580c5381L16444K21946P3281m2533o8424j8296M1034N9897M6074L0476J7623
$$ y = [-457436, -670394, -790235, -764551, -631811, -476961, -338332, -172775, 89583, 472006, 932271, 1398682, 1813944, 2150745, 2399338, 2555559, 2633327, 2687070, 2804027, 3058785, 3473112, 4017510, 4640722, 5298854, 5980165, 6716814, 7549157, 8443681, 9244951, 9737052, 9774768, 9366174, 8647947, 7799946, 6970056, 6239603, 5631038, 5144781, 4789168, 4573212, 4481990, 4477850, 4524323, 4590212, 4626872, 4560967, 4326223, 3906928, 3358311, 2792109, 2327999, 2031480, 1889934, 1854780, 1894537, 1986043, 2071933, 2078187, 1991231, 1879971, 1811025, 1761024, 1637014, 1368006, 956747, 466104, -5816, -343640, -454987, -325395, -35381, 281063, 503009, 576290, 533757, 465333, 447037, 488071, 547968, 594042, 624518, 642141]
37569F42141j0095n6377j02817j28106j16397n4980N4786J85740L00525L78845
37559A093265M19304M22105L88151L32325K76552K23830J54611N6894n2568j47312
37549C167157k20736k79701l10499k73905j53820m181Q1201O3911J2282L1671
37539B113380J43634K60019K86877K29284J70933J67628J97261K19286K48651
37530D036953L41506N16235P15665Q55152Q92189Q38660P20420N49358L38535
37521I804673J26151k9516p8145n011J50210K94907L28802K20089M1283q5445
37511A0767998q4563K9371J85282L11075L67010L58289L27895L21456L49176L87698
37501A3320687M12962M13978L82055L18163K55288K38665K65487K72488K08201
$$ y = [642141, 632046, 575669, 472852, 344746, 228349, 173369, 228155, 413895, 714420, 1093265, 1512569, 1934674, 2322825, 2655150, 2931702, 3155532, 3310143, 3367037, 3314469, 3167157, 2946421, 2666720, 2356221, 2082316, 1928496, 1924315, 2005516, 2069427, 2081709, 2113380, 2257014, 2517033, 2803910, 3033194, 3204127, 3371755, 3569016, 3788302, 4036953, 4378459, 4894694, 5610359, 6465511, 7357700, 8196360, 8916780, 9466138, 9804673, 9930824, 9901308, 9823163, 9818152, 9968362, 10263269, 10592071, 10812160, 10853443, 10767998, 10683435, 10712806, 10898088, 11209163, 11576173, 11934462, 12262357, 12583813, 12932989, 13320687, 13733649, 14147627, 14529682, 14847845, 15103133, 15341798, 15607285, 15879773, 16087974]
37492A6087974R7231Q091k3264o962M7778J51502L02721M71944O32178P83295
37482A8552488R29388J044259J075844R86212P87493N45639L48277K55632K73297
37473B4798529L70610N16210O81228Q12201Q29247O76927L81875N3780j77245
37464B8943362k35943j33342O3674K92748N29508P67143R79270J123400J181890
37455C3511710J175271J114930R56258O35503J72546k83428n50046n74079m89409
37446C5669256n00012p05632j040677j359283j553960j604927j559458j484205
37438B5861102j413142j318023j140028q62861n38638k30598M1915K76679M38384
37429B1114790M84749M33612L50610K59869J16086j07915l43691m77138m63149
$$ y = [16087974, 16185205, 16193296, 16170032, 16163070, 16210848, 16362350, 16665071, 17137015, 17769193, 18552488, 19481876, 20526135, 21601979, 22588191, 23375684, 23921323, 24269600, 24525232, 24798529, 25169139, 25685349, 26366577, 27178778, 28008025, 28684952, 29066827, 29120607, 28943362, 28707419, 28574077, 28637751, 28930499, 29460007, 30227150, 31206420, 32329820, 33511710, 34686981, 35801911, 36758169, 37393672, 37566218, 37282790, 36732744, 36158665, 35669256, 35169244, 34463612, 33422935, 32063652, 30509692, 28904765, 27345307, 25861102, 24447960, 23129937, 21989909, 21127048, 20588410, 20357812, 20399727, 20676406, 21114790, 21599539, 22033151, 22383761, 22643630, 22759716, 22651801, 22308110, 21830972, 21367823]
37420B1367823l64217k86430k98705l97904n16156n57148m50763j89966J81166
37411A8487700O05355J033390J428899J775480K069564K283546K346628K196128
37403C2226690J852757J417634R85768N85724K13766j01789k97247l23594j77023
37394C6382686J18114N35381J039939J553481J937803K048019J840217J426837
37386D6882477R90467O26784K94581p5002m66267q09148j080653j314790j521916
37377D3526533j663089j723989j765395j865064k032073k203078k304301k296494
37369B7673050k180607j990919j779125j585781j427249j312073j248208j218681
37361A4930407j173910j076748r43991q20199p25366o56191o21123o29822o49179
$$ y = [21367823, 21003606, 20717176, 20418471, 20020567, 19504411, 18947263, 18496500, 18306534, 18487700, 19093055, 20126445, 21555344, 23330824, 25400388, 27683934, 30030562, 32226690, 34079447, 35497081, 36482849, 37068573, 37282339, 37180550, 36883303, 36559709, 36382686, 36500800, 37036181, 38076120, 39629601, 41567404, 43615423, 45455640, 46882477, 47872944, 48499728, 48794309, 48719307, 48253040, 47443892, 46363239, 45048449, 43526533, 41863444, 40139455, 38374060, 36508996, 34476923, 32273845, 29969544, 27673050, 25492443, 23501524, 21722399, 20136618, 18709369, 17397296, 16149088, 14930407, 13756497, 12679749, 11735758, 10915559, 10190193, 9534002, 8912879, 8283057, 7633878]
37352G633878o15430n06308l70408k70080k22252k08546k11707k18265k10601
37343D800281j86178j71059j89920k33247k73211k95679k93073k45431j46281
37334B766202l9986P865j5485n7498o8881m9339j1121O1282J76533K84983L11788
37323C366343K46831J64459J36475J50324J36222O0410l6600r4678j01958r4263
37313C933565r9789j05217q1404k8888J8316L6486M5811Q4954J54574K06582K01542
37302D366532J59759J30579J18618P7708p446o8229j8322J38221L02208L84370
37292E583998L81592L41735K93625K42602K10219K36067L39423N05659P09125
37283H844045R19463J080309J117472R96098P56581M72967J87449r1052l37605
$$ y = [7633878, 7018448, 6512140, 6141732, 5871652, 5649400, 5440854, 5229147, 5010882, 4800281, 4614103, 4443044, 4253124, 4019877, 3746666, 3450987, 3157914, 2912483, 2766202, 2726216, 2734081, 2718596, 2661098, 2592217, 2542878, 2531757, 2593039, 2769572, 3054555, 3366343, 3613174, 3777633, 3914108, 4064432, 4200654, 4261064, 4224464, 4129786, 4027828, 3933565, 3833776, 3728559, 3647155, 3618267, 3636583, 3673069, 3718880, 3803834, 3958408, 4164990, 4366532, 4526291, 4656870, 4775488, 4853196, 4845750, 4777521, 4759199, 4897420, 5199628, 5583998, 5965590, 6307325, 6600950, 6843552, 7053771, 7289838, 7629261, 8134920, 8844045, 9763508, 10843817, 11961289, 12957387, 13713968, 14186935, 14374384, 14283332, 13945727]
37274A3945727n03969n74242n91717n97804n64476m30216k03647J0398J08379
37265A0598433Q5709J8560k2900j1606O1020J91811L36850M14424L63127J86816
37255A2222244o1242l13914n01758n65618m95233l48893k09804j21781p5541l9461
37245I488999K1203J39250L15298M82167N37430M42998K77603J59774J19688P5583
37235A2059993n2942k34779l58314l61959k96654k46820k24579j77806q5387M398
37225A0025151M1412M2851P3724J83085L80218O47155R38201J175450J280859
37216A4788106J226520J046519Q05552N66059L67050K04065L3923j69158l56736
37207A8511900m32395l44839j33954J21925L74319O00415P60369Q05145P36271
$$ y = [13945727, 13441758, 12867516, 12275799, 11677995, 11113519, 10683303, 10479656, 10490054, 10598433, 10684142, 10702702, 10679802, 10668196, 10729216, 10921027, 11257877, 11672301, 12035428, 12222244, 12161002, 11847088, 11345330, 10779712, 10284479, 9935586, 9725782, 9604001, 9528460, 9488999, 9510202, 9649452, 9964750, 10446917, 10984347, 11427345, 11704948, 11864722, 11984410, 12059993, 12007051, 11772272, 11413958, 11051999, 10755345, 10508525, 10283946, 10106140, 10020753, 10025151, 10066563, 10109414, 10183138, 10366223, 10746441, 11393596, 12331797, 13507247, 14788106, 16014626, 17061145, 17866697, 18432756, 18799806, 19003871, 19037794, 18868636, 18511900, 18079505, 17734666, 17600712, 17722637, 18096956, 18697371, 19457740, 20262885, 20999156]
37198B0999156O29583N75373N96152O35636O30034N76736N21878M91259M58104
37189B6113911L82384K53016P2305j72384m78592p76159r51299r45243q08967
37180B2688972o49647n45234n18058n53136o09582o38585o33332o56066p75338
37171A7109994r66737j105522j074887q67776n78664l22837j80464j88286l36496
37162A1488325n61136p67829q89041r18585q85129q03112o65686m83483l10350
37153E203974k14466k22134k94258l59798l72940l40339k96812k60516k18999
37144B623712j58376r1384m2852j5110J2316M7834P4209P9385Q2696J14507J80517
37133B907454K60501L32958L87380M24237M63977N51056P26242R86506J273684
$$ y = [20999156, 21628739, 22204112, 22800264, 23435900, 24065934, 24642670, 25164548, 25655807, 26113911, 26496295, 26749311, 26821616, 26649232, 26170640, 25394481, 24443182, 23497939, 22688972, 22039325, 21494091, 20976033, 20422897, 19813315, 19174730, 18541398, 17885332, 17109994, 16143257, 15037735, 13962848, 13095072, 12516408, 12193571, 12013107, 11824821, 11488325, 10927189, 10159360, 9270319, 8351734, 7466605, 6663493, 5997807, 5514324, 5203974, 4989508, 4767374, 4473116, 4113318, 3740378, 3400039, 3103227, 2842711, 2623712, 2465336, 2373952, 2331100, 2315990, 2328306, 2376140, 2450349, 2529734, 2612430, 2726937, 2907454, 3167955, 3500913, 3888293, 4312530, 4776507, 5327563, 6053805, 7040311, 8313995]
37124H313995J490946J524062J281446P66008J15502m67476q51478j035139j078146
37115A0059720j014695q56095o42548m44789l11870k41195k02195j72431j48422
37106F025480j35225j31628j23344r4342m7396k824L1808P9933J70707L03055
37096F076224M49243N87816P15155Q24967Q93564Q92165Q05984O39850M14260
37087A2299228J57905j04682l61284o01000p94284q96534q83493p81342o51486
37078G383028n40648m50176l57980k61994j86890j47500j25743r7336o6335n2819
37068E095607n5971n3220l0001J6917J00380K27568L54568L97969L19886J76058
37058F549761N6131L903K3655J29223L33448O00897Q64922J100629J342326J614718
$$ y = [8313995, 9804941, 11329003, 12610449, 13376457, 13491959, 13024483, 12173005, 11137866, 10059720, 9045025, 8188930, 7546382, 7101593, 6789723, 6548528, 6346333, 6173902, 6025480, 5890255, 5758627, 5635283, 5540941, 5493545, 5490721, 5522529, 5602462, 5773169, 6076224, 6525467, 7113283, 7828438, 8653405, 9546969, 10439134, 11245118, 11884968, 12299228, 12457133, 12352451, 11991167, 11390167, 10595883, 9699349, 8815856, 8034514, 7383028, 6842380, 6392204, 6034224, 5772230, 5585340, 5437840, 5312097, 5214761, 5148426, 5095607, 5039636, 4986416, 4956415, 4973332, 5073712, 5301280, 5655848, 6053817, 6373703, 6549761, 6605892, 6609795, 6633450, 6762673, 7096121, 7697018, 8561940, 9662569, 11004895, 12619613]
37048A2619613J868004J980656J806768J248331L50036o59254j478010j933083
37040A5803061k060102j985288j784289j489728j173624r35835q12014p51816
37032D810365o97131o37915n83547n25707m51046l57936k39974q0308J15038L00075
37022A651914M27597M88310M91698M28961K87743R8720o2105j27907r0899m202
37012C589830N3450K6800p4677j79205k14378j73540j11350p7351p4629q5304
37002B679646j06396j39838j66538j60138j23986r0428p8195o7947k8045M8130
36992A766265J39145K17607K61684K52398J80772O7055l9192r4851j01631r8142
36982B551110j08418j08330n5333N3291J67135K28500K16614J43936L2460q7338
$$ y = [12619613, 14487617, 16468273, 18275041, 19523372, 19873408, 19214154, 17736144, 15803061, 13742959, 11757671, 9973382, 8483654, 7310030, 6374195, 5562181, 4810365, 4113234, 3475319, 2891772, 2366065, 1915019, 1557083, 1317109, 1236801, 1351839, 1651914, 2079511, 2567821, 3059519, 3488480, 3776223, 3874943, 3812838, 3684931, 3594032, 3589830, 3643280, 3670080, 3595403, 3416198, 3201820, 3028280, 2916930, 2839579, 2764950, 2679646, 2573250, 2433412, 2266874, 2106736, 1982750, 1892322, 1814127, 1746180, 1718135, 1766265, 1905410, 2123017, 2384701, 2637099, 2817871, 2884926, 2845734, 2750883, 2649252, 2551110, 2442692, 2334362, 2279029, 2332320, 2499455, 2727955, 2944569, 3088505, 3120965, 3033627]
36972C033627j70814j85149j45698j03174q3724n8604J2767J20763K02643K00038
36962B822675J11825n184q0255q0672l4552l631k3907p0253q5029m1514K8345
36951B537848P0407O3561L2421J1165N953l102l1417p3542j18457j67204k20934
36940B106699k56116k32420j37530j4821O8329Q0159M3771j979m7245j06988j77846
36929A324013k15932j71112m3825J01833J88439J86398J24462N0677n736m1417
36919A497800o7743r7755j30568j42134j03587j9008O2814Q4877K8914p5641j79558
36908H58411k43670k52238k13432j50091q4772l1664J156J2020J0349Q900O177
36897g8854r718l1878k5706L5667J38668K45603L28017L65102L29978K17019Q1553
$$ y = [3033627, 2862813, 2677664, 2531966, 2428792, 2345068, 2286464, 2299231, 2419994, 2622637, 2822675, 2934500, 2929316, 2849061, 2768389, 2733837, 2730206, 2706299, 2636046, 2551017, 2509503, 2537848, 2608255, 2671816, 2704237, 2715402, 2721355, 2718253, 2686836, 2613294, 2494837, 2327633, 2106699, 1850583, 1618163, 1480633, 1465812, 1534141, 1614300, 1658071, 1656092, 1608847, 1501859, 1324013, 1108081, 936969, 893144, 994977, 1183416, 1369814, 1494276, 1544953, 1539217, 1497800, 1430057, 1332302, 1201734, 1059600, 956013, 937005, 999819, 1084696, 1113610, 1037969, 858411, 614741, 362503, 149071, -1020, -85792, -117456, -116300, -104280, -93931, -85031, -78854, -88572, -120450, -146156, -110489, 28179, 273782, 601799, 966901, 1296879, 1513898, 1595451]
36886A595451J2203M5599J31081J92745K02976J77594J24554L3884q2661j71843
36876B261583j76367q8343M0263J40490J80640J81948J85549K10622K45792K67367
36866C449544K51400J79426O0764m6857o6964K7691J90663L55537M95482O16724
36856E513410P19789P99961Q76321R87348J154595J370333J611282J825249J896241
36847A6754529J670617J069992J87826p41988j481748j908096k031686j942022
36839A1577424j741583j506455j277327j068931q81452p06562n36526l80705k70829
36830C207054k36373k68179l12952l11548k44113j39321m5734L634Q283m779o24
36819A655348M0128J08304J72393J95664J49511K2621j66051l59982m86574n03783
$$ y = [1595451, 1607654, 1653253, 1784334, 1977079, 2180055, 2357649, 2482203, 2516087, 2433426, 2261583, 2085216, 1996873, 2037136, 2177626, 2358266, 2540214, 2725763, 2936385, 3182177, 3449544, 3700944, 3880370, 3941134, 3894277, 3827313, 3855004, 4045667, 4401204, 4896686, 5513410, 6233199, 7033160, 7909481, 8896829, 10051424, 11421757, 13033039, 14858288, 16754529, 18425146, 19495138, 19682964, 18940976, 17459228, 15551132, 13519446, 11577424, 9835841, 8329386, 7052059, 5983128, 5101676, 4395114, 3858588, 3477883, 3207054, 2970681, 2702502, 2389550, 2078002, 1833889, 1694568, 1648834, 1652468, 1660751, 1655972, 1655348, 1695476, 1803780, 1976173, 2171837, 2321348, 2343969, 2177918, 1817936, 1331362, 827579]
36809H27579m28676l14197j97945p8775N8316K03324L12581L39255K75565J68157
36799A165184Q6871O9008R2904J10606J03471R6453J18019J57615J70118J20040
36789B290289K0153p1990j01089o5660j8145l472o347J9322P3788R8952N6739
36778B292540j1327l2524P032N4709O6080N0855L7597K3643k0730j10902k22499
36767B134474l01195k98798k15947j11618n0702l5495r302O3364J46164J81016
36757A501961J67471J61197K00363K61914K90864K47486J22802o3588k64503m22006
36747B203961n04041n21139m97923m36527l20880j52001L5136J90979K79464K89982
36737E67011K37465J59068R9524Q1396Q3875O1950j410o6378p5640k7149J0395
$$ y = [827579, 398903, 84706, -113239, -192014, -133698, 69626, 382207, 721462, 997027, 1165184, 1252055, 1321063, 1413967, 1524573, 1628044, 1724497, 1842516, 2000131, 2170249, 2290289, 2310442, 2238452, 2137363, 2071703, 2053558, 2050086, 2043739, 2063061, 2136849, 2235801, 2292540, 2281213, 2248689, 2255721, 2310430, 2376510, 2427365, 2464962, 2488605, 2467875, 2356973, 2134474, 1833279, 1534481, 1318534, 1206916, 1156214, 1120719, 1111417, 1174781, 1320945, 1501961, 1669432, 1830629, 2030992, 2292906, 2583770, 2831256, 2954058, 2890470, 2625967, 2203961, 1699920, 1178781, 680858, 244331, -76549, -228550, -193414, -2435, 277029, 567011, 804476, 963544, 1063068, 1144464, 1228339, 1290289, 1288879, 1222501, 1146861, 1119712, 1130107]
36726A130107k7722j21798j85212j61268p6363J0921Q2123J52390K11734K16490
36716A231402J48998N5578M946K2568Q0092J35782J67819J78810J91025K36374
36706B453394L28520M36397M99864M82818M04497L13079K37516J72868J03656
36697E432609K9114l1062m4842J5096J46895L06296M30012M86047N01711N34475
36687G806351O11349O98976P35134O87945N82473M73346M02227L89251M56444
36678A2843496O35404R33924J296106J603788J720410J544023J052248L35553
36670B1964952m12291r81892j273474j346461j336625j327314j306924j228975
36662A2750996j074654q51807n72648k64553J3415J98689K72045K56275J72106
$$ y = [1130107, 1102385, 980587, 795375, 634107, 557744, 568665, 650788, 803178, 1014912, 1231402, 1380400, 1435978, 1440924, 1463492, 1543584, 1679366, 1847185, 2025995, 2217020, 2453394, 2781914, 3218311, 3718175, 4200993, 4605490, 4918569, 5156085, 5328953, 5432609, 5461723, 5430661, 5385819, 5400915, 5547810, 5854106, 6284118, 6770165, 7271876, 7806351, 8417700, 9116676, 9851810, 10539755, 11122228, 11595574, 11997801, 12387052, 12843496, 13478900, 14412824, 15708930, 17312718, 19033128, 20577151, 21629399, 21964952, 21552661, 20570769, 19297295, 17950834, 16614209, 15286895, 13979971, 12750996, 11676342, 10824535, 10251887, 9987334, 10000749, 10199438, 10471483, 10727758, 10899864]
36653A0899864K5676j52041k87198l16907k53485j71249j31266j37520j61878
36644I313996j83353j93667j88566j73743j68743j88662k27214k67871l02126
36635G420051l24196l19865k81770k30823k00212j97560k04270k14746k49736
36626E196873l16271l74783l68634k80163j43541j0597Q0109J09076P6219L790
36616C972078p3883j32756j68628j85044j79873j46835q4244K191J04107K16953
36606C324066L41743M78921O21532P58651Q83212R88330J060463J095059J121384
36597A0673361J186613J302161J430354J540334J636742J685092J539534J033816
36589B2028007J81304p62173j475742j796473j761942j500170j144543q22675
$$ y = [10899864, 10925540, 10773499, 10486301, 10169394, 9915909, 9744660, 9613394, 9475874, 9313996, 9130643, 8936976, 8748410, 8574667, 8405924, 8217262, 7990048, 7722177, 7420051, 7095855, 6775990, 6494220, 6263397, 6063185, 5865625, 5661355, 5446609, 5196873, 4880602, 4505819, 4137185, 3857022, 3713481, 3702884, 3782993, 3892069, 3968288, 3972078, 3898195, 3765439, 3596811, 3411767, 3231894, 3085059, 3000815, 3003006, 3107113, 3324066, 3665809, 4144730, 4766262, 5524913, 6408125, 7396455, 8456918, 9551977, 10673361, 11859974, 13162135, 14592489, 16132823, 17769565, 19454657, 20994191, 22028007, 22209311, 21447138, 19971396, 18174923, 16412981, 14912811, 13768268, 12945593]
36581A2945593o28688n60379n19102m07933k23887m8250L0872k4316j90651l96270
36571I976989n46667n65727m33083j94214O1536K48235L36384L68199M06484M62329
36561A0120465M83628M12718K35456k4711l26204o04847p81381q10205p16129
36552G988790n63307l98593k44709j28145p1127n2826j4924P7384J98360K93068
36542G083971L24783K84034J78032L2365j12609k28524l15977l84122m27946m42256
36532E991751m42168m43572m30297l69149k59670j44120o1166j1457K1272L7001
36522C888425K5571p208l9225n3147m3014l993O7310J57959K33952K57527K12492
36511D696649J20764L9272K8191J01863K06906K61732K26641J33134M6780J1554
$$ y = [12945593, 12316905, 11756526, 11237424, 10829491, 10605604, 10557354, 10588226, 10563910, 10373259, 9976989, 9430322, 8864595, 8431512, 8237298, 8298834, 8547069, 8883453, 9251652, 9658136, 10120465, 10604093, 11016811, 11252267, 11227556, 10901352, 10296505, 9515124, 8704919, 7988790, 7425483, 7026890, 6782181, 6654036, 6582909, 6530083, 6515159, 6592543, 6790903, 7083971, 7408754, 7692788, 7870820, 7903185, 7790576, 7562052, 7246075, 6861953, 6434007, 5991751, 5549583, 5106011, 4675714, 4306565, 4046895, 3902775, 3841609, 3830152, 3851424, 3888425, 3913996, 3906788, 3867563, 3814416, 3771402, 3767409, 3834719, 3992678, 4226630, 4484157, 4696649, 4817413, 4856685, 4884876, 4986739, 5193645, 5455377, 5682018, 5815152, 5861932, 5873486]
36501E873486L0873Q5563J54911K25710K96967L80144M84545N94820O69093O70958
36491I467070O06331N21848M62744M38225M32620M39144M65487N08735N48112
36482A3890316N74885O13301O92274Q01659Q93764R29559R13589Q85322Q85518
36473B1080187R25886R78554R99200R73940R36489R18574Q89470P78049N65812
36464B9046161L27812J55995N8740l6894j91387l88160n62588o70241p16649p37403
36454B6285386p65279q10693q58479q78436q46022p61566o51583n48285m65965
36445A9699078l99729l45629l11447l01417l02150k98856k98639l17024l40806
36436A6783381l26833k48012j24305L202J12768J99509K45351K19686J18545j1297
$$ y = [5873486, 5904359, 5989922, 6144833, 6370543, 6667510, 7047654, 7532199, 8127019, 8796112, 9467070, 10073401, 10595249, 11057993, 11496218, 11928838, 12367982, 12833469, 13342204, 13890316, 14465201, 15078502, 15770776, 16572435, 17466199, 18395758, 19309347, 20194669, 21080187, 22006073, 22984627, 23983827, 24957767, 25894256, 26812830, 27702300, 28480349, 29046161, 29373973, 29529968, 29588708, 29551814, 29360427, 28972267, 28409679, 27739438, 27022789, 26285386, 25520107, 24709414, 23850935, 22972499, 22126477, 21364911, 20713328, 20165043, 19699078, 19299349, 18953720, 18642273, 18340856, 18038706, 17739850, 17441211, 17124187, 16783381, 16456548, 16208536, 16084231, 16087433, 16200201, 16399710, 16645061, 16864747, 16983292, 16971995]
36426A6971995j00912j11974n7554K4228J03277J57881J60469R4555p681p5580
36416A7158704p1613l3469j8123k2448K786O9684J32171J59359J89552K85744
36406A7852347M57579O46097P73505Q00104P50175O94224O95454P65797Q74747
36397B4310029R88564J091010J190968J336102J593376J981246K450208K970856
36389C7912359L594190M354558N159911N882439O535563P258876Q160854R277893
36381H8136643J0544649J1476270J0900060P552861J426589n619376j1026957
36374A13390739j3442907j3359318j2073591j0459206q782925p175363n815662
36367D2281767m760794l916128l208000k636204k176542j770034j405982j116209
$$ y = [16971995, 16871083, 16759109, 16701555, 16725783, 16829060, 16986941, 17147410, 17241965, 17234284, 17158704, 17087091, 17053622, 17035499, 17013051, 17015837, 17085521, 17217692, 17377051, 17566603, 17852347, 18309926, 18956023, 19729528, 20529632, 21279807, 21974031, 22669485, 23435282, 24310029, 25298593, 26389603, 27580571, 28916673, 30510049, 32491295, 34941503, 37912359, 41506549, 45861107, 51021018, 56903457, 63439020, 70697896, 78858750, 88136643, 98681292, 110157562, 121057622, 128610483, 130037072, 124417696, 113390739, 99947832, 86588514, 74514923, 64055717, 55272792, 48097429, 42281767, 37520973, 33604845, 30396845, 27760641, 25584099, 23814065, 22408083, 21291874]
36359B1291874q98848p26371o02400n34781m84614m17304l70221l93615m56903
36350A6406817m87949m72567m42458m03262l56203l55072m48723n85914o62601
36341A2192068o48741n89111n00321l60337j94512q0950n9319j03677j82922k72943
36331I199235l13342k41847r0236K8966N3638K7304R571m61k8369p3861j24742
36320H445856j72961j95546j66369j05995p4746r8658j45084j84398k26700k77553
36310F797846l04032k72528j88169p8888K8003J00228J07025M9989l6662j25424
36300F077388k11393k89280l45506l74259l73426l32372k58270k00710k01546
36291C490626k26936k02119j12280j3052O1217J37124K36528L32131L94505M33011
$$ y = [21291874, 20393026, 19666655, 19064255, 18529474, 18044860, 17627556, 17257335, 16863720, 16406817, 15918868, 15446301, 15003843, 14600581, 14244378, 13889306, 13440583, 12854669, 12192068, 11543327, 10954216, 10453895, 10093558, 9899046, 9818096, 9758777, 9655100, 9472178, 9199235, 8885893, 8644046, 8553810, 8582776, 8636414, 8663718, 8673289, 8672828, 8644459, 8570598, 8445856, 8272895, 8077349, 7910980, 7804985, 7730239, 7631581, 7486497, 7302099, 7075399, 6797846, 6493814, 6221286, 6033117, 5954229, 5982232, 6082460, 6189485, 6239474, 6202812, 6077388, 5865995, 5576715, 5231209, 4856950, 4483524, 4151152, 3892882, 3692172, 3490626, 3263690, 3061571, 2949291, 2936239, 2997456, 3134580, 3371108, 3703239, 4097744, 4530755]
36281D530755M60121M55298L95428K94756J94367J33234J34939J90619K46723
36272G036240K41900J65433N4628n8227j56564k04801j60444l6942Q9661J56672
36262G127556J68166J64873J72110J82931J65222Q8546k6875j00900p2544K3231
36252G892316R7538J07793P1158Q211n9715p8486o627J11232J89668K14769K32485
36241H780342K33163J47542k2470j60801j63387m2185J22543K70467L78809M51788
36231I995811N14879N73975N82198N05116M04707L80151M35022M91280N25475
36222A4408614N87800O85548P59373P88865Q13064Q31725Q00606P45087P61151
36213B1181833Q75023J013667J139222J298366J516905J765284K048311K406446
$$ y = [4530755, 4990876, 5446174, 5841602, 6136358, 6330725, 6463959, 6598898, 6789517, 7036240, 7278140, 7443573, 7498201, 7439974, 7283410, 7078609, 6918165, 6881223, 6970884, 7127556, 7295722, 7460595, 7632705, 7815636, 7980858, 8069404, 8042529, 7941629, 7869085, 7892316, 7989854, 8097647, 8168805, 8177016, 8117301, 8038815, 8032188, 8143420, 8333088, 8547857, 8780342, 9013505, 9161047, 9138577, 8977776, 8814389, 8772204, 8894747, 9165214, 9544023, 9995811, 10510690, 11084665, 11666863, 12171979, 12576686, 12956837, 13391859, 13883139, 14408614, 14996414, 15681962, 16441335, 17230200, 18043264, 18874989, 19675595, 20420682, 21181833, 22056856, 23070523, 24209745, 25508111, 27025016, 28790300, 30838611, 33245057]
36205C3245057K817302L227587L681269M267288M958471N687525O562947P785442
36197G2232888R361676J1159222J3233319J5786354J8789875K1950071K4885220
36190A87398625K6667874K5202006J8229752N938059p869804j8193377k2567759
36183B14805376k2085729j9224545j5615940j1831708q121434m617404j234586
36176A32074030K135904N488586Q894503J2523982J6365836K0191214K3623114
36169B21297169K5553854K3577132J5310774J284272j4036317k5164247k9659718
36162B18162919k9016874k6102415k2685759j9289094j6133801j3434694j1194103
36155H0306179r301985p762102o583633n621694m737078l968520l384746k914020
$$ y = [33245057, 36062359, 39289946, 42971215, 47238503, 52196974, 57884499, 64447446, 72232888, 81594564, 92753786, 105987105, 121773459, 140563334, 162513405, 187398625, 214066499, 239268505, 257498257, 263436316, 255566512, 237373135, 214805376, 192719647, 173495102, 157879162, 146047454, 137926020, 133308616, 132074030, 134209934, 139698520, 148593023, 161117005, 177482841, 197674055, 221297169, 246851023, 270428155, 285738929, 287023201, 272986884, 247822637, 218162919, 189146045, 163043630, 140357871, 121068777, 104934976, 91500282, 80306179, 71004194, 63242092, 56658459, 51036765, 46299687, 42331167, 38946421, 36032401]
36147C6032401k465226k074712j793925j558108j293783j042887q65150p19754
36139B4218856n43720l47498j42912J22230M69322Q22046J103021J283393J262028
36130B8246766Q42722k1837j045695j808606k107545k031929j766965j440729
36122A8866182j117451q10729m92974j65028Q8789J73838J01118j9490q5639o2047
36112A6476569L5420J59753K49368K69049K34738J85770J55028J71525K42767
36103A8179987L09561K68584P9469j84480m18427n75754o50404o28886n13390
36094A5866260l56958k26836j54580j49089k16028l22889l86303l48805k46034
36085A3458738j55002j00406n4580l308M0118P2242J02118J20111J03474N5473
$$ y = [36032401, 33567175, 31492463, 29698538, 28140430, 26846647, 25803760, 24938610, 24218856, 23675136, 23327638, 23184726, 23306956, 23776278, 24598324, 25701345, 26984738, 28246766, 29089488, 29067651, 28021956, 26213350, 24105805, 22073876, 20306911, 18866182, 17748731, 16938002, 16445028, 16280000, 16368789, 16542627, 16643745, 16624255, 16538616, 16476569, 16511989, 16671742, 16921110, 17190159, 17424897, 17610667, 17765695, 17937220, 18179987, 18489548, 18758132, 18837601, 18653121, 18234694, 17658940, 17008536, 16379650, 15866260, 15509302, 15282466, 15127886, 14978797, 14762769, 14439880, 14053577, 13704772, 13458738, 13303736, 13203330, 13148750, 13145442, 13185560, 13257802, 13359920, 13480031, 13583505, 13638978]
36075A3638978J0851j341J4543K7956J1985k0423q427J00980K79344M28929M82832
36064A4966207M63640M32493M22972M48696N28193O55178P69759Q04383P50002
36055B0241523O51111N53379M82761M54561M68846N07126N57696O31914P38489
36046B5287406Q64083J000299J162051J349316J516382J617443J669347J737076
36038C6203403J869147K074629K345308K663358K997097L327795L683601M120612
36030E9284950M667398N304146N991291O702625P438546Q223732R084445J0016809
36022A16713942J0991580J1999863J3066243J4190172J5292157J6239010J6892813
36015B15385780J7094684J6620684J5215590J2706023R095557M592664m06371
$$ y = [13638978, 13649829, 13648488, 13663031, 13690987, 13702972, 13682549, 13674122, 13775102, 14054446, 14483375, 14966207, 15429847, 15862340, 16285312, 16734008, 17262201, 17917379, 18687138, 19491521, 20241523, 20892634, 21446013, 21928774, 22383335, 22852181, 23359307, 23917003, 24548917, 25287406, 26151489, 27151788, 28313839, 29663155, 31179537, 32796980, 34466327, 36203403, 38072550, 40147179, 42492487, 45155845, 48152942, 51480737, 55164338, 59284950, 63952348, 69256494, 75247785, 81950410, 89388956, 97612688, 106697133, 116713942, 127705522, 139705385, 152771628, 166961800, 182253957, 198492967, 215385780, 232480464, 249101148, 264316738, 277022761, 286118318, 290710982, 290304611]
36008B90304611n382253r825778j3380515j5889568j7339741j7805433j7449940
36001A93231383j6526298j5316025j4039402j2811909j1665817j0597517r601193
35994A02673222q679300p839868p090817o432501n850046n318490m825083m380564
35986E2256553l993059l636028l266249k878165k517437k230250k016582j839972
35978B9878811j662866j466227j260229j085492r74762r00571p97118o57502n69519
35969B0504525o12118p42386q35349q24866p56458p02930o79602o59702o32485
35960A4058629o14715o19601o35483o31351n77638m72053l52082k73379k66743
35951I615584l14137l63269l64916l08638k33489j94348k03639k13584j70572
$$ y = [290304611, 284922358, 275096580, 261716065, 245826497, 228486756, 210681323, 193231383, 176705085, 161389060, 147349658, 134537749, 122871932, 112274415, 102673222, 93993922, 86154054, 79063237, 72630736, 66780690, 61462200, 56637117, 52256553, 48263494, 44627466, 41361217, 38483052, 35965615, 33735365, 31718783, 29878811, 28215945, 26749718, 25489489, 24403997, 23429235, 22528664, 21731546, 21074044, 20504525, 19892407, 19150021, 18314672, 17489806, 16733348, 16030418, 15350816, 14691114, 14058629, 13443914, 12824313, 12188830, 11557479, 10979841, 10507788, 10155706, 9882327, 9615584, 9301447, 8938178, 8573262, 8264624, 8031135, 7836787, 7633148, 7419564, 7248992]
35942G248992p9507J795K4049j6975r6860j87329k60923k96179k93153k74898
35932E769012k66716k79482l10316l43979l50011k95678j76213l0051Q2278J16719
35922C915563P0946j4963p9951p8975j6410N3074O5797K563r4277j59194j59661
35911C504512j11593m4623K8631R9543J41692J30261P7193K0066k3367o1354q5965
35900C674996n8044M8169K05427L52598M38286M41935L77963K88613K03682R4927
35890F068552r3585l46067n41777n61298m09131j99567l9257M3850P6830R4317
35880D092867J12270J13845O2639m2408j35210j41148o2882K6831P1668P0957
35870D169429L6968l2747j19971j63045j01553O8492K92194M87401N77468N31995
$$ y = [7248992, 7169485, 7171280, 7195329, 7178354, 7081494, 6894165, 6633242, 6337063, 6043910, 5769012, 5502296, 5222814, 4912498, 4568519, 4218508, 3922830, 3746617, 3716566, 3798844, 3915563, 3986509, 3971546, 3891595, 3812620, 3796210, 3849284, 3915081, 3917644, 3823367, 3664173, 3504512, 3392919, 3348296, 3376927, 3476470, 3618162, 3748423, 3825616, 3845682, 3822315, 3760961, 3674996, 3616952, 3665121, 3870548, 4223146, 4661432, 5103367, 5481330, 5769943, 5973625, 6068552, 5974967, 5628900, 5087123, 4525825, 4116694, 3917127, 3877870, 3921720, 3998550, 4092867, 4205137, 4318982, 4381621, 4339213, 4204003, 4062855, 3999973, 4026804, 4098472, 4169429, 4206397, 4173650, 4053679, 3890634, 3789081, 3857573, 4149767, 4637168, 5214636, 5746631]
35860E746631L99931K80387K38467K61432L03370L44248L88163M36090M95277
35851H893996N98921P77957J011471J232821J395609J522866J686131J940257
35843A9060029K277039K640429K992974L367029L836427M434552N120606N832685
35835D9561770O535017P168401P564263P462135O648863N085497K915718L97781
35827I3339445k148638m380055o009747o917219p187237p025356o624257o096477
35819D6950459n498208m873608m262643l689948l171680k730772k387073k128433
35811A8208094j906713j675822j432256j210114j036171q99304p70498o43996
35803H633220n40513m65580l85084k63668j20979k5683k7354j09860k16060k99598
$$ y = [5746631, 6146562, 6426949, 6665416, 6926848, 7230218, 7574466, 7962629, 8398719, 8893996, 9492917, 10270874, 11282345, 12515166, 13910775, 15433641, 17119772, 19060029, 21337068, 23977497, 26970471, 30337500, 34173927, 38608479, 43729085, 49561770, 56096787, 63265188, 70829451, 78291586, 84940449, 90025946, 92941664, 93339445, 91190807, 86810752, 80801005, 73883786, 66696549, 59671193, 53046936, 46950459, 41452251, 36578643, 32316000, 28626052, 25454372, 22723600, 20336527, 18208094, 16301381, 14625559, 13193303, 11983189, 10947018, 10047714, 9277216, 8633220, 8092707, 7627127, 7242043, 6978375, 6857396, 6831713, 6804359, 6694499, 6478439, 6178841]
35793F178841l43366l48160l24259k85498k34138j58068n9735J8848K3675n1816
35783D416324j48483j90140j44307l5213Q7499J80756K18873J97408J42156J04749
35773D829622J22977J71495J66990M4113j74433l95114n31425n47049m39704k29440
35763C018032K3330K29074L34574L65083L78497L88915L56173K41324N1830j62638
35753E224194l42801m53440m99084n05333m84215m32616l64498l11723k75766
35744A554718k12199r5718K3676O8268K3640n2517j00007r7526m7208L3567J00835
35733A199529J07506N3043j7778p1969j15453j59742j97676k24672k50617k71816
35723E0355k58371j91321r3900q132M4108O3191N3567K2300j5071m2566n2958
$$ y = [6178841, 5835475, 5487315, 5163056, 4877558, 4643420, 4485352, 4425617, 4444465, 4468140, 4416324, 4267841, 4077701, 3933394, 3898181, 3985680, 4166436, 4385309, 4582717, 4724873, 4829622, 4952599, 5124094, 5291084, 5335197, 5160764, 4765650, 4234225, 3687176, 3247472, 3018032, 3041362, 3270436, 3605010, 3970093, 4348590, 4737505, 5093678, 5335002, 5386832, 5224194, 4881393, 4427953, 3928869, 3423536, 2939321, 2506705, 2142207, 1830484, 1554718, 1342519, 1246801, 1270477, 1338745, 1362385, 1309868, 1209861, 1112335, 1065127, 1098694, 1199529, 1307035, 1360078, 1342300, 1270331, 1154878, 995136, 797460, 572788, 322171, 50355, -208016, -399337, -493237, -501369, -457261, -394070, -340503, -318203, -333274, -375840, -428798]
35712d28798m5081k4484j0189k1465m6122l7521M0777J71738K92368L39743K92419
35701E23385J83008P6722K6790M2814R9901J63431J92137J39688p969j98235l49187
35690H92485m25648m48235m29391l48102k05250n9138K9011N9558P5505J01015
35680g58190J28076J46259J53719J46609J22858R2421O7206M7917L1782J9381
35670A98038K582l3655q0628r9723p0807k7565j8087m5684p4899p9501n4594K379
35658c82144Q4977J59810J93570J98298K15955K55653K79174K55853K02600J60825
35648A624571J58588K00830K66786L05979K68545J63092O5194M5395R7888J54009
35638C350877J52961Q5123j6395j00384j20001o0282M5255J39318J93265K28894
$$ y = [-428798, -473879, -498363, -508552, -530017, -576139, -613660, -572883, -401145, -108777, 230966, 523385, 706393, 783115, 809905, 852719, 952620, 1116051, 1308188, 1447876, 1439907, 1241672, 892485, 466837, 18602, -410789, -758891, -964141, -1023279, -994268, -934710, -859205, -758190, -630114, -483855, -330136, -183527, -60669, 31752, 98958, 146875, 178657, 198038, 200620, 166965, 86337, -13386, -84193, -111758, -129845, -175529, -250428, -329929, -384523, -382144, -297167, -137357, 56213, 254511, 470466, 726119, 1005293, 1261146, 1463746, 1624571, 1783159, 1983989, 2250775, 2556754, 2825299, 2988391, 3053585, 3098980, 3196868, 3350877, 3503838, 3588961, 3572566, 3472182, 3352181, 3291899, 3337154, 3476472, 3669737, 3898631]
35628C898631K79629L34489L33403K25637K7548j87537l56333m70346n51035n99640
35618B934446n92281n18611m01702k74042j51603l9976N0356J09954J42366J56127
35608A415034J51898J33555J26313J59293K20361K46681J81281L8654r8366j50844
35598B423860j10398m0545k2002r0810k11269l02950l07102k36053j51879r6985
35588H53867o2101k6775m339k2582p4863j20144j30054j13309r4499q8850r4640
35577B1711q6808k1795J18835K82982L76752L51891K40839R9523m5464j72136
35567A166330k31803j95336j14140p9684j14183j44046j00624j4214K1991l4683
35557A59608j30246j80291j54776q4539n842P1016J38709J72662J57441J15638
$$ y = [3898631, 4178260, 4512749, 4846152, 5071789, 5099337, 4911800, 4555467, 4085121, 3534086, 2934446, 2342165, 1823554, 1421852, 1147810, 996207, 956231, 1006587, 1116541, 1258907, 1415034, 1566932, 1700487, 1826800, 1986093, 2206454, 2453135, 2634416, 2673070, 2574704, 2423860, 2313462, 2272917, 2250915, 2160105, 1948836, 1645886, 1338784, 1102731, 950852, 853867, 791766, 764991, 760652, 738070, 663207, 543063, 413009, 299700, 205201, 116351, 21711, -65097, -86892, 31943, 314925, 691677, 1043568, 1284407, 1383930, 1338466, 1166330, 934527, 739191, 625051, 545367, 431184, 287138, 186514, 172300, 194291, 159608, 29362, -150929, -305705, -390244, -396086, -325070, -186361, -13699, 143742, 259380]
35547B59380Q1819N6359J6745k7655l0522K9075J11621J63910J75386J68184J56543
35536A160845J41602J25576J02952N4190k2686q8318j00473o5136j7529L6287
35526A327310J17540K13822K62658K14768Q9746m5862j38475j77245j86051k01824
35516A476387k47958l14129l65336l74396l39544k73506j90541j06237l3216L0235
35506g38241R5706J63420K16304K40313K40194K29172K11470J81129J33164P2514
35496A045145J3716l1461p0478j26591k08669k91081l38132l45368l41673l50582
35486a045174l62402l45727k77863j67161n4124J7500M3587O5153J16395J78838
35476a830978K07503J90487J54833J22562R6304Q6970J14410J66756J92179J51781
$$ y = [259380, 341199, 397558, 414303, 386648, 356126, 385201, 496822, 660732, 836118, 1004302, 1160845, 1302447, 1428023, 1530975, 1585165, 1562479, 1474161, 1373688, 1308552, 1291023, 1327310, 1444850, 1658672, 1921330, 2136098, 2225844, 2179982, 2041507, 1864262, 1678211, 1476387, 1228429, 914300, 548964, 174568, -164976, -438482, -629023, -735260, -768476, -738241, -642535, -479115, -262811, -22498, 217696, 446868, 658338, 839467, 972631, 1045145, 1058861, 1027400, 956922, 830331, 621662, 330581, -7551, -352919, -694592, -1045174, -1407576, -1753303, -2031166, -2198327, -2252451, -2234951, -2191364, -2126211, -2009816, -1830978, -1623475, -1432988, -1278155, -1155593, -1059289, -972319, -857909, -691153, -498974, -347193]
35466c47193O0585l5770r9739j03219k1363J41936L30689M62073M78448L76629
35456A243076K06039M6697l5916l7628r477N775J6546N1963J10139J56993J63036
35445A917243J24786O4243K3200L9620J07320J72614J90841J69419J32916O9720
35435C011922m7300j99498l27160l98390m33754m54106m44417l90144l16199k58204
35425b57250k12188j42962l7415P3923J48259J66285J36289P9249J6404l8541
35415f7947q3860j25020j61966j82220j68698j14805l2530N2002J09582J18794
35405f56668P5905J056p0338j14327j39435j72704k21861k61561k63008k26073
35395b049014j71549j12611n2879r583j3756p2450j42886j65235j26241p7186
$$ y = [-347193, -286608, -322378, -422117, -525336, -546699, -404763, -74074, 387999, 866447, 1243076, 1449115, 1495812, 1459896, 1422268, 1412791, 1418566, 1435112, 1487075, 1597214, 1754207, 1917243, 2042029, 2106272, 2129472, 2169092, 2276412, 2449026, 2639867, 2809286, 2942202, 3011922, 2964622, 2765124, 2437964, 2039574, 1605820, 1151714, 707297, 317153, 954, -257250, -469438, -612400, -649815, -575892, -427633, -261348, -125059, -45810, -29406, -67947, -151807, -276827, -438793, -621013, -789711, -904516, -937046, -885044, -775462, -656668, -580763, -579707, -650045, -764372, -903807, -1076511, -1298372, -1559933, -1822941, -2049014, -2220563, -2333174, -2386053, -2395636, -2409392, -2481842, -2624728, -2789963, -2916204, -2993390]
35385b993390p6499j18668j35011o8763O4994K03043K99876L48401L48519K92870
35375a834628J93426R1712K3341q061o983L6820J19744J94194K05446J54611R4907
35364g35471P0152Q8902J53092K63165L76112M00251K73286L7292j88516l06222
35354D32043k98681k07281p8978O0404J96960L06466L50366L05822J99312R0460
35344A356893J0896o3831j64927k68621l08189k43380r9851N2917J41981J20521
35334E34409l207j52524k26247j82996p8149p357j9716q8485j47917j43812o2975
35323e78976O1743J72390K25970K22455J96558J88019K16950K68268K89554K24365
35313A487296P1566r6847j99849k25373k24686k37170k50912k38736j99225j46911
$$ y = [-2993390, -3069889, -3188557, -3323568, -3392331, -3327337, -3124294, -2824418, -2476017, -2127498, -1834628, -1641202, -1549490, -1526149, -1534210, -1541193, -1504373, -1384629, -1190435, -984989, -830378, -735471, -665319, -576417, -423325, -160160, 215952, 616203, 889489, 926781, 738265, 432043, 133362, -73919, -152897, -92493, 104467, 410933, 761299, 1067121, 1266433, 1356893, 1367789, 1303958, 1139031, 870410, 562221, 318841, 218990, 271907, 413888, 534409, 531202, 378678, 152431, -30565, -108714, -116071, -135787, -224272, -372189, -516001, -578976, -517233, -344843, -118873, 103582, 300140, 488159, 705109, 973377, 1262931, 1487296, 1558862, 1462015, 1262166, 1036793, 812107, 574937, 324025, 85289, -113936, -260847]
35303b60847q7060j9011N2120J21129J83218K17483J93295J11453J6585n3411
35293D74954j06729j58968j81531j31738k0967R2552J72491K18106K12493J18980
35283F89643n0294k15648l12754l51631l57943l01707j42967P3988K32938K54657
35273d81718J55701P591j16635j61106j12510k7151J2273o714p194P3566J94318
35262d69579K58482K29664J59151J09154Q8593O9301L3951p006l0869k4070N356
35251D22128L3250M2078L5318K2167m372n8802j35605k08090k57321k87060l06035
35240g02344l10419k90447k40995j58105l9421J00096K25343L09881L60347L96353
35230c49711M12645L82312K99661J99885J25811Q5826N1502j3696j28116k76760
$$ y = [-260847, -347907, -366918, -314798, -193669, -10451, 207032, 400327, 511780, 528365, 474954, 368225, 209257, 27726, -104012, -124979, -32427, 140064, 358170, 570663, 689643, 639349, 423701, 110947, -240684, -598627, -900334, -1043301, -969313, -736375, -481718, -326017, -318426, -435061, -596167, -708677, -735828, -723555, -730269, -737463, -663897, -469579, -211097, 18567, 177718, 286872, 375465, 444766, 478717, 471711, 440842, 416772, 422128, 455378, 497456, 532774, 554941, 550569, 491767, 356162, 148072, -109249, -396309, -702344, -1012763, -1303210, -1544205, -1702310, -1741731, -1641635, -1416292, -1106411, -746064, -349711, 62934, 445246, 744907, 944792, 1070603, 1156429, 1207931, 1194235, 1066119, 789359]
35220G89359m06673m49376l70420k00119p178J51553K45034K51415J65761L1498
35210B00854p0872r3456o5148m5704m9581m1320J637N4891Q4356R2211J07372
35199A75240J41398J69764J53560P0425p1243k35120l69114m23239l71456k31815
35189i91600o9158L8406N9101L8383N4917J35844K24830K42705J70554O1422k1688
35178e6284o0907p7616r3846j14994j40186j67764j84223j62335q4661L4224J59203
35167i49389K65061L42681L78005L48483K53170J28648J5637p7876j57537j99160
35157C47723j62083n2879N9667J15468J26482J45709J91971K34705K40497J98050
35147A445310R8893o3987k57258l96843m11746l15518j92468j12169p3694l4276
$$ y = [789359, 382686, -66690, -437110, -637229, -644407, -492854, -247820, 3595, 169356, 200854, 129982, 36526, -28622, -74326, -123907, -165227, -163590, -108699, -24343, 67868, 175240, 316638, 486402, 639962, 710387, 639144, 404024, 34910, -388329, -759785, -991600, -1060758, -1022352, -963251, -924868, -869951, -734107, -509277, -266572, -96018, -34596, -56284, -117191, -194807, -288653, -403647, -543833, -711597, -895820, -1058155, -1142816, -1108592, -949389, -684328, -341647, 36358, 384841, 638011, 766659, 782296, 704420, 546883, 347723, 185640, 132761, 192428, 307896, 434378, 580087, 772058, 1006763, 1247260, 1445310, 1544203, 1480216, 1222958, 826115, 414369, 98851, -93617, -205786, -279480, -313756]
35137c13756K8976R9296J47526J56572J18982L5513o4031j11194m4181J19138
35127A72841K68289K83653J38609q4237k67307l34981k72953j12242Q5064K44494
35117A21230L13900K87100J90673N7982p3502j56141j55048q5353p437K8330K3259
35106E44993Q907m140l9513j17745k17969k83414k65077j63529l3098N7276P5780
35095d37529M6665J8954J7433K5038R445l8877r4697j18758q9250j7387O3887
35084f15076J25721J58356J64497J48335J19940J03767J24212J73872K06308J73400
35074H83332O9460o6740j88182k69130l05656l05054k80287k41881j86979j05829
35064i96946p826P0117R7207Q5816P6387Q4257Q1398M0498k0228n2901l0122L8771
$$ y = [-313756, -284780, -185484, -37958, 118614, 237596, 273109, 209078, 97884, 53703, 172841, 441130, 724783, 863392, 779155, 511848, 176867, -96086, -208328, -123264, 121230, 435130, 722230, 912903, 970885, 897383, 741242, 586194, 500841, 493404, 521734, 544993, 553900, 549760, 510247, 392502, 174533, -108881, -373958, -537487, -570585, -513309, -437529, -390864, -371910, -354477, -329439, -319994, -358871, -453568, -572326, -661576, -678963, -615076, -489355, -330999, -166502, -18167, 101773, 205540, 329752, 503624, 709932, 883332, 952792, 886052, 697870, 428740, 123084, -181970, -462257, -704138, -891117, -996946, -1004772, -934655, -837448, -751632, -675245, -590988, -509590, -469092, -489320, -542221, -572343, -533572]
35052e33572J32390K30948L02166L03363K20297R2581k0603r8195j66044k49221
35042B14110l29699l55245k84289j25634N5857J77918K03388J68884J39341J34285
35032a084J17716O4096O062o062K4255L9157j730p1377j05753p2544l891L1930
35020B0775j0286j12702k08429k37996j92818j06566j8300M8218Q8779J25920
35010f03405J98391L09952L92404L60331K15591O1204j1135j6249l0097p9582
35000G97405j21389j15619p1655j8952K2359K7782l3248j54917k72848l15036
34990b56118k70660j92629j39134j24448j16214o6124M7394J90348K93069L13785
34980c20731K75657K25255J66272O5156p4388j77195j65325n0716O7890J06054
$$ y = [-533572, -401182, -170234, 131932, 435295, 655592, 748173, 727570, 629375, 463331, 214110, -115589, -470834, -755123, -880757, -824900, -646982, -443594, -274710, -135369, -1084, 116632, 180728, 186790, 180728, 204983, 244140, 242410, 171033, 65280, -7264, -11155, 20775, 10489, -102213, -310642, -548638, -741456, -848022, -866322, -818104, -729325, -603405, -405014, -95062, 297342, 657673, 873264, 934468, 923333, 907084, 876987, 797405, 676016, 560397, 488742, 469790, 492149, 519931, 486683, 331766, 58918, -256118, -526778, -719407, -858541, -982989, -1099203, -1165327, -1117933, -927585, -634516, -320731, -45074, 180181, 346453, 411609, 337221, 160026, -5299, -56015, 11875, 117929]
34970A17929P4361M9070P8601J40483J85363J92806J67821J07880R961r2476j37127
34959H94672r6474j4349L8731L4385j486k7183j5724L7501J07891J43705R9679
34948A201348k3571j82350l25470m11673m05018k89900j02868P3955J67863J57085
34938a40599O1517p9136k06983k58068k07091r4199J4294Q7281J34734J64331
34928e23919J61863J17673M6238l2220j10360j78775k08486j72064q0075K4167
34918i55958J11304J89044K65973L08062K57182R6133j23112l21936m48959m86493
34908a108760m33392l11814j77433q4200l0801L1731J30028K30771K86558K95659
34898a171653K93277K97302K88592K44204J72005J06664P6546P4554O2865J5700
$$ y = [117929, 192290, 241360, 319961, 460444, 645807, 838613, 1006434, 1114314, 1124275, 1031799, 894672, 798198, 783849, 822580, 856965, 855479, 828296, 812572, 850073, 957964, 1101669, 1201348, 1177777, 995427, 669957, 258284, -146734, -436634, -539502, -465547, -297684, -140599, -79082, -158218, -365201, -623269, -830360, -924559, -910265, -822984, -688250, -523919, -362056, -244383, -198145, -230365, -340725, -519500, -727986, -900050, -980125, -955958, -844654, -655610, -389637, -81575, 175607, 271740, 148628, -173308, -622267, -1108760, -1542152, -1853966, -2031399, -2115599, -2146400, -2114669, -1984641, -1753870, -1467312, -1171653, -878376, -581074, -292482, -48278, 123727, 230391, 306937, 381491, 444356, 460056]
34888D60056m3387o4434l5025L726J9301L7418R9196J87969K39353K20442J59279
34877A283894Q9205M202j07371k13226k54462k05771r6639K3647J23449J93681
34867H40609K37431K64700K83968K84364K32809J09961m4182j42116j31617o0644
34857A875283l0835q1829j52012j66877j30865j00790r7266r0929o7543n5212
34847I01125p5019j04439j09557q7172n9609n1436q2183j52272k20049k26113
34837b66724j67391j18025j41157k01747k09014j33534l5944K1373M3491O7316
34827a141356R7736J12262J07670J06886J23602J45710J54090J36058P8301k7311
34817a06352j55495k43619k41803j66469q7465o1689r2473j46374j80007j46415
$$ y = [460056, 416669, 352235, 317210, 320936, 340237, 377655, 476851, 664820, 904173, 1124615, 1283894, 1373099, 1377301, 1269930, 1056704, 802242, 596471, 499832, 523479, 646928, 840609, 1078040, 1342740, 1626708, 1911072, 2143881, 2253842, 2209660, 2067544, 1935927, 1875283, 1844448, 1762619, 1610607, 1443730, 1312865, 1212075, 1114809, 1023880, 956337, 901125, 826106, 721667, 612110, 524938, 465329, 413893, 331710, 179438, -40611, -266724, -434115, -552140, -693297, -895044, -1104058, -1237592, -1273536, -1252163, -1208672, -1141356, -1043620, -931358, -823688, -716802, -593200, -447490, -293400, -157342, -79041, -106352, -261847, -505466, -747269, -913738, -1001203, -1062892, -1155365, -1301739, -1481746, -1628161]
34807a628161j6934J69811L06645L11989K23272J57516J73568K08403J60624M368
34797G1101j93681l37533l61792k63014j09102l897p928r0203j67832j80532j15571
34786a759984J2369J70047L03189L59759L24812K22159Q9725l4073j19803j72080
34776f03880k32713l24612l98480l73357k34770n8798P0071J33736J63422J84078
34766a675303K00669K15571K29454K33520K23274K14844K28494K56677K63847
34757C91047K21863J38654N1309k762p082L2116R2287J36726J22635L2253r5414
34746A113632j85746k01408j81232j86512k23495k47155k29891j87926j40214
34737f69947q4072k6447k138l3853r5819j40475j45544j16523o0676J8493J12643
$$ y = [-1628161, -1645095, -1475284, -1168639, -856650, -633378, -475862, -302294, -93891, 66733, 71101, -122580, -460113, -821905, -1084919, -1194021, -1197918, -1205846, -1296049, -1463881, -1644413, -1759984, -1747615, -1577568, -1274379, -914620, -589808, -367649, -277924, -311997, -431800, -603880, -836593, -1161205, -1559685, -1933042, -2167812, -2226610, -2156539, -2022803, -1859381, -1675303, -1474634, -1259063, -1029609, -796089, -572815, -357971, -129477, 127200, 391047, 612910, 751564, 802873, 800111, 793029, 825145, 917432, 1054158, 1176793, 1209046, 1113632, 927886, 726478, 545246, 358734, 135239, -111916, -341807, -529733, -669947, -754019, -780466, -782604, -816457, -912276, -1052751, -1198295, -1314818, -1375494, -1357001, -1244358]
34726a244358K13713L17278M05981M46264M23107L63580L00751K26076J09078
34717A561470l9010j54808j87037j50367j03347q5781q7193o8101n150P9472J31074
34706H91222J13168M9711J0018M4143J32019J97239J72659N7488q5093j84428
34696A398146k13127j81354r7504L8186J96470L04757K96717J71700p028j62993
34686A743970k43735k27741j27469J1337J35568K19314K65326K77217K47432J73352
34676B474571O7824n1434j70301k72400l38110l57898l42015l13945k95997k96052
34666A04243l01019k89094k57885k33182k36748k52201k38504j72361o2977O4199
34656a875529J74835K26224J96080J17835N8984N3976Q1023J08636J30681J41120
$$ y = [-1244358, -1030645, -713367, -307386, 138878, 561985, 925565, 1226316, 1452392, 1561470, 1522460, 1367652, 1180615, 1030248, 926901, 841120, 753927, 685826, 680676, 760148, 891222, 1004390, 1054101, 1064119, 1108262, 1240281, 1437520, 1610179, 1667667, 1582574, 1398146, 1185019, 1003665, 906161, 944347, 1140817, 1445574, 1742291, 1913991, 1906963, 1743970, 1500235, 1272494, 1145025, 1156362, 1291930, 1511244, 1776570, 2053787, 2301219, 2474571, 2542395, 2490961, 2320660, 2048260, 1710150, 1352252, 1010237, 696292, 400295, 104243, -196776, -485870, -743755, -976937, -1213685, -1465886, -1704390, -1876751, -1939728, -1875529, -1700694, -1474470, -1278390, -1160555, -1101571, -1047595, -966572, -857936, -727255, -586135]
34646e86135J11807K7515p9196j59172j97480k07130j92846j56849j24317j16913
34636a680716j04054k9834R8681J94003J84438R6304J3861j3815P237O2277J42404
34625a029214K14078K24641J61923P9463L7069L4735L0280O705j2473j3263j9343
34614b85399n1668q3714o4238K1680J34714K20086K43954J94911Q0918n8445j57518
34603A95281j69860j08173k5447L9765Q4212J11478J08662O4569l994o2159r0661
34592A43673r8022j00550j00829q6827m3217L7514J42809K31723K50449J73981
34582E50704L6667q6610j34503r5563q35J03918J79854K11560K16693K27177K46619
34571A455681K38238J72939P7194N625l0279p4440j61810k73368l67790m24686
$$ y = [-586135, -474328, -446813, -526009, -685181, -882661, -1089791, -1282637, -1439486, -1563803, -1680716, -1784770, -1814604, -1715923, -1521920, -1337482, -1241178, -1227317, -1241132, -1233895, -1171618, -1029214, -815136, -590495, -428572, -349109, -312040, -277305, -247025, -240320, -252793, -266056, -285399, -337067, -420781, -485019, -463339, -328625, -108539, 135415, 330326, 411244, 352799, 195281, 25421, -82752, -108199, -68434, 15778, 127256, 235918, 300487, 296493, 234334, 143673, 45651, -54899, -155728, -242555, -285772, -248258, -105449, 126274, 376723, 550704, 587371, 500761, 366258, 270695, 269860, 373778, 553632, 765192, 981885, 1209062, 1455681, 1693919, 1866858, 1944052, 1949677, 1919398, 1844958, 1683148, 1409780, 1041990, 617304]
34561F17304m33511l73662k47825j17209n4160n7269n5423o228M8732M6746j0337
34550f42842o1143n5157R429J03787J94140K51578K60202K22094J47999M9772
34540D79859m9364j11745j13632p1905k5939J338Q907k714k8642m0141j155Q5657
34528A30524J73665K23492K36797K27336J84019Q6246n7964k11393l38460m22052
34518B32210m61614m74080m86242n01465m78680l72110j96671l0523N5781N2930
34508b660464j0518j13702k36076l21538k96466j45336N0823J77249J88016J35584
34498c232428J03307J27494J89229K57064L10845L29530K87449J80738M6124o2390
34488a463038j14603j17144r3928o3452k9452J7275Q5431J62952K15785K21222
$$ y = [617304, 183793, -189869, -437694, -554903, -609063, -666332, -721755, -727983, -679251, -632505, -642842, -703985, -759142, -749713, -645926, -451786, -200208, 59994, 282088, 430087, 479859, 430495, 318750, 205118, 133213, 107274, 108612, 117519, 114805, 86163, 46022, 44867, 130524, 304189, 527681, 764478, 991814, 1175833, 1262079, 1204115, 992722, 654262, 232210, -229404, -703484, -1189726, -1691191, -2169871, -2541981, -2738652, -2769175, -2713394, -2660464, -2670982, -2784684, -3020760, -3342298, -3638764, -3784100, -3733277, -3556028, -3368012, -3232428, -3129121, -3001627, -2812398, -2555334, -2244489, -1914959, -1627510, -1446772, -1400648, -1463038, -1577641, -1694785, -1788713, -1852165, -1881617, -1864342, -1778911, -1615959, -1400174, -1178952]
34478a178952K01622K07857K59897L13507K99085J95476N8993k6515k9722J886
34468C03134r1m6783q4538o3962N302P9431J36487J81111K07337J94284J43576
34457A055288Q8540N1648J8279k9056p3688q8263q0682q7212j23671j69012j96682
34446C65489j96554j62411q6855J4774R6307J20188R8333P7061Q8220J32171J99595
34435G46318K79761L41270L36499K51682J38511O7034M8210K6800m7110j63879
34425B025096k76462l46294l49849k70961j25744J6799Q3258P3834N7402P2985
34415I60064O9084k7559k00939l41990l59199k65543j45737o0802o321M6659R9180
34404b33103J25650J13688Q4674P3697R8886J49176J88681J72349P8987n6367
$$ y = [-1178952, -977330, -769473, -509576, -196069, 103016, 298492, 357485, 330970, 301248, 303134, 303043, 256260, 171722, 107760, 113062, 192493, 328980, 510091, 717428, 911712, 1055288, 1143828, 1195476, 1213755, 1184699, 1111011, 1022748, 942066, 854854, 731183, 562171, 365489, 168935, 6524, -80331, -65557, 30750, 150938, 249271, 326332, 414552, 546723, 746318, 1026079, 1367349, 1703848, 1955530, 2094041, 2161075, 2209285, 2236085, 2188975, 2025096, 1748634, 1402340, 1052491, 781530, 655786, 672585, 755843, 829677, 887079, 960064, 1029148, 1001589, 800650, 458660, 99461, -166082, -311819, -372621, -378942, -332283, -233103, -107453, 6235, 90909, 164606, 263492, 412668, 601349, 773698, 852685, 796318]
34394G96318j58762j82243j52124j18298q1233L16J32263K60710L39183L79373
34384A215503M05345L90554K85859R9864q9204k03978k20952j55587l5262R4649
34374A786791J68547J40505K8840r4902j67623j84272j89514k24907k84952l24124
34364F54389l04126k28228j30126m2334J6438L6599J9784j6759n3353q7025j27705
34353b62446j77653k26174k62452k81226k78039k52906k18165j88918j65524j38398
34343b451901j07756q1741n5170r652O0524J39224K08077K55205K59566J93675
34333a589949O2339p6244j50351j33422n3648M4376J32658K02746K56254K97794
34323a007447L29818L51944L65393L70365L54258K93637J81162M6948n8719j04891
$$ y = [796318, 637556, 455313, 303189, 184891, 103658, 103974, 236237, 496947, 836130, 1215503, 1620848, 2011402, 2297261, 2397125, 2307921, 2103943, 1882991, 1727404, 1692142, 1786791, 1955338, 2095843, 2124683, 2029781, 1862158, 1677886, 1488372, 1263465, 978513, 654389, 350263, 122035, -8091, -50425, -33987, 2612, 22396, 5637, -47716, -134741, -262446, -440099, -666273, -928725, -1209951, -1487990, -1740896, -1959061, -2147979, -2313503, -2451901, -2559657, -2641398, -2696568, -2706220, -2645696, -2506472, -2298395, -2043190, -1783624, -1589949, -1527610, -1603854, -1754205, -1887627, -1941275, -1896899, -1764241, -1561495, -1305241, -1007447, -677629, -325685, 39708, 410073, 764331, 1057968, 1239130, 1286078, 1227359, 1122468]
34313A122468r7162o0798j8650J2931J8506j2107o7369j06549q3809P457J17805
34302H32723J80542J67005R7778J2240n2132o1027l876P3941R3483K4609p2627
34291A292659j14153q4186l4343l713K4179Q1267J61468K22981K32903J99985
34281A979047J63987J50586J37413P8825l0015j36769j98003k38248l10889m14945
34271A180989m89479m86025m07977k79866j24525J6182Q4541O3852P394j6747
34261d51661O247M2578O0775N6587M7580O6600J42273K59676L54368L70518L14285
34250A269826K31322J52905R2051O7755Q6594J08322P7416n311q2109j16394j30592
34239A751785j52327j65442j43259r8290o1539k9627K8854J14847J76505J56173
$$ y = [1122468, 1025306, 964508, 945858, 958789, 977295, 965188, 897819, 791270, 707461, 714918, 832723, 1013265, 1180270, 1278048, 1290288, 1238156, 1177129, 1173253, 1247194, 1340677, 1365286, 1292659, 1178506, 1094320, 1059977, 1056264, 1080443, 1161710, 1323178, 1546159, 1779062, 1979047, 2143034, 2293620, 2431033, 2509858, 2479843, 2343074, 2145071, 1906823, 1595934, 1180989, 691510, 205485, -202492, -482358, -606883, -590701, -506160, -442308, -434914, -451661, -445414, -402836, -342061, -285474, -237894, -171294, -29021, 230655, 585023, 955541, 1269826, 1501148, 1654053, 1746104, 1813859, 1900453, 2008775, 2086191, 2080880, 1998771, 1882377, 1751785, 1599458, 1434016, 1290757, 1192467, 1130928, 1101301, 1130155, 1245002, 1421507, 1577680]
34229A577680M8258r4175k04018k50597k50664k33207k02061j44549o9314j0139
34219A67214J5189K6688M8388P1141O6351K2049n1728j38461k15535k51895k29766
34208d70365j63459p9415J1010R7037J42848J15057L8156j1829J7107J04188J89205
34197a0460K30621K20129J65343Q0924j2799r8727j68370k15415k35207k34365
34187b78326k25872k08512j66999r9895k8989L0311Q9259J61531K36593K96483
34177a94416L42639L78800L73631K70088M4245k51455n03426n96114m80891k17984
34167h34883M9238J88347J65471M5970p7793j46919j44672q6316j4200K3043J1374
34156h21340j2724r01N3085J06069J12467P3295L3957L2148N3987N3094J1862
$$ y = [1577680, 1625938, 1531763, 1327745, 1077148, 826484, 593277, 391216, 246667, 177353, 167214, 182403, 209091, 257479, 328620, 394971, 417020, 365292, 226831, 11296, -240599, -470365, -633824, -713239, -702229, -605192, -462344, -347287, -309131, -320960, -303853, -199665, -10460, 220161, 440290, 605633, 686557, 673758, 575031, 406661, 191246, -43961, -278326, -504198, -712710, -879709, -979604, -1008593, -978282, -889023, -727492, -490899, -194416, 148223, 527023, 900654, 1170742, 1214987, 963532, 460106, -136008, -616899, -834883, -785645, -597298, -431827, -385857, -463650, -610569, -755241, -841557, -855757, -832714, -821340, -834064, -834965, -781880, -675811, -563344, -490049, -456092, -423944, -369957, -316863, -305001]
34145c05001l6003n3592m8493m8133m3182R808J30121K87090M33018N27781N26416
34134A379830L90224J44700j01237k36453k45650k02167j71321j48978r3321J1985
34124G27612J33872K08993J82477N0878j19482k30703k26584j30643j4909N9331
34114F40842P4519N4122L9308N4148P9275O6392j1125j27865k32062k88643k86259
34103F2652k20933j02322K6937J09799J25615J02509O9041J8811n5484j17454
34093A9171j18050o8914m1582p4102j09616n9797Q4374K37631L14968L11660K79048
34082G74791K45393J85451O5120j03954k65458l68518m05430l96946l53610k69029
34072h92190j49228k6409O7386J24131J44932J20521N0119l2901q4373r6289r2762
$$ y = [-305001, -341004, -394596, -443089, -491222, -534404, -524596, -394475, -107385, 325633, 853414, 1379830, 1770054, 1914754, 1813517, 1577064, 1331414, 1129247, 957926, 808948, 715627, 727612, 861484, 1070477, 1252954, 1303832, 1184350, 953647, 727063, 596420, 581511, 640842, 715361, 769483, 808791, 862939, 942214, 1008606, 997481, 869616, 637554, 348911, 62652, -158281, -260603, -233666, -123867, 1748, 104257, 173298, 192109, 136625, 19171, -98879, -167793, -209375, -283477, -393093, -452890, -368516, -130885, 184083, 495743, 774791, 1020184, 1205635, 1270755, 1166801, 901343, 532825, 127395, -269551, -623161, -892190, -1041418, -1067827, -1000441, -876310, -731378, -610857, -560738, -593639, -678012, -774301, -867063]
34061h67063p9707l2992N0703J21820J20084L2912j03847k43457l45946l79199
34051a726692l37422k57837j92792j58066j22295m9695N7587J59528K12134K06380
34041b209170J83338K02012K76726L52922L62135K95195K02000J26520P1388K9084
34031a07850J4339M3949J01353J43441J40164R8294N0630K5989K1274N25o5415
34020D66693j54508k07596j97545j64409j61392j80477j59280n9966Q1134J84361
34010e52985J89419Q9946o6054j96873k29654j49136r111J09656J53445J16069
34000e45278K9409n1522o9842n51J28878K60007L47563L79648L65156L19184K58535
33989A421187J89884R4472n5843k50098m17367m77536m17530l05445k25760k08727
$$ y = [-867063, -946770, -979762, -929059, -807239, -687155, -654243, -758090, -1001547, -1347493, -1726692, -2064114, -2321951, -2514743, -2672809, -2795104, -2844799, -2787212, -2627684, -2415550, -2209170, -2025832, -1823820, -1547094, -1194172, -832037, -536842, -334842, -208322, -136934, -107850, -93511, -49562, 51791, 195232, 335396, 433690, 484320, 510309, 531583, 532108, 466693, 312185, 104589, -92956, -257365, -418757, -599234, -758514, -818480, -737346, -552985, -363566, -273620, -339674, -536547, -766201, -915337, -924448, -814792, -661347, -545278, -515869, -567391, -637233, -637784, -508906, -248899, 98664, 478312, 843468, 1162652, 1421187, 1611071, 1705543, 1649700, 1399602, 982235, 504699, 87169, -218276, -444036, -652763]
33979f52763k23864k27455k02934j59265j07471n1606L63L0834K6789o042n2523
33968a625937j06171j62120j92751j54749l8685R9672J78918J64777R4304L3168
33958a709574K2669O3415J28818J85261K10582K03803J78642J52139J43335J68690
33948b52220K18094K41530J88070O6354n5975j24576j50138j72970j95604j77803
33938d15238r6501J0045O8571M1135l1135o2118j2510N6006M1800p6063k05673
33927f81681k45383j89973j07283l6645M3488J52517K59377L12486K88645J98418
33917f034P1325m3288q4821k7236Q1546J50209J27743M9401j0190k5706m8449
33906B34500j36633k70255l57355l28032k01642n2652O4961J39071J70016J58488
$$ y = [-652763, -876627, -1104082, -1307016, -1466281, -1573752, -1625358, -1624995, -1594161, -1567372, -1573414, -1625937, -1732108, -1894228, -2086979, -2241728, -2280413, -2180741, -2001823, -1837046, -1742742, -1709574, -1686905, -1623490, -1494672, -1309411, -1098829, -895026, -716384, -564245, -420910, -252220, -34126, 207404, 395474, 461828, 405853, 281277, 131139, -41831, -237435, -415238, -511739, -501694, -433123, -391988, -423123, -485241, -497751, -441745, -399945, -476008, -681681, -927064, -1117037, -1224320, -1260965, -1217477, -1064960, -805583, -493097, -204452, -6034, 65291, 22003, -62818, -90054, -8508, 141701, 269444, 318845, 308655, 282949, 234500, 97867, -172388, -529743, -857775, -1059417, -1112069, -1047108, -908037, -738021, -579533]
33896e79533J19059P2149J7939n3792j22916j39502q1256J1268P3161P4354L2697
33885e76372q876m849O5514J66161K18084J78433R8427O9756J13714J57888J33184
33874F11064N9605Q072n82j7646q6889j82851k51830k86870l21581l54751l27545
33863a151804j99251j7349J20095J60188J26779O8684J2663l0629n0019m1020
33853a001663j0479L8316J08734J88235K39500K28678J55036M8705m6972q9378
33843a41288n9134J4558O8143O1013Q272n2889j08684j60484j89035j59399o5063
33832g83990N1359J29000J37919J02721Q0013J01159J33465J15381L7275l6966
33822F7336m5182R57M4277N9729O7528Q1103Q2621N2667o910q1868j47277j59845
$$ y = [-579533, -460474, -388325, -370386, -424178, -547094, -686596, -767852, -756584, -683423, -609069, -576372, -585248, -590097, -524583, -358422, -140338, 38095, 136522, 206278, 319992, 477880, 611064, 670669, 678741, 678159, 660513, 573624, 390773, 138943, -147927, -469508, -824259, -1151804, -1351055, -1368404, -1248309, -1088121, -961342, -892658, -879995, -910624, -960643, -1001663, -1012142, -973826, -865092, -676857, -437357, -208679, -53643, -4938, -51910, -141288, -200422, -185864, -117721, -56708, -48436, -101325, -210009, -370493, -559528, -718927, -783990, -732631, -603631, -465712, -362991, -282978, -181819, -48354, 67027, 104302, 67336, 22154, 23111, 67388, 127117, 194645, 275748, 358369, 411036, 404126, 322258, 174981, 15136]
33810A5136q6497M4268J48712J64921J06337K9820k2643l3906N450Q6445J60269
33799F18312J60396O0071r8740k35853k91476k64787k05777j66202j51228j20922
33789f96206m0522P9052J92582K58395K56431J84643N8822q4434k01179k65897
33779b58313k82443k69446k38312j86172j08878j8902N5129R2480J00796J05018
33769a009043J18948J37064J49143J46104J12752L9208m8586q9294l8900P8710
33759d03894J82745J94955R2046p8235k20142k50334j64044m0809L0383K9089
33749f28240n86j3643J144L9657R9357J67409K16973K32327K25571K16089K02655
33738G58713J67113J00874J9335m9065q7028j04847j28582j62102j66523r7264
$$ y = [15136, -71361, -27093, 121619, 286540, 392877, 422697, 400054, 366148, 371598, 458043, 618312, 778708, 838779, 740039, 504186, 212710, -52077, -257854, -424056, -575284, -696206, -736728, -657676, -465094, -206699, 49732, 234375, 293197, 208763, 7584, -258313, -540756, -810202, -1048514, -1234686, -1343564, -1362466, -1307337, -1214857, -1114061, -1009043, -890095, -753031, -603888, -457784, -345032, -305824, -354410, -443704, -482604, -403894, -221149, -26194, 65852, -12383, -232525, -482859, -646903, -687712, -657329, -628240, -628826, -642469, -641325, -601668, -502311, -334902, -117929, 114398, 339969, 556058, 758713, 925826, 1026700, 1046035, 996970, 909942, 805095, 676513, 514411, 347888, 250624]
33728B50624L4618J58232K11327J97021J58816J16290N1095m6158j39899j73186
33718H18780j21279j7293P2094R7004N7572q569p0335j30905k11139l14489m16626
33707b45185m84943n00175m62659l86405k85890j63224j3089J52741K93624L65915
33697a729290L57968K89221J81889N2341p0702j43449j37999p2008m079j210r7192
33686a374510k59814l99773m37870l72407k63421j53255l7860P5638J34555J06389
33676b982328M8147N6219J54527K77823L60828L92327L75387K93674J51696R269
33666h62431o7698p6749o9475q3241j05830r8681l6040O7998J54947J61930R0368
33655i24902K0737L1600J13117J85915J93484J45485Q1891L6851L7970R3498J59297
$$ y = [250624, 285242, 443474, 654801, 851822, 1010638, 1126928, 1178023, 1131865, 991966, 818780, 697501, 680208, 752302, 849306, 906878, 898309, 827974, 697069, 485930, 171441, -245185, -730128, -1230303, -1692962, -2079367, -2365257, -2528481, -2541570, -2388829, -2095205, -1729290, -1371322, -1082101, -900212, -847871, -918573, -1062022, -1200021, -1272029, -1276108, -1277318, -1374510, -1634324, -2034097, -2471967, -2844374, -3107795, -3261050, -3298910, -3223272, -3088717, -2982328, -2934181, -2877962, -2723435, -2445612, -2084784, -1692457, -1317070, -1023396, -871700, -862431, -930129, -1006878, -1076353, -1159594, -1265424, -1364105, -1400145, -1332147, -1177200, -1015270, -924902, -904165, -872565, -759448, -573533, -380049, -234564, -152673, -115822, -77852, 15646, 174943]
33644A74943J53687L6259j41445k81377l22234k67689j57023l4601O2343J13399
33634f63738J19069Q8654K9521m4695j06169j26789r6735k5020O6190J41507J66901
33623d51304J43028J08855R0064N8072k9082j52780k39923k51442k28258k26876
33613a179646k38822k11348j37245q1948j07041j93487k63912k68528k22998j61859
33603c066834q4174L2415J75920K88572L22939K94216K60079K53032K47307J94541
33593a081987Q0385n9408j68890k07977j67192o8317L7779Q6957M1492p3469j83084
33582a763711k26223k05668j70402j55125j48434j15949m0163O3069J54676J98034
33572b409896J87225J50712J14780O8811r494r4738j15839l7075R1927J96737
$$ y = [174943, 328630, 364889, 223444, -57933, -380167, -647856, -804879, -839480, -777137, -663738, -544669, -456015, -426494, -471189, -577358, -704147, -800882, -825902, -759712, -618205, -451304, -308276, -199421, -109357, -51285, -80367, -233147, -473070, -724512, -952770, -1179646, -1418468, -1629816, -1767061, -1849009, -1956050, -2149537, -2413449, -2681977, -2904975, -3066834, -3151008, -3118593, -2942673, -2654101, -2331162, -2036946, -1776867, -1523835, -1276528, -1081987, -1001602, -1061010, -1229900, -1437877, -1605069, -1673386, -1635607, -1548650, -1507158, -1580627, -1763711, -1989934, -2195602, -2366004, -2521129, -2669563, -2785512, -2825675, -2762606, -2607930, -2409896, -2222671, -2071959, -1957179, -1888368, -1897862, -1992600, -2108439, -2145514, -2053587, -1856850]
33562a856850K66514L43462M35693M87850M50183L42509K30159J57734J23345
33553I80599J00250O3829N755o1568j14213j33927j11945m1436P3096J93604K59546
33542A213590K39031J56681N7740l9884j41414k41169l20815l75751m15671m35576
33532c03238m09094l20236j88122n1766O1373J47265K12402K51400K35467J32623
33522b31926m6280k27874l23610l01785k00967p6887M0116J33940J84378J84966
33512h65929J61400J45666J38171J15998P2446K4788j7579o9573j45347k30218
33502f70177k87128k85337k20840j18847k1517L5454M2722J4625k9965p5598j01269
33491a717877q0393k606J08393K07487K59895K60374K26383J76123J11268K1187
$$ y = [-1856850, -1590336, -1246874, -811181, -323331, 126852, 469361, 699520, 857254, 980599, 1080849, 1144678, 1150433, 1088865, 974652, 840725, 728780, 687344, 760440, 954044, 1213590, 1452621, 1609302, 1667042, 1627158, 1485744, 1244575, 923760, 548009, 132338, -303238, -712332, -1032568, -1220690, -1272456, -1211083, -1063818, -851416, -600016, -364549, -231926, -278206, -506080, -829690, -1131475, -1332442, -1409329, -1369213, -1235273, -1050895, -865929, -704529, -558863, -420692, -304694, -232248, -207460, -225039, -294612, -439959, -670177, -957305, -1242642, -1463482, -1582329, -1603846, -1568392, -1525670, -1511045, -1541010, -1616608, -1717877, -1798270, -1800876, -1692483, -1484996, -1225101, -964727, -738344, -562221, -450953, -429766]
33481d29766r1995j95261k41441k06496j03626L6358J83439L06759L78469L94568
33471C1008L75790L30980K37433Q5096p1451j45137j11635m4046l5242j04584
33461E48212j97097k53989k57493k16645j40781l6359Q6475K13890L29297M13296
33451D88806M51003M40803L89051K98338J71903L0245q9192j55400j63362j32447
33441A729748r4125p7141q8559j07762j16401j36104k10007l31888m19917l91283
33431b43439k50949p7507O6370J69238K22483J97136J00668J1966M950N1632N2831
33420C05379l2087j33218j63678j24465q6151r3868j28545j51155j45280j08167
33410h61235l1822Q2027J97236K56151K27384J37171M7412K462K386K6557O6156
$$ y = [-429766, -521761, -717022, -958463, -1164959, -1268585, -1232227, -1048788, -742029, -363560, 31008, 406798, 737778, 975211, 1060307, 988856, 843719, 732084, 688038, 652796, 548212, 351115, 97126, -160367, -377012, -517793, -554152, -467677, -253787, 75510, 488806, 939809, 1380612, 1769663, 2068001, 2239904, 2270149, 2180957, 2025557, 1862195, 1729748, 1635623, 1558482, 1469923, 1362161, 1245760, 1109656, 899649, 567761, 147844, -243439, -494388, -571895, -505525, -336287, -113804, 83332, 184000, 195966, 200916, 252548, 305379, 273292, 140074, -23604, -148069, -234220, -328088, -456633, -607788, -753068, -861235, -893057, -811030, -613794, -357643, -130259, 6912, 54324, 56786, 59172, 85729, 151885]
33399A51885J17241J54223J42364Q5188L3645L0915O5638R4747R1745N2174k3636
33388I96129j17127j75856j56703q8108m9727p8908j31067j46018j18436q0602
33378a46423m7283j1411K3658M2810M7017N7657R0762J39049J75687J69153J07583
33367F48259J9561m5652p3053r8561j53728k17937k52884k59916k61648k41940
33357i37499j56424p711J35230K06902J98777J31560J6136j30526k61142l24033
33347a128730l03454k17940r6116K8987J22655J70385J87014J90283J82907J74687
33337f89322J94177K48622K92262K70122J85021R1823L3996J4546J8107K5155
33327F84509J0377l1746n6670o685J07195J92441J61384R725j93443l57436m01324
$$ y = [151885, 269126, 423349, 565713, 650901, 684546, 715461, 781099, 875846, 967591, 1019765, 996129, 879002, 703146, 546443, 458335, 408608, 329700, 198633, 52615, -65821, -146423, -193706, -205117, -181459, -138649, -91632, -33975, 56787, 195836, 371523, 540676, 648259, 667820, 622168, 549115, 450554, 296826, 78889, -173995, -433911, -695559, -937499, -1093923, -1101634, -966404, -759502, -560725, -429165, -413029, -543555, -804697, -1128730, -1432184, -1650124, -1746240, -1717253, -1594598, -1424213, -1237199, -1046916, -864009, -689322, -495145, -246523, 45739, 315861, 500882, 592705, 626701, 641247, 659354, 684509, 694886, 663140, 606470, 599785, 706980, 899421, 1060805, 1070530, 877087, 519651, 118327]
33316A18327k83651m4757K00188L48532L86769L62768L04437K01928O0808o8540
33306A586809j27408r7671j2862O3630P6056J5200p5930j48065j92753k28408
33296H58598k52971k43782k04394j75467j84011k07635k05963j67293j07674m3313
33286i33905J4186M7551M2402N707l6146n6028m0114M087M6056N4435L3632K3194
33274g94943M5281O9018M9340j0932o2893o6950j9725O6570J74911K67327K94180
33263A1184K43374J62123J07409Q2201L6905o9045k17606l42450l84897l44242
33253g15044k74829k29283k09333j82775j38012r4410n8363m284Q2740J72523
33243a651070K22426K24987J99742J60195J22493J28364K10912L33464M03788
$$ y = [118327, -165324, -210081, -9893, 338639, 725408, 1088176, 1392613, 1594541, 1655349, 1586809, 1459401, 1361730, 1348868, 1412498, 1488554, 1503754, 1427824, 1279759, 1087006, 858598, 605627, 361845, 157451, -18016, -202027, -409662, -615625, -782918, -890592, -933905, -919719, -872168, -829766, -824059, -860205, -916233, -956347, -952260, -906204, -851769, -818137, -794943, -749662, -680644, -631304, -642236, -705129, -772079, -791804, -725234, -550323, -282996, 11184, 254558, 416681, 524090, 606291, 643196, 574151, 356545, 14095, -370802, -715044, -989873, -1219156, -1428489, -1611264, -1749276, -1843686, -1902049, -1906333, -1823593, -1651070, -1428644, -1203657, -1003915, -843720, -721227, -592863, -381951, -48487, 355301]
33234C55301L64794K43034R7197m5688j79017k73738k90092k30114j48722j03999
33224b11044j08930j33704j43402j29276j08778r7235q1963l4081M9291J25714
33214h73408J40312P2698n1567j79729k50973k19175q8748P2522J81533K08757
33204i87778J87087J56099J22429Q1796N2240N9047R2359J01085L9223q2197j91439
33193c70049k12416j37054m1568j6837p6533j42360j22384N343J82468L20211
33183f11179L53339K72587J28588n164r0022j36615j56027j23772k1468J04044
33173b85689J66256J27945L2861n5665j13511j43027j40634j06619o4411l8980
33163f21474k7589j7689k2081o5064j34731j76942j44178l5048J12867K47919
$$ y = [355301, 720095, 963129, 1060326, 1014638, 835621, 561883, 271791, 41677, -107045, -211044, -319974, -453678, -597080, -726356, -835134, -932369, -1014332, -1048413, -999122, -873408, -733096, -660398, -711965, -891694, -1142667, -1361842, -1450590, -1378068, -1196535, -987778, -800691, -644592, -522163, -440367, -388127, -329080, -236721, -135636, -96413, -178610, -370049, -582465, -719519, -761087, -777924, -854457, -996817, -1119201, -1113858, -931390, -611179, -257840, 14747, 143335, 138171, 48149, -88466, -244493, -368265, -389733, -285689, -119433, 8512, 41373, -14292, -127803, -270830, -411464, -518083, -582494, -621474, -649063, -666752, -688833, -753897, -888628, -1065570, -1209748, -1244796, -1131929, -884010]
33153h84010L22012L12464K42923J67031J16856P6993J8028n9144j26478j63156
33143B3519j67092j39260q1243j3863K2764N468m1780o9992o0742m8720q0843
33132f51784j58702k31632k45744j90319r6363l403O6310J14330J58454K09785
33122a029068K48809K39380J81256J28570J24987J32900P1541o7550j86998j89152
33112c45325q2019M7845J36637J78287J82532J52086J01835N4524O542o3560j39838
33101B29546j63975j12733m6088l8553q1959j01462o5160l1820p0805j66030k30797
33090h79836k08975j35447r1985j19379j81105k04332j47663l4372O8340J01003
33080a833751N5239k2528p1176o5592k9743m53J3862L1559O3413R5948J10154
$$ y = [-884010, -561998, -249534, -6611, 160420, 277276, 354269, 372297, 313153, 186675, 23519, -143573, -282833, -364076, -377939, -355175, -349707, -391487, -461479, -522221, -570941, -651784, -810486, -1042118, -1287862, -1478181, -1574544, -1577947, -1511637, -1397307, -1238853, -1029068, -780259, -540879, -359623, -231053, -106066, 26834, 98375, 30825, -156173, -345325, -427344, -379499, -242862, -64575, 117957, 270043, 371878, 426402, 432944, 369384, 229546, 65571, -47162, -93250, -131803, -213762, -315224, -380384, -412204, -483009, -649039, -879836, -1088811, -1224258, -1316243, -1435622, -1616727, -1821059, -1968722, -2003094, -1934754, -1833751, -1778512, -1801040, -1872216, -1937808, -1967551, -1968004, -1954142, -1922583, -1859170, -1763222, -1653068]
33069a653068J02546Q2504O1510N2291O4479Q7088Q5918L8128l3476q1618r4066
$$ y = [-1653068, -1550522, -1468018, -1406508, -1354217, -1289738, -1202650, -1116732, -1078604, -1112080, -1193698, -1287764]
$$ [...]
##END NTUPLES=NMR SPECTRUM
##END=
