##TITLE=31Pdec_DE-22_oil_d6_TFA
 DMSO-d6
 64 sc
 6.6.2024
##JCAMPDX= 6.0         $$ Bruker NMR JCAMP-DX V2.0
##DATA TYPE= NMR SPECTRUM
##DATA CLASS= NTUPLES
##ORIGIN= UXNMR, Bruker Analytische Messtechnik GmbH
##OWNER= root
$$ XWIN-NMR		Version 3.5
$$ Thu Jun  6 16:14:12 2024 Russian Standard Time (UT+4h)  she@DPX200
##.OBSERVE FREQUENCY= 81.013821
##.OBSERVE NUCLEUS= ^31P
##.ACQUISITION MODE= SIMULTANEOUS
##.ACQUISITION SCHEME= undefined
##.AVERAGES= 40
##.DIGITISER RES= 16
##SPECTROMETER/DATA SYSTEM= spect
##.PULSE SEQUENCE= zgpg30
##.SOLVENT NAME= CDCl3
##.SHIFT REFERENCE= (INTERNAL, CDCl3, 0, 248.564)
##AUDIT TRAIL= $$ (NUMBER, WHEN, WHO, WHERE, WHAT)
$$ ##TITLE= Audit trail, XWIN-NMR		Version 3.5
$$ ##JCAMPDX= 5.01
$$ ##ORIGIN= Bruker BioSpin GmbH
$$ ##OWNER= she
$$ F:/spectra/data/she/nmr/P31/1/pdata/1/auditp.txt
$$ ##AUDIT TRAIL=  $$ (NUMBER, WHEN, WHO, WHERE, WHAT)
(   1,<2024-06-06 16:13:17.34 +0400>,<she>,<DPX200>,
      <created by zg, POWCHK disabled, PULCHK disabled
       configuration hash MD5:
       00 E9 B6 7A A2 85 ED C7 34 08 36 98 17 FE 4E 26
       data hash MD5: 32K
       70 55 9F DF 61 01 5C 3B 92 BE 3D A2 7B 54 A1 C4>)
(   2,<2024-06-06 16:13:19.95 +0400>,<she>,<DPX200>,
      <Start of raw data processing
       efp BC_mod = 2 LB = 10 FT_mod = 6 PKNL = 1 PHC0 = -248.4885 PHC1 = 124.8 SI = 64K 
       data hash MD5: 64K
       19 C3 59 16 FE 41 EE 29 F4 19 EB 40 DF 76 5C 79>)
(   3,<2024-06-06 16:13:36.15 +0400>,<she>,<DPX200>,
      <pk PHC0 = -7.6256 PHC1 = 0 
       data hash MD5: 64K
       F8 93 A9 82 0A 84 68 E7 4C 5B 0B 37 9F 62 F3 AE>)
(   4,<2024-06-06 16:13:42.09 +0400>,<she>,<DPX200>,
      <abs ABSG = 5 
       data hash MD5: 64K
       3D DF C0 DB CE 2F F0 22 9C 51 99 8E 5D 92 1B 8B>)
$$ ##END=
$$ 
$$ hash MD5
$$ E6 29 17 8F FC FA C4 A1 02 09 D4 86 D6 BB 8E 23
##$RELAX= 
##$RELAX= 
##$RELAX= 
##$RELAX= 
##$RELAX= 
##$RELAX= 
##$RELAX= 
##$RELAX= 
##$RELAX= 
$$ Bruker specific parameters
$$ --------------------------
##$DU= <F:/spectra>
##$EXPNO= 1
##$NAME= <P31>
##$PROCNO= 1
##$TYPE= <nmr>
##$USER= <she>
##$AMP= (0..31)
100 100 100 100 100 100 100 100 100 100 100 100 100 100 100 100 100 100 
100 100 100 100 100 100 100 100 100 100 100 100 100 100 
##$AQSEQ= 0
##$AQ_mod= 1
##$AUNM= <au_zg>
##$AUTOPOS= <>
##$BF1= 81.014009
##$BF2= 200.13
##$BF3= 200.13
##$BF4= 200.13
##$BF5= 200.13
##$BF6= 200.13
##$BF7= 200.13
##$BF8= 200.13
##$BYTORDA= 1
##$CFDGTYP= 0
##$CFRGTYP= 5
##$CHEMSTR= <none>
##$CNST= (0..31)
1 1 145 1 1 1 1 1 1 1 1 1 1 1 1 1 1 1 1 1 1 1 1 1 1 1 1 1 1 1 1 1 
##$CPDPRG= <waltz16>
##$CPDPRG1= <>
##$CPDPRG2= <waltz16>
##$CPDPRG3= <>
##$CPDPRG4= <mlev>
##$CPDPRG5= <mlev>
##$CPDPRG6= <mlev>
##$CPDPRG7= <mlev>
##$CPDPRG8= <mlev>
##$CPDPRGB= <>
##$CPDPRGT= <>
##$D= (0..31)
0 1 0 0 0 0 0 0 0 0 0 0.03 2e-05 3e-06 0 0 0 0 0 0 0 0 0 0 0 0 0 0 0 0 
0 0 
##$DATE= 1717675996
##$DBL= (0..7)
120 120 120 11 120 120 24 19 
##$DBP= (0..7)
150 150 150 150 150 150 150 150 
##$DBP07= 0
##$DBPNAM0= <>
##$DBPNAM1= <>
$$ [...]
##$SUBNAM3= <"">
##$SUBNAM4= <"">
##$SUBNAM5= <"">
##$SUBNAM6= <"">
##$SUBNAM7= <"">
##$SUBNAM8= <"">
##$SUBNAM9= <"">
##$SW= 501.771253377433
##$SWIBOX= (0..15)
0 1 3 0 0 0 0 0 0 0 0 0 0 0 0 0 
##$SW_h= 40650.406504065
##$TD= 32768
##$TD0= 1
##$TE= 0
##$TE2= 300
##$TE3= 300
##$TEG= 300
##$TL= (0..7)
0 120 53 12 22 120 120 120 
##$TP= (0..7)
150 150 150 150 150 150 150 150 
##$TP07= 0
##$TPNAME0= <>
##$TPNAME1= <>
##$TPNAME2= <>
##$TPNAME3= <>
##$TPNAME4= <>
##$TPNAME5= <>
##$TPNAME6= <>
##$TPNAME7= <>
##$TPOAL= (0..7)
0.5 0.5 0.5 0.5 0.5 0.5 0.5 0.5 
##$TPOFFS= (0..7)
0 0 0 0 0 0 0 0 
##$TUNHIN= 0
##$TUNHOUT= 0
##$TUNXOUT= 0
##$USERA1= <user>
##$USERA2= <user>
##$USERA3= <user>
##$USERA4= <user>
##$USERA5= <user>
##$V9= 5
##$VALIST= <valist>
##$VCLIST= <CCCCCCCCCCCCCCC>
##$VD= 0
##$VDLIST= <DDDDDDDDDDDDDDD>
##$VPLIST= <PPPPPPPPPPPPPPP>
##$VTLIST= <TTTTTTTTTTTTTTT>
##$WBST= 1024
##$WBSW= 4
##$XGAIN= (0..3)
0 0 0 0 
##$XL= 0
##$YL= 0
##$YMAX_a= 1976
##$YMIN_a= -6757
##$ZGOPTNS= <>
##$ZL1= 120
##$ZL2= 120
##$ZL3= 120
##$ZL4= 120
##$ABSF1= 248.5645
##$ABSF2= -253.2056
##$ABSG= 5
##$ABSL= 3
##$ALPHA= 0
##$AQORDER= 0
##$ASSFAC= 0
##$ASSFACI= 0
##$ASSFACX= 0
##$ASSWID= 0
##$AUNMP= <proc_1d>
##$AZFE= 0.1
##$AZFW= 0.5
##$BCFW= 0
##$BC_mod= 2
##$BYTORDP= 0
##$COROFFS= 0
##$CY= -3
##$DATMOD= 1
##$DC= 0
##$DFILT= <>
##$DTYPP= 0
##$F1P= 0
##$F2P= 0
##$FCOR= 1
##$FTSIZE= 65536
##$FT_mod= 6
##$GAMMA= 0
##$GB= 0
##$INTBC= 1
##$INTSCL= 6.047779e-11
##$ISEN= 30
##$LB= 10
##$LEV0= 0
##$LPBIN= 0
##$MAXI= 10000
##$MC2= 0
##$MEAN= 0
##$ME_mod= 0
##$MI= 50
##$NCOEF= 0
##$NC_proc= -12
##$NLEV= 6
##$NOISF1= 182.463
##$NOISF2= 159.3651
##$NSP= 0
##$NTH_PI= 0
##$NZP= 0
##$OFFSET= 248.5645
##$PC= 4
##$PHC0= -256.1141
##$PHC1= 124.8
##$PH_mod= 1
##$PKNL= yes
##$PPARMOD= 0
##$PSCAL= 0
##$PSIGN= 0
##$REVERSE= no
##$SF= 81.0140089999694
##$SI= 65536
##$SIGF1= 159.3651
##$SIGF2= -187.1042
##$SINO= 113.3802
##$SIOLD= 16384
##$SREGLST= <1H.CDCl3>
##$SSB= 0
##$STSI= 65536
##$STSR= 0
##$SW_p= 40650.406504065
##$SYMM= 0
##$S_DEV= 0
##$TDeff= 32768
##$TDoff= 0
##$TI= <>
##$TILT= no
##$TM1= 0
##$TM2= 0
##$TOPLEV= 0
##$USERP1= <user>
##$USERP2= <user>
##$USERP3= <user>
##$USERP4= <user>
##$USERP5= <user>
##$WDW= 1
##$XDIM= 65536
##$YMAX_p= 518108595
##$YMIN_p= -386904900
$$ End of Bruker specific parameters
$$ ---------------------------------
##NTUPLES= NMR SPECTRUM
##VAR_NAME=  FREQUENCY,     SPECTRUM/REAL,   SPECTRUM/IMAG
##SYMBOL=    X,             R,               I
##VAR_TYPE=  INDEPENDENT,   DEPENDENT,       DEPENDENT
##VAR_FORM=  AFFN,          ASDF,            ASDF
##VAR_DIM=   65536,         65536,           65536
##UNITS=     HZ,            ARBITRARY UNITS, ARBITRARY UNITS
##FACTOR=    0.620285442955139, 1,           1
##FIRST=     20137.2065510682, 0,            0
##LAST=      -20513.1999529968, 0,           0
##MIN=       -20513.1999529968, -386904900,  0
##MAX=       20137.2065510682, 518108595,    0
$$ Real data points
##PAGE= N=1
##DATA TABLE= (X++(R..R)), XYDATA
$$ [...]
##PAGE= N=2
##DATA TABLE= (X++(I..I)), XYDATA
$$ plain form
12876 1796036 4973145 8321696 11764127 15266172 18821953 22428694 26059652 29635142
12868 29635142 32995370 35890495 38006627 39031239 38734702 37026877 33959467 29684018
12860 29684018 24408240 18383192 11907962 5308365 -1129315 -7232810 -12963206 -18348817
12852 -18348817 -23368433 -27864312 -31556774 -34170457 -35603498 -36032739 -35887924 -35718363
12844 -35718363 -36038009 -37219782 -39449412 -42714869 -46821719 -51443301 -56198031 -60716892
12836 -60716892 -64671127 -67774214 -69799679 -70629817 -70299865 -68988446 -66945255 -64397315
12828 -64397315 -61487257 -58268143 -54742442 -50914712 -46831308 -42596671 -38372097 -34366072
12820 -34366072 -30812644 -27924736 -25823911 -24477948 -23687200 -23134482 -22476820 -21443822
$$ packed form
12876A796036L177109L348551L442431L502045L555781L606741L630958L575490
12868B9635142L360228K895125K116132J024612k96537j707825l067410m275449
12860B9684018n275778o025048o475230o599597o437680o103495n730396n385611
12852a8348817n019616m495879l692462k613683j433041m29241J44815J69561
12844c5718363l19646j181773k229630l265457m106850m621582m754730m518861
12836f0716892l954235l103087k025465q30138L29952J311419K043191K547940
12828f4397315K910058L219114L525701L827730M083404M234637M224574M006025
12820c4366072L553428K887908K100825J345963P90748N52718O57662J032998
$$ plain form
12812 -21443822 -19914863 -17953643 -15782189 -13695488 -11952276 -10696127 -9940776 -9611124
12804 -9611124 -9602886 -9826313 -10221225 -10750239 -11382209 -12070155 -12721577 -13167904 -13157745 -12399757
12794 -12399757 -10651028 -7808273 -3950945 681551 5752518 10888823 15718466 19894183
12786 19894183 23123449 25210024 26090814 25848437 24696341 22948155 20980765 19190198
12778 19190198 17939074 17504083 18037305 19551198 21931749 24977987 28452337 32113589
12770 32113589 35716253 38996453 41685630 43566229 44533453 44611828 43912742 42565017 40658383
12761 40658383 38214585 35180817 31441690 26851854 21286582 14699561 7176603 -1025009
12753 -1025009 -9468688 -17585318 -24782517 -30587444 -34762808 -37339678 -38551989 -38710631
$$ packed form
12812b1443822J528959J961220K171454K086701J743212J256149P55351L29652
12804i611124Q238k23427l94912n29014o31970o87946o51422m46327J0159P57988
12794a2399757J748729K842755L857328M632496N070967N136305M829643M175717
12786A9894183L229266K086575Q80790k42377j152096j748186j967390j790567
12778A9190198j251124m34991N33222J513893K380551L046238L474350L661252
12770C2113589L602664L280200K689177J880599R67224P8375o99086j347725j906634
12761D0658383k443798l033768l739127m589836n565272o587021p522958q201612
12753a025009q443679q116630p197199n804927m175364k576870j212311j58642
$$ plain form
12745 -38710631 -38086411 -36860074 -35147418 -33051973 -30683610 -28125817 -25395864 -22455879
12737 -22455879 -19283087 -15947896 -12639737 -9622594 -7147446 -5364932 -4275130 -3735863
12729 -3735863 -3526106 -3433588 -3327440 -3195678 -3148861 -3393103 -4171514 -5687469 -8044276
12720 -8044276 -11228986 -15132452 -19574176 -24314393 -29061432 -33485413 -37237487 -39977235
12712 -39977235 -41425962 -41455502 -40181668 -37999884 -35520835 -33424504 -32297722 -32516035
12704 -32516035 -34190796 -37170487 -41084608 -45431052 -49700414 -53499744 -56620261 -59021116
12696 -59021116 -60756480 -61902117 -62515699 -62626650 -62240511 -61356712 -60000976 -58254813 -56255817
12687 -56255817 -54164842 -52126947 -50255786 -48643818 -47374942 -46516619 -46091168 -46048850 -46270269
$$ packed form
12745c8710631O24220J226337J712656K095445K368363K557793K729953K939985
12737b2455879L172792L335191L308159L017143K475148J782514J089802N39267
12729c735863K09757R2518J06148J31762M6817k44242p78411j515955k356807
12720h044276l184710l903466m441724m740217m747039m423981l752074k739748
12712c9977235j448727k9540J273834K181784K479049K096331J126782k18313
12704c2516035j674761k979691l914121m346444m269362l799330l120517k400855
12696e9021116j735364j145637o13582j10951L86139Q83799J355736J746163J998996
12687e6255817K090975K037895J871161J611968J268876Q58323M25451M2318k21419
$$ plain form
12678 -46270269 -46607716 -46946165 -47247002 -47546346 -47908512 -48361357 -48847596 -49214942 -49249345
12669 -49249345 -48740191 -47557589 -45716727 -43400886 -40920989 -38616580 -36742249 -35400799
12661 -35400799 -34553990 -34083948 -33847285 -33688407 -33429021 -32873791 -31849995 -30263035 -28137095
12652 -28137095 -25624560 -22983688 -20526411 -18538667 -17191265 -16481222 -16241945 -16222924 -16192680
12643 -16192680 -16005375 -15604441 -14985116 -14158938 -13144033 -11969751 -10670006 -9259321 -7715162
12634 -7715162 -5992841 -4067942 -1970162 220536 2405384 4489836 6379115 7965682
12626 7965682 9141999 9845079 10101282 10030433 9796328 9529317 9263824 8920954 8339356
12617 8339356 7334855 5759775 3539195 682409 -2710799 -6432647 -10154046 -13456850
$$ packed form
12678d6270269l37447l38449l00837k99344l62166m52845m86239l67346l4403
12669d9249345N09154J182602J840862K315841K479897K304409J874331J341450
12661c5400799Q46809M70042K36663J58878K59386N55230J023796J586960K125940
12652b8137095K512535K640872K457277J987744J347402P10043K39277J9021L0244
12643a6192680J87305M00934O19325Q26178J014905J174282J299745J410685J544159
12634g715162J722321J924899K097780K190698K184848K084452J889279J586567
12626G965682J176317P03080K56203p0849k34105k67011k65493l42870n81598
12617H339356j004501j575080k220580k856786l393208l721848l721399l302804
$$ plain form
12609 -13456850 -15933456 -17320436 -17597371 -17001947 -15963178 -14987989 -14537072 -14915680 -16201670
12600 -16201670 -18231110 -20648543 -23005908 -24875452 -25941545 -26054775 -25251428 -23742964
12592 -23742964 -21868413 -20005255 -18462139 -17400172 -16814602 -16566707 -16431777 -16143737 -15442712
12583 -15442712 -14134172 -12148238 -9572628 -6640627 -3679188 -1041056 956511 2080811
12575 2080811 2225120 1435093 -104870 -2141043 -4450927 -6916049 -9518484 -12263893
12567 -12263893 -15086022 -17802896 -20163573 -21965519 -23174456 -23974919 -24721568 -25814823
12559 -25814823 -27555626 -30038293 -33127308 -36532535 -39947285 -43173014 -46162592 -48972272
12551 -48972272 -51671220 -54269628 -56694238 -58802364 -60410089 -61316866 -61324465 -60261716 -58026591
$$ packed form
12609a3456850k476606j386980k76935N95424J038769R75189M50917l78608j285990
12600a6201670k029440k417433k357365j869544j066093j13230Q03347J508464
12592b3742964J874551J863158J543116J061967N85570K47895J34930K88040P01025
12583a5442712J308540J985934K575610K932001K961439K638132J997567J124300
12575B080811J44309p90027j539963k036173k309884k465122k602435k745409
12567a2263893k822129k716874k360677j801946j208937q00463p46649j093255
12559b5814823j740803k482667l089015l405227l414750l225729k989578k809680
12551d8972272k698948k598408k424610k108126j607725r06777p599J062749K235125
$$ plain form
12542 -58026591 -54639396 -50279436 -45277763 -40066575 -35115263 -30882219 -27781699 -26140995
12534 -26140995 -26133539 -27709621 -30572208 -34233893 -38147145 -41854149 -45087611 -47782688
12526 -47782688 -50013232 -51903343 -53561854 -55054972 -56405298 -57602114 -58614694 -59400442
12518 -59400442 -59897745 -60005454 -59571749 -58420410 -56418639 -53556800 -49997600 -46069089
12510 -46069089 -42203280 -38838425 -36307854 -34744576 -34038744 -33875565 -33843963 -33564154 -32774793
12501 -32774793 -31357388 -29321399 -26784608 -23956593 -21105008 -18488374 -16272489 -14477114
12493 -14477114 -12993636 -11670982 -10418779 -9265024 -8340851 -7814445 -7818091 -8399863 -9510554
12484 -9510554 -11026095 -12798668 -14716261 -16740383 -18899956 -21242751 -23767342 -26369056
$$ packed form
12542e8026591L387195M359960N001673N211188M951312M233044L100520J640704
12534b6140995P456j576082k862587l661685l913252l707004l233462k695077
12526d7782688k230544j890111j658511j493118j350326j196816j012580p85748
12518e9400442m97303j07709M33705J151339K001771K861839L559200L928511
12510d6069089L865809L364855K530571J563278P05832J63179L1602K79809P89361
12501c2774793J417405K035989K536791K828015K851585K616634K215885J795375
12493a4477114J483478J322654J252203J153755R24173N26406l646n81772j110691
12484i510554j515541j772573j917593k024122k159573k342795k524591k601714
$$ plain form
12476 -26369056 -28831250 -30875515 -32252699 -32830453 -32635667 -31840112 -30706805 -29522878
12468 -29522878 -28537933 -27919574 -27731867 -27935431 -28404989 -28964185 -29436598 -29696474 -29688532 -29397650
12458 -29397650 -28783483 -27720834 -25983346 -23285416 -19372439 -14127037 -7644086 -237300
12450 -237300 7621134 15388892 22529792 28567433 33126517 35964873 36985445 36222691
12442 36222691 33815349 29984387 25025112 19309355 13286752 7471273 2399175 -1446396
12434 -1446396 -3729072 -4336526 -3404732 -1275859 1588864 4700194 7605805 9928489
12426 9928489 11395215 11867745 11366247 10066808 8257896 6254748 4290984 2428935
12418 2428935 538640 -1627733 -4291289 -7506070 -11104245 -14757902 -18111472 -20894608
$$ packed form
12476b6369056k462194k044265j377184n77754J94786P95555J133307J183927
12468b9522878R84945O18359J87707k03564m69558n59196m72413k59876P942K90882
12458b9397650O14167J062649J737488K697930L912977N245402O482951P406786
12450b37300P858434P767758P140900O037641M559084K838356J020572p62754
12442C6222691k407342l830962m959275n715757o022603n815479n072098l845571
12434a446396k282676o07454R31794K128873K864723L111330K905611K322684
12426I928489J466726M72530n01498j299439j808912k003148j963764j862049
12418B428935j890295k166373k663556l214781l598175l653657l353570k783136
$$ plain form
12410 -20894608 -22953291 -24212446 -24635252 -24227080 -23073293 -21364342 -19376662 -17415467
12402 -17415467 -15746902 -14543982 -13858696 -13623381 -13678839 -13821759 -13857342 -13636667 -13060824
12393 -13060824 -12052438 -10519908 -8347565 -5426550 -1712521 2720370 7658816 12780369
12385 12780369 17731135 22221979 26097072 29339547 32016799 34204506 35934317 37183683
12377 37183683 37894029 37993752 37417895 36133914 34179677 31698143 28937891 26200288 23747126
12368 23747126 21711918 20060886 18623682 17176240 15533560 13612571 11448596 9174546
12360 9174546 6983974 5094574 3715201 3009227 3050508 3784813 5023406 6487665 7893952
12351 7893952 9039182 9844485 10340591 10614305 10754568 10827096 10880003 10963442 11146218 11519810
$$ packed form
12410b0894608k058683j259155m22806M08172J153787J708951J987680J961195
12402a7415467J668565J202920O85286K35315n5458j42920l5583K20675N75843
12393a3060824J008386J532530K172343K921015L714029M432891M938446N121553
12385A2780369M950766M490844L875093L242475K677252K187707J729811J249366
12377C7183683P10346R9723n75857j283981j954237k481534k760252k737603k453162
12368B3747126k035208j651032j437204j447442j642680j920989k163975k274050
12360I174546k190572j889400j379373p05974M1281P34305J238593J464259J406287
12351G893952J145230Q05303M96106K73714J40263P2528N2907Q3439J82776L73592
$$ plain form
12341 11519810 12181996 13197154 14551912 16145808 17840320 19538057 21232129 22993679
12333 22993679 24919964 27082452 29486509 32034193 34500322 36555152 37849430 38129004
12325 38129004 37316220 35512547 32924198 29754514 26119433 22022151 17387991 12136840
12317 12136840 6267689 -68784 -6541493 -12685973 -18026789 -22223258 -25162432 -26953087
12309 -26953087 -27833328 -28048609 -27764828 -27056241 -25962292 -24563339 -23014294 -21509481 -20203155
12300 -20203155 -19135951 -18207997 -17214895 -15936720 -14241016 -12142045 -9779847 -7341518
12292 -7341518 -4990477 -2850827 -1034980 332078 1121352 1233609 633692 -632875 -2446278
12283 -2446278 -4635473 -7004293 -9351991 -11496095 -13311336 -14778492 -16011304 -17232946
$$ packed form
12341A1519810O62186J015158J354758J593896J694512J697737J694072J761550
12333B2993679J926285K162488K404057K547684K466129K054830J294278K79574
12325C8129004q12784j803673k588349l169684l635081m097282m634160n251151
12317A2136840n869151o336473o472709o144480n340816m196469k939174j790655
12309b6953087q80241k15281K83781P08587J093949J398953J549045J504813J306326
12300b0203155J067204R27954R93102J278175J695704K098971K362198K438329
12292g341518K351041K139650J815847J367058P89274J12257n99917j266567j813403
12283b446278k189195k368820k347698k144104j815241j467156j232812j221642
$$ plain form
12275 -17232946 -18707402 -20660187 -23221403 -26404027 -30116083 -34200946 -38494949 -42884499
12267 -42884499 -47344357 -51944914 -56822188 -62111047 -67856930 -73939399 -80043607 -85696287
12259 -85696287 -90357133 -93541779 -94945745 -94530081 -92529042 -89367954 -85528234 -81426676
12251 -81426676 -77358261 -73502665 -69958201 -66767461 -63924731 -61379571 -59055716 -56887793
12243 -56887793 -54855760 -52991646 -51353352 -49985242 -48888810 -48012322 -47261056 -46534094
12235 -46534094 -45785392 -45077894 -44583775 -44513785 -45012296 -46076457 -47529970 -49043428 -50184638
12226 -50184638 -50495466 -49590604 -47250742 -43469344 -38435204 -32475126 -25998963 -19464272
12218 -19464272 -13341420 -8056647 -3924260 -1106353 376421 601032 -293805 -2109735
$$ packed form
12275a7232946j474456j952785k561216l182624l712056m084863m294003m389550
12267d2884499m459858m600557m877274n288859n745883o082469o104208n652680
12259h5696287m660846l184646j403966M15664K001039L161088L839720M101558
12251h1426676M068415L855596L544464L190740K842730K545160K323855K167923
12243e6887793K032033J864114J638294J368110J096432Q76488P51266P26962
12235d6534094P48702P07498M94119O9990m98511j064161j453513j513458j141210
12226e0184638l10828R04862K339862L781398N034140N960078O476163O534691
12218a9464272O122852N284773M132387K817907J482774K24611q94837j815930
$$ plain form
12210 -2109735 -4564037 -7267979 -9742578 -11491976 -12121905 -11452839 -9566250 -6757048
12202 -6757048 -3423133 43425 3314339 6128148 8269708 9560333 9870701 9146425
12194 9146425 7430443 4871846 1712976 -1754484 -5263162 -8647256 -11882435 -15065911
12186 -15065911 -18353581 -21892863 -25775793 -30010215 -34499195 -39032686 -43306138 -46970845
12178 -46970845 -49699493 -51240283 -51444197 -50270954 -47789697 -44183232 -39750346 -34894210
12170 -34894210 -30088707 -25822406 -22528724 -20520894 -19954187 -20825428 -22996858 -26221215
12162 -26221215 -30160360 -34413022 -38570212 -42294652 -45394950 -47857868 -49817410 -51469815
12154 -51469815 -52974347 -54389991 -55675439 -56739591 -57506205 -57963283 -58185244 -58323001 -58560738
$$ packed form
12210b109735k454302k703942k474599j749398o29929O69066J886589K809202
12202f757048L333915L466558L270914K813809K141560J290625L10368p24276
12194I146425j715982k558597l158870l467460l508678l384094l235179l183476
12186a5065911l287670l539282l882930m234422m488980m533491m273452l664707
12178d6970845k728648j540790k03914J173243K481257L606465M432886M856136
12170c4894210M805503M266301L293682K007830N66707q71241k171430l224357
12162b6221215l939145m252662m157190l724440l100298k462918j959542j652405
12154e1469815j504532j415644j285448j064152p66614m57078k21961j37757k37737
$$ plain form
12145 -58560738 -59053705 -59878153 -61017953 -62384684 -63848813 -65265258 -66490699 -67394001
12137 -67394001 -67860721 -67798485 -67152949 -65931014 -64210756 -62121011 -59799521 -57359621 -54890045
12128 -54890045 -52487363 -50298247 -48542928 -47501673 -47464085 -48655069 -51155034 -54831466
12120 -54831466 -59304631 -63976233 -68137561 -71136944 -72548883 -72279913 -70574860 -67928757
12112 -67928757 -64939250 -62145283 -59896812 -58292199 -57201215 -56360322 -55495342 -54417757
12104 -54417757 -53065331 -51495011 -49852377 -48329403 -47109245 -46306868 -45932045 -45895246 -46047550
12095 -46047550 -46227071 -46294414 -46156523 -45776924 -45161466 -44317897 -43212071 -41751776 -39807791
12086 -39807791 -37254276 -34005054 -30036992 -25404516 -20248561 -14794576 -9328169 -4141317
$$ packed form
12145e8560738m92967q24448j139800j366731j464129j416445j225441r03302
12137f7394001m66720O2236O45536J221935J720258K089745K321490K439900K469576
12128e4890045K402682K189116J755319J041255L7588j190984k499965l676432
12120e4831466m473165m671602m161328k999383j411939K68970J705053K646103
12112f7928757K989507K793967K248471J604613J090984Q40893Q64980J077585
12104e4417757J352426J570320J642634J522974J220158Q02377L74823L6799j52304
12095d6047550j79521o7343J37891L79599O15458Q43569J105826J460295J943985
12086c9807791K553515L249222L968062M632476N155955N453985N466407N186852
$$ plain form
12078 -4141317 540083 4614165 8109661 11133662 13796414 16165389 18272919 20156773
12070 20156773 21893188 23599838 25416434 27481248 29907490 32748610 35951227 39322442
12062 39322442 42549914 45285337 47256210 48350743 48640385 48338092 47713401 46999155 46332153
12053 46332153 45753794 45252583 44796568 44323634 43713170 42788553 41366081 39316963 36602815
12044 36602815 33280956 29504315 25530269 21720606 18500933 16271325 15302368 15671563
12036 15671563 17270223 19861630 23144812 26795609 30489989 33927019 36858880 39123863
12028 39123863 40672510 41571094 41967794 42028675 41879738 41592578 41214178 40801239 40415624
12019 40415624 40071210 39662807 38927122 37474942 34899155 30921910 25519072 18964588
$$ packed form
12078d141317M681400M074082L495496L024001K662752K368975K107530J883854
12070B0156773J736415J706650J816596K064814K426242K841120L202617L371215
12062C9322442L227472K735423J970873J094533K89642l02293o24691p14246o67002
12053D6332153n78359n01211m56015m72934o10464r24617j422472k049118k714148
12044C6602815l321859l776641l974046l809663l219673k229608r68957L69195
12036A5671563J598660K591407L283182L650797L694380L437030K931861K264983
12028C9123863J548647Q98584L96700O0881j48937k87160l78400m12939l85615
12019D0415624l44414m08403p35685j452180k575787l977245n402838o554484
$$ plain form
12011 18964588 11767822 4521134 -2281639 -8374687 -13740285 -18522975 -22897029 -26956997
12003 -26956997 -30670511 -33895532 -36443227 -38158475 -38986094 -38997188 -38368817 -37330397 -36101039
11994 -36101039 -34842661 -33646598 -32555115 -31599018 -30823625 -30287162 -30037183 -30082982 -30379193
11985 -30379193 -30826519 -31288755 -31621836 -31708382 -31489250 -30982333 -30280200 -29525234 -28872798
11976 -28872798 -28461502 -28405818 -28810067 -29785264 -31444719 -33867073 -37040329 -40820544 -44937083
11967 -44937083 -49050679 -52837782 -56058121 -58573936 -60322674 -61277816 -61438730 -60859489
11959 -60859489 -59682011 -58123633 -56403811 -54648364 -52831723 -50791396 -48305205 -45196538
11951 -45196538 -41428895 -37153035 -32679192 -28378136 -24561454 -21412404 -19001487 -17349065
$$ packed form
12011A8964588p196766p246688o802773o093048n365598m782690m374054m059968
12003b6956997l713514l225021k547695j715248q27619j1094O28371J038420J229358
11994c6101039J258378J196063J091483R56097P75393N36463K49979m5799k96211
11985c0379193m47326m62236l33081q6546K19132N06917P02133P54966O52436
11976b8872798M11296N5684m04249r75197j659455k422354l173256l780215m116539
11967d4937083m113596l787103l220339k515815j748738r55142j60914N79241
11959f0859489J177478J558378J719822J755447J816641K040327K486191L108667
11951d5196538L767643M275860M473843M301056L816682L149050K410917J652422
$$ plain form
11943 -17349065 -16459675 -16290931 -16698131 -17432354 -18226087 -18920454 -19549253 -20327236 -21556487
11934 -21556487 -23508761 -26338370 -30044553 -34469256 -39312880 -44173766 -48631094 -52365383
11926 -52365383 -55264206 -57448126 -59197772 -60826864 -62569113 -64520092 -66637199 -68781468
11918 -68781468 -70778926 -72475237 -73763175 -74584861 -74932097 -74862538 -74518790 -74115302 -73873145
11909 -73873145 -73927256 -74262914 -74724716 -75091211 -75167080 -74846021 -74129419 -73110399 -71933990
11900 -71933990 -70739319 -69596461 -68460488 -67162420 -65443573 -63027980 -59717529 -55479662
11892 -55479662 -50487125 -45082958 -39682926 -34664092 -30292970 -26717430 -24005576 -22188169
11884 -22188169 -21264355 -21162586 -21688700 -22509569 -23198274 -23325809 -22560933 -20746585 -17937776
$$ packed form
11943a7349065Q89390J68744m07200p34223p93733o94367o28799p77983j229251
11934b1556487j952274k829609l706183m424703m843624m860886m457328l734289
11926e2365383k898823k183920j749646j629092j742249j950979k117107k144269
11918f8781468j997458j696311j287938q21686l47236O9559L43748M03488K42157
11909g3873145n4111l35658m61802l66495p5869L21059P16602J019020J176409
11900g1933990J194671J142858J135973J298068J718847K415593L310451M237867
11892e5479662M992537N404167N400032N018834M371122L575540K711854J817407
11884b2188169R23814J01769n26114q20869o88705j27535P64876J814348K808809
$$ plain form
11875 -17937776 -14392395 -10510681 -6738253 -3472414 -1012345 438834 749379 -150988
11867 -150988 -2251572 -5426024 -9411754 -13829735 -18252545 -22301023 -25730624 -28472949
11859 -28472949 -30621400 -32372111 -33942276 -35493304 -37086530 -38684373 -40183599 -41454000
11851 -41454000 -42368698 -42830589 -42797293 -42292030 -41388110 -40174956 -38729041 -37107257 -35362425
11842 -35362425 -33566497 -31820468 -30233792 -28875183 -27721821 -26640209 -25410641 -23782442
11834 -23782442 -21542457 -18584900 -14964299 -10902636 -6736249 -2827225 512561 3057973
11826 3057973 4681820 5367332 5222325 4467989 3383284 2223255 1156935 259133 -450218
11817 -450218 -959304 -1248573 -1312451 -1193914 -1001463 -895638 -1053638 -1630366 -2731245 -4402972
$$ packed form
11875a7937776L545381L881714L772428L265839K460069J451179L10545r00367
11867a50988k100584l174452l985730m417981m422810m048478l429601k742325
11859b8472949k148451j750711j570165j551028j593226j597843j499226j270401
11851d1454000r14698m61891L3296N05263R03920J213154J445915J621784J744832
11842c5362425J795928J746029J586676J358609J153362J081612J229568J628199
11834b3782442K239985K957557L620601M061663M166387L909024L339786K545412
11826C057973J623847O85512j45007p54336j084705j160029j066320q97802p09351
11817d50218n09086k89269o3878J18537J92451J05825j58000n76728j100879j671727
$$ plain form
11807 -4402972 -6640029 -9402322 -12640884 -16327308 -20474626 -25132057 -30346476 -36107228
11799 -36107228 -42307910 -48751354 -55196332 -61418136 -67248981 -72580458 -77335278 -81431508
11791 -81431508 -84760663 -87188115 -88572905 -88800285 -87819554 -85677070 -82531510 -78640492
11783 -78640492 -74317235 -69870789 -65555409 -61552510 -57987934 -54962304 -52565056 -50860275
11775 -50860275 -49857877 -49495513 -49648080 -50161207 -50886571 -51694972 -52463247 -53056848 -53333406
11766 -53333406 -53168429 -52480836 -51240134 -49458620 -47182131 -44485427 -41471377 -38274229
11758 -38274229 -35064543 -32043601 -29415348 -27342618 -25912040 -25126441 -24921039 -25185917
11750 -25185917 -25783440 -26562190 -27372333 -28081750 -28590441 -28846023 -28862936 -28732336 -28596328
$$ packed form
11807d402972k237057k762293l238562l686424m147318m657431n214419n760752
11799c6107228o200682o443444o444978o221804n830845n331477m754820m096230
11791h1431508l329155k427452j384790k27380R80731K142484L145560L891018
11783g8640492M323257M446446M315380M002899L564576L025630K397248J704781
11775e0860275J002398L62364j52567n13127p25364q08401p68275n93601k76558
11766e3333406J64977O87593J240702J781514K276489K696704L014050L197148
11758c8274229L209686L020942K628253K072730J430578P85599K05402k64878
11750b5185917n97523p78750q10143p09417n08691k55582j6913J30600J36008
$$ plain form
11741 -28596328 -28579765 -28720800 -28963586 -29232338 -29531754 -29995160 -30851830 -32347461 -34665127
11732 -34665127 -37868639 -41872697 -46444839 -51239535 -55851228 -59870688 -62938701 -64791503
11724 -64791503 -65281385 -64359553 -62035736 -58350848 -53387113 -47306278 -40383172 -33003325
11716 -33003325 -25611935 -18627512 -12357300 -6957302 -2456158 1177809 3972556 5928677
11708 5928677 7039598 7328046 6865977 5766080 4158382 2173238 -60466 -2409294
11700 -2409294 -4733926 -6899287 -8794370 -10354612 -11579545 -12542860 -13395314 -14356982 -15689512
11691 -15689512 -17644165 -20398754 -24008413 -28387376 -33320823 -38496897 -43551941 -48123317
11683 -48123317 -51898401 -54645671 -56222442 -56566218 -55681668 -53632741 -50544840 -46614852
$$ packed form
11741b8596328J6563j41035k42786k68752k99416m63406q56670j495631k317666
11732c4665127l203512m004058m572142m794696m611693m019460l068013j852802
11724f4791503m89882R21832K323817L684888M963735O080835O923106P379847
11716c3003325P391390O984423O270212N399998M501144L633967K794747J956121
11708E928677J110921K88448m62069j099897j607698j985144k233704k348828
11700b409294k324632k165361j895083j560242j224933r63315q52454r61668j332530
11691a5689512j954653k754589l609659m378963m933447n176074n055044m571376
11683d8123317l775084k747270j576771l43776Q84550K048927L087901L929988
$$ plain form
11675 -46614852 -42116440 -37383299 -32765260 -28573755 -25040671 -22299054 -20376012 -19191413
11667 -19191413 -18572942 -18299993 -18166997 -18035825 -17850921 -17613484 -17330266 -16960369 -16385178
11658 -16385178 -15420626 -13870913 -11597041 -8565083 -4857510 -658422 3765353 8077451
11650 8077451 11890435 14809779 16510954 16828727 15815278 13728538 10946137 7841500
11642 7841500 4679020 1572178 -1487827 -4561620 -7692209 -10866372 -14010081 -17001869
11634 -17001869 -19686949 -21887824 -23421572 -24136370 -23964524 -22966820 -21336555 -19353140
11626 -19353140 -17308633 -15445700 -13930001 -12850505 -12224427 -11992818 -12018535 -12113121 -12101554
11617 -12101554 -11896197 -11535188 -11168213 -11012573 -11308350 -12275907 -14066971 -16720166 -20148029
$$ packed form
11675d6614852M498412M733141M618039M191505L533084K741617J923042J184599
11667a9191413O18471K72949J32996J31172J84904K37437K83218L69897N75191
11658a6385178R64552J549713K273872L031958L707573M199088M423775M312098
11650H077451L812984K919344J701175L17773j013449k086740k782401l104637
11642G841500l162480l106842l060005l073793l130589l174163l143709k991788
11634a7001869k685080k200875j533748p14798J71846R97704J630265J983415
11626a9353140K044507J862933J515699J079496O26078K31609k5717r4586J1567
11617a2101554K05357L61009L66975J55640k95777r67557j791064k653195l427863
$$ plain form
11608 -20148029 -24165254 -28538511 -33033341 -37450258 -41651664 -45577825 -49250386 -52767452
11600 -52767452 -56290035 -60008304 -64080405 -68560834 -73353086 -78211892 -82794580 -86741201
11592 -86741201 -89755144 -91656348 -92389726 -91993266 -90552123 -88170156 -84974692 -81144470
11584 -81144470 -76931206 -72646060 -68605898 -65063870 -62159349 -59907062 -58223726 -56980954
11576 -56980954 -56069466 -55449237 -55153798 -55237827 -55699714 -56434196 -57246401 -57910704 -58233275
11567 -58233275 -58091400 -57448651 -56354780 -54935809 -53378904 -51917388 -50813319 -50323740
11559 -50323740 -50641758 -51829337 -53781523 -56254159 -58948877 -61610165 -64083613 -66319013
11551 -66319013 -68345630 -70256214 -72202019 -74366894 -76901703 -79849771 -83117816 -86511131
$$ packed form
11608b0148029m017225m373257m494830m416917m201406l926161l672561l517066
11600e2767452l522583l718269m072101m480429m792252m858806m582688l946621
11592h6741201l013943j901204p33378L96460J441143K381967L195464L830222
11584h1144470M213264M285146M040162L542028K904521K252287J683336J242772
11576e6980954R11488O20229K95439q4029m61887p34482q12205o64303l22571
11567e8233275J41875O42749J093871J418971J556905J461516J104069M89579
11559e0323740l18018j187579j952186k472636k694718k661288k473448k235400
11551f6319013k026617j910584j945805k164875k534809k948068l268045l393315
$$ plain form
11543 -86511131 -89797455 -92753920 -95188989 -96961679 -98007156 -98347641 -98068233 -97271832
11535 -97271832 -96052737 -94512006 -92796623 -91122189 -89753013 -88942326 -88853213 -89488546 -90665560
11526 -90665560 -92065453 -93350089 -94283891 -94784059 -94873241 -94582935 -93884327 -92688970 -90907776
11517 -90907776 -88528603 -85674981 -82622287 -79761489 -77515164 -76226494 -76055936 -76925391
11509 -76925391 -78538205 -80472877 -82311707 -83746704 -84619887 -84896518 -84610028 -83825615 -82638601
11500 -82638601 -81182365 -79611379 -78055958 -76578808 -75161431 -73719850 -72131438 -70261002
11492 -70261002 -67984778 -65212126 -61905218 -58101432 -53939252 -49672800 -45652083 -42260712
11484 -42260712 -39827473 -38541351 -38397395 -39191020 -40564490 -42093486 -43390535 -44197016
$$ packed form
11543h6511131l286324k956465k435069j772690j045477l40485K79408P96401
11535i7271832J219095J540731J715383J674434J369176Q10687Q9113o35333j177014
11526i0665560j399893j284636r33802n00168q9182K90306O98608J195357J781194
11517i0907776K379173K853622L052694K860798K246325J288670J70558q69455
11509g6925391j612814j934672j838830j434997q73183k76631K86490P84413J187014
11500h2638601J456236J570986J555421J477150J417377J441581J588412J870436
11492g0261002K276224K772652L306908L803786M162180M266452M020717L391371
11484d2260712K433239J286122J43956p93625j373470j528996j297049q06481
$$ plain form
11476 -44197016 -44431369 -44164713 -43525410 -42584699 -41299179 -39545908 -37211631 -34259934 -30730341
11467 -30730341 -26684181 -22147968 -17097691 -11495086 -5355041 1191364 7866999 14263830
11459 14263830 19903780 24340659 27283358 28693689 28802160 28020404 26795190 25490716
11451 25490716 24360395 23594026 23367014 23829064 25038713 26910118 29231337 31747412
11443 31747412 34241523 36550865 38515854 39923861 40515354 40066308 38494798 35917841
11435 35917841 32619101 28941697 25150995 21315385 17249405 12557094 6784166 -369139
11427 -369139 -8870078 -18299250 -27946483 -37008139 -44797343 -50888887 -55164307 -57770370
11419 -57770370 -59029873 -59340323 -59081351 -58547263 -57924256 -57319422 -56817091 -56517917 -56534331
$$ packed form
11476d4197016k34353K66656O39303R40711J285520J753271K334277K951697L529593
11467c0730341M046160M536213N050277N602605O140045O546405O675635O396831
11459A4263830N639950M436879K942699J410331J08471p81756j225214j304474
11451B5490716j130321p66369k27012M62050J209649J871405K321219K516075
11443C1747412K494111K309342J964989J408007N91493m49046j571510k576957
11435C5917841l298740l677404l790702l835610m065980m692311n772928p153305
11427c69139q500939r429172r647233r061656p789204o091544m275420k606063
11419e7770370j259503l10450K58972N34088O23007O04834N02331K99174j6414
$$ plain form
11410 -56534331 -56954917 -57809195 -59052347 -60573185 -62225492 -63878954 -65469339 -67016993
11402 -67016993 -68599532 -70295246 -72126147 -74017995 -75782386 -77125940 -77690736 -77118066
11394 -77118066 -75114912 -71503280 -66243293 -59431447 -51283019 -42112761 -32324520 -22405681
11386 -22405681 -12906681 -4385366 2685230 8018436 11577700 13563368 14323492 14236453
11378 14236453 13626523 12740375 11765505 10851316 10106450 9568970 9163329 8670812 7746400
11369 7746400 6002390 3144005 -896380 -5893246 -11370301 -16736195 -21449419 -25140348
11361 -25140348 -27655592 -29038070 -29477085 -29251981 -28676034 -28042167 -27573845 -27385791 -27462275
11352 -27462275 -27665792 -27783598 -27598002 -26945169 -25731489 -23908856 -21443536 -18316584 -14562329
$$ packed form
11410e6534331m20586q54278j243152j520838j652307j653462j590385j547654
11402f7016993j582539j695714j830901j891848j764391j343554n64796N72670
11394g7118066K003154L611632N259987O811846Q148428R170258R788241R918839
11386b2405681R499000Q521315P070596N333206L559264J985668P60124q7039
11378A4236453o09930q86148r74870r14189p44866n37480m05641m92517r24412
11369G746400j744010k858385m040385m996866n477055n365894m713224l690929
11361b5140348k515244j382478m39015K25104N75947O33867M68322J88054p6484
11352b7462275k03517j17806J85596O52833J213680J822633K465320L126952L754255
$$ plain form
11343 -14562329 -10313789 -5814682 -1382565 2661273 6069085 8730733 10706171 12206738
11335 12206738 13520743 14910184 16523926 18358682 20271313 22032095 23406295 24240103
11327 24240103 24510664 24309132 23769895 23002040 22074992 21057985 20061420 19226804 18662138
11318 18662138 18373726 18253177 18134214 17880216 17445841 16882009 16292853 15776905 15386613
11309 15386613 15127331 14993244 15010959 15250681 15786523 16629851 17686939 18779073 19719083
11300 19719083 20396647 20814385 21046396 21145303 21066585 20671641 19811099 18427203 16606568
11291 16606568 14565026 12597943 11033434 10193902 10349885 11660680 14119120 17527275
11283 17527275 21520707 25640522 29433663 32548964 34793901 36127355 36588595 36198406
$$ packed form
11343a4562329M248540M499107M432117M043838L407812K661648J975438J500567
11335A2206738J314005J389441J613742J834756J912631J760782J374200Q33808
11327B4240103K70561k01532n39237p67855r27048j017007r96565q34616n64666
11318A8662138k88412j20549j18963k53998m34375n63832n89156n15948l90292
11309A5386613k59282j34087J7715K39722N35842Q43328J057088J092134R40010
11300A9719083O77564M17738K32011R8907p8718l94944q60542j383896j820635
11291A6606568k041542j967083j564509q39532J55983J310795K458440L408155
11283A7527275L993432M119815L793141L115301K244937J333454M61240l90189
$$ plain form
11275 36198406 34894447 32549245 29062305 24461931 18949144 12863501 6598067 504130
11267 504130 -5181571 -10362746 -15053048 -19308070 -23159460 -26581528 -29495427 -31803435
11259 -31803435 -33444961 -34454951 -34989437 -35292148 -35614600 -36133653 -36907276 -37884059 -38960058
11250 -38960058 -40059396 -41198258 -42491371 -44093115 -46112213 -48556047 -51332066 -54289877
11242 -54289877 -57267147 -60113173 -62686972 -64842421 -66415342 -67220660 -67060649 -65744431
11234 -65744431 -63121675 -59131052 -53853395 -47548763 -40654624 -33730412 -27349473 -21962590
11226 -21962590 -17780899 -14730907 -12505358 -10684342 -8868475 -6774174 -4275871 -1407448
11218 -1407448 1661411 4667021 7307889 9306677 10465335 10702712 10068869 8734478
$$ packed form
11275C6198406j303959k345202l486940m600374n512787o085643o265434o093937
11267E04130n685701n181175m690302m255022l851390l422068k913899k308008
11259c1803435j641526j009990n34486l02711l22452n19053p73623r76783j075999
11250c8960058j099338j138862j293113j601744k019098k443834k776019k957811
11242e4289877k977270k846026k573799k155449j572921q05318J60011J316218
11234f5744431K622756L990623N277657O304632O894139O924212O380939N386883
11226b1962590M181691L049992K225549J821016J815867K094301K498303K868423
11218a407448L068859L005610K640868J998788J158658K37377o33843j334391
$$ plain form
11210 8734478 6957319 5032112 3234457 1773370 767446 253076 218203 639292 1496358
11201 1496358 2757981 4353712 6162588 8032046 9814588 11395774 12697880 13665151
11193 13665151 14248819 14407399 14127793 13460070 12543923 11597982 10860898 10510263 10607651
11184 10607651 11097584 11844208 12669300 13376148 13772683 13706846 13103297 11977255 10413022
11175 10413022 8515942 6360237 3958966 1275783 -1723754 -5011719 -8467378 -11893693
11167 -11893693 -15065416 -17780419 -19894209 -21329681 -22062782 -22095665 -21438311 -20113925 -18182792
11158 -18182792 -15762657 -13023769 -10148896 -7267412 -4396513 -1436029 1760606 5274683
11150 5274683 9045929 12883923 16549693 19840954 22626563 24826074 26369707 27178068
$$ packed form
11210H734478j777159j925207j797655j461087j005924n14370l4873M21089Q57066
11201A496358J261623J595731J808876J869458J782542J581186J302106R67271
11193A3665151N83668J58580k79606o67723r16147r45941p37084l50635R7388
11184A0607651M89933P46624Q25092P06848L96535o5837o03549j126042j564233
11175A0413022j897080k155705k401271k683183k999537l287965l455659l426315
11167a1893693l171723k715003k113790j435472p33101l2883O57354J324386J931133
11158a8182792K420135K738888K874873K881484K870899K960484L196635L514077
11150E274683L771246L837994L665770L291261K785609K199511J543633Q08361
$$ plain form
11142 27178068 27177272 26334820 24684543 22315537 19324316 15754084 11556970 6610651 798938
11133 798938 -5870192 -13167516 -20626359 -27631717 -33588835 -38109182 -41141788 -42994486
11125 -42994486 -44230111 -45475414 -47218103 -49666545 -52710833 -55979870 -58960878 -61140716
11117 -61140716 -62133732 -61768966 -60118767 -57466016 -54226846 -50856878 -47761867 -45221472
11109 -45221472 -43339782 -42051890 -41206848 -40699253 -40573785 -41032623 -42338298 -44672715 -48035415
11100 -48035415 -52231782 -56942828 -61821623 -66556035 -70875122 -74525602 -77264350 -78890572
11092 -78890572 -79302308 -78540489 -76792986 -74359621 -71603090 -68910439 -66666210 -65218143
11084 -65218143 -64824141 -65597384 -67481572 -70272638 -73674460 -77360674 -81018992 -84368444
$$ packed form
11142B7178068p96q42452j650277k369006k991221l570232m197114m946319n811713
11133G98938o669130p297324p458843p005358n957118m520347l032606j852698
11125d2994486j235625j245303j742689k448442l044288l269037k981008k179838
11117f1140716r93016L64766J650199K652751L239170L369968L095011K540395
11109d5221472J881690J287892Q45042N07595J25468m58838j305675k334417l362700
11100d8035415m196367m711046m878795m734412m319087l650480k738748j626222
11092g8890572m11736P61819J747503K433365K756531K692651K244229J448067
11084f5218143L94002p73243j884188k791066l401822l686214l658318l349452
$$ plain form
11076 -84368444 -87155384 -89144511 -90119376 -89894215 -88330208 -85354253 -80985254 -75365281
11068 -75365281 -68776534 -61622844 -54374170 -47495588 -41387354 -36349532 -32567919 -30109549
11060 -30109549 -28919009 -28818981 -29530935 -30731112 -32136456 -33588506 -35093990 -36798721
11052 -36798721 -38902748 -41549335 -44730610 -48250500 -51768231 -54909875 -57395717 -59118219
11044 -59118219 -60135157 -60594156 -60639362 -60349412 -59729981 -58754530 -57425001 -55816271 -54079104
11035 -54079104 -52402133 -50957176 -49857357 -49143427 -48793649 -48741009 -48884749 -49097708 -49244021
11026 -49244021 -49217988 -48993053 -48648641 -48346127 -48256360 -48475330 -48972403 -49591556 -50093734 -50214869
11016 -50214869 -49722584 -48466059 -46411957 -43651420 -40366825 -36766537 -33016908 -29205250
$$ packed form
11076h4368444k786940j989127r74865K25161J564007K975955M368999N619973
11068g5365281O588747P153690P248674O878582O108234N037822L781613K458370
11060c0109549J190540J00028p11954j200177j405344j452050j505484j704731
11052c6798721k104027k646587l181275l519890l517731l141644k485842j722502
11044e9118219j016938m58999m5206K89950O19431R75451J329529J608730J737167
11035e4079104J676971J444957J099819P13930L49778N2640j43740k12959j46313
11026d9244021K6033K24935L44412L02514Q9767k18970m97073o19153n02178j21135
11016e0214869M92285J256525K054102K760537L284595L600288L749629L811658
$$ plain form
11008 -29205250 -25350450 -21449210 -17524719 -13647538 -9924431 -6476813 -3432670 -935928
11000 -935928 841450 1701144 1441818 -95829 -2970840 -7091829 -12202993 -17921348 -23811639
10991 -23811639 -29463925 -34541698 -38790726 -42022679 -44098695 -44932433 -44514328 -42939613
10983 -42939613 -40415503 -37234324 -33720068 -30168090 -26793760 -23697050 -20849262 -18111421
10975 -18111421 -15286275 -12188592 -8709688 -4860107 -783739 3264125 6979095 10092524
10967 10092524 12438992 13975824 14759947 14909929 14570753 13881062 12943477 11808487 10478786
10958 10478786 8927589 7120520 5037121 2690003 134108 -2542130 -5242679 -7894511
10950 -7894511 -10464861 -12950345 -15338658 -17566617 -19507651 -21001236 -21902568 -22118722
$$ packed form
11008b9205250L854800L901240L924491L877181L723107L447618L044143K496742
11000i35928J777378Q59694k59326j537647k875011m120989n111164n718355n890291
10991b3811639n652286n077773m249028l231953k076016q33738M18105J574715
10983d2939613K524110L181179L514256L551978L374330L096710K847788K737841
10975a8111421K825146L097683L478904L849581M076368M047864L714970L113429
10967A0092524K346468J536832P84123J49982l39176o89691r37585j134990j329701
10958A0478786j551197j807069k083399k347118k555895k676238k700549k651832
10950g894511k570350k485484k388313k227959j941034j493585r01332k16154
$$ plain form
10942 -22118722 -21618852 -20433311 -18659543 -16471744 -14111546 -11839954 -9857693 -8231922
10934 -8231922 -6873267 -5577321 -4103867 -2253264 80534 2879083 5992553 9171053
10926 9171053 12137025 14667299 16636147 17999050 18749064 18901282 18530410 17830996 17142648
10917 17142648 16905981 17562272 19438089 22650366 27047051 32189501 37389465 41817095
10909 41817095 44675461 45394289 43764072 39948486 34376076 27574549 20026587 12095765
10901 12095765 4029561 -3983723 -11746996 -19024598 -25578039 -31247051 -36018335 -40031322
10893 -40031322 -43515188 -46695903 -49725089 -52661773 -55501863 -58221955 -60801714 -63212838
10885 -63212838 -65392938 -67234772 -68606564 -69390427 -69506704 -68899544 -67492002 -65152057
$$ packed form
10942b2118722M99870J185541J773768K187799K360198K271592J982261J625771
10934h231922J358655J295946J473454J850603K333798K798549L113470L178500
10926I171053K965972K530274J968848J362903P50014J52218l70872o99414o88348
10917A7142648k36667O56291J875817L212277M396685N142450N199964M427630
10909D1817095K858366P18828j630217l815586n572410o801527p547962p930822
10901A2095765q066204q013284p763273p277602o553441n669012m771284m012987
10893d0031322l483866l180715l029186k936684k840090k720092k579759k411124
10885f3212838k180100j841834j371792p83863j16277O07160J407542K339945
$$ plain form
10877 -65152057 -61712183 -57046100 -51158102 -44227284 -36584475 -28649710 -20874245 -13701394
10869 -13701394 -7524863 -2629222 860021 2968151 3796808 3440951 1968552 -524125
10861 -524125 -3838072 -7647042 -11549301 -15172508 -18283173 -20847824 -23008084 -24972823
10853 -24972823 -26881572 -28713184 -30281752 -31307303 -31517735 -30742621 -28974778 -26382576
10845 -26382576 -23263179 -19949089 -16709078 -13691867 -10932714 -8401332 -6051219 -3847026
10837 -3847026 -1773283 162494 1926085 3452144 4641532 5369727 5520574 5044514 4009222
10828 4009222 2598556 1046738 -454953 -1820162 -3064376 -4248276 -5407663 -6508978
10820 -6508978 -7448211 -8086030 -8296644 -8007499 -7215752 -5977348 -4374536 -2480817 -349286
$$ packed form
10877f5152057L439874M666083N887998O930818P642809P934765P775465P172851
10869a3701394O176531M895641L489243K108130Q28657l55857j472399k492677
10861e24125l313947l808970l902259l623207l110665k564651k160260j964739
10853b4972823j908749j831612j568568j025551k10432P75114J767843K592202
10845b6382576L119397L314090L240011L017211K759153K531382K350113K204193
10837c847026K073743J935777J763591J526059J189388P28195J50847m76060j035292
10828D009222j410666j551818j501691j365209j244214j183900j159387j101315
10820f508978r39233o37819k10614K89145P91747J238404J602812J893719K131531
$$ plain form
10811 -349286 1964369 4363681 6693096 8755074 10345156 11279692 11412508 10654946 9004685
10802 9004685 6567484 3550563 222473 -3144593 -6323741 -9153439 -11528937 -13386243
10794 -13386243 -14701884 -15509928 -15914324 -16073703 -16155257 -16274487 -16447852 -16586483 -16545203
10785 -16545203 -16208589 -15566267 -14735517 -13928702 -13394510 -13358123 -13966917 -15247492 -17091591
10776 -17091591 -19284248 -21563897 -23687699 -25481595 -26868894 -27876006 -28612630 -29228687
10768 -29228687 -29861408 -30592148 -31427860 -32309923 -33140585 -33811160 -34220913 -34290124 -33984046
10759 -33984046 -33359774 -32618633 -32112128 -32251012 -33327100 -35339568 -37943645 -40570022 -42649238
10750 -42649238 -43812945 -43976506 -43291385 -42021244 -40413143 -38616369 -36666692 -34519581
$$ packed form
10811c49286K313655K399312K329415K061978J590082R34536J32816p57562j650261
10802I004685k437201l016921l328090l367066l179148k829698k375498j857306
10794a3386243j315641q08044m04396j59379q1554j19230j73365j38631M1280
10785a6545203L36614O42322Q30750Q06815N34192L6387o08794j280575j844099
10776a7091591k192657k279649k123802j793896j387299j007112p36624o16057
10768b9228687o32721p30740q35712q82063q30662o70575m09753o9211L06078
10759c3984046O24272P41141N06505j38884j076088k012468k604077k626377k079216
10750d2649238j163707j63561O85121J270141J608101J796774J949677K147111
$$ plain form
10742 -34519581 -32100712 -29352106 -26269007 -22922917 -19456741 -16045600 -12844180 -9956636
10734 -9956636 -7444434 -5352293 -3720934 -2575184 -1899643 -1619997 -1600757 -1662540 -1614444
10725 -1614444 -1287636 -554314 669787 2422179 4672290 7289239 10031707 12589188
10717 12589188 14667068 16068540 16722460 16645175 15873717 14424540 12304883 9560441 6318592
10708 6318592 2792533 -762202 -4117593 -7129620 -9747783 -11975225 -13811977 -15225657
10700 -15225657 -16174077 -16667671 -16828507 -16896141 -17159908 -17849900 -19054199 -20711456 -22670098
10691 -22670098 -24763123 -26854844 -28851243 -30688693 -32317895 -33697609 -34810749 -35701671
10683 -35701671 -36510316 -37469395 -38849899 -40873041 -43626331 -47016917 -50777494 -54522649
$$ packed form
10742c4519581K418869K748606L083099L346090L466176L411141L201420K887544
10734i956636K512202K092141J631359J145750O75541K79646J9240o1783M8096
10725a614444L26808P33322J224101J752392K250111K616949K742468K557481
10717A2589188K077880J401472O53920p7285p71458j449177k119657k744442l241849
10708F318592l526059l554735l355391l012027k618163k227442j836752j413680
10700a5225657r48420m93594j60836o7634k63767o89992j204299j657257j958642
10691b2670098k093025k091721j996399j837450j629202j379714j113140q90922
10683c5701671q08645r59079j380504k023142k753290l390586l760577l745155
$$ plain form
10675 -54522649 -57841109 -60398981 -62021351 -62721447 -62664481 -62082629 -61182140 -60085898 -58830021
10666 -58830021 -57396492 -55744371 -53818620 -51552830 -48898240 -45883569 -42666065 -39524196
10658 -39524196 -36780329 -34691089 -33362098 -32725751 -32585375 -32697327 -32848666 -32899298 -32784511
10649 -32784511 -32493351 -32038921 -31430882 -30660333 -29705207 -28550596 -27205298 -25701582 -24084929
10640 -24084929 -22410752 -20754989 -19227214 -17967151 -17116098 -16776770 -16988731 -17734524 -18962736
10631 -18962736 -20600640 -22547178 -24663942 -26785102 -28747455 -30424334 -31745891 -32696625
10623 -32696625 -33291548 -33542086 -33425709 -32868034 -31743891 -29908738 -27264224 -23830252 -19770793
10614 -19770793 -15343348 -10801065 -6313549 -1953224 2255498 6264328 9955119 13150486
$$ packed form
10675e4522649l318460k557872j622370p00096N6966N81852R00489J096242J255877
10666e8830021J433529J652121J925751K265790K654590L014671L217504L141869
10658c9524196K743867K089240J328991O36347J40376j11952j51339n0632J14787
10649c2784511K91160M54430O08039P70549R55126J154611J345298J503716J616653
10640b4084929J674177J655763J527775J260063Q51053L39328k11961p45793j228212
10631a8962736j637904j946538k116764k121160j962353j676879j321557r50734
10623c2696625n94923k50538J16377N57675J124143J835153K644514L433972M059459
10614a9770793M427445M542283M487516M360325M208722M008830L690791L195367
$$ plain form
10606 13150486 15673514 17413391 18354572 18566152 18181938 17392880 16440256 15585158 15049026
10597 15049026 14944324 15222766 15664763 15924576 15625791 14471888 12318544 9172327 5129836
10588 5129836 312871 -5149602 -11090169 -17265645 -23359106 -29030082 -33986391 -38043016
10580 -38043016 -41146609 -43361410 -44826116 -45699063 -46108552 -46119454 -45723151 -44853880 -43425181
10571 -43425181 -41371563 -38683638 -35433435 -31784294 -27972320 -24258672 -20881747 -18046885
10563 -18046885 -15955575 -14830766 -14892100 -16279243 -18968006 -22732722 -27179889 -31837574
10555 -31837574 -36257227 -40082287 -43061280 -45017660 -45812217 -45330628 -43501530 -40322720
10547 -40322720 -35871001 -30295106 -23809711 -16696758 -9296780 -1977236 4903246 11002773
$$ packed form
10606A3150486K523028J739877R41181K11580l84214p89058r52624q55098n36132
10597A5049026j04702K78442M41997K59813k98785j153903k153344l146217m042491
10588E129836m816965n462473n940567o175476o093461n670976m956309m056625
10580c8043016l103593k214801j464706q72947m09489j0902L96303Q69271J428699
10571d3425181K053618K687925L250203L649141L811974L713648L376925K834862
10563a8046885K091310J124809o1334j387143k688763l764716m447167m657685
10555c1837574m419653l825060k978993j956380p94557M81589J829098L178810
10547d0322720M451719N575895O485395P112953P399978P319544O880482O099527
$$ plain form
10539 11002773 15977633 19482980 21235523 21124717 19302343 16179871 12321378 8286650
10531 8286650 4498858 1176951 -1670958 -4209989 -6706165 -9434834 -12602320 -16308558
10523 -16308558 -20548432 -25230945 -30205660 -35296769 -40334507 -45164278 -49631262 -53563931
10515 -53563931 -56780211 -59117297 -60468911 -60812772 -60215571 -58808161 -56734104 -54088781
10507 -54088781 -50875365 -47000988 -42316299 -36670683 -29939992 -22005701 -12703500 -1774895
10499 -1774895 11157721 26585141 45076757 67241823 93722665 125212539 162420953
10492 162420953 205897864 255687740 310848514 368945330 425787253 475813759 513348593
10485 513348593 534341519 537687598 525353678 501327643 470126863 435656718 400725794
$$ packed form
10539A1002773M974860L505347J752543j10806j822374l122472l858493m034728
10531H286650l787792l321907k847909k539031k496176k728669l167486l706238
10523a6308558m239874m682513m974715n091109n037738m829771m466984l932669
10515e3563931l216280k337086j351614l43861N97201J407410K074057K645323
10507e4088781L213416L874377M684689N645616O730691P934291R302201J0928605
10499a774895J2932616J5427420J8491616K2165066K6480842L1489874L7208414
10492A62420953M3476911M9789876N5160774N8096816N6841923N0026506L7534834
10485E13348593K0992926L346079j2333920k4026035l1200780l4470145l4930924
$$ plain form
10478 400725794 367062953 335555903 306524187 279944698 255610409 233241101 212569483
10471 212569483 193403502 175657004 159353988 144611257 131588827 120407240 111065786
10464 111065786 103405002 97124071 91833794 87126156 82645882 78139084 73455808 68514159
10456 68514159 63262489 57669780 51743667 45552375 39225264 32925527 26818044 21067812
10448 21067812 15875415 11507978 8273525 6430805 6078123 7077216 9048027 11444433
10440 11444433 13693352 15348054 16193257 16264825 15791239 15091015 14462311 14096141 14038074
10431 14038074 14204184 14429030 14511813 14244692 13436036 11949922 9761838 7000237 3935717
10422 3935717 906055 -1794202 -4008651 -5758145 -7214524 -8628235 -10243312 -12230537
$$ packed form
10478D00725794l3662841l1507050k9031716k6579489k4334289k2369308k0671618
10471B12569483j9165981j7746498j6303016j4742731j3022430j1181587r341454
10464A11065786p660784o280931n290277m707638m480274m506798m683276m941649
10456F8514159n251670n592709n926113o191292o327111o299737o107483n750232
10448B1067812n192397m367437l234453j842720l52682R99093J970811K396406
10440A1444433K248919J654702Q45203P1568m73586p00224o28704l66170n8067
10431A4038074J66110K24846Q2783k67121q08656j486114k188084k761601l064520
10422C935717l029662k700257k214449j749494j456379j413711j615077j987225
$$ plain form
10414 -12230537 -14654839 -17476383 -20575335 -23788319 -26945135 -29896505 -32530112 -34779172
10406 -34779172 -36628582 -38119805 -39353546 -40488211 -41727030 -43282762 -45318261 -47881574
10398 -47881574 -50867083 -54026099 -57027448 -59545605 -61341357 -62304601 -62450369 -61883830
10390 -61883830 -60758807 -59244689 -57503625 -55675108 -53865743 -52142887 -50532312 -49020260
10382 -49020260 -47555646 -46046316 -44356088 -42326867 -39842642 -36912909 -33719917 -30587353
10374 -30587353 -27878764 -25876053 -24692805 -24253529 -24339511 -24675893 -25020628 -25222546 -25237865
10365 -25237865 -25112244 -24938472 -24801325 -24732797 -24707423 -24684811 -24664599 -24702250 -24868624 -25191126
10355 -25191126 -25632227 -26123757 -26622699 -27138725 -27715589 -28392108 -29181872 -30084613 -31104802
$$ packed form
10414a2230537k424302k821544l098952l212984l156816k951370k633607k249060
10406c4779172j849410j491223j233741j134665j238819j555732k035499k563313
10398d7881574k985509l159016l001349k518157j795752r63244j45768N66539
10390f1883830J125023J514118J741064J828517J809365J722856J610575J512052
10382d9020260J464614J509330J690228K029221K484225K929733L192992L132564
10374c0587353K708589K002711J183248M39276q5982l36382l44735k01918j5319
10365b5237865J25621J73772J37147O8528K5374K2612K0212l7651j66374l22502
10355b5191126m41101m91530m98942n16026n76864o76519p89764r02741j020189
$$ plain form
10346 -31104802 -32243838 -33462973 -34652681 -35646487 -36277281 -36434920 -36086880 -35260239 -34009189
10337 -34009189 -32385778 -30414842 -28075631 -25306265 -22043876 -18285607 -14132333 -9787389
10329 -9787389 -5517182 -1601525 1709162 4231322 5880169 6681368 6750224 6248549 5343952
10320 5343952 4187775 2913025 1648120 536698 -258061 -583972 -355535 402509 1551424
10311 1551424 2867282 4079786 4912955 5129578 4566918 3139440 803180 -2489997 -6808781
10302 -6808781 -12210033 -18668194 -25998323 -33813208 -41547182 -48549484 -54209415 -58055485
10294 -58055485 -59793264 -59295448 -56587387 -51854113 -45452586 -37894145 -29785668 -21753108
10286 -21753108 -14379212 -8166736 -3515753 -696077 196889 -706409 -3028211 -6197074
$$ packed form
10346c1104802j139036j219135j189708r93806o30794j57639L48040Q26641J251050
10337c4009189J623411J970936K339211K769366L262389L758269M153274M344944
10329i787389M270207L915657L310687K522160J648847Q01199O8856n01675r04597
10320E343952j156177j274750j264905j111422p94759l25911K28437P58044J148915
10311A551424J315858J212504Q33169K16623n62660j427478k336260l293177m318784
10302f808781n401252o458161p330129p814885p733974p002302n659931l846070
10294e8055485j737779M97816K708061M733274O401527P558441Q108477Q032560
10286b1753108P373896O212476M650983K819676Q92966r03298k321802l168863
$$ plain form
10278 -6197074 -9584571 -12671741 -15164765 -17015164 -18361659 -19442017 -20510735 -21774147
10270 -21774147 -23346184 -25232573 -27349920 -29571703 -31775940 -33866396 -35757323 -37338812
10262 -37338812 -38454618 -38916218 -38553678 -37282083 -35153742 -32373540 -29268663 -26213981
10254 -26213981 -23523302 -21337557 -19567469 -17943965 -16171094 -14100651 -11825080 -9639427
10246 -9639427 -7905227 -6895616 -6693412 -7174435 -8065003 -9035357 -9789705 -10130279 -9987238
10237 -9987238 -9412622 -8546558 -7577612 -6717243 -6186097 -6193992 -6906081 -8408220 -10689247
10228 -10689247 -13649414 -17137158 -21006772 -25170509 -29609739 -34333529 -39312617 -44430099
10220 -44430099 -49468297 -54126816 -58064417 -60964181 -62615053 -62984668 -62247250 -60741083
$$ packed form
10278f197074l387497l087170k493024j850399j346495j080358j068718j263412
10270b1774147j572037j886389k117347k221783k204237k090456j890927j581489
10262c7338812j115806m61600L62540J271595K128341K780202L104877L054682
10254b6213981K690679K185745J770088J623504J772871K070443K275571K185653
10246i639427J734200J009611K02204m81023q90568r70354p54348l40574J43041
10237i987238N74616Q66064R68946Q60369N31146p895p12089j502139k281027
10228a0689247k960167l487744l869614m163737m439230m723790m979088n117482
10220d4430099n038198m658519l937601k899764j650872l69615P37418J506167
$$ plain form
10212 -60741083 -58862648 -56941668 -55154912 -53511791 -51901414 -50164872 -48160345 -45804059
10204 -45804059 -43081538 -40033512 -36731228 -33256894 -29693853 -26121998 -22617360 -19260132
10196 -19260132 -16148924 -13407336 -11169461 -9546084 -8587774 -8262046 -8452292 -8976678 -9620753
10187 -9620753 -10174945 -10465263 -10366597 -9798249 -8714867 -7108618 -5025687 -2584932 16656
10178 16656 2519266 4634660 6090717 6671986 6244403 4763806 2276045 -1088795 -5132617
10169 -5132617 -9613097 -14260633 -18783639 -22883477 -26305056 -28913908 -30749682 -32007860
10161 -32007860 -32949959 -33794387 -34651444 -35530827 -36398751 -37235017 -38055453 -38901342 -39817901
10152 -39817901 -40836328 -41960373 -43158544 -44368029 -45509264 -46498448 -47248894 -47669183
$$ packed form
10212f0741083J878435J920980J786756J643121J610377J736542K004527K356286
10204d5804059K722521L048026L302284L474334L563041L571855L504638L357228
10196a9260132L111208K741588K237875J623377R58310L25728j90246n24386o44075
10187i620753n54192k90318R8666N68348J083382J606249K082931K440755K601588
10178A6656K502610K115394J456057N81269m27583j480597k487761l364840m043822
10169e132617m480480m647536m523006m099838l421579k608852j835774j258178
10161c2007860r42099q44428q57057q79383q67924q36266q20436q45889r16559
10152c9817901j018427j124045j198171j209485j141235r89184p50446m20289
$$ plain form
10144 -47669183 -47673860 -47211464 -46299597 -45050273 -43667128 -42398365 -41448454 -40889138 -40632823
10135 -40632823 -40501214 -40351773 -40177366 -40116831 -40381438 -41149586 -42480016 -44269565 -46266886
10126 -46266886 -48142345 -49588815 -50404759 -50523595 -49996670 -48963992 -47630447 -46237159
10118 -46237159 -45019803 -44170048 -43819964 -44041416 -44832833 -46086886 -47571833 -48966078 -49945597
10109 -49945597 -50277812 -49870530 -48763120 -47088743 -45044198 -42880021 -40897438 -39432775
10101 -39432775 -38820009 -39334390 -41129166 -44187187 -48316549 -53210823 -58561664 -64170647
10093 -64170647 -69994203 -76093920 -82532004 -89290332 -96264170 -103315097 -110327241 -117227522
10085 -117227522 -123972002 -130519054 -136800628 -142695616 -148017604 -152533308 -156010024 -158265085
$$ packed form
10144d7669183m677M62396R11867J249324J383145J268763R49911N59316K56315
10135d0632823J31609J49441J74407O0535k64607p68148j330430j789549j997321
10126d6266886j875459j446470q15944j18836N26925J032678J333545J393288
10118d6237159J217356Q49755L50084k21452p91417j254053j484947j394245r79519
10109d9945597l32215M07282J107410J674377K044545K164177J982583J464663
10101c9432775O12766n14381j794776l058021m129362m894274n350841n608983
10093f4170647n823556o099717o438084o758328o973838p050927p012144o900281
10085a17227522o744480o547052o281574n894988n321988m515704l476716k255061
$$ plain form
10077 -158265085 -159186627 -158719284 -156838260 -153543759 -148888024 -143016312 -136186138 -128740197
10069 -128740197 -121038281 -113380338 -105960357 -98877067 -92197837 -86037592 -80596841 -76123773
10061 -76123773 -72818241 -70738304 -69764863 -69635001 -70014184 -70569958 -71023985 -71171838 -70867498
10052 -70867498 -69982782 -68369615 -65858420 -62306814 -57677630 -52098508 -45860111 -39347963
10044 -39347963 -32945741 -26959435 -21584345 -16902722 -12893048 -9449558 -6421280 -3667827
10036 -3667827 -1111590 1234984 3273082 4843335 5760994 5851821 4985126 3101147 226526
10027 226526 -3529680 -7999841 -12989900 -18304403 -23758300 -29180891 -34418028 -39331303
10019 -39331303 -43790884 -47666195 -50826084 -53156847 -54593499 -55146801 -54905115 -54000299
$$ packed form
10077a58265085r21542M67343J881024L294501M655735N871712O830174P445941
10069a28740197P701916P657943P419981P083290O679230O160245N440751M473068
10061g6123773L305532K079937R73441J29862l79183n55774m54027j47853L04340
10052g0867498Q84716J613167K511195L551606M629184N579122O238397O512148
10044c9347963O402222N986306N375090M681623M009674L443490L028278K753453
10036c667827K556237K346574K038098J570253R17659R0827q66695j883979k874621
10027B26526l756206m470161m990059n314503n453897n422591n237137m913275
10019c9331303m459581l875311l159889k330763j436652n53302K41686R04816
$$ plain form
10011 -54000299 -52547247 -50586315 -48061322 -44847215 -40813787 -35897357 -30158453 -23814504
10003 -23814504 -17236228 -10894352 -5261195 -704935 2572151 4527970 5227889 4784414
9995 4784414 3315287 927129 -2276228 -6167449 -10568234 -15239626 -19895429 -24229348
9987 -24229348 -27946792 -30800976 -32631612 -33391793 -33143195 -32016661 -30163625 -27733304
9979 -27733304 -24882516 -21784059 -18597240 -15413612 -12235683 -9022458 -5763842 -2514087
9971 -2514087 637233 3612451 6361620 8844764 11011035 12793698 14116323 14901159
9963 14901159 15077946 14594292 13427312 11594718 9158706 6212214 2846933 -877636
9955 -877636 -4938360 -9320563 -13981349 -18835987 -23780349 -28733346 -33667833 -38607084
$$ packed form
10011e4000299J453052J960932K524993L214107M033428M916430N738904O343949
10003b3814504O578276O341876N633157M556260L277086J955819O99919m43475
9995D784414j469127k388158l203357l891221m400785m671392m655803m333919
9987b4229348l717444k854184j830636p60181K48598J126534J853036K430321
9979b7733304K850788L098457L186819L183628L177929L213225L258616L249755
9971b514087L151320K975218K749169K483144K166271J782663J322625P84836
9963A4901159J76787m83654j166980j832594k436012k946492l365281l724569
9955h77636m060724m382203m660786m854638m944362m952997m934487m939251
$$ plain form
9947 -38607084 -43586850 -48599816 -53542135 -58182164 -62176063 -65147683 -66817057 -67123117
9939 -67123117 -66280070 -64740947 -63086389 -61881818 -61547386 -62271391 -63979073 -66356321 -68926820
9930 -68926820 -71177192 -72701905 -73313699 -73071900 -72226631 -71122666 -70114397 -69515896 -69577792
9921 -69577792 -70467994 -72240954 -74802423 -77896140 -81136971 -84091420 -86380028 -87765356
9913 -87765356 -88197150 -87805812 -86854039 -85662506 -84521401 -83604447 -82918309 -82317420 -81571756
9904 -81571756 -80429797 -78625883 -75834752 -71616544 -65391692 -56461511 -44072990 -27519128
9896 -27519128 -6279205 19767245 50041175 82999950 116164982 146616958 171802324
9889 171802324 190207612 201537892 206420238 205952585 201378807 193933093 184752574 174794910
$$ packed form
9947c8607084m979766n012966m942319m640029l993899k971620j669374l06060
9939f7123117Q43047J539123J654558J204571L34432p24005j707682k377248k570499
9930f8926820k250372j524713o11794K41799Q45269J103965J008269N98501o1896
9921f9577792q90202j772960k561469l093717l240831k954449k288608j385328
9913h7765356m31794L91338R51773J191533J141105R16954O86138O00889P45664
9904h1571756J141959J803914K791131M218208O224852Q930181J2388521J6553862
9896b7519128K1239923K6046450L0273930L2958775L3165032L0451976K5185366
9889A71802324J8405288J1330280M882346m67653m573778p445714r180519r957664
$$ plain form
9881 174794910 164783875 155219438 146442447 138705944 132205890 127055579 123228924 120521410
9873 120521410 118566588 116912378 115131219 112922933 110169136 106917770 103312924 99513608
9865 99513608 95642043 91776493 87981404 84355206 81065706 78341564 76411187 75416917
9857 75416917 75349939 76035520 77168475 78379290 79305816 79648173 79193916 77816450 75463364
9848 75463364 72153225 67987729 63168170 57992979 52816976 47973812 43688299 40018245
9840 40018245 36856779 33999168 31246313 28499487 25808375 23358447 21405341 20179100
9832 20179100 19796391 20225744 21326005 22926323 24885323 27094159 29445229 31814356
9824 31814356 34080643 36170762 38097048 39961497 41911843 44063214 46429843 48915305
$$ packed form
9881A74794910j0011035r564437q776991p736503o500054n150311l826655k707514
9873A20521410j954822j654210j781159k208286k753797l251366l604846l799316
9865I9513608l871565l865550l795089l626198l289500k724142j930377r94270
9857G5416917o6978O85581J132955J210815R26526L42357m54257j377466k353086
9848G5463364l310139m165496m819559n175191n176003m843164m285513l670054
9840D0018245l161466k857611k752855k746826k691112k449928j953106j226241
9832B0179100l82709M29353J100261J600318J959000K208836K351070K369127
9824C1814356K266287K090119J926286J864449J950346K151371K366629K485462
$$ plain form
9816 48915305 51371205 53683427 55828543 57871932 59921796 62072888 64362841 66744087
9808 66744087 69069882 71104512 72571627 73234250 72973101 71827540 69986947 67740563
9800 67740563 65397176 63191360 61211025 59387513 57561374 55593132 53466216 51337043
9792 51337043 49508386 48330424 48070194 48813124 50441412 52684508 55203991 57680266
9784 57680266 59884737 61721231 63218089 64470776 65564767 66520134 67283416 67763227 67879587
9775 67879587 67586026 66841895 65555613 63552486 60607798 56536216 51287263 44994786
9767 44994786 37957632 30564243 23197397 16158001 9629596 3683402 -1685937 -6504385
9759 -6504385 -10759679 -14368346 -17191826 -19096596 -20025756 -20047000 -19360236 -18266875 -17113051
$$ packed form
9816D8915305K455900K312222K145116K043389K049864K151092K289953K381246
9808F6744087K325795K034630J467115O62623k61149j145561j840593k246384
9800F7740563k343387k205816j980335j823512j826139j968242k126916k129173
9792E1337043j828657j177962k60230P42930J628288K243096K519483K476275
9784E7680266K204471J836494J496858J252687J093991R55367P63282M79811J16360
9775F7879587k93561p44131j286282k003127k944688m071582n248953o292477
9767D4994786p037154p393389p366846p039396o528405n946194n369339m818448
9759f504385m255294l608667k823480j904770r29160k1244O86764J093361J153824
$$ plain form
9750 -17113051 -16224004 -15848155 -16124980 -17082497 -18661353 -20754401 -23245223 -26031132 -29024821
9741 -29024821 -32136993 -35247974 -38184536 -40724802 -42643873 -43783824 -44108731 -43714122
9733 -43714122 -42793190 -41587328 -40346737 -39307311 -38673245 -38592928 -39127653 -40227613 -41733483
9724 -41733483 -43409451 -44994629 -46250192 -46986435 -47071701 -46439443 -45104845 -43177750 -40839535
9715 -40839535 -38269487 -35554636 -32646630 -29402381 -25684244 -21457164 -16831361 -12038885
9707 -12038885 -7368096 -3095387 554569 3414594 5365720 6334444 6301201 5311175 3480292
9698 3480292 995686 -1890708 -4881217 -7668661 -9985311 -11647342 -12569441 -12734988 -12140349
9689 -12140349 -10761286 -8578423 -5647081 -2151892 1607120 5299546 8673052 11624192
$$ packed form
9750a7113051Q89047L75849k76825r57517j578856k093048k490822k785909k993689
9741b9024821l112172l110981k936562k540266j919071j139951l24907L94609
9733d3714122R20932J205862J240591J039426O34066Q0317n34725j099960j505870
9724d1733483j675968j585178j255563p36243q5266O32258J334598J927095K338215
9715d0839535K570048K714851K908006L244249L718137M227080M625803M792476
9707a2038885M670789M272709L649956K860025J951126R68724l3243r90026j830883
9698C480292k484606k886394k990509k787444k316650j662031r22099j65547N94639
9689a2140349J379063K182863K931342L495189L759012L692426L373506K951140
$$ plain form
9681 11624192 14196552 16515424 18701302 20806063 22789312 24524529 25817966 26434576
9673 26434576 26135094 24724683 22101603 18288131 13433613 7794662 1703119 -4477855
9665 -4477855 -10416459 -15884573 -20804381 -25234747 -29299736 -33098739 -36640443 -39820519
9657 -39820519 -42444673 -44289728 -45183084 -45068744 -44033503 -42288968 -40123857 -37845924
9649 -37845924 -35731021 -33991417 -32762826 -32097634 -31957751 -32220544 -32716294 -33290695 -33856351
9640 -33856351 -34399739 -34945788 -35515604 -36111541 -36732032 -37389516 -38107107 -38897829 -39751256
9631 -39751256 -40641106 -41538041 -42401754 -43150871 -43642465 -43697638 -43177382 -42070518 -40538453
9622 -40538453 -38883729 -37454463 -36531748 -36249338 -36570233 -37317124 -38238731 -39089089 -39695003
$$ packed form
9681A1624192K572360K318872K185878K104761J983249J735217J293437O16610
9673B6434576k99482j410411k623080l813472m854518n638951o091543o180974
9665d477855n938604n468114m919808m430366m064989l799003l541704l180076
9657c9820519k624154j845055q93356J14340J035241J744535K165111K277933
9649c7845924K114903J739604J228591O65192J39883k62793m95750n74401n65656
9640c3856351n43388n46049n69816n95937o20491o57484p17591p90722q53427
9631c9751256q89850q96935q63713p49117m91594n5173N20256J106864J532065
9622d0538453J654724J429266R22715K82410l20895p46891r21607q50358o05914
$$ plain form
9613 -39695003 -39989982 -40006353 -39837574 -39597569 -39401660 -39373188 -39655679 -40404395 -41751156 -43762731
9603 -43762731 -46417213 -49602642 -53124617 -56714917 -60049267 -62785985 -64624853 -65372067
9595 -65372067 -64991130 -63618741 -61531404 -59068834 -56546188 -54194968 -52150271 -50467998
9587 -50467998 -49140963 -48098149 -47199190 -46250336 -45055786 -43486713 -41523331 -39229622
9579 -39229622 -36664066 -33784762 -30423534 -26355307 -21411381 -15549304 -8834576 -1370303
9571 -1370303 6748303 15412865 24443035 33554425 42389930 50593527 57873509 64020153
9563 64020153 68888122 72382639 74476434 75246798 74895886 73724187 72056668 70147817
9555 70147817 68102191 65842848 63145887 59736540 55416122 50171280 44218268 37958107
$$ packed form
9613c9695003k94979j6371J68779K40005J95909K8472k82491p48716j346761k011575
9603d3762731k654482l185429l521975l590300l334350k736718j838868p47214
9595f5372067L80937J372389K087337K462570K522646K351220K044697J682273
9587e0467998J327035J042814Q98959R48854J194550J569073J963382K293709
9579c9229622K565556K879304L361228M068227M943926N862077O714728P464273
9571a370303Q118606Q664562R030170R111390Q835505Q203597P279982O146644
9563F4020153M867969L494517K093795P70364l50912j171699j667519j908851
9555G0147817k045626k259343k696961l409347m320418n244842n953012o260161
$$ plain form
9547 37958107 31857231 26306953 21529785 17574997 14391219 11918691 10141375 9077215
9539 9077215 8729807 9043473 9889775 11085483 12424196 13706456 14766121 15496314 15870847
9530 15870847 15948602 15852038 15724550 15681933 15774020 15966659 16146384 16142736 15760506 14818009
9520 14818009 13190570 10851232 7889838 4495281 908487 -2625742 -5883931 -8666152
9512 -8666152 -10794495 -12125350 -12576212 -12151716 -10950596 -9148269 -6968679 -4666639 -2528482
9503 -2528482 -875988 -47893 -344791 -1948561 -4850697 -8830159 -13502114 -18421820 -23198381
9494 -23198381 -27573734 -31447252 -34851282 -37896195 -40710841 -43406394 -46076193 -48813539
9486 -48813539 -51711279 -54824113 -58112742 -61412299 -64456677 -66956360 -68693385 -69583747
$$ packed form
9547C7958107o100876n550278m777168l954788l183778k472528j777316j064160
9539I077215l47408L13666Q46302J195708J338713J282260J059665P30193L74533
9530A5870847P7755r6564j27488m2617R2087J92639J79725l648l82230r42497
9520A4818009j627439k339338k961394l394557l586794l534229l258189k782221
9512h666152k128343j330855m50862M24496J201120J802327K179590K302040K138157
9503b528482J652494Q28095k96898j603770k902136l979462m671955m919706m776561
9494b3198381m375353l873518l404030l044913k814646k695553k669799k737346
9486d8813539k897740l112834l288629l299557l044378k499683j737025q90362
$$ plain form
9478 -69583747 -69674932 -69085633 -67928934 -66264935 -64104605 -61454336 -58368868 -54977386 -51465027
9469 -51465027 -48021283 -44786977 -41827002 -39135900 -36669051 -34388310 -32305201 -30497554
9461 -30497554 -29084902 -28178232 -27842727 -28099455 -28954705 -30423894 -32531201 -35294009 -38708792
9452 -38708792 -42738470 -47288993 -52176461 -57110357 -61720110 -65623463 -68505422 -70175044
9444 -70175044 -70587559 -69833793 -68099633 -65602370 -62526537 -58990857 -55061830 -50797657
9436 -50797657 -46286613 -41651983 -37023244 -32500192 -28144100 -24009487 -20193109 -16853434
9428 -16853434 -14168020 -12241011 -11014060 -10239742 -9542205 -8538383 -6957782 -4702543
9420 -4702543 -1829808 1514087 5157122 8930171 12665202 16191790 19354507 22047426
$$ packed form
9478f9583747r1185N89299J156699J663999K160330K650269L085468L391482L512359
9469e1465027L443744L234306K959975K691102K466849K280741K083109J807647
9461c0497554J412652R06670L35505k56728q55250j469189k107307k762808l414783
9452c8708792m029678m550523m887468m933896m609753l903353k881959j669622
9444g0175044m12515P53766J734160K497263L075833L535680L929027M264173
9436e0797657M511044M634630M628739M523052M356092M134613L816378L339675
9428a6853434K685414J927009J226951P74318O97537J003822J580601K255239
9420d702543K872735L343895L643035L773049L735031L526588L162717K692919
$$ plain form
9412 22047426 24241463 25983529 27367053 28490556 29421913 30177624 30721220 30984181 30907674
9403 30907674 30491822 29830822 29116786 28609405 28580356 29244149 30687274 32812973 35326446
9394 35326446 37780320 39676053 40586273 40248839 38597159 35725226 31819977 27108157
9386 27108157 21848433 16359582 11041043 6342061 2671585 283942 -804324 -820761
9378 -820761 -153200 793692 1735481 2572462 3358439 4206537 5191017 6289831 7381436
9369 7381436 8283494 8804887 8779838 8072654 6574230 4223149 1055971 -2749681 -6883564
9360 -6883564 -10972503 -14678631 -17779580 -20202225 -22009871 -23360402 -24453216 -25473887
9352 -25473887 -26542705 -27681654 -28818961 -29833791 -30614554 -31093774 -31244269 -31052177 -30491311
$$ packed form
9412B2047426K194037J742066J383524J123503R31357P55711N43596K62961p6507
9403C0907674m15852o61000p14036n07381k9049O63793J443125K125699K513473
9394C5326446K453874J895733R10220l37434j651680k871933l905249m711820
9386B7108157n259724n488851n318539m698982l670476k387643j088266j6437
9378h20761O67561R46892R41789Q36981P85977Q48098R84480J098814J091605
9369G381436R02058N21393k5049p07184j498424k351081l167178l805652m133883
9360f883564m088939l706128l100949k422645j807646j350531j092814j020671
9352b5473887j068818j138949j137307j014830p80763m79220j50495J92092N60866
$$ plain form
9343 -30491311 -29510078 -28030526 -25960220 -23220558 -19788227 -15734680 -11243094 -6588286
9335 -6588286 -2081507 1997075 5444033 8134776 9991789 10952421 10964737 10014224 8162923
9326 8162923 5579313 2545766 -560414 -3310143 -5283190 -6136260 -5665831 -3852649 -879662
9317 -879662 2876148 6874483 10467951 12989999 13865057 12707723 9377026 3982845 -3129922
9308 -3129922 -11403954 -20117392 -28482740 -35783829 -41496292 -45343217 -47285266 -47480118
9300 -47480118 -46237247 -43965771 -41107612 -38070339 -35190324 -32741031 -30965557 -30091273
9292 -30091273 -30298311 -31652239 -34044165 -37183015 -40653483 -44012530 -46877455 -48972227
9284 -48972227 -50132333 -50294270 -49493777 -47871211 -45658763 -43128495 -40512346 -37935720
$$ packed form
9343c0491311R81233J479552K070306K739662L432331M053547M491586M654808
9335f588286M506779M078582L446958K690743J857013R60632J2316r50513j851301
9326H162923k583610l033547l106180k749729j973047q53070M70429J813182K972987
9317h79662L755810L998335L593468K522048Q75058j157334l330697n394181p112767
9308c129922q274032q713438q365348p301089n712463l846925j942049j94852
9300d7480118J242871K271476K858159L037273K880015K449293J775474Q74284
9292c0091273k07038j353928k391926l138850l470468l359047k864925k094772
9284d8972227j160106j61937Q00493J622566K212448K530268K616149K576626
$$ plain form
9276 -37935720 -35404564 -32850791 -30201933 -27428257 -24541526 -21557145 -18458165 -15194659
9268 -15194659 -11719072 -8027245 -4175896 -275764 3519180 7014299 9978759 12169083
9260 12169083 13374033 13463165 12414103 10305047 7284636 3550958 -640579 -4964181
9252 -4964181 -9058129 -12628292 -15568313 -18003164 -20205110 -22422858 -24725782 -26951103
9244 -26951103 -28774564 -29857461 -29992769 -29187644 -27661720 -25782486 -23978454 -22662824
9236 -22662824 -22176810 -22741851 -24409134 -27015146 -30174261 -33337083 -35910018 -37393337
9228 -37393337 -37483938 -36110580 -33401740 -29609843 -25027098 -19928088 -14557776 -9153007
9220 -9153007 -3961874 768862 4836564 8126686 10630594 12432699 13679212 14538778
$$ packed form
9276c7935720K531156K553773K648858K773676K886731K984381L098980L263506
9268a5194659L475587L691827L851349L900132L794944L495119K964460K190324
9260A2169083J204950Q9132j049062k109056l020411l733678m191537m323602
9252d964181m093948l570163k940021k434851k201946k217748k302924k225321
9244b6951103j823461j082897j35308Q05125J525924J879234J804032J315630
9236b2662824M86014n65041j667283k606012l159115l162822k572935j483319
9228c7393337r0601J373358K708840L791897M582745N099010N370312N404769
9220i153007N191133M730736M067702L290122K503908J802105J246513Q59566
$$ plain form
9212 14538778 15158450 15622742 15932572 16015967 15762841 15062988 13834092 12043092 9727586
9203 9727586 7011094 4094876 1215893 -1416987 -3676875 -5533109 -7021500 -8194766
9195 -8194766 -9083044 -9674485 -9906323 -9660027 -8769712 -7053509 -4359707 -607721 4186763
9186 4186763 9899246 16294599 23043744 29764083 36074081 41645058 46240272 49737825
9178 49737825 52129347 53484697 53891226 53403618 52044163 49857681 46976391 43633522
9170 43633522 40101433 36592157 33191913 29875213 26580838 23285815 20022669 16838519
9162 16838519 13745581 10719608 7760607 4972183 2590345 924589 239395 647409
9154 647409 2070842 4275785 6944456 9748555 12406595 14723680 16616841 18127342
$$ packed form
9212A4538778O19672M64292L09830Q3395k53126o99853j228896j791000k315506
9203I727586k716492k916218k878983k632880k259888j856234j488391j173266
9195h194766q88278n91441k31838K46296Q90315J716203K693802L751986M794484
9186D186763N712483O395353O749145O720339O309998N570977M595214L497553
9178D9737825K391522J355350M06529m87608j359455k186482k881290l342869
9170D3633522l532089l509276l400244l316700l294375l295023l263146l184150
9162A6838519l092938l025973k959001k788424k381838j665756o85194M08014
9154F47409J423433K204943K668671K804099K658040K317085J893161J510501
$$ plain form
9146 18127342 19415179 20724026 22308589 24336211 26797437 29467099 31942896 33759568
9138 33759568 34543211 34145811 32703347 30596429 28336997 26429188 25251817 24995775 25665928
9129 25665928 27124635 29133627 31367629 33414382 34796299 35029130 33702989 30563789
9121 30563789 25579149 18967952 11166607 2726029 -5822409 -14067974 -21745499 -28691297
9113 -28691297 -34777751 -39878625 -43885228 -46748163 -48496761 -49209915 -48958855 -47768427
9105 -47768427 -45625751 -42525843 -38519884 -33734540 -28348558 -22535949 -16408828 -10003428
9097 -10003428 -3332158 3521067 10320832 16669023 22076440 26090935 28436035 29110233
9089 29110233 28402410 26803062 24839664 22911373 21201652 19698943 18293849 16890394
$$ packed form
9146A8127342J287837J308847J584563K027622K461226K669662K475797J816672
9138C3759568P83643l97400j442464k106918k259432j907809j177371k56042O70153
9129B5665928J458707K008992K234002K046753J381917K32831j326141l139200
9121C0563789m984640o611197p801345q440578q548438q245565p677525o945798
9113b8691297o086454n100874m006603k862935j748598p13154K51060J190428
9105d7768427K142676L099908M005959M785344N385982N812609O127121O405400
9097a0003428O671270O853225O799765O348191N407417M014495K345100O74198
9089B9110233p07823j599348j963398j928291j709721j502709j405094j403455
$$ plain form
9081 16890394 15477198 14132451 12968253 12047743 11320930 10611537 9655886 8169963 5916524
9072 5916524 2754185 -1338454 -6264190 -11832138 -17802078 -23937697 -30049769 -36010909
9064 -36010909 -41741316 -47187192 -52317932 -57148851 -61771293 -66361181 -71144682 -76319539
9056 -76319539 -81955405 -87914183 -93829006 -99156801 -103289475 -105688937 -106006012 -104150623
9048 -104150623 -100298464 -94842231 -88312568 -81297660 -74382292 -68112416 -62974818 -59372755
9040 -59372755 -57585896 -57721818 -59679984 -63148315 -67643413 -72593609 -77445727 -81756498
9032 -81756498 -85229348 -87689410 -89031225 -89187473 -88142919 -85980712 -82925416 -79346017
9024 -79346017 -75698527 -72417744 -69799997 -67930903 -66689313 -65814273 -64991003 -63917721
$$ packed form
9081A6890394j413196j344747j164198r20510p26813p09393r55651j485923k253439
9072E916524l162339m092639m925736n567948n969940o135619o112072n961140
9064c6010909n730407n445876n130740m830919m622442m589888m783501n174857
9056g6319539n635866n958778n914823n327795m132674k399462l17075J855389
9048a04150623L852159N456233O529663P014908O915368O269876N137598L602063
9040e9372755J786859j35922j958166l468331m495098m950196m852118m310771
9032h1756498l472850k460062j341815j56248J044554K162207L055296L579399
9024g9346017L647490L280783K617747J869094J241590Q75040Q23270J073282
$$ plain form
9016 -63917721 -62346290 -60112653 -57167441 -53595322 -49601797 -45460317 -41437504 -37729762
9008 -37729762 -34441162 -31610624 -29265497 -27459176 -26262804 -25718901 -25792811 -26351564 -27174720
8999 -27174720 -27989480 -28525619 -28582529 -28085348 -27102248 -25814919 -24461198 -23276715 -22449865
8990 -22449865 -22090213 -22207691 -22706001 -23398707 -24051933 -24442300 -24404364 -23845541 -22730556
8981 -22730556 -21061486 -18880673 -16300690 -13535651 -10892856 -8698518 -7177002 -6351970
8973 -6351970 -6041993 -5962107 -5861391 -5601267 -5134987 -4429856 -3405005 -1924637 163255
8964 163255 2974507 6547430 10824317 15658448 20838745 26114950 31210515 35828524
8956 35828524 39668688 42465342 44036185 44321060 43395884 41457144 38778308 35646406
$$ packed form
9016f3917721J571431K233637K945212L572119L993525M141480M022813L707742
9008c7729762L288600K830538K345127J806321J196372N43903p3910n58753q23156
8999b7174720q14760n36139n6910M97181R83100J287329J353721J184483Q26850
8990b2449865L59652j17478m98310o92706o53226l90367L7936N58823J114985
8981b2730556J669070K180813K579983K765039K642795K194338J521516Q25032
8973f351970L09977P9886J00716K60124M66280P05131J024851J480368K087892
8964A63255K811252L572923M276887M834131N180297N276205N095565M618009
8956C5828524L840164K796654J570843K84875r25176j938740k678836l131902
$$ plain form
8948 35646406 32299417 28892557 25509785 22208498 19061202 16158189 13563925 11260443
8940 11260443 9131801 7019080 4816078 2533751 282755 -1806821 -3659311 -5268163
8932 -5268163 -6657051 -7831223 -8753763 -9350582 -9530702 -9211711 -8350003 -6977903 -5240790
8923 -5240790 -3411928 -1858885 -959317 -1003521 -2136645 -4362100 -7578777 -11609205 -16205465
8914 -16205465 -21054106 -25802259 -30101573 -33649255 -36211159 -37625477 -37791191 -36646746
8906 -36646746 -34151270 -30287638 -25097592 -18731819 -11475026 -3714764 4137358 11725807
8898 11725807 18785789 25122280 30563207 34927373 38027638 39702518 39856035 38490012
8890 38490012 35724245 31805539 27102043 22072345 17203026 12927983 9562953 7286877
$$ packed form
8948C5646406l346989l406860l382772l301287l147296k903013k594264k303482
8940A1260443k128642k112721k203002k282327k250996k089576j852490j608852
8932e268163j388888j174172r22540n96819j80120L18991Q61708J372100J737113
8923e240790J828862J553043Q99568m4204j133124k225455l216677m030428m596260
8914a6205465m848641m748153m299314l547682k561904j414318j65714J144445
8906c6646746K495476L863632N190046O365773P256793P760262P852122P588449
8898A1725807P059982O336491N440927M364166L100265J674880J53517j366023
8890C8490012k765767l918706m703496n029698m869319m275043l365030k276076
$$ plain form
8882 7286877 6172295 6232230 7442839 9728519 12932851 16809026 21040072 25272043 29142395
8873 29142395 32306198 34474236 35465153 35254830 34000157 32020860 29734030 27553637
8865 27553637 25790990 24601809 24001853 23931639 24330098 25189475 26581519 28645847 31531990
8856 31531990 35310639 39900688 45056008 50413590 55565313 60117260 63730823 66158481
8848 66158481 67278044 67112320 65819317 63651202 60894296 57809391 54591028 51356792
8840 51356792 48165301 45050957 42060494 39278401 36830941 34863079 33494116 32771114
8832 32771114 32641678 32954805 33482325 33948916 34066233 33574673 32295556 30186313 27377773
8823 27377773 24166445 20948433 18114797 15957617 14633020 14190313 14635958 15987785
$$ packed form
8882G286877j114582N9935J210609K285680L204332L876175M231046M231971L870352
8873B9142395L163803K168038R90917k10323j254673j979297k286830k180393
8865B7553637j762647j189181n99956p0214L98459Q59377J392044K064328K886143
8856C1531990L778649M590049N155320N357582N151723M551947L613563K427658
8848F6158481J119563j65724j293003k168115k756906l084905l218363l234236
8840E1356792l191491l114344k990463k782093k447460j967862j368963p23002
8832C2771114j29436L13127N27520M66591J17317m91560j279117k109243k808540
8823B7377773l211328l218012k833636k157180j324597m42707M45645J351827
$$ plain form
8815 15987785 18290652 21590905 25888979 31100299 37047782 43485752 50134441 56707142
8807 56707142 62931224 68570378 73440647 77404703 80348872 82173171 82817265 82307434
8799 82307434 80785653 78498185 75753007 72865594 70102106 67626999 65475654 63575629
8791 63575629 61813344 60107557 58443815 56853240 55355453 53899794 52331120 50394855
8783 50394855 47787509 44243863 39628393 33986569 27531515 20581882 13491036 6594989
8775 6594989 176143 -5573012 -10587150 -14945758 -18848848 -22550388 -26276461 -30164369
8767 -30164369 -34242070 -38440042 -42615448 -46579507 -50134060 -53119896 -55460650 -57176601
8759 -57176601 -58357938 -59116318 -59551294 -59755911 -59847663 -59978080 -60285527 -60813013 -61461864
$$ packed form
8815A5987785K302867L300253M298074N211320N947483O437970O648689O572701
8807E6707142O224082N639154M870269L964056K944169J824299O44094n09831
8799H2307434j521781k287468k745178k887413k763488k475107k151345j900025
8791F3575629j762285j705787j663742j590575j497787j455659j568674j936265
8783E0394855k607346l543646m615470n641824o455054o949633p090846o896047
8775F594989o418846n749155n014138m358608l903090l701540l726073l887908
8767c0164369m077701m197972m175406l964059l554553k985836k340754j715951
8759e7176601j181337p58380m34976k04617r1752j30417l07447n27486o48851
$$ plain form
8750 -61461864 -62033456 -62335207 -62270940 -61854615 -61151298 -60192775 -58912811 -57126062 -54559573
8741 -54559573 -50931699 -46052860 -39907357 -32680495 -24719152 -16443577 -8249387 -439837
8733 -439837 6791733 13336643 19127244 24103559 28214476 31459988 33947760 35913515
8725 35913515 37672125 39515728 41608854 43922906 46227514 48141730 49234704 49140320
8717 49140320 47637956 44678982 40381558 35022255 29018448 22872640 17073149 11987189
8709 11987189 7796086 4499350 1977793 78762 -1318705 -2280422 -2825579 -2944924 -2620019
8700 -2620019 -1848265 -668147 835816 2557520 4402495 6300017 8188940 10000620
8692 10000620 11662559 13120994 14356793 15368811 16126402 16528846 16417852 15650467 14183761
$$ packed form
8750f1461864n71592l01751O4267M16325P03317R58523J279964J786749K566489
8741e4559573L627874M878839O145503P226862P961343Q275575Q194190P809550
8733d39837P231570O544910N790601M976315M110917L245512K487772J965755
8725C5913515J758610J843603K093126K314052K304608J914216J092974r4384
8717D9140320j502364k958974m297424n359303o003807o145808n799491n085960
8709A1987189m191103l296736k521557j899031j397467r61717n45157j19345L24905
8700b620019P71754J180118J503963J721704J844975J897522J888923J811680
8692A0000620J661939J458435J235799J012018P57591M02444j10994p67385j466706
$$ plain form
8683 14183761 12108459 9613518 6918816 4222884 1680540 -602877 -2573969 -4231800
8675 -4231800 -5623960 -6838144 -7990119 -9208662 -10617700 -12313991 -14339183 -16654127
8667 -16654127 -19131810 -21577428 -23765287 -25477948 -26547540 -26903167 -26605495 -25832602 -24808143
8658 -24808143 -23713709 -22641014 -21596745 -20524789 -19311505 -17780663 -15712381 -12905913
8650 -12905913 -9268885 -4890044 -54874 4810768 9249278 12887861 15518294 17116987
8642 17116987 17810841 17813336 17358712 16651779 15835579 14971945 14037466 12946568 11604598
8633 11604598 9968185 8075141 6022970 3910626 1780817 -404179 -2739675 -5315799
8625 -5315799 -8141468 -11096442 -13948406 -16439480 -18402844 -19846645 -20957455 -22019949
$$ packed form
8683A4183761k075302k494941k694702k695932k542344k283417j971092j657831
8675d231800j392160j214184j151975j218543j409038j696291k025192k314944
8667a6654127k477683k445618k187859j712661j069592l55627K97672P72893J024459
8658b4808143J094434J072695J044269J071956J213284J530842K068282K806468
8650a2905913L637028M378841M835170M865642M438510L638583K630433J598693
8642A7116987O93854K495m54624p06933q16200q63634r34479j090898j341970
8633A1604598j636413j893044k052171k112344k129809k184996k335496k576124
8625e315799k825669k954974k851964k491074j963364j443801j110810j062494
$$ plain form
8617 -22019949 -23296167 -24929294 -26918886 -29166394 -31544804 -33938008 -36227902 -38251388
8609 -38251388 -39771646 -40498414 -40162660 -38618786 -35926499 -32366224 -28370642 -24397634
8601 -24397634 -20800905 -17754648 -15259412 -13217197 -11535668 -10213934 -9372536 -9211464
8593 -9211464 -9909243 -11508711 -13853631 -16621993 -19446120 -22052995 -24345877 -26389718
8585 -26389718 -28322828 -30251542 -32179797 -33997755 -35525018 -36585569 -37084422 -37057835 -36677311
8576 -36677311 -36201776 -35891810 -35918082 -36301178 -36905971 -37489139 -37778523 -37554926 -36708742 -35254742
8566 -35254742 -33307572 -31038233 -28632776 -26258715 -24032890 -21991792 -20079037 -18161517
8558 -18161517 -16067722 -13633653 -10750586 -7411308 -3733563 70446 3779598 7257336
$$ packed form
8617b2019949j276218j633127j989592k247508k378410k393204k289894k023486
8609c8251388j520258p26768L35754J543874K692287L560275L995582L973008
8601b4397634L596729L046257K495236K042215J681529J321734Q41398J61072
8593i211464o97779j599468k344920k768362k824127k606875k292882k043841
8585b6389718j933110j928714j928255j817958j527263j060551m98853K6587L80524
8576c6677311M75535L09966k6272l83096o04793n83168k89384K23597Q46184J454000
8566c5254742J947170K269339K405457K374061K225825K041098J912755J917520
8558a8161517K093795K434069K883067L339278L677745L804009L709152L477738
$$ plain form
8550 7257336 10497010 13607547 16770792 20194512 24052523 28405057 33131471 37926390
8542 37926390 42374624 46065804 48691551 50092907 50259783 49302956 47423030 44892697
8534 44892697 42048086 39265407 36902452 35213545 34275919 33969427 34028585 34151658 34121953
8525 34121953 33885568 33548666 33300780 33310390 33645605 34247182 34951207 35546482 35849751 35774714
8515 35774714 35362321 34751526 34105217 33537629 33086260 32735586 32464681 32282038 32225498 32326854
8505 32326854 32560228 32806555 32863915 32509296 31584808 30065506 28077188 25858638 23686150
8496 23686150 21791860 20308573 19258388 18574634 18127429 17731574 17143972 16075391 14229739
8487 14229739 11357882 7301759 2016721 -4422313 -11822070 -19880479 -28212581 -36395010
$$ packed form
8550G257336L239674L110537L163245L423720L858011M352534M726414M794919
8542C7926390M448234L691180K625747J401356J66876r56827j879926k530333
8534D4892697k844611k782679k362955j688907r37626l06492N9158J23073k9705
8525C4121953k36385l36902k47886R610L35215O01577P04025N95275L03269p5037
8515C5774714m12393o10795o46309n67588m51369l50674k70905j82643n6540J01356
8505C2326854K33374K46327N7360l54619r24488j519302j988318k218550k172488
8496B3686150j894290j483287j050185o83754m47205l95855n87602j068581j845652
8487A4229739k871857m056123n285038o439034p399757q058409q332102q182429
$$ plain form
8479 -36395010 -44018734 -50734168 -56280255 -60501653 -63360774 -64939778 -65417549 -65017506
8471 -65017506 -63948604 -62373693 -60417762 -58194507 -55820886 -53412349 -51075005 -48908093
8463 -48908093 -47009876 -45469694 -44339184 -43594968 -43117554 -42707877 -42142921 -41245720 -39933094
8454 -39933094 -38219266 -36183199 -33927158 -31551525 -29154241 -26845225 -24753528 -23004257
8446 -23004257 -21659943 -20652188 -19751974 -18617557 -16915976 -14465147 -11323651 -7781159
8438 -7781159 -4256945 -1161516 1210229 2709916 3291821 2938266 1613858 -716153 -4015928
8429 -4015928 -8105303 -12629595 -17094489 -20959910 -23764646 -25236480 -25342501 -24264105
8421 -24264105 -22324075 -19910522 -17421068 -15219434 -13589362 -12686845 -12507132 -12884982 -13538755
$$ packed form
8479c6395010p623724o715434n546087m221398k859121j579004m77771M00043
8471f5017506J068902J574911J955931K223255K373621K408537K337344K166912
8463d8908093J898217J540182J130510P44216M77414M09677N64956Q97201J312626
8454c9933094J713828K036067K256041K375633K397284K309016K091697J749271
8446b3004257J344314J007755R00214J134417J701581K450829L141496L542492
8438g781159L524214L095429K371745J499687N81905l53555j324408k330011l299775
8429d015928m089375m524292m464894l865421k804736j471834j06021J078396
8421b4264105J940030K413553K489454K201634J630072R02517J79713l77850o53773
$$ plain form
8412 -13538755 -14155221 -14492951 -14465559 -14166200 -13817002 -13660756 -13839185 -14309116 -14832772 -15048817
8402 -15048817 -14599090 -13263002 -11045739 -8183902 -5069973 -2134802 260172 1888042
8394 1888042 2676018 2694417 2130646 1256571 390555 -147892 -89938 733342 2359194 4691597
8384 4691597 7534233 10650900 13832350 16938534 19893598 22640606 25092263 27115768
8376 27115768 28563288 29329051 29402150 28892413 28022814 27094377 26433506 26330342 26977832
8367 26977832 28426207 30567569 33153495 35834516 38209362 39882204 40529996 39970238
8359 39970238 38205326 35421097 31935124 28109905 24256605 20557843 17037776 13599191
8351 13599191 10120996 6571712 3074996 -112017 -2690667 -4425626 -5211375 -5085096
$$ packed form
8412a3538755o16466l37730K7392K99359L49198J56246j78429m69931n23656k16045
8402a5048817M49727J336088K217263K861837L113929K935171K394974J627870
8394A888042P87976J8399n63771q74075q66016n38447N7954Q23280J625852K332403
8384D691597K842636L116667L181450L106184K955064K747008K451657K023505
8376B7115768J447520P65763P3099n09737q69599r28437o60871j03164O47490
8367B6977832J448375K141362K585926K681021K374846J672842O47792n59758
8359C9970238j764912k784229l485973l825219l853300l698762l520067l438585
8351A3599191l478195l549284l496716l187013k578650j734959p85749J26279
$$ plain form
8343 -5085096 -4199379 -2775285 -1053371 745834 2451698 3971732 5316298 6597632
8335 6597632 7981503 9602750 11490450 13545772 15576322 17352018 18640362 19202914
8327 19202914 18767745 17012977 13593056 8215480 745516 -8702757 -19729295 -31684688
8319 -31684688 -43772249 -55185429 -65242173 -73480672 -79691025 -83877672 -86178022 -86785400
8311 -86785400 -85915364 -83815644 -80784949 -77165264 -73300404 -69480801 -65901697 -62652766
8303 -62652766 -59743507 -57154999 -54894914 -53023808 -51628917 -50753702 -50329868 -50166060 -50005838
8294 -50005838 -49611261 -48815325 -47527953 -45724992 -43448451 -40812478 -37991892 -35185716
8286 -35185716 -32570566 -30264832 -28317999 -26729526 -25487801 -24605636 -24128905 -24114372 -24595541
$$ packed form
8343e085096Q85717J424094J721914J799205J705864J520034J344566J281334
8335F597632J383871J621247J887700K055322K030550J775696J288344N62552
8327A9202914m35169j754768l419921n377576p469964r448273j1026538j1955393
8319c1684688j2087561j1413180j0056744q238499o210353m186647k300350o07378
8311h6785400Q70036K099720L030695L619685L864860L819603L579104L248931
8303f2652766K909259K588508K260085J871106J394891Q75215M23834J63808J60222
8294e0005838L94577P95936J287372J802961K276541K635973K820586K806176
8286c5185716K615150K305734J946833J588473J241725Q82165M76731J4533m81169
$$ plain form
8277 -24595541 -25563459 -26979863 -28819674 -31117804 -33986201 -37583789 -42054743 -47469088
8269 -47469088 -53787618 -60849386 -68372477 -75969841 -83191430 -89597196 -94846088 -98767792
8261 -98767792 -101381922 -102851642 -103394132 -103191395 -102336055 -100822387 -98575365 -95502500 -91545170
8252 -91545170 -86703942 -81029398 -74597896 -67500646 -59854086 -51814332 -43575961 -35352996
8244 -35352996 -27356310 -19783449 -12825296 -6676319 -1524255 2493936 5353225 7180850
8236 7180850 8248386 8917850 9562301 10479532 11815025 13517102 15345923 16935287 17879480
8227 17879480 17815240 16490004 13821877 9944819 5210166 115109 -4838337 -9305480
8219 -9305480 -13211350 -16760159 -20334852 -24327110 -28965064 -34205854 -39734170 -45062382
$$ packed form
8277b4595541r67918j416404j839811k298130k868397l597588m470954n414345
8269d7469088o318530p061768p523091p597364p221589o405766n248892l921704
8261i8767792k614130j469720n42490K02737Q55340J513668K247022L072865L957330
8252i1545170M841228N674544O431502P097250P646560Q039754Q238371Q222965
8244c5352996P996686P572861O958153O148977N152064M018191K859289J827625
8236G180850J067536O69464O44451R17231J335493J702077J828821J589364R44193
8227A7879480o4240j325236k668127l877058m734653n095057m953446m467143
8219i305480l905870l548809l574693l992258m637954n240790n528316n328212
$$ plain form
8211 -45062382 -49681099 -53190477 -55366937 -56166437 -55693915 -54162410 -51846341 -49030158
8203 -49030158 -45965219 -42851124 -39843354 -37073457 -34668237 -32763327 -31506069 -31034586
8195 -31034586 -31425558 -32630807 -34446964 -36552086 -38600437 -40328352 -41620337 -42511469
8187 -42511469 -43135763 -43653066 -44192530 -44836299 -45638299 -46649803 -47925127 -49502905 -51378023
8178 -51378023 -53482234 -55683335 -57803820 -59651914 -61052316 -61866746 -62004544 -61428394 -60152795
8169 -60152795 -58226421 -55700623 -52606630 -48965480 -44826306 -40297183 -35536018 -30708698
8161 -30708698 -25955823 -21397699 -17161916 -13392704 -10226671 -7761990 -6052234 -5118732
8153 -5118732 -4949508 -5474953 -6550229 -7978567 -9571905 -11210428 -12864982 -14574903 -16397426
$$ packed form
8211d5062382m618717l509378k176460p99500M72522J531505K316069K816183
8203d9030158L064939L114095L007770K769897K405220J904910J257258M71483
8195c1034586l90972j205249j816157k105122k048351j727915j291985q91132
8187d2511469o24294n17303n39464o43769q02000j011504j275324j577778j875118
8178e1378023k104211k201101k120485j848094j400402q14430j37798N76150J275599
8169f0152795J926374K525798L093993L641150M139174M529123M761165M827320
8161c0708698M752875M558124M235783L769212L166033K464681J709756R33502
8153e118732J69224n25445j075276j428338j593338j638523j654554j709921j822523
$$ plain form
8144 -16397426 -18351953 -20380738 -22342876 -24047388 -25313448 -26030634 -26191560 -25885712 -25265686
8135 -25265686 -24508369 -23786152 -23245884 -22983747 -23012986 -23240781 -23480361 -23509189 -23151765 -22345088
8125 -22345088 -21157375 -19763181 -18397717 -17307727 -16704827 -16726492 -17410410 -18679114 -20327271
8116 -20327271 -22018861 -23318607 -23771277 -23009200 -20848167 -17340344 -12768872 -7578409
8108 -7578409 -2253710 2808988 7376404 11367246 14781717 17628805 19891238 21528891
8100 21528891 22499314 22778637 22380247 21373092 19892690 18129941 16291217 14545238 12984401
8091 12984401 11615370 10370715 9127199 7729396 6026479 3920281 1407382 -1404162
8083 -1404162 -4312025 -7068152 -9447929 -11318248 -12672938 -13611855 -14270723 -14740932 -15022441
$$ packed form
8144a6397426j954527k028785j962138j704512j266060p17186j60926L05848O20026
8135b5265686P57317P22217N40268K62137k9239k27795k39580k8828L57424Q06677
8125b2345088J187713J394194J365464J089990O02900k1665o83918j268704j648157
8116b0327271j691590j299746m52670P62077K161033L507823M571472N190463
8108g578409N324699N062698M567416L990842L414471K847088K262433J637653
8100B1528891R70423K79323l98390j007155j480402j762749j838724j745979j560837
8091A2984401j369031j244655j243516j397803j702917k106198k512899k811544
8083a404162k907863k756127k379777j870319j354690r38917o58868m70209k81509
$$ [...]
##END NTUPLES=NMR SPECTRUM
##END=
