##TITLE=31Pdec_DE-22_oil_d6
 DMSO-d6
 84 sc
 6.6.2024
##JCAMPDX= 6.0         $$ Bruker NMR JCAMP-DX V2.0
##DATA TYPE= NMR SPECTRUM
##DATA CLASS= NTUPLES
##ORIGIN= UXNMR, Bruker Analytische Messtechnik GmbH
##OWNER= root
$$ XWIN-NMR		Version 3.5
$$ Thu Jun  6 15:36:31 2024 Russian Standard Time (UT+4h)  she@DPX200
##.OBSERVE FREQUENCY= 81.013821
##.OBSERVE NUCLEUS= ^31P
##.ACQUISITION MODE= SIMULTANEOUS
##.ACQUISITION SCHEME= undefined
##.AVERAGES= 40
##.DIGITISER RES= 16
##SPECTROMETER/DATA SYSTEM= spect
##.PULSE SEQUENCE= zgpg30
##.SOLVENT NAME= CDCl3
##.SHIFT REFERENCE= (INTERNAL, CDCl3, 0, 248.564)
##AUDIT TRAIL= $$ (NUMBER, WHEN, WHO, WHERE, WHAT)
$$ ##TITLE= Audit trail, XWIN-NMR		Version 3.5
$$ ##JCAMPDX= 5.01
$$ ##ORIGIN= Bruker BioSpin GmbH
$$ ##OWNER= she
$$ F:/spectra/data/she/nmr/P31/1/pdata/1/auditp.txt
$$ ##AUDIT TRAIL=  $$ (NUMBER, WHEN, WHO, WHERE, WHAT)
(   1,<2024-06-06 15:35:31.60 +0400>,<she>,<DPX200>,
      <created by zg, POWCHK disabled, PULCHK disabled
       configuration hash MD5:
       00 E9 B6 7A A2 85 ED C7 34 08 36 98 17 FE 4E 26
       data hash MD5: 32K
       0A E4 67 17 A6 4F D4 22 37 0B 28 65 73 3B FE 00>)
(   2,<2024-06-06 15:35:34.29 +0400>,<she>,<DPX200>,
      <Start of raw data processing
       efp BC_mod = 2 LB = 10 FT_mod = 6 PKNL = 1 PHC0 = -126.0624 PHC1 = -202 SI = 64K 
       data hash MD5: 64K
       BD 9E 53 B8 27 C8 88 1E 31 14 4C 46 70 FD 27 4C>)
(   3,<2024-06-06 15:35:57.45 +0400>,<she>,<DPX200>,
      <pk PHC0 = -122.4261 PHC1 = 326.8 
       data hash MD5: 64K
       45 6E B9 A1 AE 30 78 9F 2D D7 DF EE 13 67 BA 0F>)
(   4,<2024-06-06 15:36:03.59 +0400>,<she>,<DPX200>,
      <abs ABSG = 5 
       data hash MD5: 64K
       50 1D 99 77 8F AC 49 27 EC 1E 2A EE 8B 69 3E 63>)
$$ ##END=
$$ 
$$ hash MD5
$$ 15 BE D7 A9 60 E0 B8 43 45 2B B9 E7 14 9F 5F 5E
##$RELAX= 
##$RELAX= 
##$RELAX= 
##$RELAX= 
##$RELAX= 
##$RELAX= 
##$RELAX= 
##$RELAX= 
##$RELAX= 
$$ Bruker specific parameters
$$ --------------------------
##$DU= <F:/spectra>
##$EXPNO= 1
##$NAME= <P31>
##$PROCNO= 1
##$TYPE= <nmr>
##$USER= <she>
##$AMP= (0..31)
100 100 100 100 100 100 100 100 100 100 100 100 100 100 100 100 100 100 
100 100 100 100 100 100 100 100 100 100 100 100 100 100 
##$AQSEQ= 0
##$AQ_mod= 1
##$AUNM= <au_zg>
##$AUTOPOS= <>
##$BF1= 81.014009
##$BF2= 200.13
##$BF3= 200.13
##$BF4= 200.13
##$BF5= 200.13
##$BF6= 200.13
##$BF7= 200.13
##$BF8= 200.13
##$BYTORDA= 1
##$CFDGTYP= 0
##$CFRGTYP= 5
##$CHEMSTR= <none>
##$CNST= (0..31)
1 1 145 1 1 1 1 1 1 1 1 1 1 1 1 1 1 1 1 1 1 1 1 1 1 1 1 1 1 1 1 1 
##$CPDPRG= <waltz16>
##$CPDPRG1= <>
##$CPDPRG2= <waltz16>
##$CPDPRG3= <>
##$CPDPRG4= <mlev>
##$CPDPRG5= <mlev>
##$CPDPRG6= <mlev>
##$CPDPRG7= <mlev>
##$CPDPRG8= <mlev>
##$CPDPRGB= <>
##$CPDPRGT= <>
##$D= (0..31)
0 1 0 0 0 0 0 0 0 0 0 0.03 2e-05 3e-06 0 0 0 0 0 0 0 0 0 0 0 0 0 0 0 0 
0 0 
##$DATE= 1717673731
##$DBL= (0..7)
120 120 120 11 120 120 24 19 
##$DBP= (0..7)
150 150 150 150 150 150 150 150 
##$DBP07= 0
##$DBPNAM0= <>
##$DBPNAM1= <>
$$ [...]
##$SUBNAM3= <"">
##$SUBNAM4= <"">
##$SUBNAM5= <"">
##$SUBNAM6= <"">
##$SUBNAM7= <"">
##$SUBNAM8= <"">
##$SUBNAM9= <"">
##$SW= 501.771253377433
##$SWIBOX= (0..15)
0 1 3 0 0 0 0 0 0 0 0 0 0 0 0 0 
##$SW_h= 40650.406504065
##$TD= 32768
##$TD0= 1
##$TE= 0
##$TE2= 300
##$TE3= 300
##$TEG= 300
##$TL= (0..7)
0 120 53 12 22 120 120 120 
##$TP= (0..7)
150 150 150 150 150 150 150 150 
##$TP07= 0
##$TPNAME0= <>
##$TPNAME1= <>
##$TPNAME2= <>
##$TPNAME3= <>
##$TPNAME4= <>
##$TPNAME5= <>
##$TPNAME6= <>
##$TPNAME7= <>
##$TPOAL= (0..7)
0.5 0.5 0.5 0.5 0.5 0.5 0.5 0.5 
##$TPOFFS= (0..7)
0 0 0 0 0 0 0 0 
##$TUNHIN= 0
##$TUNHOUT= 0
##$TUNXOUT= 0
##$USERA1= <user>
##$USERA2= <user>
##$USERA3= <user>
##$USERA4= <user>
##$USERA5= <user>
##$V9= 5
##$VALIST= <valist>
##$VCLIST= <CCCCCCCCCCCCCCC>
##$VD= 0
##$VDLIST= <DDDDDDDDDDDDDDD>
##$VPLIST= <PPPPPPPPPPPPPPP>
##$VTLIST= <TTTTTTTTTTTTTTT>
##$WBST= 1024
##$WBSW= 4
##$XGAIN= (0..3)
0 0 0 0 
##$XL= 0
##$YL= 0
##$YMAX_a= 2109
##$YMIN_a= -7103
##$ZGOPTNS= <>
##$ZL1= 120
##$ZL2= 120
##$ZL3= 120
##$ZL4= 120
##$ABSF1= 248.5645
##$ABSF2= -253.2056
##$ABSG= 5
##$ABSL= 3
##$ALPHA= 0
##$AQORDER= 0
##$ASSFAC= 0
##$ASSFACI= 0
##$ASSFACX= 0
##$ASSWID= 0
##$AUNMP= <proc_1d>
##$AZFE= 0.1
##$AZFW= 0.5
##$BCFW= 0
##$BC_mod= 2
##$BYTORDP= 0
##$COROFFS= 0
##$CY= -3
##$DATMOD= 1
##$DC= 0
##$DFILT= <>
##$DTYPP= 0
##$F1P= 0
##$F2P= 0
##$FCOR= 1
##$FTSIZE= 65536
##$FT_mod= 6
##$GAMMA= 0
##$GB= 0
##$INTBC= 1
##$INTSCL= 6.047779e-11
##$ISEN= 30
##$LB= 10
##$LEV0= 0
##$LPBIN= 0
##$MAXI= 10000
##$MC2= 0
##$MEAN= 0
##$ME_mod= 0
##$MI= 50
##$NCOEF= 0
##$NC_proc= -11
##$NLEV= 6
##$NOISF1= 182.463
##$NOISF2= 159.3651
##$NSP= 0
##$NTH_PI= 0
##$NZP= 0
##$OFFSET= 248.5645
##$PC= 4
##$PHC0= -248.4885
##$PHC1= 124.8
##$PH_mod= 1
##$PKNL= yes
##$PPARMOD= 0
##$PSCAL= 0
##$PSIGN= 0
##$REVERSE= no
##$SF= 81.0140089999694
##$SI= 65536
##$SIGF1= 159.3651
##$SIGF2= -187.1042
##$SINO= 113.3802
##$SIOLD= 16384
##$SREGLST= <1H.CDCl3>
##$SSB= 0
##$STSI= 65536
##$STSR= 0
##$SW_p= 40650.406504065
##$SYMM= 0
##$S_DEV= 0
##$TDeff= 32768
##$TDoff= 0
##$TI= <>
##$TILT= no
##$TM1= 0
##$TM2= 0
##$TOPLEV= 0
##$USERP1= <user>
##$USERP2= <user>
##$USERP3= <user>
##$USERP4= <user>
##$USERP5= <user>
##$WDW= 1
##$XDIM= 65536
##$YMAX_p= 290376510
##$YMIN_p= -73445198
$$ End of Bruker specific parameters
$$ ---------------------------------
##NTUPLES= NMR SPECTRUM
##VAR_NAME=  FREQUENCY,     SPECTRUM/REAL,   SPECTRUM/IMAG
##SYMBOL=    X,             R,               I
##VAR_TYPE=  INDEPENDENT,   DEPENDENT,       DEPENDENT
##VAR_FORM=  AFFN,          ASDF,            ASDF
##VAR_DIM=   65536,         65536,           65536
##UNITS=     HZ,            ARBITRARY UNITS, ARBITRARY UNITS
##FACTOR=    0.620285442955139, 1,           1
##FIRST=     20137.2065510682, 0,            0
##LAST=      -20513.1999529968, 0,           0
##MIN=       -20513.1999529968, -73445198,   0
##MAX=       20137.2065510682, 290376510,    0
$$ Real data points
##PAGE= N=1
##DATA TABLE= (X++(R..R)), XYDATA
$$ [...]
41207 -8452654 -9011686 -8996806 -8424550 -7327440 -5732986 -3665633 -1171741 1650485 4640374
41198 4640374 7595585 10316411 12653394 14540225 16003305 17147728 18125854 19100536
41190 19100536 20215663 21578511 23248518 25227562 27456362 29825491 32199539 34441326
41182 34441326 36425390 38043510 39211700 39879709 40032864 39677454 38814507 37418930 35440382
41173 35440382 32829727 29579559 25758758 21523690 17100328 12744648 8696500 5142127
41165 5142127 2194324 -109716 -1799464 -2958031 -3707583 -4191882 -4555917 -4926140 -5394984
41156 -5394984 -6010389 -6770239 -7624182 -8485060 -9244683 -9781777 -9956131 -9600803 -8534319
41147 -8534319 -6601774 -3728159 44879 4555244 9545083 14700201 19693687 24227696
41139 24227696 28068035 31066903 33170679 34410243 34874789 34680700 33954429 32837022
41131 32837022 31493113 30097663 28795458 27659460 26679857 25790596 24911826 23980094 22953004
41122 22953004 21794978 20462755 18907553 17096700 15041612 12815038 10550497 8427625
41114 8427625 6647778 5400167 4821529 4961016 5764624 7085200 8713108 10418168 11993718
41105 11993718 13292637 14243823 14842730 15122399 15123055 14877657 14417478 13786468 13048831 12282338
41095 12282338 11561029 10935435 10416473 9967821 9512214 8953959 8209607 7229398 5995667
41086 5995667 4501098 2725328 629094 -1828749 -4662064 -7833503 -11248575 -14770531
41078 -14770531 -18250359 -21561616 -24628098 -27432694 -30000543 -32361675 -34512706 -36401596
41070 -36401596 -37946538 -39077399 -39773666 -40076895 -40072298 -39849949 -39463476 -38903289 -38095360
41061 -38095360 -36926517 -35285795 -33103775 -30373273 -27145655 -23510448 -19572652 -15437682
41053 -15437682 -11203850 -6956674 -2763112 1328516 5275743 9017668 12452340 15433187
41045 15433187 17794020 19397332 20187974 20229225 19702565 18866092 17986014 17270338 16830659
41036 16830659 16677659 16736153 16864192 16874649 16567849 15777654 14418742 12515356 10198626
41027 10198626 7674711 5178717 2930670 1099822 -226227 -1067263 -1556009 -1903662
41019 -1903662 -2326230 -2964377 -3840838 -4875983 -5944433 -6935579 -7789521 -8501830 -9106786
41010 -9106786 -9652808 -10180669 -10709880 -11234095 -11723660 -12133056 -12411291 -12512751 -12405877
41001 -12405877 -12078412 -11539211 -10815627 -9944698 -8959595 -7878994 -6709195 -5462490 -4184293
40992 -4184293 -2973080 -1976506 -1356358 -1232971 -1636496 -2493571 -3658229 -4968532 -6296083
40983 -6296083 -7563919 -8731944 -9771719 -10657798 -11384280 -11986643 -12538514 -13115434 -13750680
40974 -13750680 -14415685 -15032006 -15494507 -15685469 -15480383 -14760580 -13441555 -11508932 -9043081
40965 -9043081 -6216180 -3259469 -413467 2121041 4219605 5853062 7083307 8031538
40957 8031538 8827897 9568446 10304889 11068240 11900695 12865760 14028065 15419953 17020332
40948 17020332 18758891 20539560 22266459 23858162 25246602 26367656 27156110 27553889
40940 27553889 27527906 27082654 26255438 25097459 23655896 21968334 20068928 17999375 15818533
40931 15818533 13604449 11441686 9393426 7471309 5622474 3743564 1714619 -562551
40923 -562551 -3132402 -5964134 -8944348 -11890912 -14591442 -16856233 -18563494 -19677896
40915 -19677896 -20239912 -20337447 -20072266 -19529025 -18754502 -17755880 -16519643 -15039112 -13333352
40906 -13333352 -11449868 -9458200 -7445760 -5518113 -3793576 -2381334 -1347490 -691225
40898 -691225 -351677 -241248 -277155 -387472 -495711 -507648 -317009 173153 1026749 2259567
40888 2259567 3839205 5702639 7785437 10045731 12464900 15021950 17659323 20265755
40880 20265755 22689634 24774916 26400165 27505737 28103319 28265006 28090772 27664325 27021382
40871 27021382 26151723 25032663 23668709 22111645 20453832 18805467 17271680 15939636
40863 15939636 14874620 14115760 13664916 13476434 13464708 13535813 13627380 13731469 13889145 14166053
40853 14166053 14625106 15304622 16202626 17268807 18408235 19497092 20403173 21001988 21185247
40844 21185247 20864749 19975347 18478554 16368725 13684004 10519552 7033964 3439467
40836 3439467 -26261 -3140360 -5735034 -7722504 -9092901 -9888160 -10171840 -10015400 -9502741
40827 -9502741 -8737469 -7839157 -6928924 -6112907 -5470828 -5053232 -4887428 -4985893 -5348161 -5955249
40817 -5955249 -6767265 -7733946 -8813899 -9988188 -11258689 -12633687 -14110053 -15660540
40809 -15660540 -17230731 -18746035 -20126790 -21309116 -22267104 -23025744 -23651763 -24221095 -24781256
40800 -24781256 -25334051 -25849422 -26298720 -26684928 -27051961 -27467633 -27988371 -28623933 -29320507
40791 -29320507 -29968858 -30430257 -30567909 -30274624 -29491163 -28211923 -26479214 -24372634 -22000079
40782 -22000079 -19491811 -16994821 -14663929 -12645850 -11053732 -9937170 -9263134 -8923392
40774 -8923392 -8767896 -8644807 -8425971 -8013234 -7337025 -6358385 -5073821 -3515555 -1744568
40765 -1744568 158442 2098458 3967563 5646771 7013422 7957877 8409488 8364703 7903366
40756 7903366 7180575 6392975 5733011 5351761 5344950 5760920 6614544 7890054 9530874
40747 9530874 11432183 13453006 15447809 17300736 18945600 20366811 21584778 22629650
40739 22629650 23509026 24183370 24567495 24565966 24128729 23297206 22213153 21080997 20098311
40730 20098311 19386301 18953529 18708826 18512631 18237451 17810207 17225878 16536425 15823564
40721 15823564 15165238 14609284 14166835 13825122 13564044 13360927 13184363 12990745 12732057
40712 12732057 12369897 11886581 11290861 10619879 9935240 9308178 8793923 8403855 8087823
40703 8087823 7737301 7214603 6402599 5255230 3823388 2242792 692389 -656155 -1681565
40694 -1681565 -2339948 -2667639 -2754113 -2694613 -2550231 -2340355 -2066208 -1740848 -1403984 -1120009
40684 -1120009 -968567 -1030543 -1364094 -1970207 -2760461 -3547587 -4073835 -4074623 -3353702 -1836005
40674 -1836005 422882 3263244 6457404 9737249 12817417 15428574 17362516 18512049
40666 18512049 18884603 18582308 17759259 16575726 15166039 13627342 12027825 10428285
40658 10428285 8906804 7571537 6547572 5938108 5781565 6033594 6585335 7302646 8062006
40649 8062006 8772215 9385277 9898743 10344827 10766525 11194036 11636431 12089070 12544961
40640 12544961 13002487 13472841 13989839 14613601 15415292 16441799 17676348 19018344 20298477
40631 20298477 21329061 21972690 22202023 22125721 21969325 22017268 22534748 23693726 25526318
40622 25526318 27920412 30655820 33461598 36068551 38240853 39787777 40565476 40475606
40614 40475606 39462539 37513058 34665010 31024025 26774263 22167586 17490337 13022108
40606 13022108 9000795 5598389 2907029 936880 -372766 -1131783 -1471049 -1511100 -1334114
40597 -1334114 -970917 -411154 368067 1368503 2543539 3785537 4937459 5834783 6366140
40588 6366140 6522600 6407266 6200113 6097522 6254855 6753853 7601815 8753137 10133743
40579 10133743 11654086 13213211 14707894 16053718 17207392 18172591 18983850 19680814
40571 19680814 20288520 20807334 21206857 21424170 21376781 20994832 20256902 19203607 17918429
40562 17918429 16490752 14985228 13429290 11814711 10105572 8250534 6201151 3935619
40554 3935619 1481857 -1070658 -3580467 -5886680 -7851919 -9393269 -10484478 -11132814
40546 -11132814 -11353194 -11162401 -10595667 -9726276 -8667671 -7555843 -6525301 -5689038 -5121435
40537 -5121435 -4841172 -4800077 -4888534 -4960797 -4872778 -4520256 -3865996 -2945770 -1848067 -674285
40527 -674285 500626 1644676 2754775 3826505 4833726 5733818 6491249 7097762 7574667
40518 7574667 7960783 8298376 8623763 8961169 9318272 9685141 10037455 10342061 10563905
40509 10563905 10676149 10672989 10577903 10437907 10301866 10192346 10085604 9909589 9560116 8927937
40499 8927937 7927265 6517852 4715685 2591354 259267 -2137869 -4448198 -6535573
40491 -6535573 -8308697 -9743243 -10880333 -11793982 -12541278 -13125680 -13499908 -13610301 -13456492
40482 -13456492 -13129758 -12806217 -12695549 -12966646 -13682036 -14771424 -16058791 -17329874 -18404109
40473 -18404109 -19176261 -19617834 -19754132 -19639523 -19342116 -18935646 -18491796 -18069867 -17707212
40464 -17707212 -17417619 -17201646 -17063864 -17025313 -17122291 -17393143 -17863482 -18540174 -19416405 -20480635
40454 -20480635 -21718887 -23106201 -24593715 -26102085 -27525496 -28741593 -29622189 -30046262
40446 -30046262 -29920333 -29206055 -27946031 -26274000 -24398054 -22555923 -20957470 -19741670
40438 -19741670 -18969775 -18651334 -18775308 -19318624 -20229750 -21409241 -22709041 -23952808 -24965265
40429 -24965265 -25601583 -25775582 -25482306 -24801163 -23868369 -22826173 -21774414 -20748942 -19733068
40420 -19733068 -18688389 -17583043 -16400584 -15127210 -13731277 -12156182 -10338246 -8241555
40412 -8241555 -5889000 -3373344 -846404 1506650 3501931 4996329 5923117 6309071
40404 6309071 6262149 5933598 5472454 4991698 4554127 4173345 3821390 3438636 2946981 2268017
40394 2268017 1344827 162408 -1240121 -2772324 -4313395 -5745950 -6987621 -8004118
40386 -8004118 -8799312 -9393892 -9808608 -10057853 -10148489 -10080054 -9849371 -9460932 -8934722 -8300765
40376 -8300765 -7581672 -6778178 -5872284 -4848445 -3718536 -2531638 -1357685 -251708 777471
40367 777471 1769367 2781502 3849815 4967998 6092867 7159648 8090117 8793745 9174070
40358 9174070 9147572 8670030 7759273 6503213 5044062 3536419 2093105 747915 -539589
40349 -539589 -1838170 -3185627 -4549288 -5823839 -6864239 -7537500 -7769730 -7565815 -6993603
40340 -6993603 -6145562 -5101841 -3911847 -2597628 -1173059 332788 1864034 3349028
40332 3349028 4726592 5964448 7055145 7999944 8802945 9481997 10081197 10669317 11326146
40323 11326146 12129139 13144535 14415940 15946684 17685685 19531098 21353865 23027037
40315 23027037 24443636 25517914 26178721 26366085 26034711 25162013 23758949 21883398 19651493
40306 19651493 17235399 14837492 12644696 10783182 9297488 8163404 7321674 6707695
40298 6707695 6260658 5916019 5599947 5241579 4801593 4298372 3810627 3451708 3333527
40289 3333527 3546131 4161785 5244946 6840903 8938260 11432337 14124391 16766442
40281 16766442 19128499 21053523 22480035 23433911 24002106 24300406 24442520 24514416 24556804
40272 24556804 24559664 24473414 24236673 23809785 23194455 22424757 21534271 20523363 19352178
40263 19352178 17966554 16341599 14518363 12616012 10814799 9314792 8281779 7797836
40255 7797836 7835765 8267795 8903416 9540826 10016775 10243240 10219057 10007134 9682948 9280968
40245 9280968 8771558 8081343 7140982 5930409 4500254 2966636 1488703 239753 -621420
40236 -621420 -976421 -768804 -18341 1175806 2645855 4180551 5562032 6606780 7197487
40227 7197487 7293033 6915395 6128321 5027436 3746235 2460323 1366831 636671 365495
40218 365495 555619 1137580 2009528 3065306 4201108 5312241 6294643 7054849 7523796
40209 7523796 7669140 7500240 7058010 6387404 5504846 4381794 2956178 1163816 -1027798
40200 -1027798 -3594670 -6442626 -9406786 -12269465 -14796489 -16780119 -18072126 -18599474
40192 -18599474 -18366435 -17448044 -15973204 -14095133 -11956485 -9664631 -7287089 -4862370
40184 -4862370 -2412817 48514 2513358 4968061 7376435 9664968 11723323 13425102
40176 13425102 14660220 15361924 15515818 15151113 14324556 13107548 11579871 9827685 7943041
40167 7943041 6023716 4171871 2488813 1065477 -26482 -736541 -1030980 -893040 -337183
40158 -337183 568831 1696256 2879642 3965029 4851315 5499072 5909708 6100517 6096225
40149 6096225 5934460 5667989 5352648 5024878 4681220 4271094 3708685 2901077 1778997
40140 1778997 313182 -1488629 -3591143 -5930716 -8403429 -10858411 -13111683 -14979411
40132 -14979411 -16315645 -17038929 -17140288 -16673395 -15733833 -14437318 -12905309 -11260241 -9625119
40123 -9625119 -8118126 -6836384 -5833758 -5107957 -4609711 -4269126 -4018075 -3792505 -3521742
40114 -3521742 -3126639 -2536585 -1711613 -649159 627467 2082705 3669020 5315261 6917000
40105 6917000 8340730 9443700 10102534 10238942 9830405 8900760 7498518 5679961 3509919
40096 3509919 1078869 -1477605 -3973605 -6191838 -7924219 -9019066 -9415227 -9152164
40088 -9152164 -8360380 -7243036 -6051838 -5051161 -4468608 -4444950 -5004355 -6056356 -7422993
40079 -7422993 -8874720 -10164820 -11064700 -11405739 -11121405 -10269069 -9011803 -7560686 -6102865
40070 -6102865 -4751433 -3542030 -2473434 -1560972 -862457 -457847 -400673 -679494 -1213746
40061 -1213746 -1879083 -2542481 -3093666 -3469472 -3669303 -3758559 -3858988 -4126535 -4715776 -5733267
40051 -5733267 -7194252 -9006345 -10993466 -12947800 -14680243 -16047665 -16958811 -17375352
40043 -17375352 -17318242 -16873602 -16185464 -15429138 -14768927 -14310758 -14065780 -13943565 -13783923
40034 -13783923 -13413609 -12697384 -11560199 -9982314 -7986665 -5634401 -3029627 -322573
40026 -322573 2302087 4657545 6598259 8052621 9026861 9581093 9794706 9739232 9467279
40017 9467279 9017087 8425555 7737852 7003729 6262032 5526704 4787503 4026899 3241544
40008 3241544 2451667 1688060 961940 238095 -567199 -1558327 -2817225 -4367035 -6157525
39999 -6157525 -8075569 -9974009 -11705633 -13148501 -14215890 -14853177 -15028835 -14727771 -13954103
39990 -13954103 -12742780 -11166244 -9319076 -7282826 -5098821 -2776624 -334116 2165103
39982 2165103 4607555 6859015 8803371 10368827 11534041 12317848 12760725 12908623 12808384
39973 12808384 12514014 12091375 11609254 11119826 10644503 10176311 9693377 9170944 8588701
39964 8588701 7940471 7248893 6575299 6012519 5660105 5594332 5846951 6398554 7184015 8104073
39954 8104073 9038546 9859245 10441643 10673994 10463891 9744807 8484497 6691754 4414939
39945 4414939 1731315 -1264937 -4467402 -7755006 -10991067 -14031621 -16742985 -19020432
39937 -19020432 -20797230 -22038362 -22723439 -22830159 -22326377 -21170221 -19314475 -16715601
39929 -16715601 -13350247 -9236604 -4450710 872412 6555534 12407593 18252512 23948564
39921 23948564 29394370 34523055 39286859 43634021 47484582 50718787 53189748 54757430
39913 54757430 55327176 54876231 53462654 51219319 48336662 45037696 41550774 38085297
39905 38085297 34811000 31839626 29213867 26914433 24889826 23095784 21520528 20182434
39897 20182434 19110013 18326270 17848929 17698339 17897301 18456508 19353888 20523559 21866573
39888 21866573 23282865 24707706 26128671 27569708 29051013 30548848 31977642 33202598
39880 33202598 34075286 34473980 34329887 33632468 32422823 30787151 28849921 26756023 24638045
39871 24638045 22580703 20599914 18645430 16625801 14450175 12077366 9555048 7028725
39863 7028725 4710079 2814531 1494756 798968 668779 971122 1545716 2250491 2996034
39854 2996034 3765886 4619830 5678059 7089380 8992776 11483287 14589664 18266194
39846 18266194 22397399 26812008 31301150 35635798 39581939 42917507 45456292 47076224
39838 47076224 47738511 47483843 46406287 44621364 42246118 39396403 36194521 32777862
39830 32777862 29302741 25941051 22870382 20261738 18269281 17020794 16601564 17027324
39822 17027324 18215412 19976029 22042545 24138769 26056220 27706036 29124389 30435240
39814 30435240 31792990 33331968 35140980 37264425 39715490 42483005 45525384 48760499
39806 48760499 52063824 55277781 58226284 60728998 62614817 63736426 63986804 63316638
39798 63316638 61748384 59378780 56363369 52886873 49134233 45277324 41479753 37907553
39790 37907553 34729463 32099971 30132491 28876807 28309777 28339290 28818324 29567876 30405487
39781 30405487 31169481 31728798 31980306 31847821 31293549 30335468 29053181 27573206 26042986
39772 26042986 24610860 23418668 22597068 22250095 22429520 23116139 24224626 25630321 27199805
39763 27199805 28810196 30358518 31770489 33008655 34067978 34951447 35636608 36055985
39755 36055985 36107245 35690042 34752032 33323494 31525449 29546375 27596115 25856816 24450858
39746 24450858 23432634 22795722 22482328 22389753 22378858 22292050 21982010 21342597 20328358
39737 20328358 18953729 17275770 15374219 13340771 11278333 9302633 7539538 6116957
39729 6116957 5153093 4743120 4947427 5785198 7234648 9236963 11699512 14495888 17464254
39720 17464254 20409849 23119950 25394466 27082671 28107909 28470163 28235671 27531479
39712 27531479 26549217 25541657 24792835 24562398 25027361 26248877 28176596 30682906 33606573
39703 33606573 36783980 40055411 43250099 46169298 48590212 50300486 51151104 51100807
39695 51100807 50227479 48699217 46719394 44473770 42105609 39725756 37440722 35371212
39687 35371212 33645322 32373587 31625372 31419296 31726022 32475250 33562793 34858518 36216092
39678 36216092 37483870 38517051 39192871 39428598 39196817 38529454 37505876 36229652 34805243
39669 34805243 33323638 31857185 30458598 29162274 27990716 26965068 26110316 25446678
39661 25446678 24973153 24660514 24462820 24335950 24244682 24156119 24036814 23868084 23670892 23515741
39651 23515741 23503194 23725369 24232055 25016622 26020606 27148713 28289410 29338773 30221480
39642 30221480 30899740 31366877 31632982 31714053 31628601 31396423 31033564 30545183 29924158 29159881
39632 29159881 28252217 27219472 26093226 24904206 23672013 22408640 21133863 19891035
39624 19891035 18753035 17816253 17185945 16956550 17190959 17905715 19068956 20610438 22434041
39615 22434041 24423302 26440834 28332942 29950391 31184214 32000842 32455549 32672958
39607 32672958 32802228 32968868 33244773 33644883 34144063 34700102 35269845 35812895 36286986
39598 36286986 36644602 36836467 36818039 36551502 36002943 35142964 33956906 32459768 30704230
39589 30704230 28774774 26769683 24777143 22851902 20999362 19173701 17292503 15264426
39581 15264426 13023287 10560981 7949384 5339238 2929404 913387 -578084 -1518929
39573 -1518929 -2003785 -2237119 -2498088 -3085204 -4249047 -6128851 -8714068 -11847401 -15268931
39564 -15268931 -18680075 -21797865 -24383430 -26252866 -27289704 -27464457 -26844528 -25574519
39556 -25574519 -23828545 -21759114 -19466826 -16995830 -14346686 -11501742 -8462622 -5289836
39548 -5289836 -2122067 840216 3377373 5294019 6447348 6763638 6251159 5007236
39540 5007236 3210666 1097428 -1073051 -3053360 -4642074 -5712621 -6228875 -6239489 -5851388
39531 -5851388 -5192493 -4377533 -3487923 -2570344 -1650404 -750532 99901 866230 1515532
39522 1515532 2020463 2359259 2518695 2503641 2346621 2105414 1842878 1595309 1345496 1017853
39512 1017853 503261 -296496 -1428220 -2870089 -4538019 -6300708 -7991439 -9418381
39504 -9418381 -10382278 -10705954 -10271979 -9058608 -7158770 -4765758 -2121491 552607 3105337
39495 3105337 5459481 7575498 9408765 10893741 11962590 12577859 12750932 12532341 11982092
39486 11982092 11141535 10026980 8651453 7061378 5360318 3695388 2205878 961592
39478 961592 -72753 -1027523 -2079235 -3385983 -5032224 -7001677 -9187172 -11433206
39470 -11433206 -13593173 -15575956 -17361772 -18982729 -20480737 -21864836 -23087408 -24047491
39462 -24047491 -24616222 -24670318 -24118464 -22913404 -21053765 -18585110 -15604227 -12261851 -8755918
39453 -8755918 -5310676 -2140725 595408 2835942 4624501 6070510 7277086 8279909
39445 8279909 9034716 9454942 9467825 9053801 8256400 7173519 5947447 4760552 3829744
39436 3829744 3388375 3650973 4767304 6780519 9606478 13045886 16826292 20654575
39428 20654575 24256795 27397495 29890297 31615377 32543840 32752793 32415004 31762217 31036432
39419 31036432 30446956 30142543 30197275 30606031 31291389 32128042 32983577 33760701 34420636
39410 34420636 34976890 35464495 35900250 36251588 36428752 36307345 35775582 34787052 33394159
39401 33394159 31744572 30039993 28473661 27170876 26152369 25329784 24533310 23564719
39393 23564719 22261267 20549367 18469860 16169731 13867618 11803204 10178698 9104399
39385 9104399 8568136 8446510 8557391 8729122 8851522 8886402 8841720 8734346 8567262 8329862
39375 8329862 8011140 7609899 7134712 6597153 6004569 5354022 4625718 3777368 2746079
39366 2746079 1462931 -123995 -2030277 -4228356 -6651684 -9202618 -11761604 -14200706
39358 -14200706 -16402585 -18280331 -19792364 -20949001 -21807527 -22452785 -22967337 -23405695 -23787489
39349 -23787489 -24110698 -24371504 -24576596 -24744440 -24900815 -25073212 -25283092 -25532851 -25789682
39340 -25789682 -25976929 -25984854 -25700847 -25043242 -23980603 -22533112 -20766238 -18782934 -16708629
39331 -16708629 -14664682 -12741735 -10991786 -9443185 -8121126 -7051599 -6243895 -5668334
39323 -5668334 -5253100 -4910493 -4577675 -4241632 -3929943 -3680262 -3520323 -3474752 -3582497 -3896939
39313 -3896939 -4462086 -5285393 -6330699 -7533688 -8822742 -10127452 -11371777 -12463575
39305 -12463575 -13295436 -13762612 -13790534 -13357569 -12502427 -11314452 -9911859 -8415981 -6930410
39296 -6930410 -5531383 -4269110 -3172958 -2253223 -1498925 -876971 -336535 183819 751527
39287 751527 1438421 2316405 3445286 4855772 6536878 8434398 10459735 12504945 14461099
39278 14461099 16236308 17765803 19007006 19922035 20460923 20560047 20160139 19234619 17811081
39269 17811081 15971832 13832985 11516106 9129393 6764351 4500790 2410382 555056
39261 555056 -1017542 -2277001 -3206698 -3792838 -4013585 -3840872 -3258508 -2284009 -976807
39252 -976807 571505 2254096 3961132 5585797 7029796 8211776 9075522 9592240 9755539
39243 9755539 9574822 9074127 8295256 7295610 6135961 4868449 3539939 2209111 955471
39234 955471 -138316 -1022797 -1708091 -2259468 -2768639 -3324707 -4001237 -4855594 -5926534
39225 -5926534 -7224126 -8719305 -10342060 -11988011 -13527835 -14820306 -15736958 -16200733
39217 -16200733 -16224400 -15924122 -15492075 -15136007 -15016276 -15213592 -15738520 -16563354 -17645196
39208 -17645196 -18926058 -20321579 -21718754 -22991470 -24028549 -24763323 -25192410 -25370665
39200 -25370665 -25376608 -25260270 -25001097 -24502098 -23628356 -22275668 -20439695 -18252421 -15964236
39191 -15964236 -13873849 -12233721 -11171486 -10661765 -10560765 -10687011 -10908361 -11192633 -11600129
39182 -11600129 -12226965 -13128398 -14254846 -15426502 -16360527 -16745514 -16334546 -15016835 -12840870
39173 -12840870 -9990962 -6740241 -3401742 -283851 2353563 4341235 5628590 6282804
39165 6282804 6454148 6319885 6030777 5683289 5326021 4988376 4707208 4533586 4521480 4714162
39155 4714162 5139337 5808566 6709916 7791861 8949462 10026289 10837433 11209185 11024402
39146 11024402 10257710 8982890 7342515 5488967 3525467 1478706 -683651 -3004520
39138 -3004520 -5487336 -8068503 -10618561 -12963702 -14915618 -16302354 -16997964 -16949647 -16197231
39129 -16197231 -14874995 -13186912 -11357681 -9577507 -7964358 -6555634 -5321792 -4185265
39121 -4185265 -3035431 -1742765 -178750 1757562 4111112 6846743 9837398 12875803
39113 12875803 15717646 18148473 20047347 21416361 22363172 23049480 23631968 24218525 24850771
39104 24850771 25512733 26155304 26719177 27141882 27349014 27244091 26712341 25642460 23958419
39095 23958419 21647683 18771250 15446720 11811727 7992203 4097992 242607 -3439903
39087 -3439903 -6803283 -9718042 -12099027 -13916338 -15189159 -15966658 -16299070 -16207261 -15666651
39078 -15666651 -14617561 -12998961 -10790142 -8043790 -4899323 -1571555 1682685 4608742
39070 4608742 6994002 8692318 9629477 9792903 9214058 7955103 6107469 3798620 1193282
39061 1193282 -1522531 -4172462 -6619160 -8772553 -10570206 -11942975 -12791605 -12993782
39053 -12993782 -12440787 -11084727 -8972865 -6252999 -3146463 101477 3274004 6218855
39045 6218855 8861927 11204975 13315016 15305992 17311977 19458420 21842521 24528378
39037 24528378 27553517 30939226 34697683 38830833 43321308 48124509 53175653 58417598
39029 58417598 63838744 69499294 75527531 82081509 89286235 97165300 105587442 114243912
39021 114243912 122664154 130268028 136444273 140639636 142442283 141645219 138276780 132587082
39013 132587082 124988786 115969877 106012194 95544894 84937054 74509897 64546504
39006 64546504 55291794 46948374 39673276 33573709 28698059 25023322 22446256 20788461
38998 20788461 19823253 19322245 19104212 19060465 19142313 19321866 19554881 19767842 19870787 19784325
38988 19784325 19469941 18955444 18344462 17798561 17492704 17562111 18064586 18970830 20178074
38979 20178074 21534550 22867224 24013233 24855254 25351532 25543720 25532146 25427097 25300665
38970 25300665 25163167 24973116 24672159 24225601 23648948 23010711 22416341 21986088 21834391
38961 21834391 22048956 22668281 23666166 24955523 26413548 27917541 29379061 30770746
38953 30770746 32142290 33617059 35360065 37520554 40171848 43280102 46720838 50333837
38945 50333837 53984947 57605697 61203273 64851142 68669873 72798339 77355944 82407427
38937 82407427 87946170 93901102 100157340 106577536 113020123 119359454 125510725 131452535
38929 131452535 137233666 142957285 148750982 154738994 161023886 167668956 174669291 181914037
38921 181914037 189158038 196021224 202022377 206643685 209416594 210010706 208297625 204364415
38913 204364415 198472935 190987540 182303741 172799269 162809796 152620023 142460996 132510479
38905 132510479 122896763 113704634 104979756 96730437 88933429 81553394 74575922 68037352
38897 68037352 62028310 56661943 52022346 48122392 44892245 42199351 39885039 37800143
38889 37800143 35828384 33894394 31960574 30021113 28099706 26249565 24548343 23083429
38881 23083429 21931761 21141758 20720573 20626444 20769948 21031339 21292969 21470915 21526261
38872 21526261 21451745 21249178 20917992 20462291 19907157 19308612 18748466 18317844 18101689
38863 18101689 18174100 18603037 19452940 20774392 22580264 24819353 27363892 30023093 32581818
38854 32581818 34848228 36689612 38047051 38934965 39433049 39666662 39768214 39827231 39854633
38845 39854633 39784334 39512637 38953961 38085478 36961469 35692830 34404180 33193366 32115831
38836 32115831 31197015 30453874 29900404 29527652 29273094 29007517 28558662 27765887 26538459
38827 26538459 24887360 22916399 20779678 18627377 16565662 14648742 12902824 11362499
38819 11362499 10094148 9192778 8756760 8854352 9494556 10611559 12070223 13695120 15313773
38810 15313773 16793659 18053492 19045645 19726487 20038941 19920648 19332309 18289129 16878544
38801 16878544 15254044 13603997 12106896 10895445 10048598 9609749 9608265 10061506 10954508
38792 10954508 12213328 13691130 15177525 16432120 17235147 17440940 17017607 16061085 14779696
38783 14779696 13451324 12361976 11743606 11732099 12354743 13538233 15122166 16874804 18520370
38774 18520370 19784137 20447216 20394226 19639208 18320668 16661400 14898961 13210028 11662797
38765 11662797 10220954 8793652 7300111 5714319 4074606 2467003 1001692 -205697
38757 -205697 -1050122 -1457894 -1412336 -973262 -275105 504844 1201818 1719763 2058935 2299022
38747 2299022 2550523 2907167 3424002 4118515 4974667 5937552 6906176 7740306 8287804
38738 8287804 8422348 8072623 7229541 5934133 4262073 2317896 234980 -1834292 -3745045
38729 -3745045 -5390206 -6715093 -7711829 -8408689 -8870306 -9205550 -9562216 -10092661 -10899934
38720 -10899934 -11995229 -13293455 -14647914 -15901766 -16930255 -17659738 -18063754 -18145381 -17918791
38711 -17918791 -17399417 -16602526 -15543044 -14233806 -12689206 -10942293 -9071683 -7222293
38703 -7222293 -5602704 -4452153 -3983862 -4323214 -5464747 -7267010 -9488871 -11852825
38695 -11852825 -14110410 -16087084 -17695490 -18919989 -19784794 -20320708 -20543178 -20448733 -20028299
38686 -20028299 -19286905 -18257154 -17001213 -15604647 -14165544 -12777961 -11511024 -10394115
38678 -10394115 -9420308 -8567065 -7817522 -7164994 -6598858 -6087355 -5576870 -5014978 -4385561
38669 -4385561 -3733481 -3163473 -2815788 -2833088 -3330754 -4375000 -5970691 -8062147 -10547249
38660 -10547249 -13298057 -16178512 -19054695 -21800706 -24306839 -26494392 -28334464 -29860485
38652 -29860485 -31162712 -32361052 -33565590 -34842191 -36197674 -37587223 -38933966 -40146590
38644 -40146590 -41129580 -41792931 -42068402 -41924883 -41365740 -40403806 -39034482 -37234889 -34995504
38635 -34995504 -32362776 -29464425 -26505249 -23738465 -21421454 -19762294 -18867344 -18708404
38627 -18708404 -19126541 -19873454 -20672837 -21279824 -21525403 -21340655 -20755790 -19870540 -18804466
38618 -18804466 -17650847 -16458902 -15251418 -14061122 -12957506 -12043739 -11424382 -11162780
38610 -11162780 -11250140 -11597637 -12051690 -12427854 -12555012 -12313901 -11651975 -10570740 -9102244
38601 -9102244 -7296332 -5224271 -2986052 -706331 1484077 3471795 5175349 6541371
38593 6541371 7526535 8082576 8162070 7745742 6871156 5636520 4168218 2566947 866866
38584 866866 -961482 -2963747 -5144600 -7444084 -9761794 -12004570 -14121759 -16112828
38576 -16112828 -18017058 -19899798 -21837791 -23897322 -26103770 -28413002 -30700541 -32776527
38568 -32776527 -34419216 -35410431 -35561121 -34727336 -32823641 -29837587 -25841158 -20991090
38560 -20991090 -15512680 -9670412 -3737816 2021247 7360700 12064374 15973265 19017891
38552 19017891 21229688 22714848 23602236 23997156 23966040 23551991 22800536 21773985 20546679
38543 20546679 19187724 17744259 16238607 14688155 13143935 11724575 10613315 10003474
38535 10003474 10014812 10628762 11681429 12916956 14069263 14929452 15371864 15340067 14816656
38526 14816656 13803694 12324300 10435804 8237681 5866726 3485529 1274014 -576372
38518 -576372 -1879643 -2496635 -2393024 -1681187 -610613 500209 1361498 1795569 1774212
38509 1774212 1401514 853766 302841 -144129 -465002 -702458 -924259 -1188269 -1524097
38500 -1524097 -1929473 -2374304 -2808019 -3169858 -3402232 -3463110 -3330208 -2994158 -2448514 -1690011
38490 -1690011 -734090 365461 1512101 2588194 3495676 4195343 4725095 5188971 5721432
38481 5721432 6438279 7389325 8532075 9743653 10870456 11788419 12436607 12807681 12912573
38472 12912573 12751400 12309325 11573706 10556721 9307920 7908730 6453786 5035042
38464 5035042 3740960 2663459 1891083 1477955 1405915 1571253 1812003 1962234 1903875
38455 1903875 1594056 1064228 399030 -296106 -930508 -1455397 -1869517 -2199954 -2471643
38446 -2471643 -2686060 -2819089 -2831960 -2683762 -2339940 -1777078 -985148 31636 1252666
38437 1252666 2635183 4106591 5560292 6860875 7861260 8428372 8467591 7935737 6840611
38428 6840611 5234139 3206023 877531 -1607675 -4095209 -6433172 -8490894 -10185591
38420 -10185591 -11505582 -12508327 -13283124 -13896028 -14351700 -14596591 -14560053 -14208064 -13582024
38411 -13582024 -12808718 -12083019 -11631762 -11666128 -12329854 -13656331 -15551860 -17814558 -20179980
38402 -20179980 -22370639 -24130037 -25239333 -25528479 -24891607 -23303816 -20830371 -17625609
38394 -17625609 -13925713 -10034688 -6293985 -3031307 -503557 1139876 1859701 1703889
38386 1703889 776866 -789674 -2861411 -5315483 -8036863 -10901729 -13767534 -16487477
38378 -16487477 -18945214 -21084465 -22910327 -24463277 -25788384 -26920126 -27883321 -28697199
38370 -28697199 -29374629 -29919673 -30327689 -30585634 -30669658 -30544595 -30173203 -29534572 -28639523
38361 -28639523 -27529042 -26253538 -24846245 -23310534 -21630442 -19794228 -17810726 -15708469
38353 -15708469 -13526060 -11307762 -9106435 -6984501 -5006634 -3229140 -1695491 -441490
38345 -441490 494529 1064082 1209061 872493 18481 -1342269 -3128955 -5181514 -7277221
38336 -7277221 -9172981 -10657321 -11590723 -11923914 -11698968 -11042146 -10149550 -9258573 -8600372
38327 -8600372 -8340982 -8532562 -9099509 -9869432 -10634090 -11210429 -11478473 -11392396 -10974432 -10301807
38317 -10301807 -9491597 -8684562 -8026784 -7647331 -7633963 -8015762 -8762897 -9804378 -11051662
38308 -11051662 -12412065 -13786295 -15059873 -16104612 -16798106 -17054583 -16852823 -16249776 -15375418
38299 -15375418 -14408659 -13538185 -12918473 -12635629 -12693674 -13021753 -13494683 -13957646 -14248354
38290 -14248354 -14213969 -13724722 -12688164 -11065066 -8882916 -6241716 -3309336 -305620
38282 -305620 2524505 4944587 6757303 7823600 8069674 7487034 6128729 4100348 1544919
38273 1544919 -1376083 -4503833 -7704480 -10887226 -14005664 -17033110 -19919468 -22554374
38265 -22554374 -24761831 -26333004 -27080888 -26891066 -25751296 -23757939 -21104106 -18050945
38257 -18050945 -14881628 -11846357 -9118575 -6781367 -4846024 -3286790 -2071832 -1179543
38249 -1179543 -600117 -327836 -350439 -639929 -1145583 -1788180 -2457780 -3021966 -3348799 -3338857
38239 -3338857 -2953662 -2230826 -1283255 -282244 575708 1112086 1203006 791946 -123903
38230 -123903 -1517670 -3346601 -5547573 -8023749 -10639668 -13235181 -15652420 -17758208
38222 -17758208 -19448096 -20635611 -21244406 -21217063 -20536324 -19241015 -17422383 -15201628 -12701185
38213 -12701185 -10022658 -7236623 -4383414 -1483240 1444966 4359762 7178405 9774913
38205 9774913 12000906 13725290 14880207 15494646 15697100 15680832 15646870 15753156 16088894
38196 16088894 16672016 17459262 18367753 19313356 20258431 21243633 22380728 23808282 25635932
38187 25635932 27905174 30578403 33551705 36681168 39813361 42810454 45559954 47965459
38179 47965459 49928795 51343256 52110585 52174622 51549893 50326013 48644219 46658285 44499076
38170 44499076 42257126 39984095 37702351 35413252 33105907 30772642 28426892 26108530
38162 26108530 23869277 21751564 19782836 17991494 16426749 15157965 14245894 13702566
38154 13702566 13468229 13424271 13437925 13414041 13325176 13205247 13113963 13095383 13156210 13277386
38144 13277386 13452210 13726405 14211105 15053671 16376791 18217723 20500857 23055516 25663347
38135 25663347 28107612 30206695 31830744 32906185 33409112 33349292 32755114 31672878 30180698
38126 30180698 28399241 26479201 24564775 22754640 21084872 19540300 18081012 16665730
38118 16665730 15262467 13846791 12394312 10878148 9281120 7619690 5959470 4401247
38110 4401247 3039613 1921934 1036119 331891 -242724 -712624 -1067979 -1277312 -1308262
38101 -1308262 -1137438 -740845 -76590 917806 2302753 4099823 6263930 8681894 11199842
38092 11199842 13666818 15973801 18071079 19961052 21676458 23255688 24720615 26058263
38084 26058263 27208708 28063129 28474991 28284961 27355756 25606853 23035702 19717144 15782605
38075 15782605 11388556 6687028 1810877 -3120049 -7979732 -12622926 -16892748 -20645515
38067 -20645515 -23776043 -26228834 -27991148 -29072197 -29477260 -29189002 -28167310 -26369962
38059 -26369962 -23784426 -20456021 -16502225 -12111306 -7528606 -3033373 1094080 4614303
38051 4614303 7371449 9319839 10519264 11098982 11207494 10971765 10483886 9819301 9073002
38042 9073002 8385355 7931523 7873554 8304722 9222703 10543947 12141319 13879503 15638947
38033 15638947 17334751 18934125 20462526 21985072 23563609 25209088 26856458 28378209
38025 28378209 29630829 30509113 30978644 31070377 30844890 30351594 29607639 28604899 27334785
38016 27334785 25812624 24087870 22237193 20346515 18491369 16723257 15065843 13520820
38008 13520820 12078692 10727436 9455797 8256108 7132569 6109947 5227470 4510972
38000 4510972 3938142 3422173 2825374 1993066 791239 -861766 -2973709 -5470786 -8204641
37991 -8204641 -10969441 -13525038 -15627542 -17066825 -17700394 -17470161 -16401042 -14593813
37983 -14593813 -12220857 -9516402 -6744277 -4139399 -1843669 129665 1880866 3565163
37975 3565163 5321765 7220668 9237953 11255369 13081060 14492889 15298047 15388173 14766371
37966 14766371 13536795 11865651 9931807 7885115 5825184 3804274 1847250 -24917
37958 -24917 -1780062 -3372442 -4749441 -5859842 -6658730 -7111126 -7199598 -6935175 -6361717
37949 -6361717 -5544957 -4550797 -3429359 -2217951 -959871 278714 1412682 2367076 3113830
37940 3113830 3685451 4146446 4536319 4825401 4918635 4705231 4117447 3160091 1900807
37931 1900807 439486 -1120249 -2689581 -4207925 -5653045 -7039640 -8399090 -9748343
37923 -9748343 -11069440 -12315116 -13433738 -14390750 -15170163 -15760821 -16145653 -16306013 -16237341
37914 -16237341 -15963647 -15541766 -15052929 -14582515 -14192086 -13894682 -13649152 -13382308 -13031008
37905 -13031008 -12583109 -12097077 -11691720 -11510581 -11673767 -12233300 -13147042 -14280752 -15438721
37896 -15438721 -16413275 -17036278 -17215152 -16943033 -16283499 -15339205 -14218257 -13011816 -11790257
37887 -11790257 -10613730 -9544015 -8647316 -7989169 -7628826 -7614041 -7968905 -8671958 -9636713
37878 -9636713 -10714624 -11730251 -12537243 -13068616 -13356466 -13512529 -13679937 -13977672 -14459837
37869 -14459837 -15105406 -15842321 -16593049 -17314814 -18009271 -18696002 -19367112 -19950777 -20307509
37860 -20307509 -20269331 -19710474 -18615184 -17103189 -15398356 -13761839 -12424221 -11536108 -11140725
37851 -11140725 -11173429 -11496382 -11961863 -12475719 -13029696 -13692289 -14570291 -15760183 -17305012
37842 -17305012 -19169667 -21244581 -23377880 -25419986 -27255632 -28807099 -30015124 -30820939
37834 -30820939 -31167826 -31019111 -30374828 -29275388 -27796466 -26044935 -24157481 -22295105
37826 -22295105 -20627891 -19311716 -18463293 -18138896 -18318802 -18898795 -19694699 -20469114 -20981168
37817 -20981168 -21040967 -20539741 -19441915 -17755596 -15512615 -12773332 -9643732 -6281579
37809 -6281579 -2881739 349745 3217197 5546931 7196584 8071121 8142833 7461993 6148058
37800 6148058 4364535 2288220 79887 -2140632 -4308734 -6409918 -8455552 -10454132
37792 -10454132 -12395259 -14250171 -15978324 -17529291 -18841340 -19848360 -20504426 -20820715
37784 -20820715 -20893196 -20895945 -21032157 -21463478 -22255276 -23364590 -24667968 -26004519 -27211262
37775 -27211262 -28143879 -28687209 -28759751 -28312893 -27325505 -25796609 -23739837 -21184133 -18184313
37766 -18184313 -14839032 -11304209 -7787332 -4517440 -1699660 529457 2129995 3158721
37758 3158721 3738611 4010096 4087584 4040225 3897008 3660965 3318020 2838042 2176402 1286192
37748 1286192 143903 -1222006 -2719906 -4216183 -5582914 -6745751 -7704249 -8515709
37740 -8515709 -9256727 -9986100 -10724615 -11452508 -12117949 -12653058 -12997742 -13127939 -13078060 -12946588
37730 -12946588 -12879505 -13032073 -13516638 -14355627 -15465712 -16685545 -17831003 -18746428 -19333334
37721 -19333334 -19559945 -19459490 -19115820 -18634344 -18108930 -17602264 -17146711 -16757398 -16444395
37712 -16444395 -16215834 -16070150 -15980963 -15883477 -15672644 -15216939 -14382548 -13059716 -11186851
37703 -11186851 -8770390 -5895192 -2716748 567643 3757624 6678715 9190068 11178702
37695 11178702 12558322 13281988 13360745 12872282 11949435 10750449 9423581 8082970 6805661
37686 6805661 5643001 4628293 3770631 3044211 2389547 1730091 992269 117545 -932413
37677 -932413 -2169553 -3569629 -5065217 -6551018 -7905474 -9022963 -9842446 -10358037 -10606118
37668 -10606118 -10637141 -10488487 -10172033 -9678649 -8991136 -8096088 -6992634 -5701037 -4270492
37659 -4270492 -2780818 -1336234 -55764 937356 1531908 1651918 1275453 434280 -805177
37650 -805177 -2364471 -4167649 -6148522 -8253211 -10434303 -12636616 -14788520 -16815185
37642 -16815185 -18670687 -20363822 -21952360 -23503579 -25043269 -26522231 -27817012 -28762886
37634 -28762886 -29204227 -29043887 -28274592 -26979862 -25302974 -23399118 -21395747 -19378202
37626 -19378202 -17398295 -15491168 -13688187 -12021798 -10522454 -9209971 -8085867 -7135188
37618 -7135188 -6340014 -5696326 -5222352 -4953586 -4929939 -5183376 -5728162 -6549771 -7592624
37609 -7592624 -8758309 -9928296 -11007883 -11964584 -12831339 -13670618 -14526039 -15394868 -16234772
37600 -16234772 -16993276 -17638147 -18172015 -18625236 -19031063 -19395156 -19675596 -19786130 -19623669
37591 -19623669 -19107506 -18211761 -16978335 -15509262 -13944322 -12429739 -11083129 -9964328
37583 -9964328 -9065982 -8331690 -7693205 -7105193 -6559401 -6076692 -5688373 -5416957 -5258571
37574 -5258571 -5169302 -5065498 -4848175 -4446082 -3854515 -3147553 -2460161 -1954922 -1790809 -2101434
37564 -2101434 -2979960 -4465338 -6529976 -9076580 -11952426 -14978956 -17982059 -20807671
37556 -20807671 -23320622 -25398440 -26933659 -27848467 -28113462 -27755627 -26844772 -25462728 -23673950
37547 -23673950 -21515248 -19006192 -16168687 -13046350 -9720949 -6320331 -3005999 63924
37539 63924 2780436 5111426 7097178 8822528 10386125 11879072 13369965 14888001
37531 14888001 16405458 17833043 19039981 19894431 20305693 20251249 19782354 19008409 18062311
37522 18062311 17056350 16048614 15038732 13994629 12893398 11754168 10648573 9685586
37514 9685586 8976930 8595971 8544922 8741974 9033868 9231446 9156593 8683587 7762469 6422859
37504 6422859 4762936 2927087 1075939 -642092 -2107500 -3233098 -3961797 -4265056
37496 -4265056 -4140761 -3607797 -2699697 -1462292 44477 1746902 3568427 5453746 7396747
37487 7396747 9453188 11723143 14306745 17253371 20525336 23987719 27428823 30610514
37479 30610514 33335150 35501390 37122257 38300208 39177677 39889061 40530535 41149609 41747308
37470 41747308 42285452 42697392 42904914 42840543 42467869 41793369 40870950 39803205 38735504
37461 38735504 37832816 37237853 37027213 37190456 37644306 38270334 38950346 39581849 40077524
37452 40077524 40364617 40390830 40126715 39554643 38652504 37392470 35763731 33805116 31623400
37443 31623400 29383989 27278887 25487192 24141774 23307927 22973837 23053047 23401309 23846104
37434 23846104 24217601 24367500 24173556 23540117 22403111 20735403 18544093 15861910 12744813
37425 12744813 9281335 5602053 1870803 -1746313 -5115265 -8145061 -10765381 -12887794
37417 -12887794 -14380548 -15076995 -14816582 -13501404 -11146321 -7903817 -4054603 31108
37409 31108 3946966 7305418 9789190 11196913 11473911 10713253 9118110 6934030 4377550
37400 4377550 1591985 -1353255 -4427518 -7592337 -10767702 -13824446 -16604101 -18957455
37392 -18957455 -20784064 -22054242 -22807310 -23135627 -23166910 -23047342 -22921668 -22912574 -23109067
37383 -23109067 -23568993 -24327151 -25392853 -26727685 -28212489 -29629709 -30688128 -31094300
37375 -31094300 -30641814 -29273321 -27085797 -24282571 -21099902 -17739631 -14330102 -10923985
37367 -10923985 -7526979 -4138956 -785592 2474124 5566259 8436606 11084536 13576438
37359 13576438 16024726 18533782 21134152 23738841 26149079 28111573 29400309 29883791
37351 29883791 29551178 28496298 26878175 24879708 22676134 20412613 18186914 16040645
37343 16040645 13970090 11960332 10025222 8223094 6633021 5308064 4239952 3357835
37335 3357835 2557099 1737111 827068 -210291 -1394151 -2745182 -4289295 -6035526 -7938742
37326 -7938742 -9873514 -11642298 -13021763 -13830502 -13991618 -13565992 -12742950 -11790944 -10987076
37317 -10987076 -10552088 -10610811 -11182439 -12192995 -13501039 -14931251 -16310763 -17500089 -18411861
37308 -18411861 -19018135 -19352905 -19512768 -19648560 -19937190 -20533397 -21517514 -22862235 -24433304
37299 -24433304 -26025275 -27423492 -28475524 -29146417 -29530569 -29810214 -30178854 -30764279 -31578135
37290 -31578135 -32501662 -33307651 -33715102 -33463814 -32383435 -30430490 -27682859 -24301339 -20478422
37281 -20478422 -16393360 -12186308 -7956637 -3782410 249730 4020608 7376908 10158732
37273 10158732 12245581 13596175 14259643 14352937 14018608 13385940 12553425 11595175 10577628
37264 10577628 9568532 8631652 7814738 7139003 6589627 6107101 5590298 4924004 4024700
37255 4024700 2877696 1541125 115603 -1301150 -2651253 -3928798 -5162948 -6383000
37247 -6383000 -7587426 -8733511 -9745174 -10524050 -10956288 -10923127 -10325523 -9118786 -7339282
37238 -7339282 -5107529 -2606740 -47751 2368995 4489863 6237801 7622785 8718621
37230 8718621 9607682 10319864 10802599 10943019 10632515 9839795 8654180 7274775 5946489
37221 5946489 4870827 4134841 3693687 3412577 3141416 2781360 2313330 1782607 1255213
37212 1255213 772553 329121 -116108 -606005 -1155978 -1749824 -2358240 -2959242 -3543920
37203 -3543920 -4110262 -4660431 -5211649 -5815306 -6566563 -7586711 -8975330 -10751812 -12818364
37194 -12818364 -14965040 -16910300 -18353925 -19025374 -18724894 -17356966 -14948516 -11644314
37186 -11644314 -7682890 -3364761 978657 5015942 8450208 11056893 12716732 13429673
37178 13429673 13297959 12482274 11155262 9480292 7620781 5756341 4077674 2756158
37170 2756158 1908837 1579277 1737389 2291500 3110663 4058063 5026896 5961382 6853579
37161 6853579 7725063 8610230 9548706 10582693 11753601 13096429 14631236 16350628 18206505
37152 18206505 20104653 21914206 23491277 24710362 25495193 25838198 25796198 25457760 24894507
37143 24894507 24120884 23083086 21681934 19818635 17444099 14592657 11389250 8031977
37135 8031977 4760650 1821928 -562884 -2223159 -3054355 -3025641 -2186080 -670376 1306278
37126 1306278 3476442 5569667 7364466 8722716 9597370 10015926 10049292 9780862 9291286
37117 9291286 8662909 7989645 7372392 6896468 6609187 6517153 6603727 6850371 7248473 7801542
37107 7801542 8522660 9426587 10513771 11752002 13070123 14373347 15573050 16611699
37099 16611699 17468519 18149321 18676589 19090868 19457367 19862047 20390789 21103810 22024468
37090 22024468 23149129 24466093 25964933 27627766 29410141 31228421 32966778 34503509
37082 34503509 35742734 36633693 37169634 37374108 37291287 36990470 36577652 36193678 35983372
37073 35983372 36042904 36375104 36882507 37403661 37771337 37864664 37640834 37147403 36519707 35964308
37063 35964308 35729065 36065833 37195449 39281780 42415652 46606911 51785214 57811040
37055 57811040 64492349 71594101 78829788 85841189 92192071 97404290 101043274 102827155
37047 102827155 102711811 100909393 97829079 93966289 89784599 85624613 81652274 77847607
37039 77847607 74034915 69951874 65341253 60037454 54022526 47438965 40558840 33719290
37031 33719290 27246029 21393224 16320269 12104859 8773294 6326607 4752909 4028540
37023 4028540 4113178 4940282 6404254 8352544 10594936 12933234 15198394 17274588 19098059
37014 19098059 20633861 21844452 22667506 23016201 22802874 21972013 20524638 18526196 16100761
37005 16100761 13414323 10647546 7965440 5499534 3350563 1600602 316974 -455753
36997 -455753 -703833 -442325 294812 1464825 3022646 4923114 7117129 9540420 12099564
36988 12099564 14666045 17088642 19225598 20985001 22352987 23393224 24217344 24943179
36980 24943179 25661963 26425048 27246322 28111290 28988947 29847497 30671140 31468330 32265139
36971 32265139 33090707 33968324 34914838 35938026 37027194 38149250 39263171 40343654
36963 40343654 41389031 42402957 43366793 44225887 44894140 45264485 45216423 44624211 43372526
36954 43372526 41379798 38622927 35155586 31113706 26704831 22183500 17819967 13871072
36946 13871072 10558725 8055524 6472261 5843051 6111846 7131769 8686098 10527086
36938 10527086 12418421 14168959 15654426 16828062 17717857 18405694 18990158 19546130 20099941
36929 20099941 20632581 21108959 21516955 21893748 22321551 22890386 23645340 24547883 25474474
36920 25474474 26253509 26719805 26760106 26334186 25472647 24262666 22832622 21337661 19939428
36911 19939428 18774464 17918570 17365178 17030429 16780547 16467373 15963342 15194788 14168892
36902 14168892 12981852 11800205 10822995 10242433 10214059 10834467 12121283 13998511 16298422
36893 16298422 18788792 21222160 23390456 25162956 26492862 27394958 27912943 28097943
36885 28097943 28006445 27707675 27283231 26812184 26351893 25930629 25556543 25231993 24961234
36876 24961234 24752938 24627298 24627423 24819912 25274326 26035138 27113055 28505471 30226253
36867 30226253 32317673 34838641 37846544 41390995 45521292 50295062 55773604 61997831
36859 61997831 68953494 76547539 84616972 92972361 101454793 109978342 118543443 127224286
36851 127224286 136141677 145432485 155224653 165624254 176714875 188559999 201191634
36844 201191634 214571026 228523445 242671208 256401911 268901177 279257126 286619554
36837 286619554 290376510 290295324 286573722 279773718 270661705 260021713 248514124 236617408
36829 236617408 224643255 212785950 201167493 189862205 178907928 168318137 158099649
36822 158099649 148269051 138860093 129921038 121504192 113648547 106359242 99596106 93285663
36814 93285663 87356690 81778139 76572485 71797079 67512997 63767405 60595434 58023682
36806 58023682 56056763 54650447 53694958 53029495 52487465 51950085 51378701 50806471 50292583
36797 50292583 49864459 49480427 49031624 48377792 47394888 46011495 44221505 42073836 39649638
36788 39649638 37040038 34332532 31606651 28935481 26389856 24041881 21962431 20208427
36780 20208427 18804377 17733223 16951176 16424807 16168130 16253449 16788891 17880070 19599338
36771 19599338 21970189 24958220 28461511 32306951 36265344 40090026 43570924 46589144
36763 46589144 49155250 51414981 53613292 56025807 58887177 62350093 66488381 71327422
36755 71327422 76870958 83106501 89996368 97473362 105451134 113843364 122579051 131606397
36747 131606397 140887036 150388446 160082158 169948492 179979334 190166088 200464379
36740 200464379 210737553 220694920 229855997 237578800 243171007 246057192 245933723 242842241
36732 242842241 237136121 229367058 220146652 210033739 199475296 188800758 178247556
36725 178247556 167989941 158154570 148822329 140024362 131741434 123914801 116471627 109356544
36717 109356544 102552595 96081723 89991841 84345008 79211375 74661090 70748649 67496893
36709 67496893 64892775 62896096 61449365 60478017 59884053 59545342 59326661 59095850 58735598
36700 58735598 58150431 57275315 56087175 54610716 52909597 51064084 49146198 47204312
36692 47204312 45263605 43342355 41477665 39748202 38279413 37223045 36716326 36838801
36684 36838801 37587454 38880358 40582162 42534361 44577712 46567376 48388316 49971731
36676 49971731 51302898 52411786 53351063 54176569 54940531 55693673 56485001 57354450 58324152
36667 58324152 59396536 60561171 61806133 63128849 64543428 66082939 67796852 69746377
36659 69746377 72000478 74630334 77694726 81211304 85120914 89265242 93399678 97247872
36651 97247872 100579911 103278128 105357609 106931564 108140964 109085146 109785848 110194683
36643 110194683 110227663 109798672 108834844 107279381 105098685 102301293 98959013 95213542
36635 95213542 91257187 87286240 83437966 79737814 76090248 72327325 68290611 63898150
36627 63898150 59163410 54171455 49041368 43898228 38859171 34027636 29489737 25309114
36619 25309114 21518626 18111634 15040702 12231511 9612346 7148856 4867634 2855948
36611 2855948 1237495 136420 -355213 -198462 582548 1898760 3601912 5499932 7383489
36602 7383489 9061387 10396555 11330677 11888758 12163700 12287442 12395963 12595453 12940312
36593 12940312 13433743 14051041 14771159 15598471 16567326 17733466 19158052 20887059 22930949
36584 22930949 25254834 27786361 30435474 33109591 35712650 38134432 40249713 41940674
36576 41940674 43134805 43835478 44128223 44164419 44134714 44239403 44655890 45506663 46838404
36567 46838404 48619620 50752410 53088760 55448760 57644916 59511858 60930441 61833957
36559 61833957 62195843 62011649 61290376 60059784 58376440 56326469 54011668 51529381
36551 51529381 48959864 46367259 43807750 41332890 38981118 36761510 34642299 32555483
36543 32555483 30417154 28150634 25699383 23030093 20138129 17062988 13905150 10826325
36535 10826325 8022806 5678682 3917884 2774234 2189355 2035594 2151721 2377447 2577389
36526 2577389 2651518 2533527 2181628 1568285 675905 -497106 -1920836 -3516595 -5150296
36517 -5150296 -6646538 -7822790 -8530759 -8687820 -8288025 -7393897 -6119215 -4614429 -3058519
36508 -3058519 -1648182 -570283 43271 156436 -163340 -779323 -1539284 -2315349 -3014248
36499 -3014248 -3570134 -3943469 -4136222 -4210177 -4285169 -4507138 -4999195 -5820065 -6946080 -8278822
36489 -8278822 -9673892 -10983410 -12097940 -12968515 -13598302 -14012822 -14229912 -14246297 -14043978
36480 -14043978 -13607159 -12934072 -12032509 -10904904 -9544153 -7953747 -6177198 -4304355
36472 -4304355 -2440276 -658382 1025045 2636570 4203029 5708455 7076535 8191674
36464 8191674 8951465 9322909 9368715 9227822 9063847 9011942 9147256 9478880 9962517 10528054
36454 10528054 11120275 11739992 12459469 13393186 14635991 16207576 18037036 19990206 21917045
36445 21917045 23693867 25246024 26546384 27594110 28388659 28916402 29154616 29081470 28679388
36436 28679388 27932520 26827899 25363821 23558855 21455527 19122454 16661343 14213829
36428 14213829 11950802 10033226 8559030 7530496 6866655 6451066 6179959 5981939 5808034
36419 5808034 5612034 5342407 4955351 4444093 3867235 3354847 3081666 3217421 3877998
36410 3877998 5096621 6819520 8921149 11233448 13583202 15826612 17867558 19653650
36402 19653650 21158242 22364288 23259715 23840931 24114460 24091581 23779369 23173463 22253407
36393 22253407 20979245 19292540 17130195 14455480 11296591 7770015 4068647 415197
36385 415197 -2995359 -6035221 -8652724 -10859304 -12709072 -14277546 -15639624 -16850373
36377 -16850373 -17936648 -18902544 -19740759 -20438550 -20975898 -21324326 -21454278 -21347405 -21002338
36368 -21002338 -20429728 -19646079 -18677205 -17567158 -16376077 -15158145 -13930943 -12657644
36360 -12657644 -11256118 -9634564 -7740944 -5603627 -3338353 -1112837 910307 2615875
36352 2615875 3942585 4863452 5365005 5442228 5109635 4418358 3465511 2385888 1327578
36343 1327578 424584 -221900 -554087 -567361 -320127 63514 404834 496794 145287 -778946
36333 -778946 -2293197 -4284339 -6533598 -8775430 -10763950 -12320927 -13351759 -13829930
36325 -13829930 -13763607 -13166618 -12051594 -10443733 -8395684 -5986559 -3308632 -461099
36317 -461099 2437014 5225192 7695378 9617761 10793291 11111812 10592764 9392541 7772070
36308 7772070 6030111 4422898 3101557 2093757 1334378 725290 192775 -282556 -672019
36299 -672019 -932245 -1044671 -1037999 -981514 -955530 -1018167 -1185120 -1425781 -1669135 -1814308
36289 -1814308 -1746584 -1359333 -575490 640576 2283597 4314836 6671302 9278355 12068202
36280 12068202 14997724 18051807 21226677 24505867 27848769 31198188 34493619 37673698
36272 37673698 40666470 43380602 45709281 47547194 48813505 49472807 49544877 49094037 48198598
36263 48198598 46917627 45277824 43286510 40953402 38300569 35359354 32169688 28790419
36255 28790419 25310066 21841355 18496617 15355891 12440924 9702611 7029155 4282560
36247 4282560 1359146 -1751210 -4941057 -8013838 -10752745 -12998036 -14699806 -15925581
36239 -15925581 -16821889 -17550783 -18234680 -18934115 -19658467 -20390768 -21108654 -21795965 -22447010
36230 -22447010 -23064691 -23653096 -24208754 -24715710 -25144401 -25449457 -25565230 -25407276 -24891395
36221 -24891395 -23970639 -22672368 -21109595 -19455968 -17901235 -16617355 -15749608 -15418949
36213 -15418949 -15712319 -16655843 -18188786 -20158900 -22344324 -24493403 -26371869 -27809060
36205 -27809060 -28733164 -29183448 -29292460 -29242717 -29213278 -29336160 -29678515 -30254300 -31054343 -32075146
36195 -32075146 -33330095 -34838420 -36599297 -38565966 -40636170 -42668711 -44521833 -46094310
36187 -46094310 -47346630 -48292208 -48968276 -49406637 -49617932 -49587455 -49272977 -48602906 -47485291
36178 -47485291 -45835995 -43615635 -40849988 -37618192 -34021050 -30159142 -26137959 -22087826
36170 -22087826 -18170933 -14560868 -11405921 -8800342 -6778125 -5325450 -4398002 -3933014
36162 -3933014 -3854084 -4071425 -4480344 -4960017 -5375063 -5582953 -5449887 -4874473 -3811660
36153 -3811660 -2283831 -370310 1818173 4161560 6536047 8809008 10840185 12497913
36145 12497913 13682977 14346599 14495690 14186722 13511902 12581069 11503721 10376006 9274540
36136 9274540 8254320 7345874 6549185 5827695 5110557 4309017 3342862 2164211 769002
36127 769002 -801590 -2461868 -4084032 -5510437 -6579463 -7155280 -7146854 -6511600 -5250955
36118 -5250955 -3405511 -1049513 1718156 4784760 8031369 11337081 14584864 17672167
36110 17672167 20521866 23085342 25333975 27243648 28781550 29902956 30559533 30714715
36102 30714715 30359399 29522930 28276854 26729209 25007521 23232540 21491562 19823343
36094 19823343 18221988 16657080 15099061 13537860 11989531 10494195 9111087 7911469
36086 7911469 6965649 6324126 6001194 5971252 6180946 6572335 7109022 7795163 8675729 9812640
36076 9812640 11247011 12968423 14905369 16935138 18904321 20654948 22052062 23003039
36068 23003039 23459736 23408157 22862581 21875970 20559815 19092302 17695130 16575108 15848755
36059 15848755 15485014 15300309 15016751 14361471 13164498 11416791 9272512 7003164 4923119
36050 4923119 3306482 2314658 1957236 2106341 2564529 3156510 3800897 4533252 5480363
36041 5480363 6804017 8635951 11025188 13916895 17170575 20605332 24047022 27357455
36033 27357455 30442687 33250263 35766226 38014700 40053730 41958574 43790742 45562620
36025 45562620 47213575 48609424 49567049 49895535 49438868 48105822 45881540 42826582
36017 42826582 39072891 34818917 30316014 25837052 21629633 17871980 14654719 11997428
36009 11997428 9884229 8290522 7186044 6522956 6226810 6198188 6321662 6479019 6567874
36000 6567874 6523697 6337242 6059151 5788495 5646682 5743203 6145892 6868138 7873660 9086798
35990 9086798 10398363 11670952 12754764 13516475 13870936 13802006 13365284 12674290 11877005
35981 11877005 11130018 10573331 10305937 10365538 10721024 11282448 11921010 12486261 12819188
35972 12819188 12773827 12255672 11263402 9905740 8376132 6894920 5647643 4745571 4218220
35963 4218220 4031288 4115836 4395707 4806687 5306614 5875758 6503404 7159895 7767397 8194484
35953 8194484 8291122 7952122 7174077 6074766 4869109 3816669 3159867 3067845 3599464
35944 3599464 4697027 6212243 7951109 9717293 11340017 12685448 13659179 14206327
35936 14206327 14309035 13977383 13234583 12106764 10628484 8861403 6907265 4897677
35928 4897677 2964547 1213557 -283033 -1480553 -2359272 -2927254 -3215183 -3255949 -3061419
35919 -3061419 -2613352 -1869446 -773569 732149 2684311 5064019 7770948 10627260
35911 10627260 13411057 15899002 17899962 19277428 19967058 19991432 19465222 18579552 17560290
35902 17560290 16612385 15879732 15445859 15369784 15720598 16576237 17985514 19923603 22274005
35893 22274005 24850674 27453177 29933916 32248697 34464363 36716003 39134205 41780076
35885 41780076 44618878 47538282 50393305 53051493 55421485 57465341 59205362 60731088
35877 60731088 62198431 63807389 65756691 68193032 71179005 74690415 78635048 82880490
35869 82880490 87289115 91764822 96304939 101032774 106185112 112052486 118898385 126891426
35861 126891426 136067926 146321032 157404357 168941997 180440949 191303669 200845164
35854 200845164 208330848 213054157 214454176 212242157 206487009 197619762 186349701 173519957
35846 173519957 159951493 146323968 133121398 120640182 109034105 98367039 88655098
35839 88655098 79892041 72057603 65112175 58987430 53586254 48799831 44537566 40756368
35831 40756368 37475089 34765263 32717341 31392326 30778784 30775369 31204976 31848809 32483152
35822 32483152 32910033 32981245 32613495 31788363 30536045 28912741 26984320 24820240 22492857
35813 22492857 20077102 17649345 15284509 13049451 10993420 9140582 7488359 6010196
35805 6010196 4660533 3384519 2136342 901975 -287756 -1366499 -2262093 -2928510
35797 -2928510 -3358602 -3569105 -3568636 -3331318 -2795034 -1886950 -561651 1169321 3229968
35788 3229968 5493372 7805169 10005338 11943075 13486729 14534619 15030121 14976993 14444735
35779 14444735 13557139 12468213 11336744 10306245 9488683 8950810 8709791 8746796 9036831
35770 9036831 9580140 10417099 11617165 13246488 15331000 17835063 20666282 23700467
35762 23700467 26810037 29881732 32819846 35540306 37965403 40027841 41684080 42925460
35754 42925460 43774584 44269231 44451440 44374875 44121759 43805802 43547144 43430205 43471655 43619652
35744 43619652 43783268 43870829 43812451 43556620 43050971 42228732 41018025 39374340 37317311
35735 37317311 34944459 32406652 29856553 27401492 25089345 22934437 20967581 19281808
35727 19281808 18045496 17468211 17728896 18898057 20889662 23463198 26274354 28954863
35719 28954863 31191584 32776258 33614446 33705182 33112993 31945486 30337129 28436061 26391858
35710 26391858 24341309 22390467 20599268 18980245 17514439 16173285 14932672 13777268
35702 13777268 12702766 11720033 10855881 10144553 9612958 9269962 9107591 9112739 9281150
35693 9281150 9625349 10171904 10946926 11953042 13148406 14442922 15719871 16874404 17848485
35684 17848485 18646478 19330678 20006893 20808816 21881556 23358647 25329359 27803371 30688399
35675 30688399 33793541 36857993 39594613 41738512 43094967 43578252 43227060 42185689
35667 42185689 40655493 38836049 36878625 34865961 32820343 30732430 28598083 26448802
35659 26448802 24364273 22464535 20891699 19796005 19330409 19641390 20841967 22970844
35651 22970844 25959184 29624451 33695443 37861438 41833318 45397376 48437999 50918325
35643 50918325 52834076 54171148 54889315 54935697 54279033 52948927 51059373 48799872 46395387
35634 46395387 44054945 41930880 40098892 38559669 37260784 36133888 35133147 34256891
35626 34256891 33543180 33044776 32797594 32796166 32985060 33269177 33538345 33694594 33669888 33429815
35616 33429815 32968507 32302867 31469392 30521641 29526682 28561980 27714382 27080239 26764003
35607 26764003 26872403 27501039 28712280 30510506 32827159 35524484 38415586 41293620
35599 41293620 43968425 46311346 48297958 50026165 51693428 53539855 55781972 58561037
35591 58561037 61917558 65793079 70053697 74523940 79016445 83347322 87338092 90815795
35583 90815795 93625933 95664676 96919910 97496558 97604296 97506278 97449677 97605552 98036030
35574 98036030 98693575 99447556 100126210 100557086 100591356 100108527 99009370 97208450 94634656
35565 94634656 91243480 87039103 82096380 76567951 70667194 64631912 58684912 53007400
35557 53007400 47730831 42940577 38679134 34942531 31677690 28796842 26215258 23896818
35549 23896818 21880094 20268349 19189760 18748936 18990437 19885189 21338287 23206127
35541 23206127 25309533 27440930 29377585 30912678 31899766 32290926 32149398 31630222 30935127
35532 30935127 30255401 29720671 29371440 29164390 29004935 28790810 28449499 27957484 27335383
35523 27335383 26621057 25834780 24959272 23951283 22779533 21463869 20089693 18789283
35515 18789283 17700754 16924293 16494601 16381332 16515475 16824706 17257517 17787743 18404941
35506 18404941 19099300 19847638 20609119 21339728 22021412 22683233 23391255 24207579 25144434
35497 25144434 26142676 27085682 27837176 28280179 28338614 27978495 27199069 26023659 24489380
35488 24489380 22630941 20463448 17978997 15167633 12058402 8762928 5497515 2561697
35480 2561697 267547 -1156260 -1639173 -1284549 -325397 947789 2250924 3347207 4072107
35471 4072107 4353185 4222485 3807152 3288281 2837713 2560652 2471979 2515286 2609928 2697999
35461 2697999 2767987 2849717 2992322 3240844 3619745 4125324 4728892 5390825 6078844 6780549
35451 6780549 7506474 8286476 9160187 10159110 11284501 12493834 13704837 14813179 15714423
35442 15714423 16325619 16603169 16548942 16199373 15605943 14822511 13903993 12906726 11882727
35433 11882727 10872522 9904547 8999241 8168746 7409219 6693826 5976225 5204715 4337053
35424 4337053 3346346 2219030 954537 -428195 -1885176 -3355853 -4787317 -6158580
35416 -6158580 -7484539 -8792904 -10087644 -11323296 -12408463 -13238655 -13740821 -13905505 -13790564
35407 -13790564 -13496244 -13126302 -12756732 -12428380 -12163458 -11988775 -11944246 -12068174 -12370407
35398 -12370407 -12814557 -13323678 -13806132 -14183750 -14405598 -14446976 -14308206 -14024135 -13676765
35389 -13676765 -13392414 -13315042 -13567504 -14221173 -15285894 -16717698 -18432834 -20316549 -22222582
35380 -22222582 -23970443 -25354449 -26173494 -26276197 -25603539 -24209418 -22249043 -19939444
35372 -19939444 -17507757 -15146084 -12986112 -11097026 -9501018 -8194410 -7161735 -6378124
35364 -6378124 -5806663 -5400315 -5108981 -4883941 -4676837 -4440659 -4139124 -3758185 -3307355
35355 -3307355 -2809019 -2287107 -1765578 -1274640 -853919 -545086 -375659 -342900 -408308 -508478
35345 -508478 -578599 -576455 -494583 -356190 -200007 -64044 23228 41588 -27797 -206489 -514747
35334 -514747 -961354 -1534794 -2202583 -2919732 -3640034 -4319691 -4906614 -5321858 -5452569 -5174110
35324 -5174110 -4398430 -3122007 -1441214 478214 2461774 4382207 6179059 7832570
35316 7832570 9311549 10531342 11350394 11608423 11185297 10052052 8293702 6098306 3720852
35307 3720852 1437823 -494359 -1873358 -2578521 -2589125 -1985989 -934501 344511 1610336
35298 1610336 2645106 3301479 3539069 3427961 3113942 2763882 2516763 2453374 2584367
35289 2584367 2854865 3167005 3417180 3534988 3508253 3387335 3272321 3288533 3552295 4131584
35279 4131584 5015752 6111099 7265444 8305953 9070422 9424997 9273447 8562689 7284347
35270 7284347 5473902 3212723 633065 -2084489 -4732445 -7114566 -9084238 -10564582
35262 -10564582 -11542405 -12042132 -12096011 -11728490 -10963229 -9844571 -8453616 -6902135 -5303218
35253 -5303218 -3733424 -2207040 -677164 934923 2695332 4620229 6664620 8740656
35245 8740656 10751447 12621248 14312181 15828766 17212060 18520180 19796130 21037800
35237 21037800 22190913 23171370 23900191 24324901 24413725 24130735 23414397 22180098 20350966
35228 20350966 17900933 14884689 11437917 7749065 4015720 401272 -2992680 -6126041
35220 -6126041 -8993212 -11589308 -13894281 -15881341 -17532440 -18840797 -19799359 -20390856
35212 -20390856 -20591539 -20384370 -19768819 -18760816 -17387557 -15684910 -13699885 -11495028
35204 -11495028 -9150375 -6759196 -4414396 -2187367 -111220 1814886 3596380 5208877
35196 5208877 6589410 7664852 8396008 8801502 8944706 8899181 8721882 8448978 8106225
35187 8106225 7717722 7306153 6888799 6475125 6067184 5662077 5256983 4856649 4480094
35178 4480094 4162051 3947450 3881089 3996921 4311489 4823277 5515073 6354921 7295925 8280568
35168 8280568 9251959 10164509 10982544 11663404 12134183 12277120 11936110 10948754 9196198
35159 9196198 6651031 3401826 -354828 -4348569 -8284296 -11897027 -15002090 -17524635
35151 -17524635 -19495761 -21019817 -22234493 -23284594 -24312874 -25453823 -26814529 -28441419
35143 -28441419 -30290227 -32222850 -34041809 -35549235 -36601646 -37136529 -37166916 -36758302 -36005183
35134 -36005183 -35013820 -33886889 -32705306 -31511496 -30304624 -29053656 -27722669 -26295295
35126 -26295295 -24786803 -23239519 -21705408 -20225813 -18820173 -17490460 -16238694 -15087330
35118 -15087330 -14090280 -13325400 -12867583 -12754483 -12966052 -13432598 -14066023 -14793637 -15577683
35109 -15577683 -16417644 -17338867 -18369043 -19507084 -20699260 -21839518 -22795786 -23445703 -23703297
35100 -23703297 -23531339 -22944664 -22008083 -20826511 -19525725 -18229064 -17039583 -16033464
35092 -16033464 -15261507 -14748970 -14486771 -14418132 -14434543 -14392617 -14149779 -13603469 -12715629 -11512693
35082 -11512693 -10064923 -8460471 -6791375 -5156698 -3670173 -2453259 -1607222 -1176910
35074 -1176910 -1124977 -1326601 -1584773 -1663599 -1335196 -428780 1134548 3332404 6055288
35065 6055288 9133752 12367807 15552167 18495192 21032075 23032475 24400616 25068121
35057 25068121 24989401 24155023 22625497 20562622 18224922 15914257 13895043 12324331
35049 12324331 11220438 10476027 9905881 9311456 8540701 7524558 6282895 4906190 3526580
35040 3526580 2291063 1343698 815549 815422 1416289 2640263 4449485 6746246 9380382
35031 9380382 12163185 14889454 17364622 19427109 20959911 21897230 22234616 22037937 21434423
35022 21434423 20575757 19584331 18509677 17320057 15937089 14298694 12419365 10416887
35014 10416887 8492744 6877177 5763899 5259948 5367678 6002152 7030791 8312498
35006 8312498 9719778 11143725 12491155 13679516 14630123 15263663 15506975 15314526 14694773
34997 14694773 13724647 12541749 11316661 10216519 9371944 8854198 8663439 8727285 8911903
34988 8911903 9048104 8967361 8533830 7661112 6316158 4520808 2352693 -66531 -2604727
34979 -2604727 -5161698 -7690757 -10180308 -12608180 -14904275 -16949988 -18613573 -19795683
34971 -19795683 -20456768 -20614786 -20321603 -19635385 -18601411 -17243128 -15559925 -13531210 -11130515
34962 -11130515 -8349016 -5218056 -1817763 1730665 5279837 8671072 11753952 14417729
34954 14417729 16627652 18444858 20013383 21518758 23138027 24999280 27158784 29596878
34946 29596878 32229186 34924119 37517167 39822364 41651240 42844135 43301890 42998737
34938 42998737 41969953 40285646 38027081 35274824 32109895 28624258 24932203 21172716
34930 21172716 17498450 14054961 10955960 8258473 5944637 3921700 2046993 169751
34922 169751 -1828343 -4007945 -6366806 -8854517 -11403500 -13963304 -16518905 -19082520
34914 -19082520 -21667540 -24264363 -26832333 -29309495 -31633082 -33759422 -35671036 -37365216
34906 -37365216 -38833016 -40048410 -40981053 -41625996 -42028525 -42285646 -42522217 -42853479 -43348416
34897 -43348416 -44004664 -44742274 -45420620 -45875775 -45966517 -45612455 -44811498 -43632336 -42185938
34888 -42185938 -40587327 -38923869 -37244023 -35568491 -33912267 -32303147 -30790310 -29444077
34880 -29444077 -28347608 -27579636 -27192355 -27195885 -27558369 -28218530 -29099005 -30113497 -31171002
34871 -31171002 -32182450 -33068242 -33761122 -34204386 -34352850 -34182079 -33700685 -32953103 -32005119
34862 -32005119 -30917839 -29725552 -28430366 -27014390 -25459397 -23762516 -21942548 -20037395
34854 -20037395 -18095285 -16164111 -14284813 -12492260 -10819207 -9294388 -7932577 -6726456
34846 -6726456 -5652499 -4691178 -3848001 -3160430 -2686643 -2483392 -2582954 -2975292 -3598126
34837 -3598126 -4338250 -5047443 -5570402 -5773470 -5562249 -4887012 -3744931 -2184258 -303479
34828 -303479 1763371 3871416 5886096 7694157 9209824 10380375 11184045 11612382 11645604
34819 11645604 11243695 10367611 9019348 7271985 5267709 3185397 1197422 -564888
34811 -564888 -2029431 -3185096 -4066052 -4718073 -5156584 -5337742 -5161600 -4508465 -3289886
34802 -3289886 -1489090 825981 3518256 6413106 9328573 12093350 14553016 16572003
34794 16572003 18038329 18874841 19056805 18628667 17705849 16451665 15037097 13606044 12262321
34785 12262321 11073366 10074144 9265117 8613977 8070119 7585277 7124392 6660260 6162519
34776 6162519 5596833 4938261 4186544 3366675 2510270 1630648 710235 -292338 -1423428
34767 -1423428 -2714933 -4166606 -5728245 -7288743 -8687600 -9756049 -10373474 -10512180
34759 -10512180 -10251285 -9758049 -9246821 -8928488 -8962428 -9421552 -10278548 -11418319 -12676252
34750 -12676252 -13891873 -14955978 -15828648 -16521876 -17062410 -17459344 -17691991 -17718600 -17497610
34741 -17497610 -17011423 -16283126 -15377362 -14380455 -13364301 -12350871 -11299396 -10127695 -8757288
34732 -8757288 -7157395 -5367626 -3494698 -1687921 -99815 1157660 2042995 2584289
34724 2584289 2847572 2892755 2739274 2352438 1649799 523713 -1121885 -3325236 -6026569
34715 -6026569 -9058619 -12183553 -15163117 -17822581 -20073200 -21889800 -23267903 -24186859
34707 -24186859 -24593029 -24409793 -23575583 -22094340 -20065385 -17667039 -15101927 -12539475
34699 -12539475 -10087186 -7797249 -5696084 -3820176 -2241864 -1069314 -413779 -336874
34691 -336874 -806830 -1689402 -2777544 -3841962 -4678606 -5138871 -5141025 -4666458 -3744026 -2427593
34681 -2427593 -776941 1147069 3271118 5492452 7673186 9657523 11309918 12557468
34673 12557468 13412506 13958850 14306516 14540689 14694392 14757230 14709180 14556368 14349238 14175220
34663 14175220 14129488 14276053 14615224 15070756 15502051 15738241 15624500 15066348 14055979
34654 14055979 12670624 11046227 9340981 7703222 6249842 5054692 4145439 3507308
34646 3507308 3090239 2815893 2584418 2283344 1799728 1034590 -81832 -1577036 -3431144
34637 -3431144 -5583813 -7950210 -10439388 -12973071 -15506042 -18041166 -20622754 -23300901
34629 -23300901 -26083946 -28909769 -31652109 -34150968 -36242938 -37776091 -38611695 -38627947
34621 -38627947 -37741958 -35952507 -33383434 -30295034 -27044856 -24011048 -21512524 -19754545
34613 -19754545 -18808275 -18619143 -19036322 -19855915 -20868481 -21900299 -22838985 -23636974 -24292066
34604 -24292066 -24813872 -25193317 -25390786 -25347015 -25008890 -24356862 -23420487 -22271908 -20997077
34595 -20997077 -19659750 -18281170 -16848186 -15341110 -13759828 -12131897 -10500894 -8904378
34587 -8904378 -7355335 -5839616 -4332215 -2819251 -1303861 213823 1768192 3444044
34579 3444044 5361232 7635244 10334711 13455152 16917828 20589715 24310470 27911633
34571 27911633 31224802 34088637 36364833 37960964 38848007 39062112 38689460 37841425 36632359
34562 36632359 35171313 33567936 31937221 30385304 28977101 27708999 26511745 25288003
34554 25288003 23966031 22542094 21090512 19735962 18602944 17770512 17254036 17014548
34546 17014548 16981281 17075620 17232633 17415413 17613847 17826633 18038264 18205429 18257342 18106481
34536 18106481 17667039 16879601 15735458 14289255 12651593 10961454 9346243 7883503
34528 7883503 6580015 5375385 4161997 2807544 1177582 -832383 -3253325 -6007036
34520 -6007036 -8905927 -11696905 -14129091 -16012713 -17248163 -17826388 -17816744 -17357374 -16648884
34511 -16648884 -15937395 -15473577 -15453342 -15966833 -16983685 -18381003 -19996121 -21678640 -23324660
34502 -23324660 -24886970 -26361876 -27760994 -29084393 -30309909 -31399845 -32313889 -33019576
34494 -33019576 -33501676 -33773252 -33882879 -33908899 -33939406 -34045603 -34257946 -34552983 -34857632 -35071200
34484 -35071200 -35093387 -34842480 -34260095 -33312787 -31997526 -30343802 -28402589 -26226391 -23854990
34475 -23854990 -21314422 -18623625 -15801065 -12871051 -9872637 -6868153 -3942497 -1187056
34467 -1187056 1326998 3571340 5564852 7357167 9001032 10524917 11911474 13085831
34459 13085831 13921345 14267722 13993778 13027637 11381179 9154974 6523316 3701264 904831
34450 904831 -1677060 -3890038 -5612754 -6763920 -7319218 -7322349 -6877628 -6127936 -5230807
34441 -5230807 -4339948 -3590340 -3082507 -2866754 -2935087 -3229524 -3666318 -4163035 -4653834 -5091532
34431 -5091532 -5447949 -5720984 -5943159 -6180315 -6516758 -7032500 -7780095 -8767019 -9950328
34422 -9950328 -11249525 -12575470 -13862956 -15091456 -16284494 -17487766 -18735253 -20019357
34414 -20019357 -21280890 -22424274 -23348716 -23979225 -24286114 -24289654 -24050526 -23648832 -23159144
34405 -23159144 -22632303 -22089275 -21522422 -20896929 -20153154 -19216687 -18016759 -16502691 -14648911
34396 -14648911 -12453368 -9944457 -7202585 -4381269 -1701626 593077 2308048 3357792
34388 3357792 3785547 3733232 3379267 2873284 2292872 1636413 852793 -105878 -1234994
34379 -1234994 -2459196 -3658120 -4725314 -5629901 -6445277 -7323409 -8424123 -9838793 -11552399
34370 -11552399 -13459895 -15416837 -17291472 -18998995 -20514675 -21866181 -23106483 -24277867
34362 -24277867 -25385565 -26392693 -27232697 -27829100 -28117961 -28072069 -27720212 -27149765 -26486373
34353 -26486373 -25857241 -25353287 -25005256 -24781856 -24608343 -24395812 -24068394 -23578253 -22903901
34344 -22903901 -22034499 -20950648 -19616103 -17988162 -16039920 -13778730 -11251290 -8538518
34336 -8538518 -5747652 -3002950 -432439 1846958 3738202 5163144 6057369 6369042
34328 6369042 6063732 5131683 3595754 1521090 -975544 -3724882 -6520790 -9153134
34320 -9153134 -11450460 -13319801 -14767968 -15890543 -16827965 -17708889 -18611730 -19562972 -20565020
34311 -20565020 -21629135 -22791366 -24103006 -25600843 -27272478 -29036199 -30748154 -32233196
34303 -32233196 -33322244 -33880061 -33819193 -33104260 -31749746 -29811082 -27370525 -24523305 -21369257
34294 -21369257 -18010172 -14549892 -11095021 -7755280 -4640988 -1854496 523135 2443109
34286 2443109 3891383 4884304 5464168 5697694 5673601 5494632 5263937 5068573 4962807
34277 4962807 4955261 5005978 5036634 4950074 4652572 4076501 3203462 2081974 827527 -402640
34267 -402640 -1453810 -2220000 -2674173 -2870803 -2918909 -2934525 -2990073 -3079440 -3112060 -2941285
34257 -2941285 -2421680 -1475252 -134985 1459834 3114994 4649229 5942075 6945205
34249 6945205 7667000 8150937 8460297 8667433 8839696 9020194 9212898 9386225 9499952
34240 9499952 9542334 9552492 9609115 9787672 10109637 10513956 10868832 11017764 10832944 10246370
34230 10246370 9248376 7869198 6167887 4236559 2205367 229875 -1539538 -2987818
34222 -2987818 -4046421 -4684201 -4894722 -4700323 -4177725 -3485164 -2858004 -2555774 -2779958
34213 -2779958 -3606328 -4965116 -6669775 -8472858 -10129008 -11453846 -12366452 -12897889 -13155479
34204 -13155479 -13254740 -13251285 -13106651 -12703883 -11902312 -10601624 -8782986 -6511404 -3908046
34195 -3908046 -1117237 1710891 4419346 6838166 8788443 10102161 10653509 10392370
34187 10392370 9368775 7736569 5729625 3616244 1649774 34656 -1085133 -1623376
34179 -1623376 -1547602 -878502 313423 1921252 3822313 5894622 8020515 10080792 11950767
34170 11950767 13507162 14646132 15305295 15479552 15223143 14638013 13855199 13014035 12237391
34161 12237391 11602468 11118343 10726899 10330204 9827241 9139875 8224327 7078515 5751168
34152 5751168 4344948 3001868 1870243 1066918 653594 637685 992073 1675878 2640373
34143 2640373 3819217 5117588 6416892 7599071 8578736 9325878 9869809 10286862 10679038
34134 10679038 11147943 11767453 12562477 13501819 14505033 15455776 16218055 16659906 16686021
34125 16686021 16267488 15451399 14344327 13078806 11776236 10515619 9314932 8131718
34117 8131718 6885815 5499262 3939886 2249400 538956 -1049240 -2392884 -3421925
34109 -3421925 -4117698 -4492366 -4573874 -4407904 -4066765 -3647832 -3254577 -2969294 -2833568 -2845118
34099 -2845118 -2965881 -3131656 -3262494 -3281453 -3141337 -2842364 -2422547 -1924792 -1367219 -739628
34089 -739628 -22966 790509 1692487 2665382 3687582 4733508 5777540 6809231 7851911
34080 7851911 8965723 10223401 11668017 13278184 14963174 16590381 18026799 19170647
34072 19170647 19961756 20376410 20419264 20118963 19525076 18701095 17711379 16605248 15405939
34063 15405939 14112514 12715751 11218825 9651025 8070986 6563237 5228420 4162051
34055 4162051 3423619 3012862 2872393 2917304 3071206 3286170 3540837 3827795 4144236 4491280
34045 4491280 4877814 5321547 5843091 6453605 7140027 7854124 8512576 9012154 9255267
34036 9255267 9173787 8741085 7971780 6914383 5639804 4226347 2746039 1260828 -168761
34027 -168761 -1472063 -2568183 -3383269 -3876692 -4059187 -3989646 -3751133 -3421359 -3055778
34018 -3055778 -2688754 -2342273 -2029083 -1749450 -1491638 -1242446 -1001875 -790615 -645734
34009 -645734 -609685 -721333 -1014989 -1528108 -2311162 -3426417 -4924138 -6800846 -8964839
34000 -8964839 -11237313 -13394796 -15228566 -16587747 -17391206 -17618417 -17298773 -16510446 -15386589
33991 -15386589 -14117254 -12932327 -12056713 -11645978 -11729305 -12190823 -12803254 -13301288 -13464239
33982 -13464239 -13176658 -12448387 -11393686 -10184332 -8997678 -7977031 -7212830 -6743799 -6568880
33973 -6568880 -6656901 -6946839 -7345094 -7733583 -7993348 -8032242 -7801140 -7294361 -6540120 -5584719
33963 -5584719 -4469885 -3208688 -1775250 -119672 1798639 3980275 6374466 8887701
33955 8887701 11401161 13786279 15915590 17672472 18962861 19726665 19944034 19636286 18865867
33946 18865867 17734929 16372330 14900905 13395207 11856199 10223374 8419589 6402504
33938 6402504 4195199 1884356 -405730 -2543746 -4410511 -5905976 -6955542 -7524092
33930 -7524092 -7632017 -7359615 -6833287 -6199566 -5598375 -5142643 -4904454 -4904737 -5106244 -5415694
33920 -5415694 -5702364 -5831039 -5693100 -5217818 -4362518 -3099674 -1419157 655090 3052036
33911 3052036 5660160 8352982 11019338 13583946 16011722 18295924 20433889 22399427
33903 22399427 24127002 25521115 26490068 26986699 27035516 26737753 26258393 25800874 25571421
33894 25571421 25737247 26390345 27530853 29076375 30892823 32834527 34778175 36637902
33886 36637902 38359787 39908336 41262458 42426563 43443658 44389982 45343161 46337960
33878 46337960 47336778 48235152 48900576 49222183 49144420 48670740 47841836 46703338 45277154
33869 45277154 43545158 41450217 38917136 35890911 32380755 28490444 24416347 20407193
33861 20407193 16699278 13455059 10731106 8484042 6603851 4956851 3426113 1943710
33853 1943710 508300 -820816 -1955396 -2822932 -3401523 -3726760 -3868127 -3888087 -3805024
33844 -3805024 -3578973 -3126845 -2356605 -1199122 378807 2380374 4789279 7569504 10650282
33835 10650282 13906638 17152922 20161209 22701787 24589760 25719271 26074572 25717954
33827 25717954 24762583 23342361 21590236 19630118 17578855 15549858 13651959 11983154
33819 11983154 10624616 9642257 9097784 9059934 9599492 10760344 12519035 14757226 17263743
33810 17263743 19766195 21982624 23681604 24734752 25141354 25013700 24532473 23895071 23273692
33801 23273692 22786473 22481346 22336645 22280892 22224239 22087968 21822742 21414149 20877377 20243303
33791 20243303 19539934 18775239 17927555 16948753 15782819 14395164 12797837 11053761 9256071
33782 9256071 7496720 5844157 4339424 3006254 1865769 948909 302699 -11603 73009
33773 73009 618732 1673586 3262388 5375443 7954992 10882328 13969926 16964804 19571794
33764 19571794 21501716 22536208 22586408 21721188 20154643 18199634 16201738 14467960
33756 14467960 13205713 12489641 12267375 12398087 12702408 13001824 13138696 12982266 12432990
33747 12432990 11435535 10001008 8225428 6284320 4392963 2743797 1448755 511790
33739 511790 -159522 -710860 -1283063 -1959055 -2734256 -3521475 -4187749 -4606630 -4702282 -4466569
33729 -4466569 -3946116 -3212685 -2334794 -1359885 -307600 825079 2044220 3331642 4630244
33720 4630244 5859437 6954035 7898463 8732989 9533109 10379175 11328396 12390156 13506460
33711 13506460 14549205 15346915 15737536 15623693 15001455 13949303 12587948 11035393 9377987
33702 9377987 7664473 5918217 4157972 2417056 751755 -767348 -2081420 -3178476
33694 -3178476 -4121438 -5051509 -6158379 -7625528 -9572581 -12017833 -14873913 -17976749
33686 -17976749 -21136717 -24191770 -27039392 -29634609 -31961409 -33998953 -35701442 -36998674
33678 -36998674 -37815352 -38102161 -37864947 -37174894 -36152046 -34932599 -33639106 -32364139 -31165185
33669 -31165185 -30065435 -29058758 -28117627 -27201423 -26266033 -25279828 -24245526 -23214886 -22280239
33660 -22280239 -21540720 -21058578 -20826581 -20760539 -20720825 -20557577 -20165041 -19523995 -18713959 -17888636
33650 -17888636 -17222698 -16849650 -16816171 -17073449 -17507320 -17985644 -18392630 -18635921 -18638457 -18337438
33640 -18337438 -17697393 -16721945 -15444795 -13899465 -12089491 -9983662 -7543414 -4768241
33632 -4768241 -1735532 1385135 4352993 6908347 8836708 10016595 10430666 10142131
33624 10142131 9257356 7895905 6175042 4204873 2091933 -46297 -2059343 -3751911
33616 -3751911 -4904636 -5331996 -4952046 -3827123 -2149909 -184023 1806205 3604517
33608 3604517 5059943 6082378 6630794 6701949 6321556 5538578 4422755 3062520 1557289
33599 1557289 12 -1546111 -3063858 -4577590 -6126060 -7726652 -9352366 -10933414
33591 -10933414 -12377430 -13592144 -14499267 -15040763 -15185355 -14939209 -14356509 -13541485 -12636783
33582 -12636783 -11800341 -11179209 -10889604 -11006542 -11557798 -12514254 -13777756 -15180976 -16514551
33573 -16514551 -17578571 -18233810 -18426458 -18180630 -17573543 -16709432 -15696126 -14622304 -13539284
33564 -13539284 -12456292 -11352625 -10199841 -8982759 -7711699 -6424838 -5184567 -4073095
33556 -4073095 -3189134 -2641557 -2534162 -2941361 -3882029 -5300738 -7063034 -8970339 -10798739
33547 -10798739 -12356416 -13537811 -14344780 -14860918 -15196596 -15441653 -15651550 -15863195 -16117436
33538 -16117436 -16470265 -16990302 -17747239 -18793891 -20145148 -21762566 -23553152 -25381626
33530 -25381626 -27088352 -28508927 -29497981 -29956874 -29854937 -29230880 -28171335 -26778573 -25146324
33521 -25146324 -23356065 -21490815 -19650191 -17949997 -16502721 -15390780 -14648821 -14263287
33513 -14263287 -14186273 -14354749 -14707467 -15196868 -15797142 -16508093 -17349734 -18343674 -19488044
33504 -19488044 -20742424 -22034151 -23280676 -24411559 -25378463 -26153359 -26721221 -27072314 -27197159
33495 -27197159 -27086696 -26739229 -26172916 -25438422 -24622474 -23833517 -23169907 -22685729 -22375858
33486 -22375858 -22190960 -22072237 -21983749 -21926521 -21934240 -22059327 -22356060 -22863116 -23589125 -24507117
33476 -24507117 -25559143 -26664486 -27726346 -28642341 -29326350 -29734555 -29875175 -29791989 -29536821
33467 -29536821 -29154276 -28683317 -28161258 -27619978 -27080779 -26557948 -26069975 -25648857 -25340469
33458 -25340469 -25193918 -25240239 -25465672 -25792986 -26085797 -26179722 -25928361 -25243903 -24115800
33449 -24115800 -22603042 -20809291 -18857486 -16875183 -14987831 -13308142 -11915356 -10832930
33441 -10832930 -10021206 -9393925 -8850722 -8307289 -7709664 -7032773 -6272414 -5438645 -4552809
33432 -4552809 -3646550 -2759329 -1929755 -1179351 -495815 171539 897063 1749672 2761460
33423 2761460 3905043 5087444 6165252 6978915 7393931 7332004 6781626 5789612 4443232
33414 4443232 2852951 1140073 -573398 -2178400 -3597229 -4800042 -5809172 -6686205
33406 -6686205 -7506573 -8332854 -9196717 -10091844 -10973770 -11764551 -12367572 -12697119 -12713490 -12441974
33396 -12441974 -11961973 -11375507 -10777074 -10237390 -9797926 -9470371 -9241067 -9080639 -8953014
33387 -8953014 -8818803 -8637818 -8380339 -8046689 -7679674 -7353291 -7138442 -7066014 -7110011 -7197018
33377 -7197018 -7231166 -7120778 -6800138 -6242605 -5458669 -4476616 -3317931 -1988694 -497404
33368 -497404 1113884 2752302 4289459 5603651 6621775 7332620 7765647 7957652 7936931
33359 7936931 7733039 7394441 6993763 6619137 6363797 6319772 6568762 7163096 8102362 9320758
33349 9320758 10695461 12072607 13298085 14242501 14818107 14989300 14775064 14239825 13475083
33340 13475083 12581100 11656252 10793115 10075164 9570177 9320608 9333519 9573695 9962949
33331 9962949 10384940 10693199 10725008 10328800 9404761 7941503 6025723 3816814 1499094
33322 1499094 -768135 -2887353 -4836330 -6653003 -8396951 -10105976 -11769140 -13326104
33314 -13326104 -14687509 -15762538 -16479691 -16793127 -16678256 -16129223 -15167536 -13856396 -12304472
33305 -12304472 -10648516 -9020688 -7517153 -6181166 -5003290 -3934351 -2906552 -1859575
33297 -1859575 -766180 352925 1434861 2401729 3197115 3814011 4301017 4743821 5227241
33288 5227241 5788444 6376815 6839615 6948777 6467987 5235526 3223571 543906 -2599899
33279 -2599899 -5985333 -9434265 -12846802 -16203458 -19542592 -22923816 -26390084 -29938723
33271 -29938723 -33504895 -36957370 -40109695 -42750502 -44686860 -45783395 -45982375 -45304367
33263 -45304367 -43838334 -41726149 -39140580 -36259820 -33249400 -30260272 -27438297 -24929805
33255 -24929805 -22871964 -21371685 -20487585 -20225911 -20547671 -21375204 -22591322 -24037086 -25519868
33246 -25519868 -26835664 -27797551 -28258593 -28123630 -27351274 -25948409 -23957278 -21436191 -18440014
33237 -18440014 -15010964 -11187874 -7032584 -2660991 1739004 5916021 9591487 12511191
33229 12511191 14491521 15443550 15372675 14366705 12587437 10267129 7695948 5186616
33221 5186616 3020056 1393506 393319 -599 112843 593651 1297849 2103895 2918870
33212 2918870 3663237 4248271 4568485 4522327 4054411 3197216 2088413 950368 35608
33203 35608 -440843 -355029 304120 1445380 2909146 4514600 6107691 7592346 8931818
33194 8931818 10126207 11188066 12132284 12975753 13732574 14402092 14963195 15387662 15666952
33185 15666952 15829829 15931329 16017073 16090377 16109243 16013678 15757643 15321664 14708042 13938152
33175 13938152 13060319 12154220 11314864 10621065 10112741 9793934 9652630 9674248 9838287
33166 9838287 10109937 10443026 10793721 11128428 11414807 11604767 11629476 11416644 10920497 10143212
33156 10143212 9131808 7951730 6654227 5257429 3749919 2112194 346527 -1493525
33148 -1493525 -3285552 -4848101 -5985328 -6552822 -6514100 -5960853 -5088110 -4132815 -3295614
33139 -3295614 -2675428 -2248796 -1908097 -1536961 -1075052 -533495 39702 611387 1195842
33130 1195842 1853260 2661517 3677839 4906519 6286491 7707370 9050389 10235947
33122 10235947 11253420 12157877 13036736 13965166 14972931 16036134 17091661 18060719 18867357
33113 18867357 19446247 19743222 19715690 19337482 18607582 17558912 16263254 14828854 13386462
33104 13386462 12061727 10941629 10052959 9367376 8828614 8382600 7996411 7667057 7424441
33095 7424441 7323943 7422882 7748336 8274360 8919766 9561875 10054719 10244781 9984728 9150421
33085 9150421 7666467 5537778 2871339 -132370 -3223472 -6161822 -8757736 -10873417
33077 -10873417 -12392298 -13186259 -13111512 -12041712 -9918796 -6791776 -2828096 1697601
33069 1697601 6427500 10956365 14881389 17858709 19648338 20131606 19299845 17228283
33061 17228283 14053372 9962074 5186002 -12892 -5368100 -10633811 -15596749 -20076349
33053 -20076349 -23926590 -27046732 -29392557 -30974017 -31836541 -32038757 -31642019 -30713540 -29330333
33044 -29330333 -27572363 -25509309 -23196840 -20690235 -18064673 -15424470 -12894976 -10605520
33036 -10605520 -8673493 -7190162 -6202812 -5693586 -5566243 -5655020 -5758850 -5687999 -5303555
33027 -5303555 -4538664 -3403675 -1981910 -417839 1104567 2392772 3279649 3652047 3467867
33018 3467867 2760245 1630587 231213 -1264038 -2698796 -3968722 -5032327 -5892397
33010 -5892397 -6565076 -7060598 -7383494 -7541340 -7550111 -7435302 -7232441 -6984582 -6731251 -6491233
33000 -6491233 -6251851 -5977098 -5634523 -5226560 -4807678 -4476875 -4348571 -4513961 -5005948
32991 -5005948 -5777886 -6703189 -7598971 -8269884 -8560436 -8399218 -7819525 -6948289 -5967542
32982 -5967542 -5064658 -4392054 -4049900 -4090571 -4531400 -5361626 -6540897 -7999091 -9647658
32973 -9647658 -11400437 -13191663 -14982085 -16753780 -18496648 -20186217 -21756754 -23086062
32965 -23086062 -24010039 -24365993 -24040615 -22996348 -21270174 -18959565 -16213048 -13228756
32957 -13228756 -10249546 -7541109 -5352130 -3870916 -3196211 -3328264 -4173190 -5553741
32949 -5553741 -7230049 -8938815 -10448951 -11614348 -12398341 -12858783 -13107157 -13267770 -13452717
32940 -13452717 -13748384 -14202748 -14814385 -15534739 -16288779 -17002660 -17619796 -18095952 -18380321
32931 -18380321 -18399986 -18062793 -17279554 -15992003 -14190850 -11919873 -9272060 -6381696 -3410077
32922 -3410077 -524700 2120880 4399453 6214765 7501238 8219192 8347346 7880705 6841434
32913 6841434 5299035 3385717 1293880 -749176 -2525720 -3879022 -4751242 -5188383
32905 -5188383 -5308868 -5252141 -5131635 -5010056 -4903031 -4805618 -4725743 -4703446 -4802425 -5079007
32895 -5079007 -5550216 -6183209 -6912226 -7668340 -8398720 -9063825 -9623179 -10031859 -10258778
32886 -10258778 -10315089 -10268497 -10226715 -10292502 -10510385 -10833574 -11133937 -11256489 -11092081 -10628475
32876 -10628475 -9954377 -9222643 -8600882 -8234559 -8229311 -8645981 -9501183 -10769592 -12383940
32867 -12383940 -14229551 -16138596 -17898291 -19282861 -20100315 -20230763 -19639213 -18365910
32859 -18365910 -16509659 -14214305 -11657487 -9037197 -6555075 -4397113 -2712007 -1589956
32851 -1589956 -1049769 -1041879 -1467600 -2207385 -3148288 -4201931 -5307046 -6417952 -7489394
32842 -7489394 -8469385 -9301487 -9928505 -10293000 -10339862 -10026570 -9337068 -8290360 -6940661
32833 -6940661 -5370662 -3676729 -1945531 -233223 1434056 3033431 4512160 5775200
32825 5775200 6701642 7176108 7117635 6498082 5347753 3745713 1797194 -389147 -2709300
32816 -2709300 -5055760 -7308267 -9340791 -11047911 -12376428 -13341216 -14011490 -14469792 -14763322
32807 -14763322 -14875074 -14732779 -14250306 -13376664 -12128098 -10595858 -8936966 -7355035 -6069946
32798 -6069946 -5274444 -5086492 -5517448 -6473964 -7793745 -9294172 -10806849 -12187262 -13312552
32789 -13312552 -14087712 -14464702 -14459340 -14149839 -13656913 -13118067 -12666353 -12414378 -12440066 -12772998
32779 -12772998 -13383242 -14176619 -15002173 -15677220 -16028850 -15939331 -15375242 -14385734 -13073443
32770 -13073443 -11559731 -9967671 -8427556 -7085732 -6090483 -5547349 -5466281 -5738716 -6168094
32761 -6168094 -6542271 -6709304 -6620840 -6332855 -5974861 -5701548 -5636814 -5824749 -6209024 -6654238
32751 -6654238 -7000520 -7126256 -6994641 -6670405 -6302272 -6075507 -6149702 -6603863 -7407871 -8429786
32741 -8429786 -9478171 -10366978 -10978624 -11298226 -11406500 -11441143 -11548387 -11842069 -12377726
32732 -12377726 -13144194 -14073159 -15062050 -15998818 -16776700 -17296779 -17468928 -17225056 -16547285
32723 -16547285 -15496744 -14221115 -12927398 -11824082 -11054325 -10651183 -10539949 -10587576 -10667890
32714 -10667890 -10701094 -10650287 -10493936 -10206299 -9759788 -9140475 -8363196 -7479966 -6577882 -5761246
32704 -5761246 -5119997 -4700596 -4497758 -4468649 -4553127 -4684596 -4791467 -4798486 -4631734 -4223138
32694 -4223138 -3512052 -2448110 -999807 833608 3014612 5470219 8105440 10822544
32686 10822544 13538969 16198525 18775198 21271057 23706811 26101546 28444639 30673566
32678 30673566 32673867 34306520 35452303 36053313 36133321 35789768 35165572 34417738 33693537
32669 33693537 33111026 32736247 32559687 32485262 32342930 31925441 31041439 29571856 27511274
32660 27511274 24976376 22176387 19359007 16755327 14543757 12841917 11721842 11231806
32652 11231806 11405748 12253756 13743592 15787208 18237079 20890046 23499178 25798599
32644 25798599 27543263 28557668 28780437 28287219 27276260 26014424 24761710 23703205
32636 23703205 22910517 22339593 21861473 21316748 20576920 19590311 18395345 17099027 15833436
32627 15833436 14710131 13790530 13079741 12536646 12086007 11627405 11051263 10272921 9275854
32618 9275854 8134932 6994538 6005124 5250984 4707864 4250375 3703274 2913396 1812935
32609 1812935 446923 -1050138 -2520631 -3862553 -5083702 -6308263 -7733972 -9555281
32601 -9555281 -11881645 -14688058 -17824425 -21076600 -24238682 -27155113 -29722575 -31872051
32593 -31872051 -33554339 -34736079 -35401858 -35558112 -35236568 -34493567 -33401872 -32036552 -30461221
32584 -30461221 -28720705 -26842684 -24846654 -22754866 -20598377 -18414414 -16237703 -14092290
32576 -14092290 -11989096 -9930468 -7920030 -5974387 -4131821 -2452620 -1008319 136726
32568 136726 941317 1389132 1473558 1178787 478260 -640279 -2137203 -3897489 -5737763
32559 -5737763 -7440076 -8796813 -9651921 -9928660 -9638973 -8876457 -7800609 -6617686 -5554741
32550 -5554741 -4821366 -4564284 -4832134 -5566534 -6621277 -7798181 -8886097 -9696285 -10093473
32541 -10093473 -10021197 -9514002 -8685845 -7691559 -6674171 -5722269 -4856229 -4043001 -3222416
32532 -3222416 -2327015 -1291214 -60023 1391726 3032720 4758664 6402618 7772546
32524 7772546 8701072 9090300 8941051 8360403 7544105 6737396 6186222 6091465 6572513 7643711
32514 7643711 9210174 11087638 13040402 14824543 16228960 17113684 17438909 17267313 16728113
32505 16728113 15956303 15040417 14005271 12830314 11483643 9949670 8238535 6377218
32497 6377218 4391785 2294729 86993 -2227513 -4626025 -7057555 -9438496 -11650367
32489 -11650367 -13546466 -14979390 -15848448 -16144163 -15960472 -15463702 -14835009 -14216174 -13680837
32480 -13680837 -13235367 -12839744 -12434544 -11964221 -11393193 -10714633 -9951685 -9151275 -8373343
32471 -8373343 -7679169 -7119953 -6725654 -6497078 -6404867 -6392715 -6377547 -6247278 -5869327 -5120929
32461 -5120929 -3933069 -2324923 -411072 1620004 3547470 5167843 6337073 6988128
32453 6988128 7118612 6761061 5955559 4736017 3131897 1184377 -1027524 -3364826 -5628526
$$ [...]
##END NTUPLES=NMR SPECTRUM
##END=
