##TITLE=31Pdec_DE-22_oil
 CDCl3
  64 sc
 3.11.2023
##JCAMPDX= 6.0         $$ Bruker NMR JCAMP-DX V2.0
##DATA TYPE= NMR SPECTRUM
##DATA CLASS= NTUPLES
##ORIGIN= UXNMR, Bruker Analytische Messtechnik GmbH
##OWNER= root
$$ XWIN-NMR		Version 3.5
$$ Fri Nov  3 14:53:52 2023 Russian Standard Time (UT+4h)  she@DPX200
##.OBSERVE FREQUENCY= 81.013821
##.OBSERVE NUCLEUS= ^31P
##.ACQUISITION MODE= SIMULTANEOUS
##.ACQUISITION SCHEME= undefined
##.AVERAGES= 64
##.DIGITISER RES= 16
##SPECTROMETER/DATA SYSTEM= spect
##.PULSE SEQUENCE= zgpg30
##.SOLVENT NAME= CDCl3
##.SHIFT REFERENCE= (INTERNAL, CDCl3, 0, 248.564)
##AUDIT TRAIL= $$ (NUMBER, WHEN, WHO, WHERE, WHAT)
$$ ##TITLE= Audit trail, XWIN-NMR		Version 3.5
$$ ##JCAMPDX= 5.01
$$ ##ORIGIN= Bruker BioSpin GmbH
$$ ##OWNER= she
$$ F:/spectra/data/she/nmr/P31/1/pdata/1/auditp.txt
$$ ##AUDIT TRAIL=  $$ (NUMBER, WHEN, WHO, WHERE, WHAT)
(   1,<2023-11-03 14:51:54.25 +0400>,<she>,<DPX200>,
      <continue with go, POWCHK disabled, PULCHK disabled
       configuration hash MD5:
       00 E9 B6 7A A2 85 ED C7 34 08 36 98 17 FE 4E 26
       data hash MD5: 32K
       4C 4C FE 46 44 D2 74 91 96 75 9B DB F8 97 C8 59>)
(   2,<2023-11-03 14:51:57.10 +0400>,<she>,<DPX200>,
      <Start of raw data processing
       efp BC_mod = 2 LB = 5 FT_mod = 6 PKNL = 1 PHC0 = -10839.34 PHC1 = 666.0902 SI = 64K 
       data hash MD5: 64K
       3D 6D CF 20 EF 29 AD 61 8A EF A0 A0 23 F8 57 64>)
(   3,<2023-11-03 14:52:27.39 +0400>,<she>,<DPX200>,
      <pk PHC0 = 191.9093 PHC1 = -370 
       data hash MD5: 64K
       1A C3 50 F1 08 B8 B8 A4 C5 28 C9 61 FF 0E 98 0E>)
(   4,<2023-11-03 14:52:32.39 +0400>,<she>,<DPX200>,
      <abs ABSG = 5 
       data hash MD5: 64K
       48 18 21 02 18 73 24 16 E7 B2 FA 6D 79 8A 40 D3>)
$$ ##END=
$$ 
$$ hash MD5
$$ 6D D6 02 12 D1 07 EC 12 6E E6 2B D9 3C 3D F9 D8
##$RELAX= 
##$RELAX= 
##$RELAX= 
##$RELAX= 
##$RELAX= 
##$RELAX= 
##$RELAX= 
##$RELAX= 
##$RELAX= 
$$ Bruker specific parameters
$$ --------------------------
##$DU= <F:/spectra>
##$EXPNO= 1
##$NAME= <P31>
##$PROCNO= 1
##$TYPE= <nmr>
##$USER= <she>
##$AMP= (0..31)
100 100 100 100 100 100 100 100 100 100 100 100 100 100 100 100 100 100 
100 100 100 100 100 100 100 100 100 100 100 100 100 100 
##$AQSEQ= 0
##$AQ_mod= 1
##$AUNM= <au_zg>
##$AUTOPOS= <>
##$BF1= 81.014009
##$BF2= 200.13
##$BF3= 200.13
##$BF4= 200.13
##$BF5= 200.13
##$BF6= 200.13
##$BF7= 200.13
##$BF8= 200.13
##$BYTORDA= 1
##$CFDGTYP= 0
##$CFRGTYP= 5
##$CHEMSTR= <none>
##$CNST= (0..31)
1 1 145 1 1 1 1 1 1 1 1 1 1 1 1 1 1 1 1 1 1 1 1 1 1 1 1 1 1 1 1 1 
##$CPDPRG= <waltz16>
##$CPDPRG1= <>
##$CPDPRG2= <waltz16>
##$CPDPRG3= <>
##$CPDPRG4= <mlev>
##$CPDPRG5= <mlev>
##$CPDPRG6= <mlev>
##$CPDPRG7= <mlev>
##$CPDPRG8= <mlev>
##$CPDPRGB= <>
##$CPDPRGT= <>
##$D= (0..31)
0 1 0 0 0 0 0 0 0 0 0 0.03 2e-05 3e-06 0 0 0 0 0 0 0 0 0 0 0 0 0 0 0 0 
0 0 
##$DATE= 1699008636
##$DBL= (0..7)
120 120 120 11 120 120 24 19 
##$DBP= (0..7)
150 150 150 150 150 150 150 150 
##$DBP07= 0
##$DBPNAM0= <>
##$DBPNAM1= <>
$$ [...]
##$SUBNAM3= <"">
##$SUBNAM4= <"">
##$SUBNAM5= <"">
##$SUBNAM6= <"">
##$SUBNAM7= <"">
##$SUBNAM8= <"">
##$SUBNAM9= <"">
##$SW= 501.771253377433
##$SWIBOX= (0..15)
0 1 3 0 0 0 0 0 0 0 0 0 0 0 0 0 
##$SW_h= 40650.406504065
##$TD= 32768
##$TD0= 1
##$TE= 0
##$TE2= 300
##$TE3= 300
##$TEG= 300
##$TL= (0..7)
0 120 53 12 22 120 120 120 
##$TP= (0..7)
150 150 150 150 150 150 150 150 
##$TP07= 0
##$TPNAME0= <>
##$TPNAME1= <>
##$TPNAME2= <>
##$TPNAME3= <>
##$TPNAME4= <>
##$TPNAME5= <>
##$TPNAME6= <>
##$TPNAME7= <>
##$TPOAL= (0..7)
0.5 0.5 0.5 0.5 0.5 0.5 0.5 0.5 
##$TPOFFS= (0..7)
0 0 0 0 0 0 0 0 
##$TUNHIN= 0
##$TUNHOUT= 0
##$TUNXOUT= 0
##$USERA1= <user>
##$USERA2= <user>
##$USERA3= <user>
##$USERA4= <user>
##$USERA5= <user>
##$V9= 5
##$VALIST= <valist>
##$VCLIST= <CCCCCCCCCCCCCCC>
##$VD= 0
##$VDLIST= <DDDDDDDDDDDDDDD>
##$VPLIST= <PPPPPPPPPPPPPPP>
##$VTLIST= <TTTTTTTTTTTTTTT>
##$WBST= 1024
##$WBSW= 4
##$XGAIN= (0..3)
0 0 0 0 
##$XL= 0
##$YL= 0
##$YMAX_a= 131
##$YMIN_a= -935
##$ZGOPTNS= <>
##$ZL1= 120
##$ZL2= 120
##$ZL3= 120
##$ZL4= 120
##$ABSF1= 248.5645
##$ABSF2= -253.2056
##$ABSG= 5
##$ABSL= 3
##$ALPHA= 0
##$AQORDER= 0
##$ASSFAC= 0
##$ASSFACI= 0
##$ASSFACX= 0
##$ASSWID= 0
##$AUNMP= <proc_1d>
##$AZFE= 0.1
##$AZFW= 0.5
##$BCFW= 0
##$BC_mod= 2
##$BYTORDP= 0
##$COROFFS= 0
##$CY= -3
##$DATMOD= 1
##$DC= 0
##$DFILT= <>
##$DTYPP= 0
##$F1P= 0
##$F2P= 0
##$FCOR= 1
##$FTSIZE= 65536
##$FT_mod= 6
##$GAMMA= 0
##$GB= 0
##$INTBC= 1
##$INTSCL= 6.047779e-11
##$ISEN= 30
##$LB= 5
##$LEV0= 0
##$LPBIN= 0
##$MAXI= 10000
##$MC2= 0
##$MEAN= 0
##$ME_mod= 0
##$MI= 50
##$NCOEF= 0
##$NC_proc= -15
##$NLEV= 6
##$NOISF1= 182.463
##$NOISF2= 159.3651
##$NSP= 0
##$NTH_PI= 0
##$NZP= 0
##$OFFSET= 248.5645
##$PC= 4
##$PHC0= -10647.43
##$PHC1= 296.0902
##$PH_mod= 1
##$PKNL= yes
##$PPARMOD= 0
##$PSCAL= 0
##$PSIGN= 0
##$REVERSE= no
##$SF= 81.0140089999694
##$SI= 65536
##$SIGF1= 159.3651
##$SIGF2= -187.1042
##$SINO= 113.3802
##$SIOLD= 16384
##$SREGLST= <1H.CDCl3>
##$SSB= 0
##$STSI= 65536
##$STSR= 0
##$SW_p= 40650.406504065
##$SYMM= 0
##$S_DEV= 0
##$TDeff= 32768
##$TDoff= 0
##$TI= <>
##$TILT= no
##$TM1= 0
##$TM2= 0
##$TOPLEV= 0
##$USERP1= <user>
##$USERP2= <user>
##$USERP3= <user>
##$USERP4= <user>
##$USERP5= <user>
##$WDW= 1
##$XDIM= 65536
##$YMAX_p= 457909469
##$YMIN_p= -390579474
$$ End of Bruker specific parameters
$$ ---------------------------------
##NTUPLES= NMR SPECTRUM
##VAR_NAME=  FREQUENCY,     SPECTRUM/REAL,   SPECTRUM/IMAG
##SYMBOL=    X,             R,               I
##VAR_TYPE=  INDEPENDENT,   DEPENDENT,       DEPENDENT
##VAR_FORM=  AFFN,          ASDF,            ASDF
##VAR_DIM=   65536,         65536,           65536
##UNITS=     HZ,            ARBITRARY UNITS, ARBITRARY UNITS
##FACTOR=    0.620285442955139, 1,           1
##FIRST=     20137.2065510682, 0,            0
##LAST=      -20513.1999529968, 0,           0
##MIN=       -20513.1999529968, -390579474,  0
##MAX=       20137.2065510682, 457909469,    0
$$ Real data points
##PAGE= N=1
##DATA TABLE= (X++(R..R)), XYDATA
$$ [...]
39061a617666J1098210Q403433P328691P219450N248368n2359o502764j0323847
39053B0801516r765448o051337j533167K041118L801385L559469J854790k41215
39045A4467111j796652k523581k597407k093685p09881J913423N598745R442127
39037B1700200J2285019J3277425J1896645P721815P71768p694316j5116413j9045581
39029B5796562j9002134j6808020j4713906j3144211j0711398o637329k410377
39022e7630813j04922O03245K348477O560644J1251785J3267160J1944996R421234
39014b338194P792727P183419O431455M500173J124638k869085n620759n533458
39006A0670916k961765q3761J064380m8873k762159n779690p315291o004796k432519
$$ plain form
39061 -1617666 9480544 17883977 25212668 32432118 37680486 37628127 31125363 20801516
39053 20801516 11036068 4984731 3451564 5492682 9294067 12853536 14708326 14467111
39045 14467111 12670459 10146878 7549471 5455786 4745905 6659328 12258073 21700200
39037 21700200 33985219 47262644 59159289 66881104 67652872 59958556 44842143 25796562
39029 25796562 6794428 -10013592 -24727498 -37871709 -48583107 -55220436 -57630813
39022 -57630813 -57735735 -57132490 -54784013 -48223369 -36971584 -23704424 -11759428 -2338194
39014 -2338194 5454533 12637952 19069407 23569580 24694218 21825133 16204374 10670916
39006 10670916 7709151 7625390 8689770 8640897 5878738 99048 -7216243 -13221039 -15653558
38997a5653558J016684K435495J919088N26238j217288l050761m236513m256607
38989b2517222l736304l638583l892366l706619k795342j277711J157813M604388
38981c5801946P536253P560410M112988n87415l834711m955798n132472n533240
38973c6635931o277109o659850n661666k524304K507318Q010983J2239427J4061291
38965b0939841J3055854R285195L518991k583774p075393q605821o800596k418093
38957b2563478K393135M715404K995323j189941m271670l986592j113541K151098
38949b0870262M664152O545673P686021P349504N406965K902200P57559j470227
38941A2971585m790898r019843j2544336j3785120j2267179q365984k979693K173014
$$ plain form
38997 -15653558 -14636874 -12201379 -10282291 -9756053 -10973341 -14024102 -18260615 -22517222
38989 -22517222 -26253526 -29892109 -33784475 -37491094 -40286436 -41564147 -40406334 -35801946
38981 -35801946 -28265693 -20705283 -16592295 -17179710 -21014421 -25970219 -31102691 -36635931
38973 -36635931 -42913040 -49572890 -55234556 -57758860 -55251542 -47240559 -35001132 -20939841
38965 -20939841 -7883987 1401208 4920199 2336425 -4738968 -13344789 -20145385 -22563478
38957 -22563478 -20170343 -15454939 -12459616 -13649557 -17921227 -21907819 -23021360 -20870262
38949 -20870262 -16206110 -9660437 -1974416 5375088 10782053 13684253 14441812 12971585
38941 12971585 8180687 -839156 -13383492 -27168612 -39435791 -47801775 -50781468 -48608454
38933d8608454M905677M275086J793340K05054J011310L553200O151660P326297
38925a9386830O087527K302610k563588n820215n549041k163298K304549O037157
38917a8751129Q157005Q299962O516409L609136P78924j287345k543578k914047
38909A865337k261265j123119n73837q52635q33920M68046K349842L071351J725952
38900C835752j169990m521396p196385q021426o432645l362723n35852J409564
38892b5995101L182636M954385N488851M065738K209201K077598L589902M583616
38884D156826L731647J877990K41760j274647l234475n176096n973812n180243
38876a0831050l258289r14932J110633K064406J838926J378559J614709K128321
$$ plain form
38933 -48608454 -43702777 -39427691 -37634351 -37429297 -36417987 -32864787 -26713127 -19386830
38925 -19386830 -13299303 -10996693 -13560281 -19380496 -24929537 -27092835 -24788286 -18751129
38917 -18751129 -10594124 -2294162 4222247 7831383 8610307 7322962 4779384 1865337
38909 1865337 -395928 -1519047 -2092884 -2945519 -3779439 -3311393 -961551 2109800 3835752
38900 3835752 2665762 -1855634 -9052019 -17073445 -23506090 -26868813 -27404665 -25995101
38892 -25995101 -22812465 -17858080 -12369229 -8303491 -6094290 -4016692 -426790 4156826
38884 4156826 7888473 9766463 10008223 8733576 5499101 323005 -5650807 -10831050
38876 -10831050 -14089339 -15004271 -13893638 -11829232 -9990306 -8611747 -6997038 -4868717
38868d868717J687323J01163j320273j389452l91292N75648J036230J398035K078468
38859a092867K849749K970276J704822j122233m758874p765504q962434q280537
38851b4457602o556975m463097j863328J522961M938590O589715N297144K030768
38843a6961824p24030j289850j42188J087853J294692K56711j851495m312269
38835b2642400n574150m353054j384978P91691M04234j671149l063445k508211
38827d0001462p33572R06889J866543K306628K197759J161835o81257k062856
38819c5039493j252214K341277P379366J1591665J3406921J2456890R022529L907805
38811B3814746j058176l430525j987799J906071N224799N606065K775810j775493
$$ plain form
38868 -4868717 -3181394 -3080231 -4400504 -5789956 -6181248 -5605600 -4569370 -3171335 -1092867
38859 -1092867 1756882 4727158 6431980 5309747 550873 -7214631 -16177065 -24457602
38851 -24457602 -31014577 -35477674 -37341002 -35818041 -30879451 -24289736 -18992592 -16961824
38843 -16961824 -17685854 -18975704 -19117892 -18030039 -16735347 -16478636 -18330131 -22642400
38835 -22642400 -28216550 -32569604 -33954582 -33162891 -32758657 -34429806 -37493251 -40001462
38827 -40001462 -40735034 -39828145 -37961602 -35654974 -33457215 -32295380 -32976637 -35039493
38819 -35039493 -36291707 -33950430 -26571064 -14979399 -1572478 10884412 19906941 23814746
38811 23814746 22756570 19326045 17338246 19244317 24469116 30075181 32850991 31075498
38803C1075498n947060q105472p827991o020052m166929l269810l427334m239872
38795a1929022n313365o299508o682444n852379l629490p41460J480496K170297
38787c6796875J642837Q61827M03015L20491P96974K210314M469420O962186R337946
38778i791865J1583546J3002956J2041788P920361J888324l909925q349084j1370807
38770A3015294j2796845j2367044j0790074r482536r030336q857842q533212q272190
38762f7114785p808573n992233k347643J771826M451557N101145M366111K844144
38754f4728451R90360j2251J403246N486487J0391840J3509948J3466560J0932633
38746h559628P928153O391608O981178Q966031J1248470J3263434J4618248J4241981
$$ plain form
38803 31075498 25128438 17022966 9194975 3174923 -992006 -4261816 -7689150 -11929022
38795 -11929022 -17242387 -23541895 -30224339 -36076718 -39706208 -40447668 -38967172 -36796875
38787 -36796875 -35154038 -34292211 -33889196 -33568705 -32771731 -30561417 -26091997 -19129811 -9791865
38778 -9791865 1791681 14794637 26836425 34756786 36645110 32735185 24386101 13015294
38770 13015294 218449 -12148595 -22938669 -32421205 -41451541 -50309383 -58842595 -67114785
38762 -67114785 -74923358 -80915591 -83263234 -81491408 -77039851 -71938706 -67572595 -64728451
38754 -64728451 -63738091 -63750342 -62347096 -56860609 -46468769 -32958821 -19492261 -8559628
38746 -8559628 -631475 5760133 12741311 21707342 32955812 46219246 60837494 75079475
38738G5079475J0771354M128841l780775j0456913j4780816j7315830j8798116
38731B4847220j8868892j6641906j2300327p536529m022402j647389J249343N806923
38723b9113959J1124337J4902131J5318863J2278207P307639K458317j151724
38716C3123811m045435p301481j0586046j1975780j0310968p012792m580543l735618
38708b6424852l266490k502993k393382l637682n070689m839366k389865J519707
38700d9005612N947913R854886J1764658J0786415P846086M603672J096754m087220
38692a192448j0746984j5576896j5066078r412231k439517K240395M058848M594152
38684d3540759N081511N477794N288266M357750K860326J196062J38646N61301
$$ plain form
38738 75079475 85850829 89979670 86198895 75741982 60961166 43645336 24847220
38731 24847220 5978328 -10663578 -22963905 -30500434 -34522836 -36170225 -34920882 -29113959
38723 -29113959 -17989622 -3087491 12231372 24509579 31817218 34275535 33123811
38716 33123811 29078376 21776895 11190849 -784931 -11095899 -18108691 -22689234 -26424852
38708 -26424852 -29691342 -32194335 -34587717 -38225399 -43296088 -48135454 -50525319 -49005612
38700 -49005612 -43057699 -33202813 -21438155 -10651740 -2805654 1798018 2894772 -1192448
38692 -1192448 -11939432 -27516328 -42582406 -51994637 -54434154 -52193759 -48134911 -43540759
38684 -43540759 -38459248 -32981454 -27693188 -23335438 -20475112 -19279050 -19140404 -18579103
38676a8579103K456552M309031L999979P30336m000598p504624p991347n589938
38668c2169712j690789K239384N236240O875861P254080O845758O084461N081769
38660E757052L894043K900131K596930L019409L617257L741982L051254J464280
38652C0042338q89895l426999n051351m780848k604835M06753L021944M909041
38644B1626148O688312Q872846J0927682J1631622J0302885P326800L540964k45459
38636H0671800k910791l179588j138101R42067O89050j412362k563502j602357
38628F9496216r12151l272857p971924j1626201j2242577j0720899q539551n967679
38620H242377l192261j469773j791716l264057m083910l766950l419128m031853
$$ plain form
38676 -18579103 -16122551 -11813520 -7813541 -7083205 -11083803 -18588427 -26579774 -32169712
38668 -32169712 -33860501 -31621117 -26384877 -19509016 -12254936 -5409178 675283 5757052
38660 5757052 9651095 12551226 15148156 18167565 21784822 25526804 28578058 30042338
38652 30042338 29152443 25725444 20674093 15893245 13288410 13695163 16717107 21626148
38644 21626148 28314460 37187306 48114988 59746610 70049495 77376295 80917259 80671800
38636 80671800 77761009 74581421 73443320 74385387 75074437 73662075 71098573 69496216
38628 69496216 68584065 65311208 57339284 45713083 33470506 22749607 14210056 8242377
38620 8242377 5050116 3580343 1788627 -1475430 -5559340 -9326290 -12745418 -16777271
38612a6777271n410375o712739p230776o562106m738005k480361r05715o82925
38604e1500273j634798l205083n034589o913174q339562q451987o695642l647253
38596i5422361q39849O46379J214090J814379K207161J145327j496370l853277
38588i4584521l992183j890665J191187M412859P405045R407622R767963R012241
38580e9270452Q142642P057937M987754K362795O91486L65851J97249l31932q726
38571c5805396J890297L763958L625388K053359J545408L113053M913823M454495
38563a0445615J176870l309295o693301p402663n374958j976519J063398K913569
38555c0048514L831868M291288M323055L756952K715210J595738N96329o26671
$$ plain form
38612 -16777271 -22187646 -28900385 -36131161 -42693267 -47431272 -49911633 -50817348 -51500273
38604 -51500273 -53135071 -56340154 -61374743 -68287917 -76627479 -85079466 -91775108 -95422361
38596 -95422361 -96262210 -95615831 -94401741 -92587362 -90380201 -89234874 -90731244 -94584521
38588 -94584521 -98576704 -100467369 -99276182 -94863323 -87458278 -78050656 -68282693 -59270452
38580 -59270452 -51127810 -44069873 -39082119 -36719324 -36027838 -35661987 -35464738 -35796670 -35805396
38571 -35805396 -33915099 -30151141 -26525753 -24472394 -22926986 -19813933 -14900110 -10445615
38563 -10445615 -9268745 -12578040 -19271341 -26674004 -32048962 -34025481 -32962083 -30048514
38555 -30048514 -26216646 -21925358 -17602303 -13845351 -11130141 -9534403 -8938074 -9564745
38547i564745k615716n188776p049510o922943n192412l702803l526095l555198
38539d7318198j915353J761605O189750J0053264J2776557J3863028J2636981
38532H047634R114830M550096O73298j454684j839652j188145k59966O23893J447721
38523A9715025J895148J367799l0356j114490r75200l08385m43680j241440j024913
38514A7839508J311915N113116Q997344J1952131J2992316J0929778N489984j860741
38506G2765351q949173j4383648j7547552j7886572j5277585j0850628o353570
38499a8483377k499170J266490N059628P416066O660759L276847J48895q05K785274
38490E630607N950942P020443N449895K201879j346556l585426k975442M31316
$$ plain form
38547 -9564745 -12180461 -17369237 -24418747 -31341690 -36534102 -40236905 -43763000 -47318198
38539 -47318198 -49233551 -47471946 -41282196 -31228932 -18452375 -4589347 8047634
38532 8047634 17162464 21712560 22385858 20931174 19091522 17903377 17643411 18267304 19715025
38523 19715025 21610173 22977972 22947616 21833126 20857926 20549541 20105861 18864421 17839508
38514 17839508 19151423 24264539 33261883 45214014 58206330 69136108 74626092 72765351
38506 72765351 63816178 49432530 31884978 13998406 -1279179 -12129807 -18483377
38499 -18483377 -20982547 -19716057 -14656429 -7240363 -579604 2697243 2846138 2845333 5630607
38490 5630607 11581549 18601992 24051887 26253766 24907210 21321784 18346342 18777658
38482A8777658M182598N565135M611693L727075M202568M592434L150002M40003
38474D9249166j617539k353582k713164l497698m413666m756518m265940l468004
38466B2163055l666473o010215r724980j1802766r594214l617198L028580P726574
38458a1497637R852196R675470P380359L592106l31803l256277m880544n048081
38450E485789l272891M10019M644792P469277P757031N818772K909670K83057
38442C1505516j601901k997590l734853k573084J360367O494101R408266Q160952
38434D6021774M260340P24492j117202k231265m013655o755981r602065j1132878
38426A6153560j0112001o410363j328489L268568N972796N962978L034947j679344
$$ plain form
38482 18777658 22960256 28525391 33137084 36864159 41066727 45659161 48809163 49249166
38474 49249166 47631627 45278045 42564881 39067183 34653517 29896999 25631059 22163055
38466 22163055 18496582 12486367 2761387 -9041379 -18635593 -22252791 -19224211 -11497637
38458 -11497637 -1645441 8030029 15410388 19002494 18670691 15414414 10533870 5485789
38450 5485789 2212898 2622917 7267709 14736986 22494017 28312789 31222459 31505516
38442 31505516 29903615 26906025 23171172 20598088 21958455 28452556 37860822 46021774
38434 46021774 50282114 51006606 49889404 47658139 43644484 36888503 27286438 16153560
38426 16153560 6041559 -368804 -1697293 1571275 7544071 13507049 16541996 14862652
38418A4862652n708895p178894o573588n552075m324637j675964K282984N104161
38410h764256M698263J892181q15686k207944k812369l035114k386827o18758
38402a4050510J656934L816791N705172O946556O825783N462148M240538M289275
38394B4892687N129979N553446N169510M154641K096346j531122n861860r001675
38386C0601952j0182295j0347256j0190345q946047o011048k622811n93309o22
38378a8291781M82181J275928J410352N15342q7286J034153L588576N952222O785480
38369B665167N708070L013112l85861k877082k878712r8082M047741P446492Q832318
38360B5473163Q443471P242136N653302L453150R85003k88478O46759K481903
$$ plain form
38418 14862652 9153757 1974863 -4598725 -10150800 -14475437 -16151401 -13868417 -8764256
38410 -8764256 -4065993 -2173812 -2989498 -5197442 -8009811 -11044925 -13431752 -14050510
38402 -14050510 -12393576 -8576785 -2871613 4074943 10900726 16362874 20603412 24892687
38394 24892687 30022666 35576112 40745622 44900263 46996609 45465487 39603627 30601952
38386 30601952 20419657 10072401 -117944 -9063991 -15075039 -17697850 -18291159 -18291781
38378 -18291781 -17809600 -16533672 -15123320 -14607978 -14695264 -13661111 -10072535 -4120313 2665167
38369 2665167 8373237 11386349 11000488 8123406 5244694 5146612 9194353 16640845 25473163
38360 25473163 33916634 41158770 46812072 50265222 51250225 50961747 51608506 54090409
38352E4090409K374710j077479o386896j0879368j2950176j2319708r282199m784482
38344a215189n75114J953242K941857L245128K730707N17935l043649n793401
38336G61516n748871l126671k5468J403743J94067l365110q188622j3022541j6970085
38327d8088042j9363281j9129710j4876896o233419M972140J5368534K2058133
38320f5292541K3925984K1336424J5394162P954911J740591p61160Q26729M263830
38312I388930O534397O180391L686244R8184l863930p330073q976583p998283
38304b280723n098661j956805J88567J142591J310712J247266J567364K740318
38296a139371M718245O857049Q178158P741458N199910J348346k176951m206262
$$ plain form
38352 54090409 56465119 55387640 49000744 38121376 25171200 12851492 3569293 -1215189
38344 -1215189 -1790303 162939 3104796 6349924 9080631 9598566 6554917 761516
38336 761516 -4987355 -8114026 -8139494 -6735751 -6541684 -9906794 -18095416 -31117957 -48088042
38327 -48088042 -67451323 -86581033 -101457929 -107691348 -102719208 -87350674 -65292541
38320 -65292541 -41366557 -20030133 -4635971 3318940 5059531 4298371 5125100 9388930
38312 9388930 15923327 22103718 25789962 25888146 22024216 14694143 5717560 -2280723
38304 -2280723 -7379384 -9336189 -9147622 -8005031 -6694319 -5447053 -3879689 -1139371
38296 -1139371 3578874 10435923 18614081 26355539 31555449 32903795 30726844 26520582
38288B6520582m939919n306366n768736o181590o423372o485920o091684m839905
38280a9516910k660736L26809M090784Q158481J1178932J1970427J0842758Q848778
38272C3239323N878973R30383n425367j0410917j1892943j0821953r698151r352206
38264a7552858q499876o070292k648193M40171K382774K920264J950967l50453
38256b7427496l248086n525792n915973l815080k836L545129N087891M441553
38248c2860690K742575J208579M35395M13745N57803K7880j179165j642754L6322
38239c0260310L097848M836798L381482k74350l271750l397042m69964L903139
38231b2454149P296183P726329M936501P36949k160188j899420J510648O333171
$$ plain form
38288 26520582 21580663 16274297 10505561 4323971 -2099401 -8585321 -14677005 -19516910
38280 -19516910 -22177646 -21850837 -17760053 -9601572 1577360 13547787 24390545 33239323
38272 33239323 39118296 40048679 34623312 24212395 12319452 1497499 -8200652 -17552858
38264 -17552858 -26052734 -32123026 -34771219 -34331048 -31948274 -29028010 -27077043 -27427496
38256 -27427496 -30675582 -36201374 -42117347 -45932427 -45935263 -42390134 -37302243 -32860690
38248 -32860690 -30118115 -28909536 -28474141 -28060396 -27502593 -27474713 -28653878 -30296632 -30260310
38239 -30260310 -27162462 -22325664 -18944182 -19218532 -22490282 -25887324 -26357288 -22454149
38231 -22454149 -15157966 -7431637 -2495136 -1758187 -3918375 -5817795 -4307147 2026024
38223B026024J0112353J1174332R682787P078659M268738P14488m334926j0064095
38215C0658360j4175105j4853061j2381266q780801o029466m587221l449919j556022
38207c5154501R00544K656460K787732J587142m6206j613195l002080l814091
38199c5698195l417082j863744k91069O6931p20946j182302k319K387196M124312
38190c6597218L936369K433507J081770M41647K11784O17820K371241M864789
38182b0638291N743305L402109p28708l491679l278195j091153J211172K444202
38174a6427238J992415k60578l257087n124204n093949m444559m785307n912057
38166d3312564o117902m246652o80449L378445O674313Q003298O585590K878292
$$ plain form
38223 2026024 12138377 23312709 32995496 40074155 44342893 45057381 40722455 30658360
38215 30658360 16483255 1630194 -10751072 -19531873 -25561339 -30148560 -33598479 -35154501
38207 -35154501 -34253957 -31597497 -28809765 -27222623 -27268829 -28882024 -31884104 -35698195
38199 -35698195 -39115277 -40979021 -41270090 -41203159 -41924105 -43106407 -43108726 -40721530 -36597218
38190 -36597218 -32660849 -30227342 -29145572 -28703925 -28492141 -27874321 -25503080 -20638291
38182 -20638291 -14894986 -11492877 -12221585 -15713264 -18991459 -20082612 -18871440 -16427238
38174 -16427238 -14434823 -14695401 -17952488 -23076692 -28170641 -32615200 -37400507 -43312564
38166 -43312564 -49430466 -53677118 -54357567 -50979122 -44304809 -36301511 -29715921 -26837629
38158b6837629j420565m650340o396369p326681q089450q579263q103569o018989
38150g7422855k277096K379840O632360R154566R329775P682025N539409L961432
38142c5020544K862893J356952r78785l406583m672422m036258j522422K368194
38134d3048975O634723R635896R696166O341357R72256l799548n756881m580087
38126b3905093k151980j122306k687997n746210q331876r482029r275747p646380
38118g0349618m315966p912L427441M835235N130025O141013Q382340J0574736
38110c6182706J1180219R797981P079070L863293O66650k246090m589042o027608
38102a6458233o549299o730093p185531p591741o691184l607912J163585O311366
$$ plain form
38158 -26837629 -28258194 -32908534 -39304903 -46631584 -54721034 -63300297 -71403866 -77422855
38150 -77422855 -79699951 -77320111 -70687751 -61533185 -52203410 -44521385 -38981976 -35020544
38142 -35020544 -32157651 -30800699 -31779484 -35186067 -39858489 -43894747 -45417169 -43048975
38134 -43048975 -36414252 -26778356 -17082190 -10740833 -9768577 -13568125 -19325006 -23905093
38126 -23905093 -26057073 -27179379 -29867376 -35613586 -43945462 -53427491 -62703238 -70349618
38118 -70349618 -74665584 -74673496 -71246055 -66410820 -61280795 -55139782 -46757442 -36182706
38110 -36182706 -25002487 -15204506 -8125436 -4262143 -3595493 -5841583 -10430625 -16458233
38102 -16458233 -23007532 -29737625 -36923156 -44514897 -51206081 -54813993 -53650408 -47339042
38094d7339042J0646843J2962615J1735804O368353j097651o634441p349649l684965
38086b4392133J591075N898015Q090386Q184081O936079N592929N268291O290206
38078B3458929Q287789J0655830J2523760J2573763R719127M291268j795021o322911
38070G3392534q183178p734532o300737n400973n865840p192073p944249p168979
38062A7601973n321058l514794k063176k73633K278338M845898O235888O095332
38054B5884768N051474L795907K551136J352661J87306j374880m083082q028394
38046B5336896j2047402j4514726j4498072j1866263o908666p50965M195821N569854
38038b5483523L421194M89963m60030Q85082K929637M432150N474690O667663
$$ plain form
38094 -47339042 -36692199 -23729584 -11993780 -5625427 -6723078 -13357519 -20707168 -24392133
38086 -24392133 -22801058 -16903043 -8812657 -628576 6307503 11900432 17168723 23458929
38078 23458929 31746718 42402548 54926308 67500071 77219198 81510466 79715445 73392534
38070 73392534 65209356 57474824 51174087 45773114 39907274 32715201 24770952 17601973
38062 17601973 12280915 8766121 6702945 6429312 8707650 13553548 19789436 25884768
38054 25884768 30936242 34732149 37283285 38635946 38823252 37448372 33365290 25336896
38046 25336896 13289494 -1225232 -15723304 -27589567 -34498233 -35249198 -31053377 -25483523
38038 -25483523 -22062329 -21572366 -22032396 -21147314 -18217677 -13785527 -8310837 -1643174
38030a643174Q313391J0267854J1923080J2352081J1060898Q549349N585575K103414
38022F8512468k381574p204329j0272705r873975o464771k483422o21934k063111
38014B7146647n622078q389817p917201m275112K20344L259521L987715K498271
38006A0908290p46791m414961o495689o266501n469978o277336q344335r105176
37998c6212477o980976l137168J72664J940017K624034K982266L464635M324720
37990c0822285N631512P217821Q858690J0267754J0751413R325817N686245R72671
37982B7889638k783684m138297l332031k190109k825353n911469r984329j2681366
37974a5957000j2733161j0505375o876126k467537J790635M296785L820237O42246
$$ plain form
38030 -1643174 6670217 16938071 28861151 41213232 52274130 60823479 66409054 68512468
38022 68512468 66130894 58926565 48653860 38779885 32315114 29831692 29209758 27146647
38014 27146647 21524569 13134752 5217551 942439 1162783 4422304 8410019 10908290
38006 10908290 10161499 5746538 -749151 -7015652 -12485630 -18762966 -27107301 -36212477
37998 -36212477 -43193453 -46330621 -46157957 -44217940 -41593906 -38611640 -35147005 -30822285
37990 -30822285 -25190773 -17972952 -9114262 1153492 11904905 21230722 26916967 27889638
37982 27889638 25105954 20967657 17635626 15445517 12620164 6708695 -3275634 -15957000
37974 -15957000 -28690161 -39195536 -46071662 -48539199 -46748564 -42451779 -38631542 -37989296
37966c7989296l802044q066341j1093275j2084659j0820493p973951m508070q71207
37958i7209336K786517N971714Q102478R132021R172075P762552M489868K97667
37950d9494444k882511m106075m167203m093108l848694l102368k374637k440882
37942g6509922k970550k671055q03556J981024M312150N254078M926114M360685
37934f2121032M656629N927122P123257P116225N837916M189776L077554K792397
37926b1400156L079112L471965L713674M033244M684280M970854L309039j018625
37918D843387o359774r674778r224667o045986k880370j918912l251617m920260
37910c9432977m609004j875292J291234K579848J903430J327774K698421O069385
$$ plain form
37966 -37989296 -41791340 -49857681 -60950956 -73035615 -83856108 -91830059 -96338129 -97209336
37958 -97209336 -94422819 -88451105 -80348627 -71216606 -62044531 -54281979 -49792111 -49494444
37950 -49494444 -52376955 -56483030 -60650233 -64743341 -68592035 -71694403 -74069040 -76509922
37942 -76509922 -79480472 -82151527 -82955083 -80974059 -76661909 -71407831 -66481717 -62121032
37934 -62121032 -57464403 -51537281 -44414024 -37297799 -31459883 -27270107 -24192553 -21400156
37926 -21400156 -18321044 -14849079 -11135405 -7102161 -2417881 2552973 5862012 4843387
37918 4843387 -1516387 -11191165 -20415832 -26461818 -29342188 -31261100 -34512717 -39432977
37910 -39432977 -44041981 -45917273 -44626039 -42046191 -40142761 -38814987 -36116566 -30047181
37902c0047181J0278803J3990976J5952145J5320746J2452010Q756571N260386
37895E1964456J870819j491239l806530l828702j620500J482953M033195M883930
37887E3488382L035397j658841p522703j1809626j2831693j0813400o646536q44792
37879D396188N676112J0649012J1538029P839993J824442l274491n704485n925531
37871B7019269n286592m288129k200619J740846O982185J1639537J3834126J3005341
37863F2445964J0032415O261398K424936j641427o309116j1179343j4866980j5899223
37855C1268624j3860206r614770m529378K95647M023159N696917M404051J59827
37847A7843871n484100j0202952j2608628j2994284j2126470r827931n671616
$$ plain form
37902 -30047181 -19768378 -5777402 10174743 25495489 37947499 46704070 51964456
37895 51964456 53835275 52344036 48537506 44708804 43088304 44571257 48604452 53488382
37887 53488382 56523779 54864938 47342235 35532609 22700916 11887516 5240980 4396188
37879 4396188 10072300 20721312 32259341 40099334 41923776 38649285 32944800 27019269
37871 27019269 21732677 17444548 15243929 16984775 23966960 35606497 49440623 62445964
37863 62445964 72478379 78739777 81164713 79523286 73214170 62034827 47167847 31268624
37855 31268624 17408418 7793648 3264270 3559917 7583076 13279993 17684044 17843871
37847 17843871 12359771 2156819 -10451809 -23446093 -35572563 -45400494 -51072110
37840e1072110q98598J833862J490568M41354J860034N715217Q733535Q428117
37832b3468021N876816M095059M793837P387224J0135064J1200967R251130M341907
37824C3613983j680223o434910q795806r070733p805281n305234k278649Q6712
37816g670141J130136J209071R02504L88761q230N20471K136553L231817J536723
37807C377665l275211q628822j1133257r571364n783574k770227j914647j864936
37799d1564373j87252L672113P281042P589154M382652P80860J79765L339017
37791a4527022Q536251J3352445J5467850J2980154N956936k348622p700617r074138
37783B2643237r401836j1382949j3870612j3678508r937062m944271j108052J194101
$$ plain form
37840 -51072110 -51970708 -50136846 -48646278 -48204924 -46344890 -40629673 -31896138 -23468021
37832 -23468021 -17591205 -13496146 -8702309 -1315085 8819979 20020946 29272076 33613983
37824 33613983 31933760 25498850 16703044 7632311 -172970 -5478204 -7756853 -7670141
37816 -7670141 -6540005 -5330934 -4428430 -4039669 -4047899 -3527428 -1390875 1840942 3377665
37807 3377665 102454 -8526368 -19659625 -29230989 -35014563 -37784790 -39699437 -41564373
37799 -41564373 -41751625 -38079512 -30798470 -23209316 -18826664 -18045804 -17866039 -14527022
37791 -14527022 -5990771 7361674 22829524 35809678 41766614 39417992 31717375 22643237
37783 22643237 13241401 1858452 -12012160 -25690668 -35627730 -40572001 -41680053 -40485952
37775d0485952K637159L586017M393517N691901P320835P747457N606932J511357
37767a990777k409451m550587m906043m460100m158659m341421m635113m332010
37759c5784161l016290o55117K826495P287426J1368176J2755990J0476133O372727
37751A1631379L148257J200369j318167n313469r142097j0814308j0548171j0025823
37743c1182030r874591r223688p600689n999977n619712o265513o506162n021145
37735h7293507j463317L530590Q560624J1856260J2150386R514366N189390N74227
37727c7380981l368006n800923n824843l160357J207574N578110Q701171J0139709
37719b9908546R843949Q102754N862993M219082L223156J849196m25116k570696
$$ plain form
37775 -40485952 -37848793 -34262776 -29869259 -24177358 -16856523 -9109066 -3502134 -1990777
37767 -1990777 -4400228 -8950815 -13856858 -18316958 -22475617 -26817038 -31452151 -35784161
37759 -35784161 -38800451 -39455568 -36629073 -29341647 -17973471 -5217481 5258652 11631379
37751 11631379 14779636 15980005 14661838 9348369 206272 -10608036 -21156207 -31182030
37743 -31182030 -41056621 -50280309 -57880998 -63880975 -69500687 -75766200 -82272362 -87293507
37735 -87293507 -88756824 -85226234 -76665610 -64809350 -52658964 -43144598 -37955208 -37380981
37727 -37380981 -40748987 -46549910 -52374753 -55535110 -54327536 -48749426 -40048255 -29908546
37719 -29908546 -20064597 -11961843 -6098850 -1879768 1343388 3192584 2767468 196772
37711A96772l070403j570743J058269L796238N857902O405163M887921J799446
37703A9360565j521418l893740m707050l738184j506148L00083n6025k342816
37695A895267m262503l802251j020143K752341O427893R179639R990732Q538707
37687B9699682O214197N028987N395590N851106N037809L068683P63435j493785
37679E9565704l603191n220622o186225p157517r038387j1707257j3780195j3765893
37671a0893583j1200098o644160r92544M880907R949694J3022401J3344461J1282011
37663B2749089Q179693N396425L578407K811276K934643L258803K437868m04921
37655E0941283m252210o712027o455523m587476l116653k729059k895085l587784
$$ plain form
37711 196772 -2873631 -4444374 -3386105 410133 6268035 12673198 17561119 19360565
37703 19360565 17839147 13945407 9238357 5500173 3994025 4294108 4238083 1895267
37695 1895267 -2367236 -6169487 -7189630 -4437289 1990604 11170243 21160975 29699682
37687 29699682 35913879 40942866 46338456 52189562 57227371 60296054 61059489 59565704
37679 59565704 55962513 50741891 44555666 37398149 28359762 16652505 2872310 -10893583
37671 -10893583 -22093681 -28737841 -29730385 -24849478 -14899784 -1877383 11467078 22749089
37663 22749089 30928782 36325207 39903614 42714890 45649533 48908336 51346204 50941283
37655 50941283 46689073 39977046 33521523 28934047 25817394 23088335 20193250 16605466
37647A6605466n472160q194113r787171q617191n237463j540354J440599M066119
37639a6736268O750201Q981112R726563Q243070M568909j74996m081354n810529
37631A1466708n756662n285805m911662m093270k850809k346538l246209m486553
37623b1510800m537342l186722j200599J070313L511685N056478M143879P04400
37615a5948708l273274n565991n508582l861405j752900j60506L03623j99690
37607c5967433p50753m49962J001077L595310P379052J2038009J6302548J8181395
37599B1329243J5991424R407735j18844r951408j7662533k2115341k3307599k1690234
37591d8117557j8191811j4429542j1739596r822617p296917l830894o38934J653766
$$ plain form
37647 16605466 11133306 2939193 -6847978 -15465169 -20702632 -22242986 -20802387 -16736268
37639 -16736268 -9986067 -1004955 8721608 16964678 21533587 21358591 17277237 11466708
37631 11466708 5710046 424241 -4487421 -8580691 -11431500 -13778038 -17024247 -21510800
37623 -21510800 -26048142 -29234864 -30435463 -29365150 -25853465 -20796987 -16653108 -15948708
37615 -15948708 -19221982 -24787973 -30296555 -34157960 -35910860 -36071366 -35767743 -35967433
37607 -35967433 -36718186 -37168148 -36167071 -32571761 -25192709 -13154700 3147848 21329243
37599 21329243 37320667 46728402 46609558 36658150 18995617 -3119724 -26427323 -48117557
37591 -48117557 -66309368 -80738910 -92478506 -102301123 -109598040 -113428934 -114067868 -112414102
37583a12414102M432868R259359J5315587J9906835K1208103J9435879J5569293
37576g286178J0291848M519855j95039k659291l103780k853199l203254m740968
37568i230006p137342r080859q853365n799612j374899J799597K289908J071262
37560c6315316J52406K26590J88817j064633l108752m700196n394375n660115
37552e5675574n719564n239439m120932k588058l72084L060392P055406R699128
37544e3900725R956235Q930002Q120834P369614N699430L440033K034562K001830
37536f348185K421221K353462J585397J16140j716926k557515j010722K230069
37528b927059M590179M638845L735702L812281M589640M234366K213598K03893
$$ plain form
37583 -112414102 -107981234 -98721875 -83406288 -63499453 -42291350 -22855471 -7286178
37576 -7286178 3005670 7525525 7330486 4671195 1567415 -1285784 -4489038 -9230006
37568 -9230006 -16367348 -25448207 -34301572 -40101184 -41476083 -39676486 -37386578 -36315316
37560 -36315316 -36162910 -35936320 -35747503 -36812136 -39920888 -44621084 -50015459 -55675574
37552 -55675574 -61395138 -66634577 -70755509 -73343567 -73715651 -70655259 -63599853 -53900725
37544 -53900725 -43944490 -35014488 -26893654 -19524040 -13824610 -10384577 -8350015 -6348185
37536 -6348185 -3926964 -1573502 11895 128035 -1588891 -4146406 -5157128 -2927059
37528 -2927059 1663120 6301965 10037667 13849948 18439588 22673954 24887552 25091445
37520B5091445Q8899J872012L814821M226052K875918P35493j441648l782563
37512C3480429o193678p218856n149964l90990M318707O480978N964212M428558
37504C5719396L670051M888110Q284178J2343638J4308530J2481838P800418K588479
37496A02084638j619809m506697o339361q067127j1165949j5818484j9554037
37489C5013174j9142882j3903335o157465J274216O783547R563326R344791P072799
37481B9848171M530353K631603Q85881j279919l774628o579334r764978j2214280
37473D282869j1864318q323405m086602j900753j808412k061865k046052k519042
37465c0327580l271196k461888J133538O376474J0851861J2971567J2664616J0800954
$$ plain form
37520 25091445 25180344 27052356 30867177 35093229 37969147 38704640 37262992 33480429
37512 33480429 27286751 20067895 14917931 14526941 18845648 25326626 31290838 35719396
37504 35719396 39389447 44277557 52561735 64905373 79213903 91695741 99496159 102084638
37496 102084638 100464829 95958132 89618771 81551644 70385695 54567211 35013174
37489 35013174 15870292 1966957 -4190508 -2916292 3867255 13430581 22775372 29848171
37481 29848171 34378524 37010127 37896008 36616089 32841461 26262127 16497149 4282869
37473 4282869 -7581449 -15904854 -19991456 -21892209 -23700621 -25762486 -27808538 -30327580
37465 -30327580 -33598776 -36060664 -34927126 -28550652 -17698791 -4727224 7937392 18738346
37457A8738346Q516965O613423N034303L033780J3514l961326q281265j1807606
37449A7900134j2813709r911502l677857L172786P871834R539011Q643539N326061
37441B6050297m08679o805570j0193807p987011j621050M378708O394416M392659
37433A4199963R62191j240106q62379J941638N312937O176291K588286l854129
37425B5224692q946994r855650p503001m642157k691399j472134j033594j928874
37417a2849111l763058n097817n205780m604873l386758n16697M123456Q167330
37409b3133308Q774710N756568J405213k397112n397693p418751p467912n290885
37401c5169170k537020j091306p70786K08906K663460N334022O481982N824895
$$ plain form
37457 18738346 27255311 33868734 38903037 41936817 41950331 37989005 29707740 17900134
37449 17900134 5086425 -4825077 -8502934 -5330148 2541686 12080697 20724236 26050297
37441 26050297 25641618 18836048 8642241 655230 -965820 3412888 9807304 14199963
37433 14199963 15162154 13922048 13059669 15001307 20314244 26490535 29078821 25224692
37425 25224692 16277698 6422048 -1080953 -5723110 -8414509 -9886643 -10920237 -12849111
37417 -12849111 -16612169 -21709986 -26915766 -31520639 -34907397 -35424094 -31300638 -23133308
37409 -23133308 -14358598 -8602030 -7196817 -9593929 -14991622 -22410373 -29878285 -35169170
37401 -35169170 -37706190 -38797496 -39568282 -39359376 -36695916 -31361894 -24879912 -19055017
37393a9055017M528823L708167L328316K496707O23495j775411l482054l801528
37385a3428502l248158k931649l459222m584428n647509o032660n427904m135309
37377d8895341l095730l114277l930269m442071m012005l170063k771986k799429
37369g6231171k411172j072014P60175K140355K564229K248583J657937J024130
37361f9318948M36884K37294J007493L024498N869114Q700419J0745755J1379562
37353b7917929J0090270O967907L264096Q81090Q64151K485972L951542L864947
37345D452046K025525p77983l473204n518317p373734r946268j3196047j5522534
37337d9330516j5090060j1792820p420895l735866q39366K252899N808305Q683544
$$ plain form
37393 -19055017 -14526194 -10818027 -7489711 -4993004 -4369509 -6144920 -9626974 -13428502
37385 -13428502 -16676660 -19608309 -23067531 -27651959 -33299468 -39332128 -44760032 -48895341
37377 -48895341 -51991071 -55105348 -59035617 -63477688 -67489693 -70659756 -73431742 -76231171
37369 -76231171 -78642343 -79714357 -78954182 -76813827 -74249598 -72001015 -70343078 -69318948
37361 -69318948 -68882064 -68644770 -67637277 -64612779 -58743665 -50043246 -39297491 -27917929
37353 -27917929 -17827659 -10859752 -7595656 -6714566 -5850415 -3364443 587099 4452046
37345 4452046 6477571 5699588 2226384 -3291933 -10665667 -20611935 -33807982 -49330516
37337 -49330516 -64420576 -76213396 -83634291 -87370157 -88209523 -85956624 -80148319 -71464775
37329g1464775R377056P337529L212272j602739n231643n656030j896035M591494
37321f1332871J0203977J1684347Q547973K948569k511991o358304q068874p558803
37313e2445977n401128k866260r68509L48371J673990L152017M567964O015754
37305d5923778P665694Q980441R014341P675725O009458M953957M375150L588778
37297F339766K258647M38644j672658l527742m362729m234011m447130n981325
37289a5188538p656815p025162l435720P64016K791083K483891J861136K060375
37281b3345734J980590J89803k957637n826691p308420p115775m826422j27612
37273d9337898N695271R860923J0683807R404350Q460429Q413221P785657N781934
$$ plain form
37329 -71464775 -62087719 -54750190 -51537918 -53140657 -58372300 -64028330 -65924365 -61332871
37321 -61332871 -51128894 -39444547 -30896574 -27948005 -30459996 -36818300 -44887174 -52445977
37313 -52445977 -57847105 -60713365 -61681874 -61333503 -59659513 -56507496 -51939532 -45923778
37305 -45923778 -38258084 -29277643 -20263302 -12587577 -6578119 -1624162 2750988 6339766
37297 6339766 8598413 9037057 7364399 3836657 -526072 -4760083 -9207213 -15188538
37289 -15188538 -22845353 -29870515 -33306235 -32542219 -29751136 -27267245 -25406109 -23345734
37281 -23345734 -21365144 -21175341 -24132978 -29959669 -37268089 -44383864 -49210286 -49337898
37273 -49337898 -43642627 -33781704 -23097897 -13693547 -5233118 3180103 10965760 16747694
37265A6747694L633789K593545J813168m88503m174957o784081o161478k622883
37257D556294J830140N669477Q577765J0506400J0958561R569632P038177M991097
37249F3697543M673623N725719O316571M582105J5075o354573j2730966j7258326
37241D8666771j8442145j5833697j0744630n763039k826591j647880k70589K887453
37233c974347P699276J2664482J6054177J6961193J6026893J5327897J6922308
37226I7681879K1268219K7651840L6135722M7501029N9862804O6383822N9082388
37219D15567703L6368577N973189k0651275l6600324m2185327m1239173l7069126
37212B80164244l1930016k7864873k5929535k4929288k2401742j7274969j0944146
$$ plain form
37265 16747694 20381483 22975028 24788196 24299693 20124736 13340655 7179177 4556294
37257 4556294 6386434 12055911 20633676 31140076 42098637 51668269 58706446 63697543
37249 63697543 68371166 74096885 80413456 84995561 85010636 78656063 65925097 48666771
37241 48666771 30224626 14390929 3646299 -2116740 -4943331 -6591211 -6861800 -3974347
37233 -3974347 3724929 16389411 32443588 49404781 65431674 80759571 97681879
37226 97681879 118950098 146601938 182737660 230238689 290101493 356485315 415567703
37219 415567703 451936280 457909469 437258194 400657870 358472543 317233370 280164244
37212 280164244 248234228 220369355 194439820 169510532 147108790 129833821 118889675
37205A18889675n587178k103515n4747J011126R57173k95070k131345l513053
37197A07173066l661083k405611j77752K115369L435265L225771J791316j05531
37189A11390810k160026m978699r396273j5103209j9985921k1303186j8054014
37182B0409482j2181376o996660m278576l211811k076406k21925J949678M089659
37174b517935O030504P143771O630723M673219K637339J878641K700681M414103
37166C3591046N807750N564283L012330j193982n639327r505012j2709597j4633480
37158D294011j3815759r666989l781875J296303M243527N292301N020460L816091
37150c301930K338163J487119J662287K561610L777896N135490O412631P128500
$$ plain form
37205 118889675 113302497 111198982 111144235 112155361 113112534 112817464 110686119 107173066
37197 107173066 103511983 101106372 100928620 103043989 106479254 109705025 111496341 111390810
37189 111390810 109230784 104252085 94855812 79752603 59766682 38463496 20409482
37182 20409482 8228106 1231446 -3047130 -6258941 -8335347 -8557272 -6607594 -2517935
37174 -2517935 3512569 10656340 17287063 21960282 24597621 26476262 29176943 33591046
37166 33591046 39398796 44963079 47975409 46781427 41142100 31637088 18927491 4294011
37158 4294011 -9521748 -19188737 -22970612 -21674309 -17430782 -12138481 -7118021 -3301930
37150 -3301930 -963767 523352 2185639 4747249 8525145 13660635 20073266 27201766
37142B7201766O648506M361428J18487n078598r208357j0703919r687012p362075
37134c709774m665305k209122j004896j955080m494712o747344p387630o719946
37126c8893809n800492n228656m951276m476012l032612k53216L054603N540184
37118e4041286O968068Q459114J0755086J3102009J4364676J4433605J3846347
37111B7887619J2723173J0959317R070634P982709Q052991Q830400R619071R797672
37103A04923586Q754359O036100J667503l757716r132145j3058168j4616667j4159429
37095F6657423j2811932j0988248q122302m227390q07331N82534N3221j157638
37087B9178337k362796l612191m712278n281390n681523o759416q502494r894911
$$ plain form
37142 27201766 33850272 38211700 38330187 33251589 24043232 13339313 3652301 -3709774
37134 -3709774 -8375079 -10584201 -11589097 -13544177 -18038889 -24786233 -32173863 -38893809
37126 -38893809 -44694301 -49922957 -54874233 -59350245 -62382857 -62636073 -59581470 -54041286
37118 -54041286 -47073218 -38614104 -27859018 -14757009 -392333 14041272 27887619
37111 27887619 40610792 51570109 60640743 68623452 76676443 85506843 95125914 104923586
37103 104923586 113677945 119714045 121381548 117623832 108491687 95433519 80816852 66657423
37095 66657423 53845491 42857243 34734941 30507551 29700220 30282754 30335975 29178337
37087 29178337 26815541 23203350 18491072 13209682 7528159 768743 -7733751 -17628662
37079a7628662j0343965j0392474j0657672j0806584j0122787q662634p332965
37072h5947743o882693o962545o121625k908400K634667Q565188J2413402J2921984
37064g2287765J0331597N567023m8622m622947o507298n744102l973008k489027
37056g9774149j032643J082928L402197M741653M889303N018393O190389P948910
37048d7533019Q793278P948964O345019N627363O306853P219963O909061N109000
37040F726482K541144l11336l523089o932700r731908j1013367j0304864p599483
37032d0149121l488649O26563L177213L692030K991504J851529L3286k870271
37024c4135916o049657p619960o201716k165176K500744N355429M966967J882867
$$ plain form
37079 -17628662 -27972627 -38365101 -49022773 -59829357 -69952144 -78614778 -85947743
37072 -85947743 -92830436 -99792981 -105914606 -108823006 -106188339 -97623151 -85209749 -72287765
37064 -72287765 -61956168 -56389145 -56437767 -61060714 -67568012 -73312114 -77285122 -79774149
37056 -79774149 -80806792 -79723864 -76321667 -71580014 -66690711 -61672318 -55481929 -47533019
37048 -47533019 -38739741 -30790777 -24445758 -18818395 -12511542 -5291579 1617482 6726482
37040 6726482 9267626 8956290 5433201 -1499499 -11231407 -22244774 -32549638 -40149121
37032 -40149121 -43637770 -43011207 -39833994 -36141964 -33150460 -31298931 -31265645 -34135916
37024 -34135916 -40185573 -47805533 -54007249 -56172425 -53671681 -48316252 -43349285 -41466418
37016d1466418j664649l236947j594788K968188Q965254J4029075J5548924J2103215
37008E651854M708655l647740r986942j2870321j2281434q768644l270629K487459
37000c7977742O265766O562400L599609j066001n737952r240400j0888925j0655953
36992e9139198r498897q723270q472708p347852m104714P13917N546785R768507
36984h1257430J3801221J7347583J8779960J6866499J2250586O517923M87815
36977D794157n612247j0649501j2549752j0330870n620615j491261J99828k2849
36969d1283110o04998p85361o46379L436J595452L445350L624652J122618k506508
36960c6034848m658982m414981k721499l49742K715634N739311O857992N218172
$$ plain form
37016 -41466418 -43131067 -46368014 -47962802 -44994614 -36029360 -22000285 -6451361 5651854
37008 5651854 10360509 6712769 -3274173 -16144494 -28425928 -37194572 -40465201 -37977742
37000 -37977742 -31711976 -25149576 -21549967 -22615968 -28353920 -37594320 -48483245 -59139198
36992 -59139198 -68638095 -77361365 -85834073 -93181925 -97286639 -96572722 -91025937 -81257430
36984 -81257430 -67456209 -50108626 -31328666 -14462167 -2211581 4306342 4794157
36977 4794157 -818090 -11467591 -24017343 -34348213 -39968828 -41460089 -41260261 -41283110
36969 -41283110 -41888108 -42673469 -43319848 -43316412 -41720960 -38275610 -34650958 -33528340 -36034848
36960 -36034848 -40693830 -45108811 -47830310 -48180052 -45464418 -39725107 -32867115 -27648943
36952b7648943K413505P80964R70497K009588K922095L123135J806926j551509
36944a5173742n888190q770523q411460n132847q18051K651641M480085N092722
36936c1970365N490211O316373P493887Q717905R957227J1286722J2616291J3879992
36928D3788243J5152477J6376218J7469617J8841171K0819891K1942693J8951153
36921A73341463J0034052k162999j2117548j6237292j5295735j2313012r366556
36914A15882373o856762m667485k994028k240257k542444l309495l319807j773692
36906H8178403P10583K619324K979485J708685j175267n590453j0479304j4029498
36898F4921958j5459306j5832705j6460775j7050185j6023711j2283850o276569
$$ plain form
36952 -27648943 -25235438 -24454474 -23483977 -21474389 -18552294 -15429159 -13622233 -15173742
36944 -15173742 -21061932 -29832455 -38243915 -43376762 -44194813 -41543172 -37063087 -31970365
36936 -31970365 -26480154 -20163781 -12669894 -3951989 6005238 17291960 29908251 43788243
36928 43788243 58940720 75316938 92786555 111627726 132447617 154390310 173341463
36921 173341463 183375515 181212516 169094968 152857676 137561941 125248929 115882373
36914 115882373 109025611 104358126 101364098 99123841 96581397 93271902 89952095 88178403
36906 88178403 88888986 91508310 94487795 96196480 95021213 89430760 78951456 64921958
36898 64921958 49462652 33629947 17169172 118987 -15904724 -28188574 -34465143
36891c4465143K05981M936141O604844N848502M579828M010914L844009L512956
36883i21968L152260K719912J282853j628724m618440n680968m601778k970807
36875a3267660k011616j610380j486678j992325l252517m467599m730771m067971
36867c6887517l255716k932915l043606k744972q25099L176895Q026092J1458126
36859b7028712J2123086J0760248R632987J1165680J6619867K5033184L3510423
36852I1816763L9720469M4225152M8896711N2507831M9709362L6222839J4505774
36845C77604901p274584k1839334k7428617k6586963k2436285j6781440j0292030
36838B44965648l018371N124053J3636848K1161742K6110626K7330905K4070136
$$ plain form
36891 -34465143 -34259162 -29323021 -22718177 -16869675 -12289847 -8278933 -4434924 -921968
36883 -921968 2230292 4950204 6233057 4604333 -14107 -5695075 -10296853 -13267660
36875 -13267660 -15279276 -16889656 -18376334 -20368659 -23621176 -28088775 -32819546 -36887517
36867 -36887517 -40143233 -43076148 -46119754 -48864726 -49689825 -46512930 -38486838 -27028712
36859 -27028712 -14905626 -4145378 5487609 16653289 33273156 58306340 91816763
36852 91816763 131537232 175762384 224659095 277166926 326876288 363099127 377604901
36845 377604901 370330317 348490983 321062366 294475403 272039118 255257678 244965648
36838 244965648 241947277 247071330 260708178 281869920 307980546 335311451 359381587
36831C59381587J5917822L432220j1240904k4774902l3940255l6910506l4060636
36824B37804426k7846201k1454418j6969322j4631044j3606779j2919378j1589260
36817A18788024q798327m714976p93061J516099K260863K618591L178980L349949
36809A17406142K584328J447096R54187J144023P23878j854479o980714j3247107
36801A02177354j7999548j8773085j4729461p208690Q34077O193788P125755M504162
36793F2124352J160451n83048q47262j331514k755613l980417l762932k379059
36785D7644958q87819M14454J806709K795272K150053m15595l382920m750299
36777D5374813l882729j757235K55129J433881J794136J742629J864862K719391
$$ plain form
36831 359381587 375299409 378731629 367490725 342715823 308775568 271865062 237804426
36824 237804426 209958225 188503807 171534485 156903441 143296662 130377284 118788024
36817 118788024 109989697 105274721 104481660 105997759 108258622 110877213 114056193 117406142
36809 117406142 119990470 121437566 122391753 123535776 124259654 122405175 115424461 102177354
36801 102177354 84177806 65404721 50675260 43466570 44300647 50494435 57620190 62124352
36793 62124352 63284803 62701755 61854493 60522979 57767366 53786949 50024017 47644958
36785 47644958 46757139 47171593 48978302 51773574 53923627 53508032 50125112 45374813
36777 45374813 41492084 39734849 39989978 41423859 43217995 44960624 46825486 49544877
36769D9544877M416703O313381P388018P190570O368055O013347O528474P461466
36761A01224891Q494261J0043028J2417772J4685065J5050626J2625173Q599956
36754A83140772N544452N536690Q700396J3125198J6175595J6331983J4233673
36747B62788759J2185830J2694226J7014470K4047155K9927705K9495057J9934106
36740D08087308L870500j1716182k0445330k0597888j4673768o105752K873456
36733C41292344J1057966J7563791K1662334K2588916J9334461J1343178k48426
36726D44594564j2633149k3019449l0025230l3353437l2919130k9053877k3218632
36719B60371660j7631493j3934950j2461420j2611421j3408022j3724025j2672515
$$ plain form
36769 49544877 53961580 60274961 67662979 74853549 81221604 87234951 93763425 101224891
36761 101224891 109719152 119762180 132179952 146865017 161915643 174540816 183140772
36754 183140772 188685224 194221914 202922310 216047508 232223103 248555086 262788759
36747 262788759 274974589 287668815 304683285 328730440 358658145 388153202 408087308
36740 408087308 411957808 400241626 379796296 359198408 344524640 338418888 341292344
36733 341292344 352350310 369914101 391576435 414165351 433499812 444842990 444594564
36726 444594564 431961415 408941966 378916736 345563299 312644169 283590292 260371660
36719 260371660 242740167 228805217 216343797 203732376 190324354 176600329 163927814
36712A63927814j0171651o830524l073389J215839N794852R151439R219675N366444
36704A74600499m72440m917609n693960l379818p88605m85347k711897n659070
36696A50491753p562282q160539q127696p777411o925586n661149m436993l375066
36688I8465031k240656j339126j657422l503485n516782n830681m062925j448344
36680G2865610Q99510K969909M914586O126406N994808M926660L643487J823654
36672A04164630j339622n131904p191545o146660l463760j690796j515007j719558
36664G5965778j554974j563006j959084j874846r60489l77370j095981k269987
36656F4310041k637791k709887l894065n827818o437316m874558k701653j511094
$$ plain form
36712 163927814 153756163 146925639 143852250 145068089 150862941 160014380 169234055 174600499
36704 174600499 174128059 169210450 163516490 160136672 159348067 158862720 156150823 150491753
36696 150491753 142929471 134768932 126641236 118863825 111938239 106277090 101840097 98465031
36688 98465031 96224375 94885249 93227827 89724342 84207560 78376879 74313954 72865610
36680 72865610 73765120 76735029 81649615 87776021 93770829 98697489 102340976 104164630
36672 104164630 102825008 97693104 90501559 84354899 80891139 79200343 77685336 75965778
36664 75965778 74410804 72847798 70888714 69013868 68053379 67676009 66580028 64310041
36656 64310041 61672250 58962363 55068298 49240480 42803164 37928606 35226953 33715859
36648C3715859q19649P16558L130626N328161O651474P109491O605338N119948
36640F7557806L360050K064026P17900j981438o205916j0335054j2405051j1634432
36632C1137891q529340m275659k53227K539743M006792M646996M730178M228477
36624C8231851L463630L045720K968580K473920J126948o27696k343026m273718
36616D4066209o565253q280074q068655n695680k313413O96162K662604L574149
36608B0076049L761935L794157M180636M849512N107614M375676K981277K129188
36600E1256044K894663M954451O321114M877108O29802l855367n825420n008600
36592E6243795l365104k368027j476616M10903K982010M869889N469285N339948
$$ plain form
36648 33715859 32896210 33612768 36743394 42071555 48723029 55832520 62437858 67557806
36640 67557806 70917856 72981882 73699782 71718344 65512428 55177374 42772323 31137891
36632 31137891 22608551 18332892 18079665 20619408 24626200 29273196 34003374 38231851
36624 38231851 41695481 44741201 47709781 50183701 51310649 50682953 48339927 44066209
36616 44066209 37500956 29220882 21152227 15456547 13143134 13839296 16501900 20076049
36608 20076049 23837984 27632141 31812777 36662289 41769903 46145579 49126856 51256044
36600 51256044 54150707 59105158 65426272 70303380 70933182 67077815 61252395 56243795
36592 56243795 52878691 50510664 49034048 49444951 52426961 57296850 62766135 68106083
36584F8106083M872226L587522J107169j990501m821278p124046q959501j0025032
36576D4752642j0102612r900988j0457737j1581221j1754645r957196o882197
36569b5883954l832141r95834K361791O129154Q553668P653640L340822k027380
36561d700234n339030n144254k480287O48659L268160N547684P327353P573800
36553F701851N704040K745816N80731L54945J893366M024888M987322L300374
36545C0293333p47093m776389o384009n416396l527026j862240k17954J672486
36537I034712L248494L842694L414781K306983J119104J085305L543252Q297327
36529C5892652J3061248J5156182J3537565R005323L062903k995349q357698j2539685
$$ plain form
36584 68106083 72978309 76565831 77673000 75682499 70861221 63737175 54777674 44752642
36576 44752642 34650030 24749042 14291305 2710084 -9044561 -19001757 -25883954
36569 -25883954 -29716095 -30711929 -28350138 -22220984 -13667316 -6013676 -2672854 -4700234
36561 -4700234 -10039264 -15183518 -17663805 -17015146 -13746986 -8199302 -871949 6701851
36553 6701851 12405891 15151707 15732438 16087383 17980749 22005637 26992959 30293333
36545 30293333 29546240 24769851 18385842 12969446 9442420 7580180 7362226 9034712
36537 9034712 12283206 16125900 19540681 21847664 22966768 24052073 27595325 35892652
36529 35892652 48953900 64110082 77647647 86652970 89715873 86720524 78362826 65823141
36521F5823141j4826653j4093848j0075503m909115k104694l048015n259509n028932
36513F476872j299990L732136P136285P334629M341294n59724n201482p674323
36505A4285697p557883n710322l073206l61821J383799J129777r18678l175621
36497c998258m160737l719320k706577k030304k044718k201644j193853J768140
36489b0287271N559923P815895P419671N597395M032615K707602M92870k682721
36481A0655979n412696o549333o390497n882586n444134n077020n083507n955980
36473c5139774p631476r335734j0199185r704019p591448l880363P52903N038729
36465g7690367Q033124R819996J0940985J1397293J0827289R519234Q330418P299878
$$ plain form
36521 65823141 50996488 36902640 26827137 21918022 19813328 16765313 11505804 6476872
36513 6476872 5176882 8909018 16045303 23379932 27721226 27161502 21960020 14285697
36505 14285697 6727814 1017492 -2055714 -2417535 -1033736 96041 -822637 -3998258
36497 -3998258 -8158995 -11878315 -14584892 -16615196 -18659914 -20861558 -22055411 -20287271
36489 -20287271 -14727348 -6911453 508218 6105613 10138228 12845830 13338700 10655979
36481 10655979 5243283 -1306050 -7696547 -13579133 -19023267 -24100287 -29183794 -35139774
36473 -35139774 -42771250 -52106984 -62306169 -72010188 -79601636 -83481999 -82729096 -77690367
36465 -77690367 -69657243 -59837247 -48896262 -37498969 -26671680 -17152446 -8822028 -1522150
36457a522150N219945J327528l089051n616412n106060k545770J99256J795128
36449i337586J837053Q85736L33680J338353L367202M372886K932109j55018k779649
36440B794766l635528k990995j767819m97243R01483K819121N452023Q217336
36432A1293144R693279Q631703N307496J664162j78075K83988J510020J243535
36424C9449252j497120n378345p585709n966337p21757N807797J1018699J3819519
36416D8945999J4764640J4735569J3800110J1459870P701057L320562q36530m470807
36408A09420470p341815q608558p338238l787252K33852K534138K083627m37924
36400H6758300l332032n204032n977732o676677q012354r326918r289611p478433
$$ plain form
36457 -1522150 3697795 5025323 1936272 -3680140 -8786200 -11331970 -11132714 -9337586
36449 -9337586 -7500533 -6614797 -6281117 -4942764 -1575562 2797324 5729433 5574415 2794766
36440 2794766 -840762 -3831757 -5599576 -6096819 -5195336 -2376215 3075808 11293144
36432 11293144 20986423 29618126 34925622 36589784 36411709 36695697 38205717 39449252
36424 39449252 37952132 32573787 24988078 19021741 18299984 24107781 35126480 48945999
36416 48945999 63710639 78446208 92246318 103706188 111407245 114727807 113891277 109420470
36408 109420470 102078655 93470097 86131859 82344607 82578459 85112597 87196224 86758300
36400 86758300 83426268 78222236 72244504 65567827 57555473 48228555 38938944 31460511
36392C1460511m733087k054034M9857R80294j53151l358408o931874q704193p974983
36383a419068n563483k236849J872213O119842Q743528Q370416N882669L941908
36375B5711176M341082O151096O829862N108870K414546J141227J714602J979125
36367E5391586k24920m424822q077984r404998q704814o846461l744384P43500
36359A4706703N142141O934470N010978P92821l248741n552740n893237m830039
36351A3062356l400671k780065l408004m509352m922246m249966k841892j000716
36343a4050556J129808L019091L777551K863226M21657k876366n742725o260595
36335a7718909l061165K953230Q571657J0449421P341898N79587o821388j1555866
$$ plain form
36392 31460511 26727424 24673390 24723247 25703541 25550390 22191982 15260108 6555915 -1419068
36383 -1419068 -6982551 -9219400 -7347187 -1227345 7516183 15886599 21769268 25711176
36375 25711176 30052258 36203354 43033216 48142086 50556632 51697859 53412461 55391586
36367 55391586 55166666 50741844 42663860 33258862 24554048 17707587 13963203 14706703
36359 14706703 19848844 26783314 31794292 32587113 29338372 23785632 17892395 13062356
36351 13062356 9661685 6881620 3473616 -1035736 -5957982 -10207948 -13049840 -14050556
36343 -14050556 -12920748 -9901657 -6124106 -3260880 -2839223 -5715589 -11458314 -17718909
36335 -17718909 -20780074 -17826844 -9255187 1194234 8536132 9115719 2294331 -9261535
36327i261535j1781747q305767l587908P84422N039570R493596J3036964J4120514
36319I538109J2346827Q245376K487646l463309o905880n974099k049883J368300
36311A5593087K203401R99115r85733k959924l763897k059451J602345M500527
36303A5129470M736030L309575K144463J356272m0679j802164k733507k870549
36295A9228911l535491n073006o013526m932933k153013P34314K251970J830011
36287B337237J48053j020338j41466K466627M894627N696958N030495L622160
36279B3034353J603945r74449l216502l952884l150487k086054k001757k909911
36271F346254l767768l614164k481535j252011o06821k04212R01978L090325N740755
$$ plain form
36327 -9261535 -21043282 -29349049 -32936957 -32152535 -27112965 -17619369 -4582405 9538109
36319 9538109 21884936 30130312 32617958 29154649 22248769 16274670 14224787 15593087
36311 15593087 17796488 18795603 17809870 14849946 11086049 9026598 10628943 15129470
36303 15129470 19865500 23175075 25319538 26675810 26635131 24832967 22099460 19228911
36295 19228911 15693420 10620414 4606888 -326045 -2479058 -1744744 507226 2337237
36287 2337237 2485290 1464952 1323486 3790113 8684740 14381698 19412193 23034353
36279 23034353 24638298 23663849 20447347 16494463 13343976 11257922 9256165 6346254
36271 6346254 2578486 -1035678 -3517213 -4769224 -5376045 -5580257 -4678279 -1587954 4152801
36262D152801P970692R360102R788558R034531O964713L915449N38178k607870
36254D9117154n057548o260751n829766l974047j440237R02614K177516J498488
36246C1133423j384380n183471p489168o845160m343305k587605l006699m702953
36238d409318o059739o729708p405027q127819p861189n865149k639384R60813
36230d8136520M898345R500073J4070050J6764050J6180117J2832394Q856277
36223C4964786O293676N617451N733809N274324L819750J887448M77j825390l668768
36214E8097563n231856n996542n534043l504329K00102M934200R220257J1563910
36206F3749262J1233642Q265352L411078j549834m412354m586911m136570n545732
$$ plain form
36262 4152801 12123493 21483595 31272153 40306684 47271397 51186846 51725024 49117154
36254 49117154 44059606 37798855 31969089 27995042 26554805 27457419 29634935 31133423
36246 31133423 29749043 24565572 17076404 10231244 5887939 3300334 293635 -4409318
36238 -4409318 -10469057 -17198765 -24603792 -32731611 -40592800 -46457949 -49097333 -48136520
36230 -48136520 -43238175 -33738102 -19668052 -2904002 13276115 26108509 34964786
36223 34964786 41258462 46875913 52609722 57884046 61703796 63591244 63591721 61766331 58097563
36214 58097563 52865707 46869165 41335122 37830793 38030895 42965095 52185352 63749262
36206 63749262 74982904 83248256 86659334 85109500 80697146 76110235 71973665 66427933
36198F6427933q465645r861691p673413l269014K07488J013919k21491j809882
36190C6348204k434468j832487q73668o77979j145353q96960O81858K059698J336969
36181C2565814j006324k506703j896093n10566r6287n48009p97286r52336k108668
36172B2143542m259138n742005n155476k932669m63231J734027M196953P003551
36164A6525554Q710764P147997J310435p367729j5435693j9366723j7736266j2019437
36156c8231098n402852p38275O66540r74524m272770o955106o842665l555212
36148f6305962Q33111L552082L685987K519563J479452O89762p0685j00588J305725
36139e2411553L092131L051047N89516k170443k739927j035823Q60100J108291
$$ plain form
36198 66427933 57962288 48100597 40427184 37158170 37365658 38379577 38158086 36348204
36190 36348204 33913736 32081249 31207581 30529602 29384249 28487289 29169147 31228845 32565814
36181 32565814 31559490 29052787 27156694 26646128 26549841 26001832 25204546 24252210 22143542
36172 22143542 17884404 12142399 6986923 4054254 3591023 5325050 9522003 16525554
36164 16525554 25236318 32384315 33694750 26327021 10891328 -8475395 -26211661 -38231098
36156 -38231098 -43633950 -44372225 -43705685 -44680209 -48952979 -55908085 -62750750 -66305962
36148 -66305962 -65472851 -61920769 -58234782 -55715219 -54235767 -53546005 -53616690 -53717278 -52411553
36139 -52411553 -49319422 -46268375 -45678859 -47849302 -50589229 -51625052 -50764952 -49656661
36131d9656661n23422l119074n217587n101381j947614K661035N417405M545165
36123e2942134K014946J630747M972219R898845J3044912J3092505J1356334R730321
36115A2798695Q655437P134749M374090R21476k130366m756698p949219j1694298
36107G353866j3832501j1936539o138981P87071O157802R337202J0897051J0956578
36099A3581549R200112O081961L072362J353825M56526j447134n399224r653615
36091A7246362j0580637o513506l74419K722327O07546m241753q136798r720732
36083a8991610r456086p374655l133686K383502P211345R988581J0404849Q339915
36075f27845M046040p29777l289766k398953M77894K675573K522086K7702l700615
$$ plain form
36131 -49656661 -50180083 -53299157 -58516744 -63618125 -65565739 -62904704 -57487299 -52942134
36123 -52942134 -50927188 -49296441 -44324222 -34425377 -21380465 -8287960 3068374 12798695
36115 12798695 21454132 28588881 32962971 33884447 31754081 26997383 19048164 7353866
36107 7353866 -6478635 -18415174 -24554155 -23767084 -17609282 -8272080 2624971 13581549
36099 13581549 22781661 28863622 31935984 33289809 33746335 32299201 26899977 17246362
36091 17246362 6665725 152219 -222200 2500127 3107673 -1134080 -9270878 -18991610
36083 -18991610 -28447696 -35822351 -38956037 -36572535 -29361190 -19372609 -8967760 -627845
36075 -627845 3418195 2688418 -601348 -3000301 -2522407 153166 2675252 2702954 -997661
36066i97661p279740r775685j0932085j0543942p974977l029602K890287P416180
36058d0227225R073947P893778M582582L23275k813458l040271j097445J7137
36050b5287680j582861m519429n942687m330688J12933O290309J2095817J4743050
36042h421236J3089795R195251O033537M012713J262334k951894o917434q806296
36034F496770q716726p830437o820549n777770m655297k983738O6011M474376
36026b5747360Q630181J0405773Q763348M206950j538962n811156n982876j555756
36018h629858M645209Q334977P391579L493347J54895m89083J099855L145814
36010A9146735M186748L398842L91610m151674p841625q080647n026214k114852
$$ plain form
36066 -997661 -8277401 -18053086 -28985171 -39529113 -47504090 -50533692 -47643405 -40227225
36058 -40227225 -31153278 -23259500 -18676918 -18353643 -21167101 -24207372 -25304817 -25287680
36050 -25287680 -26870541 -31389970 -37332657 -41663345 -41550412 -35260103 -23164286 -8421236
36042 -8421236 4668559 13863810 19897347 23910060 25172394 22220500 15303066 6496770
36034 6496770 -2219956 -10050393 -16870942 -22648712 -27304009 -30287747 -30221736 -25747360
36026 -25747360 -17117179 -6711406 2051942 6258892 4719930 -1091226 -7074102 -8629858
36018 -8629858 -3984649 4350328 11741907 15235254 15390149 14901066 16000921 19146735
36010 19146735 23333483 26732325 27123935 22972261 15130636 7049989 2023775 -91077
36002i1077k485239n431061p642476p497477o408764n856494n126114l049548
35994d3588250m33446Q74777N62237o1274j38987J00445O61530K101407M125210
35985c5796351N291682M968407M562223N753077Q121362R649708R331295Q164756
35977B0046159P457277P227915O905540O878032Q350730J1663061J5487217J8116194
35969A02132125J9337518K0775048K4408472L0698350L7729034M1826514L9401214
35962C16308275K9243488J3857016j576404j2447840j7799253k0364232k3269895
35955B83951155k6609958k7581248k4071729j7497358j1500732q245608o911629
35948A61532893n757832m411730l471537k879892j940472o35032K24295K27680
$$ plain form
36002 -91077 -2576316 -8007377 -15649853 -23147330 -29556094 -35412588 -40538702 -43588250
35994 -43588250 -44021696 -43146919 -42584682 -42645956 -42784943 -42684498 -42022968 -39921561 -35796351
35985 -35796351 -30504669 -25536262 -20974039 -15220962 -7099600 2550108 11881403 20046159
35977 20046159 27503436 34731351 41636891 48514923 56865653 68528714 84015931 102132125
35969 102132125 121469643 142244691 166653163 197351513 235080547 276907061 316308275
35962 316308275 345551763 359408779 357832375 345384535 327585282 307221050 283951155
35955 283951155 257341197 229759949 205688220 188190862 176690130 168444522 161532893
35948 161532893 155775061 151363331 147891794 145011902 143071430 142436398 142660693 142888373
35940A42888373j43270m05877o74712j228398k294111m443189q187943j2620455
35932A12890418j5315870j4432723j0440135n134965L85613N810245J0216012
35925H3978595J2023555J0642271P205270L273592m39674l617537n347974m391921
35917A03326177l04663O119806J3260268J9077103K1519588J9565406J4307750
35910A96871435Q462769M161192J325512j366601m163643n697450m989398l188125
35902A91415691k529402l912899o334971q573618j0443153j2163311j3482071
35895A33976266j4078728j4166158j3926593j2813280j0302202p179219n202938
35888E6307148n259681o320575o383203m219123l42681L338689M980870M448307
$$ plain form
35940 142888373 142745103 142339226 141664514 140436116 138142005 133698816 125510873 112890418
35932 112890418 97574548 83141825 72701690 67566725 67952338 73762583 83978595
35925 83978595 96002150 106644421 113849691 117123283 116683609 113066072 107718098 103326177
35917 103326177 103021514 109141320 122401588 141478691 162998279 182563685 196871435
35910 196871435 205334204 209495396 210820908 209454307 205290664 199593214 194603816 191415691
35902 191415691 188886289 184973390 178638419 170064801 159621648 147458337 133976266
35895 133976266 119897538 105731380 91804787 78991507 68689305 61510086 56307148
35888 56307148 51047467 44726892 38343689 34124566 33781885 37120574 42101444 46549751
35880D6549751L540025M223736O769691J0006549J3043976J5956494J8964999
35873A19055221K1985063K5129193K8553246L1273627L1123655K6866194J9949250
35866C03935449J3332678Q695664N369743J844078k327931o196175q591229r533227
35858C06529050j0515319j3081285j6887173j9574632j9009265j5359576j0556823
35851B01544977o156965k486326L71408J802442J249109j024140m127013p161666
35843A84011826r413286j0305841r585658p573671n177523l603881l654895m792716
35835A29904355n088293k904475J062579L957710L377527m59307n239085q630733
35827A15980278r490638p791779m428559j124906K51578j221599n005797r307028
$$ plain form
35880 46549751 50089776 54313512 61083203 71089752 84133728 100090222 119055221
35873 119055221 141040284 166169477 194722723 225996350 257120005 283986199 303935449
35866 303935449 317268127 325963791 331333534 333177612 330849681 324653506 316062277 306529050
35858 306529050 296013731 282932446 266045273 246470641 227461376 212101800 201544977
35851 201544977 195388012 192901686 193273094 195075536 196324645 195300505 191173492 184011826
35843 184011826 174598540 164292699 154707041 147133370 141955847 138351966 134697071 129904355
35835 129904355 124816062 121911587 122974166 126931876 130309403 129850096 124611011 115980278
35827 115980278 106489640 98697861 94269302 93144396 93395974 92174375 87168578 77861550
35819G7861550j1523151r260689k299836O112415J1046451R968509M845331j99512
35811H6551068k761331l114444k235781n68057J056447R22038j883268n915202
35803G2051470q612688q856832p437116n338725k871030o54279m0946j558020
35795C6681834l664546m162742k641067o17914O82924J730507L490749N546081
35787C7045826O156180M183881N85763k176896k221145J59037K833481L730061
35779E0296188K462496K91049j244986j623091j624015k584720n096542q047767
35771C2828612r090786o574681j242665M145221O981131O625094M349118J914664
35763C9935708L08917l77868j32091J580684N147562R478701J2038224J0921461
$$ plain form
35819 77861550 66338399 57077710 54777874 60890289 71936740 81905249 86750580 86551068
35811 86551068 83789737 80675293 78439512 77871455 78927902 79849940 77966672 72051470
35803 72051470 63438782 54581950 47144834 41806109 38935079 38280800 38239854 36681834
35795 36681834 33017288 28854546 26213479 25595565 26278489 28008996 31499745 37045826
35787 37045826 43202006 47385887 47971650 45794754 43573609 43732646 46566127 50296188
35779 50296188 52758684 53049733 51804747 50181656 48557641 45972921 40876379 32828612
35771 32828612 23737826 17163145 15920480 20065701 27046832 33671926 38021044 39935708
35763 39935708 40244625 39866757 39734666 41315350 46462912 55941613 67979837 78901298
35755G8901298O715045J697407k604362o331459r958670j3149272j5299874j6306696
35747B3663417j6177983j4605385j1709927q740372p117706o839299o478735m812700
35739e2818690k046569M86962J470426O30200q94605j328919J34124K617059M835545
35730d6914467O750294R206590J2107822J3951487J3477100J1023047P923317
35723B7525190N320979M005788M453762N931876O017581K417552m246579j0212298
35715D1213851j1752380q413942k964982J388159L325209L451922K962641K617154
35707C1827632K592569K741274K765765K264075Q92910j185376k890960k566471
35699C6441418P49704O189788J1426389J4356744J4324888J1775736P321608J660782
$$ plain form
35755 78901298 85616343 87313750 84709388 78377929 68419259 55269987 39970113 23663417
35747 23663417 7485434 -7119951 -18829878 -27570250 -34687956 -41527255 -48005990 -52818690
35739 -52818690 -54865259 -54378297 -52907871 -52277671 -53172276 -54501195 -54367071 -51750012 -46914467
35730 -46914467 -40164173 -30957583 -18849761 -4898274 8578826 19601873 27525190
35723 27525190 32846169 36851957 41305719 47237595 53255176 55672728 51426149 41213851
35715 41213851 29461471 21047529 18082547 19470706 22795915 26247837 29210478 31827632
35707 31827632 34420201 37161475 39927240 42191315 43084225 41898849 39007889 36441418
35699 36441418 37191122 43380910 54807299 69164043 83488931 95264667 102586275 104247057
35691A04247057l950482q010041r846850r998017r355372q346918p136731o041688
35683D1560958n126910l624908n38446L834604P335909P402868L288010l193708
35675E0938377r123134j2582535j3322111j1761791q094745k758148K763852O498949
35667B558714P526659O538242M876034L552428L174129L938764N254380O081700
35659D3501050O344538P523868J1052551J6298412K0825979K2621097K1560560
35652A49728055J8869424J5813077J2928659R871637N827872N79183m657758p924256
35644B01035893q344158p023757o031495o763742r301759j2779660j5951769j7709834
35636A17129719j7633128j6228098j4470505j2990106j1707457j0230668q423231
$$ plain form
35691 104247057 100296575 92286534 82439684 72441667 63086295 54739377 47602646 41560958
35683 41560958 36434048 32809140 32270694 36105298 43441207 50844075 54132085 50938377
35675 50938377 41815243 29232708 15910597 4148806 -3945939 -6704087 -3940235 2558714
35667 2558714 10085373 16623615 21499649 25052077 28226206 32164970 37419350 43501050
35659 43501050 49845588 57369456 68422007 84720419 105546398 128167495 149728055
35652 149728055 168597479 184410556 197339215 207210852 213038724 213617907 208960149 201035893
35644 201035893 192691735 185667978 179636483 172872741 163570982 150791322 134839553 117129719
35636 117129719 99496591 83268493 68797988 55807882 44100425 33869757 25446526
35629B5446526o387012m048287j376544O66162J99164l327102p076227o609202
35621b512522o24282P040966J1134284R994441N902456J481903k420350n523731
35613B4473165o852662n557489j967132K773819P333500J0152130R840037O362521
35605D6557889J313368l334976o220534o463666l909627r3610K241511J610925
35597C1701280q65243l194399m653205n379235m936201k761853M21918L073053
35589A3406115M693341O153238Q071139R708050R611582O873178J948570l218592
35581E7246621o294438o604946n867400o147590p432946q048971o958390m413274
35573E478666o57425M386686R796645J3383182J3461015J0130064M508996k250821
$$ plain form
35629 25446526 19059514 15011227 13634683 14300845 14500009 11172907 4096680 -2512522
35621 -2512522 -3136804 3904162 15038446 25032887 30935343 32417246 29996896 24473165
35613 24473165 17620503 12063014 10095882 12869701 20203201 30355331 40195368 46557889
35605 46557889 47871257 44536281 38315747 31852081 27942454 27848844 30090355 31701280
35597 31701280 30836037 27641638 22988433 17609198 12672997 9911144 10333062 13406115
35589 13406115 18099456 24252694 32323833 42031883 51643465 58516643 60465213 57246621
35581 57246621 50952183 44347237 38479837 32332247 24899301 16850330 9891940 5478666
35573 5478666 4821241 9207927 19004572 32387754 45848769 55978833 60487829 58237008
35565E8237008q635029j2504758j2260636q157619k173968L071528N356337L914534
35557B6847397J30419l458730n407182o172788o620567o810049o730700o859428
35549a5081628o863768m954470k10537N169577P927598P944565Q342905J0925473
35541A3199715J3503564J2966284R447240N679490L084146N61634k833129n987899
35533D9621045p400149p421789p498390p723407o559301l223035O38522K267908
35525A2701404L91443l906444q461462j1509192j2071063r887163n732444j527608
35517d0002529P63403Q54015M82176J592801M248550O731779P612288P060472
35509a0657045N923823M340954K115856N3970k55327J674639M326118N644129
$$ plain form
35565 58237008 49601979 37097221 24836585 16678966 14504998 17576526 22932863 26847397
35557 26847397 26977816 23519086 18111904 11939116 5318549 -1491500 -8222200 -15081628
35549 -15081628 -21945396 -26899866 -27110403 -21940826 -14013228 -6068663 2274242 13199715
35541 13199715 26703279 39669563 49116803 54796293 57880439 58442073 55608944 49621045
35533 49621045 42220896 34799107 27300717 19577310 13018009 9794974 10433496 12701404
35525 12701404 13092847 9186403 724941 -10784251 -22855314 -32742477 -38474921 -40002529
35517 -40002529 -39239126 -38385111 -37902935 -36310134 -32061584 -25329805 -17717517 -10657045
35509 -10657045 -4733222 -392268 1723588 1777558 1522231 3196870 7522988 13167117
35501A3167117M938338K975259P54554j204278k715096l732674m244104l987089
35493E952027k529366o1985K247563L388217L803978M746188O275529O761512
35485C0583663M816281J237839j425563j067165K336227O817070R792283R704342
35477F2794977O918546L211631K37154j669747l363871n796347r049358j2204661
35469D1078324j3973413j3491920j0695062o227957j265342K769384M920882N393728
35461H508624N103117M339811K529078k60974k442755k596491j560951j524805
35453A2094654l015445m055178k693668O80982M092368O088882O374785N087247
35445B4654627K446329r99684m325991o384714o012556k818230J785881N078516
$$ plain form
35501 13167117 18105455 21080714 21835268 20630990 17915894 14183220 9939116 5952027
35493 5952027 3422661 3360676 5608239 8996456 12800434 17546622 23822151 30583663
35485 30583663 35399944 36637783 35212220 34145055 36481282 43298352 53090635 62794977
35477 62794977 69713523 72925154 73162308 71492561 68128690 62332343 53282985 41078324
35469 41078324 27104911 13612991 2917929 -3310028 -4575370 -1805986 3114896 8508624
35461 8508624 13611741 17951552 20480630 20219656 17776901 15180410 13619459 12094654
35453 12094654 9079209 5024031 2330363 3011345 7103713 13192595 19567380 24654627
35445 24654627 27100956 26101272 21775281 15390567 9378011 6559781 8345662 13424178
35437A3424178N401257L732192K272221J863361J549738L17649j719675l794390
35429B3046531n134037m932315k625964J163836M457056N359798L694316R95522
35421B6024743q84661q92169J136615M646313Q201288R716316P921221M058209
35413E9927875J484189K719626O918310J0876859J2479277J2315338J1731753
35406A18453227J0368581O589428J230p350932j2471693j3765342j1971995r139379
35398H0713125o732781m616522j876531J504599M186615M734860K915586l33739
35390H0495212l657038n873177o614865o835847p977996j0039347j1123223r619991
35382A8753728o240220l086076j308240o27702n20107m96161M83923L241046O685638
$$ plain form
35437 13424178 18825435 22557627 24829848 26693209 28242947 28560596 26840921 23046531
35429 23046531 17912494 12980179 10354215 11518051 15975107 21334905 25029221 26024743
35421 26024743 25140082 24247913 25384528 30030841 38232129 47948445 55869666 59927875
35413 59927875 61412064 64131690 71050000 81926859 94406136 106721474 118453227
35406 118453227 128821808 135411236 135412466 128061534 115589841 101824499 89852504 80713125
35398 80713125 73980344 69363822 67487291 68991890 73178505 77913365 80828951 80495212
35390 80495212 76838174 70964997 64350132 57514285 49536289 39496942 28373719 18753728
35382 18753728 12513508 9427432 8119192 7491490 6971383 6475222 6959145 10200191 16885829
35373A6885829Q196113O296672K144097j948586m493073n021581l639204j407250
35365A7013017l35376j716916m576416o577974o478790n203152m627307n754856
35357a8257770p925751r336486q390516m958741m53276L350162N425457N628485
35349c4918436M498418L387888M168638P851240J3321196J7863198J9157813J6851306
35341E2181261J2536734Q456158N843578M044409J387567k741056o904991r039667
35333F5763993q537336o367169l456908Q0515L919130O636477O647777L860845
35325F8547324p9479l186332m516252m322653l364564k392814k123435l182464
35317D5379331n620280q420991r817610q501363m767633n47852J786760J024395
$$ plain form
35373 16885829 25081942 31378614 33522711 31574125 27081052 22059471 18420267 17013017
35365 17013017 16677641 14960725 10384309 3806335 -2672455 -7875607 -12502914 -18257770
35357 -18257770 -26183521 -35520007 -43910523 -48869264 -49322540 -45972378 -40546921 -34918436
35349 -34918436 -30420018 -27032130 -22863492 -15012252 -1691056 16172142 35329955 52181261
35341 52181261 64717995 73174153 79017731 83062140 84449707 81708651 74803660 65763993
35333 65763993 57226657 50859488 47402580 47483095 51402225 58038702 64686479 68547324
35325 68547324 68467845 65281513 60765261 56442608 53078044 50685230 48561795 45379331
35317 45379331 39759051 31338060 21520450 13019087 8251454 7703602 9490362 10514757
35309A0514757j989739m903669n625940l887717j113930J183062K643963L763844
35301E84631M931925O146397P236356P705105O509077K788140k857858q248018
35293B4795755j1121118j0621995p331926k439175K669231O483320P977721P439615
35285A7851428O244950N496609N101190M327226K838431P27701k152405o125604
35277C4309526j0789823j4778748j6817726j6640466j4485909j0174406l478962
35270e2856514M637789J1943660J6430265J7500962J5587245J1288746N423350
35263B9955503n48060m963419o968050o824808n407799l813714l238423m392137
35255f200907o605731p905588o507656k398071K524183N774755N941008L528734
$$ plain form
35309 10514757 8525018 3621349 -2004591 -5892308 -7006238 -5823176 -3179213 584631
35301 584631 5516556 11662953 18899309 26604414 33113491 35901631 33043773 24795755
35293 24795755 13674637 3052642 -4279284 -6718459 -4049228 2434092 10411813 17851428
35285 17851428 24096378 29592987 34694177 39021403 41859834 42587535 40435130 34309526
35277 34309526 23519703 8740955 -8076771 -24717237 -39203146 -49377552 -52856514
35270 -52856514 -48218725 -36275065 -19844800 -2343838 13243407 24532153 29955503
35263 29955503 29407443 24444024 17475974 10651166 5243367 1429653 -1808770 -6200907
35255 -6200907 -12806638 -20712226 -27219882 -29617953 -27093770 -21319015 -15378007 -11849273
35247a1849273M09767j792981k887050l467540l258367r64296L679976Q442197
35239a1687567J0293198Q546539N390785L195010K278340J704380J123686P94775
35231B1639146M76120l70239j343132j208039N35877L072157N478170P645872
35223C5925932R671280J1249406J2226648J2903115J3055281J1464151P458391
35216A13954204K420500j396184l346562m586420n854572o280708m756115j557757
35208H8596386J816754L667765K602665j997915r138350j6202820k0483574k0733234
35200B8127677j7280551j1446701n350279j387422o44656j776341k210735o35158
35192a2604166K067766M157756M696820L935923K766292K090915K344520L272058
$$ plain form
35247 -11849273 -11439506 -13232487 -16119537 -19587077 -22845444 -23809740 -20129764 -11687567
35239 -11687567 -1394369 7152170 12542955 15737965 18016305 19720685 20844371 21639146
35231 21639146 22115266 21745027 20401895 19193856 19729733 22801890 28280060 35925932
35223 35925932 45597212 56846618 69073266 81976381 95031662 106495813 113954204
35216 113954204 116374704 114978520 111631958 107045538 101190966 94910258 90154143 88596386
35208 88596386 90413140 94080905 96683570 94685655 85547305 69344485 48860911 28127677
35200 28127677 10847126 -599575 -5949854 -7337276 -7981932 -9758273 -11969008 -12604166
35192 -12604166 -10536400 -6378644 -1681824 2254099 5020391 7111306 9455826 12727884
35184A2727884M162566M273093L021195J58442l765570p242417q659948p511956
35176b836711m592730j099090K158606M829763O848486Q285893R047288Q736727
35168C1378232P201352N123077L491388K392653R14673j496693m124561n776349
35160C9103772o017123n186251l702107k112580j612818l460917p300359j0564202
35152h52585j0408512o537910j774398N39359l51930k278900k669818q82689J937220
35143b3280163M452213N927505N950617M348888J523152j716329m739383p094838
35135a4628338q118627p386149n671974m571861m764488n331353n123735l948752
35127e9545277j913688J306891N430407Q518641Q438497N352459J665866n32219
$$ plain form
35184 12727884 16890450 21163543 24184738 24343180 20577610 13335193 4675245 -2836711
35176 -2836711 -7429441 -8528531 -6369925 -1540162 5308324 13594217 22641505 31378232
35168 31378232 38579584 43702661 47194049 49586702 50501375 49004682 44880121 39103772
35160 39103772 33086649 27900398 24198291 22085711 20472893 17011976 9711617 -852585
35152 -852585 -11261097 -17799007 -19573405 -19034046 -19385976 -21664876 -24334694 -25217383 -23280163
35143 -23280163 -18827950 -12900445 -6949828 -2600940 -1077788 -2794117 -7533500 -14628338
35135 -14628338 -22746965 -30133114 -35805088 -40376949 -45141437 -50472790 -55596525 -59545277
35127 -59545277 -61458965 -60152074 -54721667 -46203026 -37764529 -32412070 -30746204 -31278423
35119c1278423r81057k75599J238890L068514M191230L989796L028278K230376
35111a4787995J736798J161141M84021n3547o39061j651737k727436k716200q39080
35102b0033096K324308N045270N563811L295381o23738l980375n010263l512479
35094a6931181o00288K390650M657403N912964N976780M554032J695517j282297
35086F373580j861915J583417P461724J1635489J1068464O333808K52967m954981
35078C7892553q455253r874015r151894p110762m958037l200736j848368j322127
35070h028639j994762l021800k952916j579209O7910J621125L803163O553321
35062e531807Q225446P486007M887841J748431j476355m800858p715760r729478
$$ plain form
35119 -31278423 -32259480 -32535079 -31296189 -28227675 -24036445 -20046649 -17018371 -14787995
35111 -14787995 -13051197 -11890056 -11406035 -11459582 -12098643 -13750380 -16477816 -19194016 -20033096
35102 -20033096 -17708788 -12663518 -7099707 -3804326 -4428064 -8408439 -13418702 -16931181
35094 -16931181 -17531469 -15140819 -10483416 -4570452 1406328 5960360 7655877 6373580
35086 6373580 4511665 6095082 13556806 25192295 36260759 42594567 42847534 37892553
35078 37892553 29437300 19563285 10411391 3300629 -1657408 -4858144 -6706512 -8028639
35070 -8028639 -10023401 -13045201 -15998117 -17577326 -17509416 -15888291 -12085128 -5531807
35062 -5531807 2693639 10179646 15067487 16815918 15339563 10538705 2822945 -6906533
35054f906533j1215670j2645941j3501062j2930421j1042125q623375o029242
35047h2894369l267955p59773R60203J998283K714074K916824K267945J111642
35039g4953126J40441k38908N81061L619942Q634525J2875466J3283008R868123
35031b6189468N445984K164832m9189j706410k564600k839783l648178n147779
35023c4534591n810293m800979l713970m394025o015298o031246l531172l5546
35015f8867120K852001M939972O278757N934839K951955j892089o006042o795225
35007f0602952l569280K072319P532243J0928344J1725373J0105834O336301J049336
34999a4422482m164110o984069n635958l93449N992398R902199R695146P032737
$$ plain form
35054 -6906533 -18122203 -30768144 -44269206 -57199627 -68241752 -76865127 -82894369
35047 -82894369 -86162324 -86922097 -85961894 -83963611 -81249537 -78332713 -76064768 -74953126
35039 -74953126 -74812685 -75051593 -74470532 -70850590 -62216065 -49340599 -36057591 -26189468
35031 -26189468 -20743484 -18578652 -18627841 -20334251 -22898851 -25738634 -29386812 -34534591
35023 -34534591 -40344884 -45145863 -48859833 -53253858 -59269156 -65300402 -68831574 -68867120
35015 -68867120 -66015119 -61075147 -54796390 -48861551 -45909596 -47801685 -53807727 -60602952
35007 -60602952 -64172232 -62099913 -54567670 -43639326 -31913953 -21808119 -15471818 -14422482
34999 -14422482 -18586592 -25570661 -31206619 -31600068 -25607670 -15705471 -6010325 1022412
34991A022412M961138M895251O041987P232698P990222P807626N951944K689015
34983D8592293m03391k072571k461164k075504r60049K67992l3319k484998n117445
34974C3251844n425290l404919j024312P84395K796268N351354P509087Q735825
34966D8574252R694537J0561900R986329O864400K315590j206590k448461k374734
34958H1967223l070026o155858j1732595j7990811k1941387k1330604j6375059
34951a6629117r714657m572462k573170k772721k598979j1724M982453J0709986
34943b3180391J5210498J6996688J5303989J0869315O435677N092451P298465
34936E4026692J0207839J0607001Q017680M355031J254644j173285l202842m406660
$$ plain form
34991 1022412 5983550 10878801 16920788 24153486 32143708 39951334 45903278 48592293
34983 48592293 48188902 46116331 43655167 41579663 40619614 40887606 40854287 38369289 33251844
34974 33251844 27826554 24421635 23397323 24181718 26977986 32329340 39838427 48574252
34966 48574252 58268789 68830689 78817018 85681418 87997008 86790418 84341957 81967223
34958 81967223 78897197 72741339 61008744 43017933 21076546 -254058 -16629117
34951 -16629117 -26343774 -30916236 -33489406 -36262127 -38861106 -38872830 -33890377 -23180391
34943 -23180391 -7969893 9026795 24330784 35200099 41635776 46728227 54026692
34936 54026692 64234531 74841532 82859212 87214243 88468887 87295602 84092760 79686100
34928G9686100m233922k951756j366033M7194J115769J267144l35977l607659
34920F9620860p033610q989606r428127r693640j0679539j1765136j1691578r820829
34912i481205o231650j371724L577647O452150N366110O13664n144268q899478
34904a5118754r449202p711956n305650k907304J18001M408363Q932836J1109966
34896a5923700R066917L576725k633105p236499r573513j0041172r152635p330835
34888d9247817m990964k490039j53851J686436K904484L662197M050925L993728
34880d0584901L873596M748463P172912J0001771J1107360R313394N236001N69218
34872A1437814k870785l941469l106916k435905l645402o122136p709784p233145
$$ plain form
34928 79686100 75452178 72500422 71134389 71181583 72297352 73564496 73228519 69620860
34920 69620860 62587250 53597644 44169517 34475877 23796338 12031202 339624 -9481205
34912 -9481205 -15712855 -17084579 -13506932 -7054782 -1688672 -1075008 -6219276 -15118754
34904 -15118754 -24567956 -32279912 -37585562 -40492866 -40374865 -35966502 -27033666 -15923700
34896 -15923700 -6856783 -3280058 -5913163 -13149662 -22723175 -32764347 -41916982 -49247817
34888 -49247817 -54238781 -56728820 -56882671 -55196235 -52291751 -48629554 -44578629 -40584901
34880 -40584901 -36711305 -31962842 -24789930 -14788159 -3680799 5632595 10868596 11437814
34872 11437814 8567029 4625560 1518644 -917261 -4562663 -10684799 -18394583 -25627728
34864b5627728n156411j986654K417808P651294J2316072J5353051J6626323J5707528
34856C7301283J1561063M454018k989228p893094r640279r418615q216002o500214
34848H658932n131666n000274n819333o449778o392779n906467m665207j554370
34840c2260942L625435Q971004J1737162J0850127Q064119O549969Q042347J1166807
34832C6746028J2788906J1094423O954007K307457j806793n091272o949756o897918
34824D9145082n672202m764417m822433n309155n585643n391713m370675k305733
34816A0923111q6149P27958k3258l34691J721136N394485P804385P026597L895713
34807C7049287O38761j491010k706381l447399l737511l922387n009530p415194
$$ plain form
34864 -25627728 -30784139 -32770793 -30352985 -22701691 -10385619 4967432 21593755 37301283
34856 37301283 48862346 53316364 50327136 42434042 32793763 23375148 15159146 8658932
34848 8658932 3527266 -1473008 -7292341 -13742119 -20134898 -26041365 -30706572 -32260942
34840 -32260942 -28635507 -19664503 -7927341 2922786 10986905 17536874 25579221 36746028
34832 36746028 49534934 60629357 67583364 69890821 68084028 62992756 56043000 49145082
34824 49145082 43472880 38708463 33886030 28576875 22991232 17599519 13228844 10923111
34816 10923111 10836962 11564920 11541662 11206971 12928107 18322592 26126977 33153574 37049287
34807 37049287 37688048 36197038 33490657 30043258 26305747 22383360 17373830 9958636
34799I958636r860857j0533819r285077p724870p017272o604968n562504m239686
34791e0870417l693049l990077l931616k357029P43947M243483O683482P389929
34783d5781347P129110P376629Q725302J0382745J1262708J0842225Q836626N170943
34775B3944941Q81151k035813k616840k023890j880155k477440l503643n202804
34767E085507p259560p715604n168459j424997M40469N34858K039137O128527
34759g340122R612107R012888M952982P42279j797641l042244l213466j820262
34751G106521N37748J873319J095782n31557q81577P49901L251225M983263N039236
34742B3223861L712330K254597K018858L424443N658163P421685P866140O772876
$$ plain form
34799 9958636 97779 -10436040 -19721117 -27445987 -34463259 -41068227 -46630731 -50870417
34791 -50870417 -54563466 -58553543 -62485159 -64842188 -64098241 -59854758 -53171276 -45781347
34783 -45781347 -38652237 -31275608 -22550306 -12167561 -904853 9937372 18773998 23944941
34775 23944941 24826092 22790279 20173439 18149549 16269394 13791954 10288311 5085507
34767 5085507 -2174053 -9889657 -15058116 -16483113 -16042644 -15507786 -13468649 -7340122
34759 -7340122 2271985 11284873 16237855 16980134 15182493 12140249 8926783 7106521
34751 7106521 7644269 9517588 10613370 10081813 9200236 9950137 13201362 18184625 23223861
34742 23223861 26936191 29190788 31209646 34634089 40292252 47713937 55580077 62352953
34734F2352953M184075L93456l606412o292462o940694o658630p241106q721417
34726B7469763q916551o088744j376580K399060L928080M256433M605154M725205
34718C1001820L847572K153504N56359k97999j72570J007897K780374L875317
34710D4752274L118944O64746k051096l567079l414143k095248m62905P80257
34702C7725750J155663L09556j775861m405140o509868p728071q629777r322670
34694H19582q513295n042772O516M075424O026725O966877P987009Q571727P869679
34685B8767472O135611L891018P68940l555954q029894j1097936j2526642j3205193
34677h852578j3338707j1922012q127436k549057K975883O420643O799593N010538
$$ plain form
34734 62352953 66537028 66930484 63324072 57031610 50090916 43432286 36191180 27469763
34726 27469763 18553212 12464468 11087888 13486948 17415028 21671461 26276615 31001820
34718 31001820 34849392 37002896 37559255 37261256 37088686 38096583 40876957 44752274
34710 44752274 47871218 48535964 46484868 42917789 39503646 37408398 36945493 37725750
34702 37725750 38881413 39190969 37415108 33009968 26500100 18772029 10142252 819582
34694 819582 -7693713 -12736485 -12729969 -8654545 -2627820 4339057 12326066 20897793 28767472
34685 28767472 34903083 38794101 39563041 36007087 27977193 16879257 4352615 -8852578
34677 -8852578 -22191285 -34113297 -42240733 -44789790 -41813907 -35393264 -28593671 -23583133
34669b3583133L323431L532071N668229Q591536J1143978J2309431J1180099P808077
34661C9973719L642445J99233k355671m536241o084152o350653n713470n244171
34653A3531039n017895m067425k208262o96970o43125j694460k714598k999221
34645f510917k500780j623076j136098j548767k226422j929735o78851k33919
34637a8388565j929261m525008n087867k025770L180046P261935Q013241O057583
34629g443666M030452L937967N307149O111649N334969M045958L833333M807268
34621B9965079N636875N321057M472711M729337O909474R753768J0677637P992999
34613H5458937K291754m420312j0439375j4774824j6522631j5042792j0971026
$$ plain form
34669 -23583133 -20259702 -16727631 -11059402 -2467866 8676112 20985543 32165642 39973719
34661 39973719 43616164 43815397 41459726 36923485 30839333 24488680 18775210 13531039
34653 13531039 8513144 4445719 2237457 1540487 897362 -797098 -3511696 -6510917
34645 -6510917 -9011697 -10634773 -11770871 -13319638 -15546060 -17475795 -18154646 -18388565
34637 -18388565 -20317826 -24842834 -29930701 -31956471 -28776425 -21514490 -13501249 -7443666
34629 -7443666 -3413214 524753 5831902 11943551 17278520 21324478 25157811 29965079
34621 29965079 35601954 40923011 45395722 50125059 57034533 66788301 77465938 85458937
34613 85458937 87750691 83330379 72891004 58116180 41593549 26550757 15579731
34606A5579731o254121k800704j412346j894087l457985m930281n354843m707953
34598a5232589l520779j806310Q28327L873900N698574N134396K672573j69938
34590b521846j937905j591265R72213M040313M793974J953553k800570o730484
34582c822017q643372q895371p832808n523159k428836R77845M849995Q882422
34574b2435301J1040889R171828M090638n54963k093226j216373l914R49485K200837
34565A149900L252492K331787j582392p507538j3372073j7488203j8989647j7500865
34557f9706539j2952912n812242K558118R897779J3845795J3259097Q957503L167759
34549c6785642j776550m421763m489730k681246j40393K186043L800152M388838
$$ plain form
34606 15579731 9325610 6524906 5112560 3218473 -239512 -5169793 -10524636 -15232589
34598 -15232589 -18753368 -20559678 -19731351 -15857451 -10158877 -5024481 -2351908 -2521846
34590 -2521846 -4459751 -6051016 -5078803 -1038490 3755484 5709037 2908467 -3822017
34582 -3822017 -12465389 -21360760 -29193568 -34716727 -37145563 -36167718 -31317723 -22435301
34574 -22435301 -11394412 -2222584 1868054 1313091 -780135 -1996508 -2000422 -1050937 1149900
34565 1149900 4402392 6734179 5151787 -2355751 -15727824 -33216027 -52205674 -69706539
34557 -69706539 -82659451 -88471693 -85913575 -76015796 -62170001 -48910904 -39953401 -36785642
34549 -36785642 -38562192 -42983955 -47473685 -50154931 -50295324 -48109281 -44309129 -39920291
34541c9920291L649606J684771n19770j394724O2618L215683N889769N895276
34533b1437062K862187j347504m130360l948121p44627M594177J0286226J3591356
34525b73728J2284982O977198J128322k074452k360877j367044J6184J914435
34517A6245020L587250L168228j1352l959359n753739m231975n36993L235448
34509A1742528N265259M668318K051449p93563k668372m406597p751933j2803591
34501d696502j7408494j9285665j8023654j4707247j0342984n261476L51606N976043
34493h3398373J0773295J3845717J4694068J3654399J1643881R269685O488484
34486c028844L332087M88696j266017j850539j644873q94197L4414J84378j266311
$$ plain form
34541 -39920291 -36270685 -34585914 -35105684 -36500408 -36437790 -33222107 -27332338 -21437062
34533 -21437062 -18574875 -19922379 -24052739 -28000860 -28745487 -24151310 -13865084 -273728
34525 -273728 12011254 18988452 20116774 18042322 15681445 14314401 14330585 16245020
34517 16245020 19832270 23000498 22989146 19029787 13276048 9044073 8507080 11742528
34509 11742528 17007787 21676105 23727554 22933991 20265619 15859022 8107089 -4696502
34501 -4696502 -22104996 -41390661 -59414315 -74121562 -84464546 -89726022 -89374416 -83398373
34493 -83398373 -72625078 -58779361 -44085293 -30430894 -18787013 -9517328 -3028844
34486 -3028844 303243 791939 -474078 -2324617 -3969490 -4863687 -4829273 -4644895 -5911206
34477e911206l767581n652898n797135m393292k036041J029441M271116O313968
34469a5943628N932852L394607J96587k396299m089888n094405n566320n471806
34461b9038300m449747j880604K165603N863487O367711K454207l690210p925284
34453c0133137p608348l486780J588701N270884O992954P399575P244318O769996
34445e961837N606762L134338o63103m556612o721734o359788m395127k268815
34437b2185916l90764J754473M282957O416689P365795P137397O294400N292298
34429A5967329M122731K218395j252093o359441j1494878j4113976j2841134q539654
34421c2292721l191759J642881M975477N924881M145896O12801k680964l901059
$$ plain form
34477 -5911206 -9678787 -15331685 -21128820 -25522112 -27558153 -26528712 -22257596 -15943628
34469 -15943628 -10010776 -6616169 -6419582 -8815881 -12905769 -18000174 -23566494 -29038300
34461 -29038300 -33488047 -35368651 -33203048 -27339561 -20971850 -18517643 -22207853 -30133137
34453 -30133137 -37741485 -41228265 -39639564 -34368680 -27375726 -19976151 -12731833 -5961837
34445 -5961837 -355075 2779263 2116160 -2440452 -9162186 -15521974 -19917101 -22185916
34437 -22185916 -22576680 -20822207 -16539250 -10122561 -2756766 4380631 10675031 15967329
34429 15967329 20090060 22308455 21056362 14696921 3202043 -10911933 -23753067 -32292721
34421 -32292721 -35484480 -33841599 -28866122 -22941241 -18795345 -18182544 -20863508 -24764567
34413b4764567k224647J783854O006503P614375N278594P02478k748241l084264
34405a1435915j000590J488057K871681K770684J821943J232866J662879K267689
34397A679294J514361r36948l977604o732716r269294j1125437j0498303o155455
34389d5502102N27488O622329J0340935J1668287J0890088Q050374L993295N35522
34381G126216j082545j197579p80699k05164O44550J768336L170783N095586P512258
34372B2051742R644964J0551519J0053970Q769069P419923O408843N775388N162742
$$ plain form
34413 -24764567 -26989214 -25205360 -19198857 -11584482 -6305888 -5603410 -8351651 -11435915
34405 -11435915 -12436505 -10948448 -8076767 -5306083 -3484140 -2251274 -588395 1679294
34397 1679294 3193655 2256707 -1720897 -8453613 -17722907 -28848344 -39346647 -45502102
34389 -45502102 -44974614 -38352285 -28011350 -16343063 -5452975 2597399 6590694 7126216
34381 7126216 6043671 4846092 4065393 3860229 4504779 6273115 9443898 14539484 22051742
34372 22051742 31696706 42248225 52302195 61071264 68491187 74900030 80675418 85838160
$$ [...]
##END NTUPLES=NMR SPECTRUM
##END=
