##TITLE=31Pdec_DE-22_2hrm
 
  24 sc
 31.10.2023
##JCAMPDX= 6.0         $$ Bruker NMR JCAMP-DX V2.0
##DATA TYPE= NMR SPECTRUM
##DATA CLASS= NTUPLES
##ORIGIN= UXNMR, Bruker Analytische Messtechnik GmbH
##OWNER= root
$$ XWIN-NMR		Version 3.5
$$ Tue Oct 31 16:31:35 2023 Russian Standard Time (UT+4h)  she@DPX200
##.OBSERVE FREQUENCY= 81.013821
##.OBSERVE NUCLEUS= ^31P
##.ACQUISITION MODE= SIMULTANEOUS
##.ACQUISITION SCHEME= undefined
##.AVERAGES= 24
##.DIGITISER RES= 16
##SPECTROMETER/DATA SYSTEM= spect
##.PULSE SEQUENCE= zgpg30
##.SOLVENT NAME= CDCl3
##.SHIFT REFERENCE= (INTERNAL, CDCl3, 0, 248.564)
##AUDIT TRAIL= $$ (NUMBER, WHEN, WHO, WHERE, WHAT)
$$ ##TITLE= Audit trail, XWIN-NMR		Version 3.5
$$ ##JCAMPDX= 5.01
$$ ##ORIGIN= Bruker BioSpin GmbH
$$ ##OWNER= she
$$ F:/spectra/data/she/nmr/P31/1/pdata/1/auditp.txt
$$ ##AUDIT TRAIL=  $$ (NUMBER, WHEN, WHO, WHERE, WHAT)
(   1,<2023-10-31 16:30:02.71 +0400>,<she>,<DPX200>,
      <created by zg, POWCHK disabled, PULCHK disabled
       configuration hash MD5:
       00 E9 B6 7A A2 85 ED C7 34 08 36 98 17 FE 4E 26
       data hash MD5: 32K
       54 9F D1 8E 7E 1A 68 5A E7 5B 56 61 22 43 D0 BA>)
(   2,<2023-10-31 16:30:05.42 +0400>,<she>,<DPX200>,
      <Start of raw data processing
       efp BC_mod = 2 LB = 5 FT_mod = 6 PKNL = 1 PHC0 = -10697.29 PHC1 = 164.8902 SI = 64K 
       data hash MD5: 64K
       B4 1E D7 E2 BA 1C 9A E7 2E C0 58 60 86 75 0E 06>)
(   3,<2023-10-31 16:30:24.90 +0400>,<she>,<DPX200>,
      <pk PHC0 = 57.13036 PHC1 = 29 
       data hash MD5: 64K
       D0 D5 75 62 ED 13 0D 1D CC 61 B6 82 F2 54 53 B6>)
(   4,<2023-10-31 16:30:28.10 +0400>,<she>,<DPX200>,
      <abs ABSG = 5 
       data hash MD5: 64K
       95 E3 C8 98 BF F8 0B 60 0E 52 D3 AC 78 98 C1 7D>)
$$ ##END=
$$ 
$$ hash MD5
$$ 6B 1B 80 AF 24 C5 46 AB 2F FF 96 2D 04 B6 C2 94
##$RELAX= 
##$RELAX= 
##$RELAX= 
##$RELAX= 
##$RELAX= 
##$RELAX= 
##$RELAX= 
##$RELAX= 
##$RELAX= 
$$ Bruker specific parameters
$$ --------------------------
##$DU= <F:/spectra>
##$EXPNO= 1
##$NAME= <P31>
##$PROCNO= 1
##$TYPE= <nmr>
##$USER= <she>
##$AMP= (0..31)
100 100 100 100 100 100 100 100 100 100 100 100 100 100 100 100 100 100 
100 100 100 100 100 100 100 100 100 100 100 100 100 100 
##$AQSEQ= 0
##$AQ_mod= 1
##$AUNM= <au_zg>
##$AUTOPOS= <>
##$BF1= 81.014009
##$BF2= 200.13
##$BF3= 200.13
##$BF4= 200.13
##$BF5= 200.13
##$BF6= 200.13
##$BF7= 200.13
##$BF8= 200.13
##$BYTORDA= 1
##$CFDGTYP= 0
##$CFRGTYP= 5
##$CHEMSTR= <none>
##$CNST= (0..31)
1 1 145 1 1 1 1 1 1 1 1 1 1 1 1 1 1 1 1 1 1 1 1 1 1 1 1 1 1 1 1 1 
##$CPDPRG= <waltz16>
##$CPDPRG1= <>
##$CPDPRG2= <waltz16>
##$CPDPRG3= <>
##$CPDPRG4= <mlev>
##$CPDPRG5= <mlev>
##$CPDPRG6= <mlev>
##$CPDPRG7= <mlev>
##$CPDPRG8= <mlev>
##$CPDPRGB= <>
##$CPDPRGT= <>
##$D= (0..31)
0 1 0 0 0 0 0 0 0 0 0 0.03 2e-05 3e-06 0 0 0 0 0 0 0 0 0 0 0 0 0 0 0 0 
0 0 
##$DATE= 1698755402
##$DBL= (0..7)
120 120 120 11 120 120 24 19 
##$DBP= (0..7)
150 150 150 150 150 150 150 150 
##$DBP07= 0
##$DBPNAM0= <>
##$DBPNAM1= <>
$$ [...]
##$SUBNAM3= <"">
##$SUBNAM4= <"">
##$SUBNAM5= <"">
##$SUBNAM6= <"">
##$SUBNAM7= <"">
##$SUBNAM8= <"">
##$SUBNAM9= <"">
##$SW= 501.771253377433
##$SWIBOX= (0..15)
0 1 3 0 0 0 0 0 0 0 0 0 0 0 0 0 
##$SW_h= 40650.406504065
##$TD= 32768
##$TD0= 1
##$TE= 0
##$TE2= 300
##$TE3= 300
##$TEG= 300
##$TL= (0..7)
0 120 53 12 22 120 120 120 
##$TP= (0..7)
150 150 150 150 150 150 150 150 
##$TP07= 0
##$TPNAME0= <>
##$TPNAME1= <>
##$TPNAME2= <>
##$TPNAME3= <>
##$TPNAME4= <>
##$TPNAME5= <>
##$TPNAME6= <>
##$TPNAME7= <>
##$TPOAL= (0..7)
0.5 0.5 0.5 0.5 0.5 0.5 0.5 0.5 
##$TPOFFS= (0..7)
0 0 0 0 0 0 0 0 
##$TUNHIN= 0
##$TUNHOUT= 0
##$TUNXOUT= 0
##$USERA1= <user>
##$USERA2= <user>
##$USERA3= <user>
##$USERA4= <user>
##$USERA5= <user>
##$V9= 5
##$VALIST= <valist>
##$VCLIST= <CCCCCCCCCCCCCCC>
##$VD= 0
##$VDLIST= <DDDDDDDDDDDDDDD>
##$VPLIST= <PPPPPPPPPPPPPPP>
##$VTLIST= <TTTTTTTTTTTTTTT>
##$WBST= 1024
##$WBSW= 4
##$XGAIN= (0..3)
0 0 0 0 
##$XL= 0
##$YL= 0
##$YMAX_a= 963
##$YMIN_a= -1549
##$ZGOPTNS= <>
##$ZL1= 120
##$ZL2= 120
##$ZL3= 120
##$ZL4= 120
##$ABSF1= 248.5645
##$ABSF2= -253.2056
##$ABSG= 5
##$ABSL= 3
##$ALPHA= 0
##$AQORDER= 0
##$ASSFAC= 0
##$ASSFACI= 0
##$ASSFACX= 0
##$ASSWID= 0
##$AUNMP= <proc_1d>
##$AZFE= 0.1
##$AZFW= 0.5
##$BCFW= 0
##$BC_mod= 2
##$BYTORDP= 0
##$COROFFS= 0
##$CY= -3
##$DATMOD= 1
##$DC= 0
##$DFILT= <>
##$DTYPP= 0
##$F1P= 0
##$F2P= 0
##$FCOR= 1
##$FTSIZE= 65536
##$FT_mod= 6
##$GAMMA= 0
##$GB= 0
##$INTBC= 1
##$INTSCL= 6.047779e-11
##$ISEN= 30
##$LB= 5
##$LEV0= 0
##$LPBIN= 0
##$MAXI= 10000
##$MC2= 0
##$MEAN= 0
##$ME_mod= 0
##$MI= 50
##$NCOEF= 0
##$NC_proc= -10
##$NLEV= 6
##$NOISF1= 182.463
##$NOISF2= 159.3651
##$NSP= 0
##$NTH_PI= 0
##$NZP= 0
##$OFFSET= 248.5645
##$PC= 4
##$PHC0= -10640.16
##$PHC1= 193.8902
##$PH_mod= 1
##$PKNL= yes
##$PPARMOD= 0
##$PSCAL= 0
##$PSIGN= 0
##$REVERSE= no
##$SF= 81.0140089999694
##$SI= 65536
##$SIGF1= 159.3651
##$SIGF2= -187.1042
##$SINO= 113.3802
##$SIOLD= 16384
##$SREGLST= <1H.CDCl3>
##$SSB= 0
##$STSI= 65536
##$STSR= 0
##$SW_p= 40650.406504065
##$SYMM= 0
##$S_DEV= 0
##$TDeff= 32768
##$TDoff= 0
##$TI= <>
##$TILT= no
##$TM1= 0
##$TM2= 0
##$TOPLEV= 0
##$USERP1= <user>
##$USERP2= <user>
##$USERP3= <user>
##$USERP4= <user>
##$USERP5= <user>
##$WDW= 1
##$XDIM= 65536
##$YMAX_p= 492166409
##$YMIN_p= -15663149
$$ End of Bruker specific parameters
$$ ---------------------------------
##NTUPLES= NMR SPECTRUM
##VAR_NAME=  FREQUENCY,     SPECTRUM/REAL,   SPECTRUM/IMAG
##SYMBOL=    X,             R,               I
##VAR_TYPE=  INDEPENDENT,   DEPENDENT,       DEPENDENT
##VAR_FORM=  AFFN,          ASDF,            ASDF
##VAR_DIM=   65536,         65536,           65536
##UNITS=     HZ,            ARBITRARY UNITS, ARBITRARY UNITS
##FACTOR=    0.620285442955139, 1,           1
##FIRST=     20137.2065510682, 0,            0
##LAST=      -20513.1999529968, 0,           0
##MIN=       -20513.1999529968, -15663149,   0
##MAX=       20137.2065510682, 492166409,    0
$$ Real data points
##PAGE= N=1
##DATA TABLE= (X++(R..R)), XYDATA
$$ [...]
38908F066007M81456J30431k25295m78236n89733n84594n14068m31481l79041
$$ 6066007 6547463 6677894 6452599 5974363 5384630 4800036 4285968 3854487 3475446
38899C475446l69976l82969l88620l79889l61509l12652j89088J6668K30587L40970
$$ 3475446 3105470 2722501 2333881 1953992 1592483 1279831 1090743 1107411 1337998 1678968
38889A678968K95606J44413j5676j22372j71151j81960j68922j39101r9012n4329
$$ 1678968 1974574 2118987 2103311 1980939 1809788 1627828 1458906 1319805 1220793 1166464
38879A166464j1009K3008M6695P4590J21333J74054J94997J60637Q8139J4454
$$ 1166464 1155455 1178463 1225158 1299748 1421081 1595135 1790132 1950769 2038908 2053362
38869B053362m1749q7959j36770j90254k41125k75429k72256k11592r0616O5983
$$ 2053362 2011613 1923654 1786884 1596630 1355505 1080076 807820 596228 505612 571595
38859E71595K10477K90120K74374J76181M2198q7579k07098l22329m10898m26294
$$ 571595 782072 1072192 1346566 1522747 1564945 1477366 1270268 947939 537041 110747
38849A10747l49686k20625j01546j9461M3718J07689J58335J63043J13324M2759
$$ 110747 -238939 -459564 -561110 -580571 -536853 -429164 -270829 -107786 5538 48297
38839D8297K3N216L3842M5205K4844o761k7356m1054n9363o2514o845J14761K36017
$$ 48297 48320 53536 87378 132583 157427 150666 123310 82256 22893 -39621 -46466 68295 304312
38826C04312K65327J73543K0838j04390j59470j60396j44487j37461j43935j46018
$$ 304312 569639 743182 764020 659630 500160 339764 195277 57816 -86119 -232137
38816b32137j10595j9461R7040J68449J40315K2203j22273k26761k60233k27750
$$ -232137 -342732 -362193 -265153 -96704 43611 65814 -56459 -283220 -543453 -771203
38806g71203j53627o9484o989J2234j2681n8962r1115q4201m5416j1116j3165
$$ -771203 -924830 -994314 -1001303 -989069 -1001750 -1060712 -1151827 -1236028 -1281444 -1292560 -1305725
38795a305725m4840o6642m9991q375K2684L1882M6177R4867J69009K26396K36225
$$ -1305725 -1350565 -1417207 -1467198 -1475573 -1452889 -1421007 -1374830 -1279963 -1110954 -884558 -648333
38784f48333K10863J88565J87714J85267J45170O5351j1954m1640k1991Q749J9151
$$ -648333 -437470 -248905 -61191 124076 269246 334597 322643 281003 259012 267761 286912
38773B86912J4703J6223K1608N954m0076q6366q8622l7047K5674L9889j3644r1273
$$ 286912 301615 317838 339446 345400 305324 218958 130336 93289 118963 158852 145208 53935
38761E3935j24688q2667Q157R9719J64235J93846J80150J21486M8104J1300L2194
$$ 53935 -70753 -153420 -145263 -45544 118691 312537 492687 614173 662277 673577 705771
38750G05771P4524Q2710M2070o721q194N7405J55270K20454K09223J35319N1829
$$ 705771 780295 863005 905075 898354 890160 947565 1102835 1323289 1532512 1667831 1719660
38739A719660n531m7255r9021j59649k04443k15832j89192j18720q632R7366J29505
$$ 1719660 1714129 1666874 1567853 1408204 1203761 987929 798737 680017 671385 768751 898256
38728H98256N9309n7085j24710j00952l0280J1900j932l3748l1493J3963O4487
$$ 898256 957565 900480 775770 674818 644538 656438 654506 620758 589265 603228 667715
38717F67715P7463M4691p962m8802o3112n3549k6873J3975O2068R3692P5929M48
$$ 667715 745178 789869 781907 733105 669993 616444 589571 603546 665614 759306 835235 835683
38705H35683r2266j37124r9816k946J00976J69200J80882J31870L5861p5614j67894
$$ 835683 743417 606293 506477 503531 604507 773707 954589 1086459 1122320 1046706 878812
38694H78812k18666k19664j76854j16249p3858o4890p1880p3812p2424p3667n9022
$$ 878812 660146 440482 263628 147379 73521 8631 -63249 -137061 -209485 -283152 -342174
38683c42174j747R2518J82848K28545K11948J37152L3119m7493o5075l4313k857
$$ -342174 -343921 -251403 -68555 159990 371938 509090 542209 494716 429641 395328 392471
38672C92471J4828N1456J23434J84321J65715M9518j15508k51411k90323k02064
$$ 392471 407299 458755 582189 766510 932225 981743 866235 614824 324501 122437
38662A22437j8551J70575K73376K58607J61413L5265q7587j93537k67593k89030
$$ 122437 103886 274461 547837 806444 967857 1003122 915535 721998 454405 165375
38652A65375k45691j49124l2692O9765J42975J82887J76103J05368j6548j34752
$$ 165375 -80316 -229440 -262132 -192367 -49392 133495 309598 414966 398418 263666
38642B63666j91495j74887j20147o8996l9484l1240m3085p5462j19622j55904
$$ 263666 72171 -102716 -222863 -291859 -331343 -362583 -405668 -481130 -600752 -756656
38632g56656j71849j79264j97200k09447j56715M165K36515M40231N32053M93951
$$ -756656 -928505 -1107769 -1304969 -1514416 -1671131 -1666966 -1430451 -990220 -458167 35784
38622C5784L55162J64578j6156j37103k02368k58356l16837l21025k19774m8130
$$ 35784 390946 555524 539368 402265 199897 -58459 -375296 -696321 -916095 -964225
38612i64225J06549K00570K51305K70103K33672J37332L3712j3157K932K7701
$$ -964225 -857676 -657106 -405801 -135698 97974 235306 269018 255861 258793 286494
38602B86494P542n5738j06970r2137j5147O4182R4572Q3002O7525O0943N1082
$$ 286494 294036 238298 131328 39191 24044 88226 182798 265800 333325 394268 445350
38591D45350M2975N8030Q8468R4196N9898K0950J4543L7581P6578J47066K66183
$$ 445350 488325 546355 634823 729019 788917 809867 824410 861991 938569 1085635 1351818
38580A351818M02685M91134M92913M18642K98843J62307M0400m0675q2497j08504
$$ 1351818 1754503 2245637 2738550 3157192 3456035 3618342 3658742 3618067 3535570 3427066
38570C427066j27896j25397r5925o9086q2460j41776k22347l01412l71996m27664
$$ 3427066 3299170 3173773 3077848 3008762 2926302 2784526 2562179 2260767 1888771 1461107
38560A461107m52179m33134l78708l12950k55373k08236j61406j04609l5172L9581
$$ 1461107 1008928 575794 197086 -115864 -371237 -579473 -740879 -845488 -880660 -841079
38550h41079J02568J33988J27856J04061R5767J17034J45581J44644J01205L6243
$$ -841079 -738511 -604523 -476667 -372606 -276839 -159805 -14224 130420 231625 267868
38540B67868k1949o4833r9858j29686j46843j45381j23888p5051J0603J17351
$$ 267868 245919 181086 81228 -48458 -195301 -340682 -464570 -539621 -529018 -411667
38530d11667J92150J82921R3148j7032r0416j19912j30046j30933j11119o7249
$$ -411667 -219517 -36596 56552 39520 -50896 -170808 -300854 -431787 -542906 -610155
38520f10155j6499K4709N8312R5785J43568J99757K50853K67389K20725J18220
$$ -610155 -626654 -601945 -543633 -447848 -304280 -104523 146330 413719 634444 752664
38510G52664J1186m6156m0329O845P1969J36110J65437J21050N622j19215j85600
$$ 752664 763850 717694 677365 684210 756179 892289 1057726 1178776 1184398 1065183 879583
38499H79583j84241j58085j34174q4770L3344K15397L99410N16166N39525M94507
$$ 879583 695342 537257 403083 318313 351657 567054 966464 1482630 2022155 2516662
38489B516662M30212L82994L49545K89844J68558J655j47634k29385k55733k77291
$$ 2516662 2946874 3329868 3679413 3969257 4137815 4139470 3991836 3762451 3506718 3229427
38479C229427l18535l55883l60451l38636l13233k78266j99507o6155P6614J62969
$$ 3229427 2910892 2555009 2194558 1855922 1542689 1264423 1064916 998761 1075375 1238344
38469A238344J70603J38343J19581J26019J18443M6743r9880k71068l79070l57144
$$ 1238344 1408947 1547290 1666871 1792890 1911333 1958076 1858196 1587128 1208058 850914
38459H50914k09959r606J60339K55614K73314K27410J40942M9559j6668o1950
$$ 850914 640955 631349 791688 1047302 1320616 1548026 1688968 1738527 1721859 1659909
38449A659909j16828j92697k58711k74869k37811j82271j43015j24632j05022
$$ 1659909 1543081 1350384 1091673 816804 578993 396722 253707 129075 24053
38440B4053o1237N761O7516R1766P1841K9249j0969l7960m8809l9473j0072K9028
$$ 24053 -37184 -31423 36093 127859 199700 228949 217980 180020 131211 91738 81666 110694
38428A10694O2374P5011N3922k396p2706j26561j54798j71733j82682j69879j20987
$$ 110694 173068 248079 302001 299605 226899 100338 -54460 -226193 -408875 -578754 -699741
38417f99741n0341K3844J03710J93478K73030L10300K87736K01607N7564j08791
$$ -699741 -750082 -726238 -622528 -429050 -156020 154280 442016 643623 701187 592396
38407E92396k30815k66797k43131k05790j44877j5584J71547L36631M17977M24435
$$ 592396 361581 94784 -148347 -354137 -499014 -514598 -343051 -6420 411557 835992
38397H35992L83006K85151J20524p1713k25291l01405k93388k04082n7127Q7520
$$ 835992 1218998 1504149 1624673 1552960 1327669 1026264 732876 528794 471667 559187
38387E59187J73670K03691K21813K45025K40595J72525M2824j14131k50978l20068
$$ 559187 732857 936548 1158361 1403386 1643981 1816506 1859330 1745199 1494221 1174153
38377A174153k99476k20079j44992j10435j03742j03409j10796j24239j10341
$$ 1174153 874677 654598 509606 399171 295429 192020 81224 -43015 -153356
38368a53356l6439P5498J58567J69222J24867O8419J6999m0641j11309j82419
$$ -153356 -189795 -114297 44270 213492 338359 406778 423777 383136 271827 89408
38358H9408k37435k69985k79324k64334k29396j87656j48144j02916l7471M4456
$$ 89408 -148027 -418012 -697336 -961670 -1191066 -1378722 -1526866 -1629782 -1667253 -1622797
38348a622797J14721J43913J26935Q3756M1456K1433L8208R6270J79476K48910
$$ -1622797 -1508076 -1364163 -1237228 -1153472 -1112016 -1090583 -1052375 -956105 -776629 -527719
38338e27719K64585K18802J47080R8862R2810J02892R1110N1654J7861K4408O6479
$$ -527719 -263134 -44332 102748 201610 294420 397312 488422 540076 557937 582345 648824
38327F48824J01056Q9752L6233k3322o2803q7039j06929j10805p9356k2750K0765
$$ 648824 749880 839632 875865 852543 789740 702701 595772 484967 405611 382861 403626
38316D03626K9310K2344L1339N8829P7816O3419J8104k5738k5924L0297J01074
$$ 403626 432936 455280 486619 545448 623264 686683 704787 679049 653125 683422 784496
38305G84496J23757Q3597K5823j3102n3308j21027j80352j64728o9210L4375P8812
$$ 784496 908253 991850 1017673 1004571 951263 830236 649884 485156 415946 450321 529133
38294E29133O1116J7328k2822m4799m8191n1550o9155p4518k6178N3244O8970
$$ 529133 590249 607577 584755 539956 491765 440215 371060 296542 270364 323608 392578
38283C92578l7067j98286k85874k44603j31629l3881J4047L3667O2494J18794
$$ 392578 355511 157225 -128649 -373252 -504881 -538762 -524715 -491048 -428554 -309760
38273c09760J81983K02454J50406N7763q154j6085L440Q309q43R407N3498J02380
$$ -309760 -127777 74677 225083 282846 274692 258607 262047 270356 269513 278920 332418 434798
38261D34798J12113O9712O972k9828j9376K7393Q9520J49436J85584J73796J09420
$$ 434798 546911 616623 623595 593767 574391 601784 691304 840740 1026324 1200120 1309540
38250A309540J7416o7066j15060r7021J1011J87976L50473M08874L45567K22421
$$ 1309540 1326956 1259890 1144830 1047809 1058820 1246796 1597269 2006143 2351710 2574131
38240B574131J15630O0374M9734N7786N7418L6474M966k5778p0219j54210k68154
$$ 2574131 2689761 2750135 2799869 2857655 2915073 2951547 2956513 2930735 2860516 2706306 2438152
38229B438152l55618l62520k86099j65393l7630P8027J60323J74758R9572l9979
$$ 2438152 2082534 1720014 1433915 1268522 1230892 1308919 1469242 1644000 1743572 1703593
38219A703593j76807k50787k50934k06539j47086q6375l9876k9830o0261j04478
$$ 1703593 1526786 1275999 1025065 818526 671440 585065 545189 515359 455098 350620
38209C50620j30252j21733o5952N5398K31051L92369M57502M07262K95234J84939
$$ 350620 220368 98635 32683 88081 319132 711501 1169003 1576265 1871499 2056438
38199B056438J01830M5014J1821m980k3241n7590j08433j70805k40510l04710
$$ 2056438 2158268 2203282 2215103 2210123 2186882 2129292 2020859 1850054 1609544 1304834
38189A304834l41173l38135l06333k63235k12265j43312m8704O2573J59909K03526
$$ 1304834 963661 625526 319193 55958 -156307 -299619 -348323 -285750 -125841 77685
38179G7685J76407J06589M5591K0683J7184N908k6889p7200j31066j65907j58096
$$ 77685 254092 360681 406272 426955 444139 450047 423158 345958 214892 48985 -109111
38168a09111j00724r328Q9729J65442J80902J13660n432q9963o0275Q4787K62535
$$ -109111 -209835 -219163 -129434 36008 216910 330570 325138 235175 174900 259687 522222
38157E22222L72656L71241K92530K10104J77866K03068K67205L56401M59666N49115
$$ 522222 894878 1266119 1558649 1768753 1946619 2149687 2416892 2773293 3232959 3782074
38147C782074N87298N63131N10284M84195N24315O33239P79307R18954J026585
$$ 3782074 4369372 4932503 5442787 5926982 6451297 7084536 7863843 8782797 9809382
38138I809382J103943J160351J202246J258275J394405J671787K094727K620640
$$ 9809382 10913325 12073676 13275922 14534197 15928602 17600389 19695116 22315756
38130B2315756L191158L694915L912841L596529K665500J298946k01055j601519
$$ 22315756 25506914 29201829 33114670 36711199 39376699 40675645 40474590 38873071
38122C8873071k767090l573143l905654l770809l337641k827742k378452k018520
$$ 38873071 36105981 32532838 28627184 24856375 21518734 18690992 16312540 14294020
38114A4294020j732910j513435j359390j260916j192225j119153j017909q88938
$$ 14294020 12561110 11047675 9688285 8427369 7235144 6115991 5098082 4209144
38106D209144p47748o04168m59904l23248k09648j21781m0422N5823J63853K51133
$$ 4209144 3461396 2857228 2397324 2074076 1864428 1742647 1702225 1758048 1921901 2173034
38096B173034K77257K25976J21019M845j01915k08887l17040l90193l86942l11308
$$ 2173034 2450291 2676267 2797286 2802131 2700216 2491329 2174289 1784096 1397154 1085846
38086A085846k08199j15141m5287j3776m2207j19438j84350j74499q5999K7872
$$ 1085846 877647 762506 717219 703443 661236 541798 357448 182949 96950 124822
38076A24822J09741J39264J32348J16934J10257J10390J06280R4532Q2490P7880
$$ 124822 234563 373827 506175 623109 733366 843756 950036 1044568 1127058 1204938
38066A204938Q5402J12269J62036K19169K56513K68505K83088L26406L85318M21342
$$ 1204938 1290340 1402609 1564645 1783814 2040327 2308832 2591920 2918326 3303644 3724986
38056C724986M17399L94399L80887L81050L79379L67981L59389L71693M05153
$$ 3724986 4142385 4536784 4917671 5298721 5678100 6046081 6405470 6777163 7182316
38047G182316M35977M31921L70864K46446O8461j30949k99980l96852m22585m11958
$$ 7182316 7618293 8050214 8421078 8667524 8735985 8605036 8305056 7908204 7485619 7073661
38037G073661l90118l56414l17209l08151l57762m39962m90505m70947l94863
$$ 7073661 6683543 6327129 6009920 5701769 5344007 4904045 4413540 3942593 3547730
38028C547730k92033j77175o8796j2278m9566j63591k75320l09293k57686j76724
$$ 3547730 3255697 3078522 3009726 2997448 2947882 2784291 2508971 2199678 1941992 1765268
38018A765268j29229j39324j95318k75289l54551l94975l50401k00804J8367K29895
$$ 1765268 1636039 1496715 1301397 1026108 671557 276582 -73819 -274623 -256256 -26361
38008b6361L64189M00713L71057L28838L09838L07173K80643J97279O7117o2833
$$ -26361 337828 738541 1109598 1438436 1748274 2055447 2336090 2533369 2600486 2537653
37998B537653j48065j75529j60751j33183j26297j60888k21330k59034k39281
$$ 2537653 2389588 2214059 2053308 1920125 1793828 1632940 1411610 1152576 913295
37989I13295j83545j50040j71328k24670k64760k68383k40026j91692j35397q8224
$$ 913295 729750 579710 408382 183712 -81048 -349431 -589457 -781149 -916546 -1004770
37979a004770o4133n4925l1197K7604J05162J55631J42316P0877j5417p3980r5937
$$ -1004770 -1068903 -1123828 -1155025 -1127421 -1022259 -866628 -724312 -653435 -668852 -742832 -838769
37968h38769j00768j04537j03920r1916p4734o0895l9710J4867J14475K34934
$$ -838769 -939537 -1044074 -1147994 -1239910 -1314644 -1375539 -1415249 -1400382 -1285907 -1050973
37958a050973L25526L39334K63703J33056R777o2021q9988j13155j43434j37324
$$ -1050973 -725447 -386113 -122410 10646 20423 -41598 -131586 -244741 -388175 -525499
37948e25499l8000J54756L65000M94763M96957L97935K57651J15851k3823j67858
$$ -525499 -563499 -408743 -43743 451020 947977 1345912 1603563 1719414 1695591 1527733
37938A527733l01791l85404l73937k48308l8473J77230L09523L13759K14455P3046
$$ 1527733 1225942 840538 466601 218293 179820 357050 666573 980332 1194787 1267833
37928A267833o4747j86214k88043l54286l63514l10436k16723j22886o5926n6599
$$ 1267833 1203086 1016872 728829 374543 11029 -299407 -516130 -639016 -704942 -761541
37918g61541p8908j17300j78068k70193l67209m07696l44906j88930M801J78377
$$ -761541 -840449 -957749 -1135817 -1406010 -1773219 -2180915 -2525821 -2714751 -2709950 -2531573
37908b531573K96135L41212L10316K21704J21416O5773Q0688J32186J50046R6919
$$ -2531573 -2235438 -1894226 -1583910 -1362206 -1240790 -1175017 -1094329 -962143 -812097 -715178
37898g15178J0191m0987l7621k7669n4885r3962p5925L0653J79449K84700K92496
$$ -715178 -704987 -745974 -783595 -811264 -866149 -960111 -1036036 -1005383 -825934 -541234 -248738
37887b48738K22646J51734J50510K26074L22423L76739L69364L23107K75584K64846
$$ -248738 -26092 125642 276152 502226 824649 1201388 1570752 1893859 2169443 2434289
37877B434289L23395M58479O34167P86848Q66319Q62790P98935O98690N58607
$$ 2434289 2757684 3216163 3850330 4637178 5503497 6366287 7165222 7863912 8422519
37868H422519L51096O9143k32063m61445n72420n97585n89752n54871m71360l54811
$$ 8422519 8773615 8842758 8610695 8149250 7576830 6979245 6389493 5834622 5363262 5008451
37858E008451k62111k33248k61256l18208l76454m01319l62043k68549j71705
$$ 5008451 4746340 4513092 4251836 3933628 3557174 3155855 2793812 2525263 2353558
37849B353558j10521p9755o1419o0914q9747j32861j59690j58441j39643j14074
$$ 2353558 2243037 2163282 2101863 2040949 1951202 1818341 1658651 1500210 1360567 1246493
37839A246493q4544n1789j2515L9650R4159J12955O1825m5802j49121j84930j27552
$$ 1246493 1161949 1110160 1097645 1137295 1231454 1344409 1406234 1360432 1211311 1026381 898829
37828H98829N077J69708L25408M54278N51662N93318N32566L51342J02725j22440
$$ 898829 903906 1073614 1399022 1853300 2404962 2998280 3530846 3882188 3984913 3862473
37818C862473k69167l42002l68060l68397l64092l72401l79860l44278k44088
$$ 3862473 3593306 3251304 2883244 2514847 2150755 1778354 1398494 1054216 810128
37809H10128j12024n646M3193M0072R587j5171K02O7153J54986K10221J96778
$$ 810128 698104 692458 735651 775723 785310 770139 770341 837494 992480 1202701 1399479
37798A399479J13446j3330j35245j91622j45582k4073R2576J34287R2503R585
$$ 1399479 1512925 1499595 1364350 1172728 1027146 1003073 1095649 1229936 1322439 1332024
37788A332024o9437j26613j62088j70279j33919m6895N8379J20784J04582M1778
$$ 1332024 1262587 1135974 973886 803607 669688 622793 681172 801956 906538 948316
37778I48316M154L0245R3831J44609J55287J16815J6666j40997k99510l73202
$$ 948316 952470 982715 1076546 1221155 1376442 1493257 1509923 1368926 1069416 696214
37768F96214l24957k02217q1806M782P4337J36549J66642J38281O2848j6204n8656
$$ 696214 371257 169040 87234 92016 166353 302902 469544 607825 670673 654469 595813
37757E95813n0207j814O0041J07165J27780J34549J48585J73400J87416J61005
$$ 595813 545606 543792 603833 710998 838778 973327 1121912 1295312 1482728 1643733
37747A643733P8195n2561j97974l09022l41507k78304j36496M1763K02177K94412
$$ 1643733 1721928 1669367 1471393 1162371 820864 542560 406064 447827 650004 944416
37737I44416K98129K41823J82487J53996J41114J11944O6353L7982N1524R1168
$$ 944416 1242545 1484368 1666855 1820851 1961965 2073909 2140262 2178244 2229768 2320936
37727B320936J12768Q0571l493r5213j35513r8560j8871L6829K6826m0831j32435
$$ 2320936 2433704 2514275 2510782 2415569 2280056 2181496 2162625 2199454 2226280 2185449 2053014
37716B053014k18384k77548k94708k70473k25866j84386j50098j05655k5741J06565
$$ 2053014 1834630 1557082 1262374 991901 766035 581649 431551 325896 300155 406720
37706D06720K80910M50172N56139N79795N58559N44303N54402N71457N69652N17475
$$ 406720 687630 1137802 1693941 2273736 2832295 3376598 3931000 4502457 5072109 5589584
37696E589584L70518J02364k43506n53951p17081o95979n41589l51820k17934
$$ 5589584 5960102 6062466 5818960 5265009 4547928 3851949 3310360 2958540 2740606
37687B740606j83976k34306l18297l91836m35921m44617m14927l55641k91454
$$ 2740606 2556630 2322324 2004027 1612191 1176270 731653 316726 -38915 -330369
37678c30369k43356k06580j55138o9859L7088J23861J51327J23237Q9977R9533
$$ -330369 -573725 -780305 -935443 -1005302 -968214 -844353 -693026 -569789 -479812 -380279
37668c80279J45495J76339J54725R1975K4757j9607k6511J3942R5951J85310K35326
$$ -380279 -234784 -58445 96280 188255 213012 193405 166894 180836 276787 462097 697423
37657F97423K20357J52254O7893P94m3089q3181j30493j60059j34220n5201K5209
$$ 697423 917780 1070034 1137927 1138721 1095632 1012451 881958 721899 587679 532478 557687
37646E57687N6285L2809j6015o1056q7800j00056j24434j88976k77945l28389
$$ 557687 613972 646781 630766 569710 481910 381854 257420 68444 -209501 -537890
37636e37890k94796j99719r6792m406R0662J79887K26228K10719J50649O9311
$$ -537890 -832686 -1032405 -1129197 -1133603 -1042941 -863054 -636826 -426107 -275458 -206147
37626b06147j7143p6717o4347K9894J56014K43923K54977J91412Q3397j8060o3458
$$ -206147 -223290 -300007 -364354 -334460 -178446 65477 320454 511866 595263 577203 513745
37615E13745n0169l6555q6905k00526l04921l16514k05422j3334J80710L18624
$$ 513745 463576 427021 340116 139590 -165331 -481845 -687267 -700601 -519891 -201267
37605b01267L96905M42605M63256M38287L58836K49572J40795M4185k7249m1212
$$ -201267 195638 638243 1101499 1539786 1898622 2148194 2288989 2333174 2305925 2264713
37595B264713K2411J33847K32874K79362K65432J91912O4575q8747k27374l29589
$$ 2264713 2287124 2420971 2653845 2933207 3198639 3390551 3455126 3366379 3139005 2809416
37585B809416l94644m15310l79527l06997k50543k37463k30687j76288p9905p485
$$ 2809416 2414772 1999462 1619935 1312938 1062395 824932 594245 417957 338052 330567
37575C30567p779n6409q6130n7512J3510Q9370J52881K08549K53351K63619K19030
$$ 330567 322788 266379 180249 122737 136247 225617 378498 587047 840398 1104017 1323047
37564A323047J33007M7549n813l3894o5360j09542j39401j18562m0285O5989J62562
$$ 1323047 1456054 1503603 1497790 1463896 1398536 1288994 1149593 1031031 990746 1056735 1219297
37553A219297K27184K49922K25982J67543J10795Q7030Q6256P1486L3188N828
$$ 1219297 1446481 1696403 1922385 2089928 2200723 2287753 2374009 2445495 2478683 2484511
37543B484511J9557N9595R2242J10274J26829J40431J38352J28480J35282J63430
$$ 2484511 2504068 2563663 2655905 2766179 2893008 3033439 3171791 3300271 3435553 3598983
37533C598983J95479K27297K70492L09537K95342K09380J08170P0119J08874J66192
$$ 3598983 3794462 4021759 4292251 4601788 4897130 5106510 5214680 5284799 5393673 5559865
37523E559865J80713J34951M0653q5947k22585l38781m12940m44418m43907m22548
$$ 5559865 5740578 5875529 5916182 5830235 5607650 5268869 4855929 4411511 3967604 3545056
37513C545056l92856l63969l26858k57544j47879k6040O4327J00799R0558N0728
$$ 3545056 3152200 2788231 2461373 2203829 2055950 2029910 2094237 2195036 2285594 2336322
37503B336322n081o1831j00133j08093r3306p8185q2726j10895j49493j77198
$$ 2336322 2331241 2269410 2169277 2061184 1967878 1889693 1806967 1696072 1546579 1369381
37493A369381j77501j49604j10539q3473p7921q0183o7605l3968K926J9620O964
$$ 1369381 1191880 1042276 931737 848264 770343 690160 622555 588587 591513 611133 618097
37482F18097k9958q1741j36071j76251j90051j78970j51330j10687o0189j0944
$$ 618097 588139 506398 370327 194076 4025 -174945 -326275 -436962 -497151 -508095
37472e08095K9692P2518J25802J59105J18918R76j13687j25771j9768J22098K08990
$$ -508095 -478403 -405885 -280083 -120978 -2060 -1084 -114771 -240542 -260310 -138212 70778
37461G0778K23816K09928J97578J68875R7546L286n4980m4027M27J0438l9194
$$ 70778 294594 504522 702100 870975 968521 971807 916827 872800 873227 883665 844471
37450H44471j08950j46273j38346j07623p8964o9855r5512j56167k22285k53771
$$ 844471 735521 589248 450902 343279 264315 194460 98948 -57219 -279504 -533275
37440e33275k35716j82311j11150l1682M6310J16990J91098K77366L44696L32709
$$ -533275 -768991 -951302 -1062452 -1094134 -1047824 -930834 -739736 -462370 -117674 215035
37430B15035K21202P1455k5590l5675K076L6888O0048R1696J35085J63626J51990
$$ 215035 436237 507692 482102 446427 448503 485391 545439 637135 772220 935846 1087836
37419A087836J05526N0827M484l6453p5079j02796j14173j17996j19934j06909
$$ 1087836 1193362 1244189 1248673 1212220 1137141 1034345 920172 802176 682242 575333
37409E75333o6355j1151L4828O7509R5098J06579P7713J0012o3549j13479j26424
$$ 575333 508978 497827 532655 600164 695262 801841 879554 889566 826017 712538 586114
37398E86114q5877J5412J30657J73863J12236J1473m5041n3845p0734j19135j68587
$$ 586114 500237 515649 646306 820169 932405 943878 898837 844992 774258 655123 486536
37387D86536j93239k02010k07125k02342j79956j38763p2041K1093J09494J49407
$$ 486536 293297 91287 -115838 -318180 -498136 -636899 -708940 -687847 -578353 -428946
37377d28946J38551J19217J17283J09167O3546j1636p9184j05391p0963K0754
$$ -428946 -290395 -171178 -53895 55272 118818 107182 27998 -77393 -148356 -127602
37367a27602J26453J81399J62548J15674R6634J04222R8223O7411M3944N2465
$$ -127602 -1149 180250 342798 458472 555106 659328 757551 824962 868906 921371
37357I21371P6746Q6625P8432P5547R4055J14764R4199J1619r5081j55245j34093
$$ 921371 998117 1084742 1163174 1238721 1332776 1447540 1541739 1553358 1458277 1303032 1168939
37346A168939o1786J1040O4095R9489J10212Q9014N6273M3437M7633L1517k5803
$$ 1168939 1107153 1118193 1182288 1281777 1391989 1481003 1537276 1580713 1628346 1659863 1634060
37335A634060j00076j49449j50823j04483k4648O4381J38211J86967K07956J83532
$$ 1634060 1533984 1384535 1233712 1129229 1104581 1168962 1307173 1494140 1702096 1885628
37325A885628Q9487o4435k23733l35120l88486l99237l67215k77205j32370L5140
$$ 1885628 1975115 1910680 1686947 1351827 963341 564104 196889 -80316 -212686 -177546
37315a77546J85482K87634L21421K86385K11657J37903Q2851L7335l364k3826
$$ -177546 7936 295570 616991 903376 1115033 1252936 1335787 1373122 1369758 1345932
37305A345932j2729J4694L2961L4664K9845K7094K9916M3598O7502Q3833P3063
$$ 1345932 1333203 1347897 1380858 1415522 1445367 1472461 1502377 1545975 1613477 1697310 1770373
37294A770373M3152K7810N0574J02521J58602K01931K26338K30394K20503K09868
$$ 1770373 1813525 1841335 1891909 1994430 2153032 2354963 2581301 2811695 3032198 3242066
37284C242066K03047J88875J57523J15464P3738L2703p166l0113k1743K371M889
$$ 3242066 3445113 3633988 3791511 3906975 3980713 4013416 4006250 3976137 3954394 3956765 3961654
37273C961654l4589j04522j82746k50281k80179k40093j26536J5786J28089J88723
$$ 3961654 3927065 3822543 3639797 3389516 3109337 2869244 2742708 2758494 2886583 3075306
37263C075306K20827K54757K93008L08257K68921J73692O9248K3823O7141J58263
$$ 3075306 3296133 3550890 3843898 4152155 4421076 4594768 4664016 4687839 4754980 4913243
37253D913243K25299K35480K15231K05615K16460K28756K26146K13010K09117
$$ 4913243 5138542 5374022 5589253 5794868 6011328 6240084 6466230 6679240 6888357
37244F888357K34167K90277L51600L77912L49379K86154K25903J84305J45538
$$ 6888357 7122524 7412801 7764401 8142313 8491692 8777846 9003749 9188054 9333592
37235I333592Q8357R743p7268j55559k08591k26190k16054k00660j91461j73946
$$ 9333592 9421949 9431692 9354424 9198865 8990274 8764084 8548030 8347370 8155909 7981963
37225G981963j32432q2876o1372q0413j17233j49978j83192k25770k64482k78761
$$ 7981963 7849531 7766655 7705283 7624870 7507637 7357659 7174467 6948697 6684215 6405454
37215F405454k67529k40941j98681j42423j00645j06380j46057j63634j31427
$$ 6405454 6137925 5896984 5698303 5555880 5455235 5348855 5202798 5039164 4907737
37206D907737q9798r2242j29347j38656q6653j2700J6715k2237r9488j75798k39562
$$ 4907737 4817939 4725697 4596350 4457694 4371041 4358341 4375056 4352819 4253331 4077533 3837971
37195C837971k99232l55258l90230l82869l23849k20221r3775K3752J04624J42171
$$ 3837971 3538739 3183481 2793251 2410382 2086533 1866312 1772537 1796289 1900913 2043084
37185B043084J50005J41101J14863O9084J4456l1305n4616m2997J4425J05588
$$ 2043084 2193089 2334190 2449053 2518137 2532593 2501288 2446672 2403675 2418100 2523688
37175B523688J86089K16503K06976K00318K09347J97936J34051L8915l1709m1192
$$ 2523688 2709777 2926280 3133256 3333574 3542921 3740857 3874908 3913823 3882114 3840922
37165C840922K247N6558P1907K5287n3539j03797r6497o2217m2586l4018m713
$$ 3840922 3843169 3899727 3971634 3996921 3943382 3839585 3743088 3680871 3638285 3604267 3599554
37154C599554M6585Q1376P0340K6489r158J1010J31370L65273O57609R03178J031702
$$ 3599554 3646139 3727515 3797855 3824344 3815186 3826196 3957566 4322839 4980448 5883626 6915328
37143F915328J066460J084917J142621J259610J447483J676624J797302J567544
$$ 6915328 7981788 9066705 10209326 11468936 12916419 14593043 16390345 17957889
37135A7957889Q51065j96604j189424j793368j945237j806556j562058j303704
$$ 17957889 18808954 18612350 17422926 15629558 13684321 11877765 10315707 9012003
37127I012003j065993q84825p86237p52580p33527o84580n88642m59248l34507
$$ 9012003 7946010 7061185 6274948 5522368 4788841 4104261 3515619 3056371 2721864
37118B721864k50512k08010j78836j50298j38528j44348j25095l9528R5382K21756
$$ 2721864 2471352 2263342 2084506 1934208 1795680 1651332 1526237 1486709 1582091 1803847
37108A803847L04996L52584L76327L68376L18505K29978J12864j7270j29737j90098
$$ 1803847 2108843 2461427 2837754 3206130 3524635 3754613 3867477 3850207 3720470 3530372
37098C530372j90420j52262r4384j6934P3564J44673J61715J21567M9574k8941
$$ 3530372 3339952 3187690 3093306 3076372 3149936 3294609 3456324 3577891 3627465 3598524
37088C598524j02323j65543k12952k35305k16674j43493l0198P0792J05363P0771
$$ 3598524 3496201 3330658 3117706 2882401 2665727 2522234 2492036 2562828 2668191 2738962
37078B738962K1843J7803O9095J38066J79372J70624J16067M1364j4049k0699
$$ 2738962 2760805 2778608 2847703 2985769 3165141 3335765 3451832 3493196 3479147 3458448
37068C458448R521K4472k0207j14905k06714k50970k38500j77930p8630L4663
$$ 3458448 3467969 3492441 3472234 3357329 3150615 2899645 2661145 2483215 2404585 2439248
37058B439248J10563J03956K6174n1562n5056L0977J54220K41593K55357K10622
$$ 2439248 2549811 2653767 2679941 2628379 2573323 2604300 2758520 3000113 3255470 3466092
37048C466092J46142Q5223K8649k1279m5151k2160M5590J31828K06463K54124
$$ 3466092 3612234 3697457 3726106 3704827 3659676 3637516 3683106 3814934 4021397 4275521
37038D275521K77938K89978K94502K77454K18392J18850J5760l9514j8577O2411
$$ 4275521 4553459 4843437 5137939 5415393 5633785 5752635 5768395 5728881 5710304 5772715
37028E772715J52225J99549J91201J58574J38115J28060J00376N5571L9886R2322
$$ 5772715 5924940 6124489 6315690 6474264 6612379 6740439 6840815 6896386 6936272 7028594
37018G028594J93102K86432L43448L78657M08243M19295L91966L39210L11388
$$ 7028594 7221696 7508128 7851576 8230233 8638476 9057771 9449737 9788947 10100335
37009A0100335L59250M90238O57624P95750Q72096R05156R32650R71769J014274
$$ 10100335 10459585 10949823 11607447 12403197 13275293 14180449 15113099 16084868 17099142
37000A7099142J045357J050266J006995Q90817O94813M43781J86017l3429k03729
$$ 17099142 18144499 19194765 20201760 21092577 21787390 22231171 22417188 22383759 22180030
36991B2180030l57559n37314p43455r27963j048599j113652j154476j166718j107010
$$ 22180030 21822471 21285157 20541702 19613739 18565140 17451488 16297012 15130294 14023284
36982A4023284r49925p27263n05730l41837k62621k69901l44239m45982n24343
$$ 14023284 13073359 12346096 11840366 11498529 11235908 10966007 10621768 10175786 9651443
36973I651443n37652m77973l83797l19593l25126l77656m08459l60228k32453
$$ 9651443 9113791 8635818 8252021 7932428 7607302 7229646 6821187 6460959 6228506
36964F228506q2269J1511j939j09242k39743l18749l22057k80358k37302k11497
$$ 6228506 6146237 6157748 6155809 6046567 5806824 5488075 5166018 4885660 4648358 4436861
36954D436861j95875j81275j72388j80005k00866k13302j99969j67561j29772
$$ 4436861 4240986 4059711 3887323 3707318 3506452 3293150 3093181 2925620 2795848
36945B795848p7985N372J01667J55200J33495O3925o938o2800j01497j00343m1791
$$ 2795848 2717863 2723235 2824902 2980102 3113597 3177522 3170584 3107784 3006287 2905944 2864153
36934B864153L9523Q1344O6550L3848J4803J897j1312k431M0522Q2778P9048L1807
$$ 2864153 2903676 2985020 3051570 3085418 3100221 3102118 3090806 3088375 3128897 3211675 3290723 3322530
36922C322530j4851l2939l7337n4388q4124j02942r4887p0552n4118n7060p0843
$$ 3322530 3307679 3274740 3237403 3183015 3098891 2995949 2901062 2830510 2776392 2719332 2648489
36911B648489q3802r4163j01974j01697r4689r7344j19273j40317j28982q2075
$$ 2648489 2564687 2470524 2368550 2266853 2172164 2074820 1955547 1815230 1686248 1604173
36901A604173k8330P273K6316M4175P1270J08727J47322J68055J56273J16118
$$ 1604173 1575843 1583116 1609432 1653607 1724877 1833604 1980926 2148981 2305254 2421372
36891B421372O1506k35o0086r2855p7552k9893J4535N2342J14585K04147K63288
$$ 2421372 2482878 2482643 2422557 2329702 2252150 2222257 2236792 2289134 2403719 2607866 2871154
36880B871154K32529J26503K2837k2275k6669m8181j14329j95495k41317k30780
$$ 2871154 3103683 3230186 3253023 3230748 3204079 3155898 3041569 2846074 2604757 2373977
36870B373977j80516j14254m3820J7562M9002M9096N3136R6762J68409K21408
$$ 2373977 2193461 2079207 2035387 2052949 2101951 2151047 2204183 2300945 2469354 2690762
36860B690762K29217K04261J64069J06626K6461o4460j38709j64376j19877k0401
$$ 2690762 2919979 3124240 3288309 3394935 3421396 3356936 3218227 3053851 2933974 2913573
36850B913573P2674R5818M2702l8907j05600j45798j52269j09756k7849M5670
$$ 2913573 2986247 3082065 3124767 3085860 2980260 2834462 2682193 2572437 2544588 2590258
36840B590258O8607M1925j3407r3307j98306k98708l41376k95688j82942o1044
$$ 2590258 2658865 2700790 2687383 2594076 2395770 2097062 1755686 1459998 1277056 1216012
36830A216012J7716M3087M7812O7809J02822J24763J16850Q5311L7941k1816p7110
$$ 1216012 1233728 1276815 1324627 1392436 1495258 1620021 1736871 1822182 1860123 1838307 1761197
36819A761197j02160r4039p7588p0659o6901n9890n7836o2454n8850m2349l3774
$$ 1761197 1659037 1564998 1487410 1416751 1349850 1289960 1232124 1169670 1110820 1068471 1034697
36808A034697n1766q8474j26502j59521j79689j64800j00624p016P4548J16178
$$ 1034697 982931 894457 767955 608434 428745 263945 163321 156305 230853 347031
36798C47031J23127J29116J72154K57132L40236L68618L34236K66457J79360O5464
$$ 347031 470158 599274 771428 1028560 1368796 1737414 2071650 2338107 2517467 2582931
36788B582931n5249j26849j19315o4489r912L0374N7921N8094J7557m8252j09030
$$ 2582931 2527682 2400833 2281518 2217029 2207117 2237491 2295412 2353506 2371063 2322811 2213781
36777B213781j41525j24029m0942Q4578J91755K39884K39774K13221J61356R8260
$$ 2213781 2072256 1948227 1907285 1991863 2183618 2423502 2663276 2876497 3037853 3136113
36767C136113P0104R8373J37131J30439Q6254N3583N3548P5489J15206J70202
$$ 3136113 3206217 3304590 3441721 3572160 3658414 3711997 3765545 3841034 3956240 4126442
36757D126442K16599K35193K43755K65843K91676L10784L52505M41844N43108
$$ 4126442 4343041 4578234 4821989 5087832 5379508 5690292 6042797 6484641 7027749
36748G027749O08661O63887P79544R72557J198101J431853J697487K019823K413526
$$ 7027749 7636410 8300297 9079841 10052398 11250499 12682352 14379839 16399662 18813188
36739A8813188K909752L526712M217017M893887N455153N665893N073592L287889
$$ 18813188 21722940 25249652 29466669 34360556 39815709 45481602 50555194 53843083
36731E3843083M93272k435185m508291n339385n260095m828704m360034l882890
$$ 53843083 54336355 51901170 47392879 42053494 36793399 31964695 27604661 23721771
36723B3721771l345607k746400k135093j588617j185188r58414q71437q48083
$$ 23721771 20376164 17629764 15494671 13906054 12720866 11762452 10891015 10042932
36715A0042932q21565p52640o30023m75724l36537k48845k10743j94074j78028
$$ 10042932 9221367 8468727 7838704 7362980 7026443 6777598 6566855 6372781 6194753
36706F194753j65877j73571k05466k38823k35155j75667q5850j7815p440n2856
$$ 6194753 6028876 5855305 5649839 5411016 5175861 5000194 4914344 4896529 4889089 4836233
36696D836233j28660k08002k70931l06663l18105l18767l16292k98192k37895
$$ 4836233 4707573 4499571 4228640 3921977 3603872 3285105 2968813 2670621 2432726
36687B432726j19147M1235J92997K80539K82354K28642J77630J70060K04318K51159
$$ 2432726 2313579 2354814 2547811 2828350 3110704 3339346 3516976 3687036 3891354 4142513
36677D142513K82904K83160K40404J55360O2165K0849O3894J54321K20748K39271
$$ 4142513 4425417 4708577 4948981 5104341 5166506 5187355 5251249 5405570 5626318 5865589
36667E865589K60751L48916N09997O93379Q38267Q97152Q32746O32862L41137
$$ 5865589 6126340 6475256 6985253 7678632 8516899 9414051 10246797 10879659 11220796
36658A1220796N2453j40699k00677j49819l8192Q7484J94546K65129L03066L40988
$$ 11220796 11273249 11132550 10931873 10782054 10743862 10831346 11025892 11291021 11594087 11935075
36648A1935075M22848N62343P27060Q83174J044597J240328J427881J486133J332538
$$ 11935075 12357923 12920266 13647326 14530500 15575097 16815425 18243306 19729439 21061977
36639B1061977J029650P42842N99934O14867P32370R04593J111938J335591J536389
$$ 21061977 22091627 22834469 23434403 24049270 24781640 25686233 26798171 28133762 29670151
36630B9670151J672287J745440J833878K060629K512400L182274L989167M846972
$$ 29670151 31342438 33087878 34921756 36982385 39494785 42677059 46666226 51513198
36622E1513198N713920O562985P259115P445176O648584M675937J967412n48744
$$ 51513198 57227118 63790103 71049218 78494394 85142978 89818915 91786327 91237583
36614I1237583k072364k417223j928249j103410m30044m14676j409273l250057
$$ 91237583 89165219 86747996 84819747 83716337 83286293 82871617 81462344 78212287
36606G8212287n221704o555107o965046o682508o079245n377682m654027l946319
$$ 78212287 72990583 66435476 59470430 52787922 46708677 41330995 36676968 32730649
36598C2730649l291427k717633k246835j887236j618005j406607j244556j144914
$$ 32730649 29439222 26721589 24474754 22587518 20969513 19562906 18318350 17173436
36590A7173436j106313j098984j081784j017254q84070p00148n24561m10581l59649
$$ 17173436 16067123 14968139 13886355 12869101 11985031 11284883 10760322 10349741 9990092
36581I990092l38231l25775l18936k99914k39131j38029m3216l578k3388o2738
$$ 9990092 9651861 9326086 9007150 8707236 8468105 8330076 8286860 8283282 8259894 8197156
36571H197156p5529m6575k632R730l5289j19177j94466k20146j85367j13135m8192
$$ 8197156 8121627 8075052 8072420 8082150 8046861 7927684 7733218 7513072 7327705 7214570 7166378
36560G166378k9357o1053j14352j57403j74096j52290p7913M0505J56498K20284
$$ 7166378 7137021 7075968 6961616 6804213 6630117 6477827 6399914 6440419 6596917 6817201
36550F817201K28229K21411K36001K72022L14030L64005M38176N36589O32297
$$ 6817201 7045430 7266841 7502842 7774864 8088894 8452899 8891075 9427664 10059961
36541A0059961O98809P41923P96083Q93411J044726J239831J439029J559697J506770
$$ 10059961 10758770 11500693 12296776 13190187 14234913 15474744 16913773 18473470 19980240
36532A9980240J251508Q76680N25669L09571K66981L84061O17722R04885J178711
$$ 19980240 21231748 22108428 22634097 22943668 23210649 23594710 24212432 25117317 26296028
36523B6296028J384615J484129J475561J434906J501096J772551K230451K799120
$$ 26296028 27680643 29164772 30640333 32075239 33576335 35348886 37579337 40378457
36515D0378457L456206M231190N109221N976067O615084O695238N851195L981111
$$ 40378457 43834663 48065853 53175074 59151141 65766225 72461463 78312658 82293769
36507H2293769J538472o10528j759376j798433j114882k30190L63953K11756r27620
$$ 82293769 83832241 83221713 81462337 79663904 78549022 78318832 78682785 78894541 77966921
36498G7966921k795600m682243n906003o256374n975989n416553m786052m149861
$$ 77966921 75171321 70489078 64583075 58326701 52350712 46934159 42148107 37998246
36490C7998246l532745k965620k475158k071007j748885j500758j318747j184576
$$ 37998246 34465501 31499881 29024723 26953716 25204831 23704073 22385326 21200750
36482B1200750j060187r06124p17785n34039m00770l26240k70747j76444j3490
$$ 21200750 20140563 19234439 18516654 17982615 17581845 17255605 16984858 16808414 16794924
36473A6794924J93973L91380N49265O85076Q21045R40201J010109J039188J074988
$$ 16794924 16988897 17380277 17929542 18614618 19435663 20375864 21385973 22425161 23500149
36464B3500149J142869J217135J266780J307779J392279J557177J794775K060598
$$ 23500149 24643018 25860153 27126933 28434712 29826991 31384168 33178943 35239541
36456C5239541K292219K425638K413961K243805J935531J525949J048517N26837
$$ 35239541 37531760 39957398 42371359 44615164 46550695 48076644 49125161 49651998
36448D9651998j7041n53581j049603j479738j829263k088125k252172k332579
$$ 49651998 49634957 49081376 48031773 46552035 44722772 42634647 40382475 38049896
36440C8049896k354224k338147k289099k200896k066398j882548j659438j431703
$$ 38049896 35695672 33357525 31068426 28867530 26801132 24918584 23259146 21827443
36432B1827443j249790j146321j108423j084021j015681q78125o97163n30993
$$ 21827443 20577653 19431332 18322909 17238888 16223207 15345082 14647919 14116926
36424A4116926m19742l52969k97180k47504k30360k57722l06398l48132l72841
$$ 14116926 13697184 13344215 13047035 12799531 12569171 12311449 12005051 11656919 11284078
36415A1284078l71888l28192k44771j62378j23147j25065j29942j08619o4635
$$ 11284078 10912190 10583998 10339227 10176849 10053702 9928637 9798695 9690076 9625441
36406I625441k3155j1868m5692j13858j80267k03076j57959n2651O8414J43497
$$ 9625441 9602286 9590418 9544726 9430868 9250601 9047525 8889566 8836915 8905329 9048826
36396I048826J44548J12447J17290J76508K34489K29660J57583O0878j3982l5231
$$ 9048826 9193374 9305821 9423111 9599619 9834108 10063768 10221351 10282229 10268247 10233016
36386A0233016J0553J09849K30613L50738M62377N45149N66847N28113M81013
$$ 10233016 10243569 10353418 10584031 10934769 11397146 11942295 12509142 13037255 13518268
36377A3518268M83179N49938O59945P81930Q86620R66648J063747J245729J536207
$$ 13518268 14001447 14551385 15211330 15993260 16879880 17846528 18910275 20156004 21692211
36368B1692211J889423K231765K470519K449210J992874J096669M2499p66079
$$ 21692211 23581634 25813399 28283918 30733128 32726002 33822671 33865170 33099091
36360C3099091j111653j078157q84744o73431m61170k17403P2147L98608P43095
$$ 33099091 31987438 30909281 30024537 29351106 28889936 28672533 28744680 29143288 29886383
36351B9886383J086410J413915J716414J994648K267759K562764K880722L184849
$$ 29886383 30972793 32386708 34103122 36097770 38365529 40928293 43809015 46993864
36343D6993864L440075L655797L871786M109254M352414M570840M742084M854023
$$ 46993864 50433939 54089736 57961522 62070776 66423190 70994030 75736114 80590137
36335H0590137M894457M834462M621587M206235L580588K774859J816313P24843
$$ 80590137 85484594 90319056 94940643 99146878 102727466 105502325 107318638 108043481
36327A08043481m40590j568648k555177l356204l971608m411838m700484m871201
$$ 108043481 107602891 106034243 103479066 100122862 96151254 91739416 87038932 82167731
36319H2167731m931523m859020m656942m376598m057556l690544l278585k889726
$$ 82167731 77236208 72377188 67720246 63343648 59286092 55595548 52316963 49427237
36311D9427237k596422k396086k242792k122133k035242j942982j803048j650792
$$ 49427237 46830815 44434729 42191937 40069804 38034562 36091580 34288532 32637740
36303C2637740j569479j575039j588965j532607j400587j240835j110909j052988
$$ 32637740 31068261 29493222 27904257 26371650 24971063 23730228 22619319 21566331
36295B1566331j059146j055555r69901q23283p12250o93107p25584p36024o91759
$$ 21566331 20507185 19451630 18481729 17658446 16946196 16253089 15527505 14791481 14099722
36286A4099722o01989m86671l64805k50780j52843q7794q3460j39574k04196k28111
$$ 14099722 13497733 13011062 12646257 12395477 12242634 12154840 12071380 11931806 11727610 11499499
36276A1499499k29878k65510l46259m31430m89875n17012m99871m22520l07504
$$ 11499499 11269621 11004111 10657852 10226422 9736547 9219535 8719664 8297144 7989640
36267G989640k01255j19132n4436l2783r1281j99636k71626k74491k66871l05751
$$ 7989640 7788385 7669253 7614817 7582034 7490753 7291117 7019491 6745000 6478129 6172378
36257F172378l71171m06693l80325k78909r9218J14316K66628K92962K20281J19130
$$ 6172378 5801207 5394514 5014189 4735280 4636062 4750378 5017006 5309968 5530249 5649379
36247E649379K2091p9680j84703k62897k81567k29333j22651j122R2986J38374
$$ 5649379 5671470 5591790 5407087 5144190 4862623 4633290 4510639 4509517 4602503 4740877
36237D740877J33622Q3390N651n9759q2969q1952r8772j42618j87593k16632k25182
$$ 4740877 4874499 4957889 4963540 4903781 4820812 4738860 4640088 4497470 4309877 4093245 3868063
36226C868063j87521p2218R8449K48607L22001L20914K69364J83653R2802M2917
$$ 3868063 3680542 3608324 3706773 3955380 4277381 4598295 4867659 5051312 5144114 5187031
36216E187031N4891J03598J53608J90166K06161J88328J31732N0787k8331p3515
$$ 5187031 5241922 5345520 5499128 5689294 5895455 6083783 6215515 6266302 6237971 6164456
36206F164456n9050J343N1110N6983O1893J26645K31386K86108K34236R8357o7116
$$ 6164456 6105406 6106749 6157859 6214842 6276735 6403380 6634766 6920874 7155110 7253467 7186351
36195G186351k11746k81050k36406r8786O8237K20273L37647L87350L45563K58150
$$ 7186351 6974605 6693555 6457149 6358363 6426600 6646873 6984520 7371870 7717433 7975583
36185G975583K13734K46013L14469L79862M37381M75206M69485M30272L89587
$$ 7975583 8189317 8435330 8749799 9129661 9567042 10042248 10511733 10942005 11331592
36176A1331592L38436K43828J34845R4712J45896K10190K05009J20657q938j43346
$$ 11331592 11670028 11913856 12048701 12143413 12289309 12499499 12704508 12825165 12816227 12672881
36166A2672881k28048k21674j55295j03759q2758l7601N8136J68858K74954M03820
$$ 12672881 12444833 12223159 12067864 11964105 11881347 11843746 11901882 12070740 12345694 12749514
36156A2749514N62052P11610Q25906Q83767P97867M63458p3664n93401r03503
$$ 12749514 13311566 14023176 14849082 15732849 16530716 16994174 16920510 16327109 15423606
36147A5423606r94323r58957q56727p14968n76796m65946l55053k23648r8365
$$ 15423606 14429283 13470326 12613599 11898631 11321835 10855889 10500836 10277188 10178823
36138A0178823k87Q3000J38161J14892J7227o8779q5401p0388p2455p8144p0169
$$ 10178823 10178536 10261536 10399697 10514589 10531816 10463037 10377636 10307248 10234793 10156649 10086480
36127A0086480p9375j23865j65591j74285j64651j31462k9667J35590K80260L48069
$$ 10086480 10007105 9883240 9717649 9543364 9378713 9247251 9217584 9353174 9633434 9981503
36117I981503L67673L68675L32279K63240K11828J83908J33820Q4845J34139K85126
$$ 9981503 10349176 10717851 11050130 11313370 11525198 11709106 11842926 11927771 12061910 12347036
36107A2347036M02539M01165L57075L63202M01077M30986M81340N64691O24328
$$ 12347036 12749575 13150740 13507815 13871017 14272094 14703080 15184420 15749111 16373439
36098A6373439O40152O66849P06341O87229O37269P12654R75450J310029J639412
$$ 16373439 17013591 17680440 18386781 19074010 19711279 20423933 21399383 22709412 24348824
36089B4348824K034529K518785K975495L362829L809421M385503N012997N716772
$$ 24348824 26383353 28902138 31877633 35240462 39049883 43435386 48448383 54165155
36081E4165155O695463Q011956R518068J1233528J3448612J6285973J9584511
$$ 54165155 60860618 68872574 78390642 89624170 103072782 119358755 138943266
36074A38943266K3418186K8201702L3999503M0325441M6788587N2632265N4633834
$$ 138943266 162361452 190563154 224562657 264888098 311676685 364308950 418942784
36067D18942784M7010817K6212808l556314l1486033m8208651n2278859m8649033
$$ 418942784 465953601 492166409 488610095 457124062 408915411 356636552 307987519
36060C07987519m2549691l6207900l0084425k4638534k0201720j6497393j3170578
$$ 307987519 265437828 229229928 199145503 174506969 154305249 137807856 124637278
36053A24637278j0302782q031808o150509m409728k834727j479950k00774J102113
$$ 124637278 114334496 106302688 100152179 95742451 92907724 91427774 91227000 92329113
36045I2329113K288228L214095L913553M378404M393183L755438K487263P31968
$$ 92329113 94617341 97831436 101744989 106123393 110516576 114272014 116759277 117491245
36037A17491245j348380l464485n210379o343871o927994p114113o953175o506639
$$ 117491245 116142865 112678380 107468001 101124130 94196136 87082023 80128848 73622209
36029G3622209n952057n437581m955166m458822l984653l565344l156031k742076
$$ 73622209 67670152 62232571 57277405 52818583 48833930 45268586 42112555 39370479
36021C9370479k404115k183557j992901j752222j517279j383801j349409j348174
$$ 39370479 36966364 34782807 32789906 31037684 29520405 28136604 26787195 25439021
36013B5439021j342148j309426j220226j091686r96936r65173r40958q82615q20708
$$ 25439021 24096873 22787447 21567221 20475535 19478599 18513426 17572468 16689853 15869145
36004A5869145p78502p22107o36328n63317n17209m46911l37078k63438k91087
$$ 15869145 15090643 14368536 13732208 13168891 12651682 12204771 11867693 11604255 11313168
35995A1313168l89648m94828n75247n93576m92671k87704r9555l0022n9797j18288
$$ 11313168 10923520 10428692 9853445 9259869 8767198 8479494 8379939 8349917 8290120 8171832
35985H171832j85488k67430l35777l59336l53592l50258l57295l79638m24887
$$ 8171832 7986344 7718914 7383137 7023801 6670209 6319951 5962656 5583018 5158131
35976E158131m57127m07031k64959j05707R872R3136J60821J89906J78865J71295
$$ 5158131 4701004 4293973 4029014 3923307 3933179 4026315 4187136 4377042 4555907 4727202
35966D727202J67959R8082n7328j88389j76900l6129J36044K83230L96161M47303
$$ 4727202 4895161 4993243 4935915 4747526 4570626 4534497 4670541 4953771 5349932 5797235
35956E797235M05518K88244J34389m4669k31615l62409l87074l43241l07935l01287
$$ 5797235 6202753 6490997 6625386 6580717 6349102 5986693 5599619 5256378 4948443 4647156
35946D647156k92935k73273k56414k35084j93839j54336j55598j99620k57462
$$ 4647156 4354221 4080948 3824534 3589450 3395611 3241275 3085677 2886057 2628595
35937B628595l11944l54701l62176l16933k35428j39305k3588J08779K09462K29113
$$ 2628595 2316651 1961950 1599774 1282841 1047413 908108 884520 993299 1202761 1431874
35927A431874J81873J26201R8852J00398J20110J37310J23833Q5120P4346J26295
$$ 1431874 1613747 1739948 1838800 1939198 2059308 2196618 2320451 2405571 2479917 2606212
35917B606212K03275K46930K53940K53801K41418J88726J04457K4990m4892j30034
$$ 2606212 2809487 3056417 3310357 3564158 3805576 3994302 4098759 4123749 4078857 3948823
35907C948823k29208l09358l53748l74935l83143l79127l71426l61696l19917
$$ 3948823 3719615 3410257 3056509 2681574 2298431 1919304 1547878 1186182 866265
35898H66265k16361p6869L1798P2328O0848K7073j0653l0906r237N6505J43722
$$ 866265 649904 573035 604833 677161 738009 765082 754429 723523 714286 770791 914513
35887I14513K28107K86918K89235K18919J09209K1449j9458m4944r2886j59460
$$ 914513 1142620 1429538 1718773 1937692 2046901 2068350 2048892 2003948 1911062 1751602
35877A751602k07032k03411j49037p7398k8306j0165P253N3679J22422J84976
$$ 1751602 1544570 1341159 1192122 1114724 1086418 1076253 1083506 1137185 1259607 1444583
35867A444583K25112K38008K09581J26168N429j02201j47268j11238j4551R0462
$$ 1444583 1669695 1907703 2117284 2243452 2248881 2146680 1999412 1888174 1873623 1964085
35857A964085J44098J16131K2466r2694j78424j85781r1635O3603J86143K06433
$$ 1964085 2108183 2224314 2246780 2154086 1975662 1789881 1698246 1761849 1947992 2154425
35847B154425J40093N9006J8389K4598M8946N0239N461n6706p3280k4200K8494
$$ 2154425 2294518 2353524 2371913 2396511 2445457 2495696 2501157 2444451 2371171 2346971 2375465
35836B375465R392p8910j63626j85211j40263n5633M1627J31076K06044K72669
$$ 2375465 2384857 2305947 2142321 1957110 1816847 1761214 1802841 1933917 2139961 2412630
35826B412630L20062L02965J85243l783j84446k96446l32817l16010k71159k19836
$$ 2412630 2732692 3035657 3220900 3217117 3032671 2736225 2403408 2087398 1816239 1596403
35816A596403j71093j15452m5388K3832P1801R8872J10810R2942L2775m1253q0713
$$ 1596403 1425310 1309858 1264470 1288302 1360103 1458975 1569785 1662727 1695502 1654249 1573536
35805A573536p5777n9560n3885m5103j8956J4082M1536P2798J26376K06478K96298
$$ 1573536 1497759 1438199 1384314 1339211 1320255 1334337 1375873 1448671 1575047 1781525 2077823
35794B077823L62267L70247L19662K60912K56046L17724M00492M44830M10100
$$ 2077823 2440090 2810337 3129999 3390911 3646957 3964681 4365173 4810003 5220103
35785E220103K80245P9587j13173k09737j95304j45682j44646k01581k63109k83540
$$ 5220103 5500348 5579935 5466762 5257025 5061721 4916039 4771393 4569812 4306703 4023163
35775D023163k60707k13707j50783o5376M6263J71812K90902L95533M93394N83914
$$ 4023163 3762456 3548749 3397966 3332590 3378853 3550665 3841567 4237100 4730494 5314408
35765E314408O41188O37611N85555N44529N82686P30282R61651J217053J453428
$$ 5314408 5955596 6593207 7178762 7723291 8305977 9036259 9997910 11214963 12668391
35756A2668391J683132J953551K284669K647341L013634L397086L808104M178830
$$ 12668391 14351523 16305074 18589743 21237084 24250718 27647804 31455908 35634738
35748C5634738M356994M165969L463840K199302M90696j342805k900957l914565
$$ 35634738 39991732 44157701 47621541 49820843 50311539 48968734 46067777 42153212
35740D2153212m352577m340393m021418l511504k929380k399675k005670j754311
$$ 42153212 37800635 33460242 29438824 25927320 22997940 20598265 18592595 16838284
35732A6838284j594025j463227j326173j173884j005129q23966o59635n64305
$$ 16838284 15244259 13781032 12454859 11280975 10275846 9451880 8792245 8227940
35724H227940n65894o32438p05100p54813p79966p64108o80462n39982l92051
$$ 8227940 7662046 7029608 6324508 5569695 4789729 4025621 3345159 2805177 2413126
35715B413126k65192j43516j5594R1625J51212J78469K09152K57906L20232L93374
$$ 2413126 2147934 2004418 1988824 2080449 2231661 2410130 2619282 2877188 3197420 3590794
35705C590794M72244N44217O09462O87083P82352Q72026R41128R96308J004104
$$ 3590794 4063038 4607255 5216717 5903800 6686152 7558178 8499306 9495614 10499718
35696A0499718Q54801M60531j06768o33278r40669j012567r41590q09122o53719
$$ 10499718 11354519 11815050 11708282 11075004 10134335 9121768 8180178 7371056 6717337
35687F717337n11776m19706l68734l01326j77217k9503O0687M4449m2538j05043
$$ 6717337 6205561 5785855 5417121 5115795 4938578 4909075 4969762 5014211 4971673 4866630
35677D866630o8906N3370J72909K02505J26242l902j26582k14900k72150l07378
$$ 4866630 4797724 4851094 5024003 5226508 5352750 5348848 5222266 5007366 4735216 4427838
35667D427838l24607l26477l20539l24350l60222m30426m95506m96598m12311
$$ 4427838 4103231 3776754 3456215 3131865 2771643 2341217 1845711 1349113 936802
35658I36802k80954j54613m7406N1890J33497J67802J53205J30376J36333J66408
$$ 936802 655848 501235 453829 505719 639216 807018 960223 1090599 1226932 1393340
35648A393340J93883K07162K12893K19213K31683K50431K53911K00078O7613j07897
$$ 1393340 1587223 1794385 2007278 2226491 2458174 2708605 2962516 3162594 3230207 3122310
35638C122310k56837l33222l39024l01684k49060k05473j89712k03121k23876
$$ 3122310 2865473 2532251 2193227 1891543 1642483 1437010 1247298 1044177 820301
35629H20301k20459j77114j13254p4813r0199j30316j31209o6895K1186Q3130
$$ 820301 599842 422728 309474 234661 144462 14146 -117063 -183958 -162772 -79642
35619g9642J24040J79088K45058K79894K67903K41443K24806J94274J19231J8590
$$ -79642 44398 223486 468544 748438 1016341 1257784 1482590 1676864 1796095 1814685
35609A814685n3365o7739m4457j8920m827Q939L9413R3180J60934K22965K61792
$$ 1814685 1761320 1693581 1649124 1630204 1625377 1634316 1673729 1766909 1927843 2150808 2412600
35598B412600K71471K55587K19422J67910J11340O8998O0126Q5651J21200J36754
$$ 2412600 2684071 2939658 3159080 3326990 3438330 3507328 3567454 3653105 3774305 3911059
35588C911059J25326J04935R0548P4392L8882k2140j02083j89268k64985l05738
$$ 3911059 4036385 4141320 4231868 4306260 4345142 4323002 4220919 4031651 3766666 3460928
35578C460928l03003k74461k42447k07953j59272r7211l3396K9780R4383J40720
$$ 3460928 3157925 2883464 2641017 2433064 2273792 2176581 2143185 2172965 2267348 2408068
35568B408068J28552L7479j00944k19071k63455k36000j89484j73092j76863j44421
$$ 2408068 2536620 2574099 2473155 2254084 1990629 1754629 1565145 1392053 1215190 1070769
35558A070769n0069N8019J11922J01962P2200N4504M5704M4069O4481J07792J49754
$$ 1070769 1020700 1078719 1190641 1292603 1364803 1419307 1465011 1509080 1573561 1681353 1831107
35547A831107J72172J75008J48181O7954n8301j76061k41120k71089l10236l57315
$$ 1831107 2003279 2178287 2326468 2394422 2336121 2160060 1918940 1647851 1337615 980300
35537I80300l57885k64456q4792J23710K90107L67049L53104K83636J95665J06267
$$ 980300 622415 357959 273167 396877 686984 1054033 1407137 1690773 1886438 1992705
35527A992705K4256l7852p6448j04486j30065j41515j29420j05589p7985k4978
$$ 1992705 2016961 1979109 1902661 1798175 1668110 1526595 1397175 1291586 1213601 1188623
35517A188623P1330J72660K02655J26924r588j33180k07037k39109k52492k68999
$$ 1188623 1259953 1432613 1635268 1762192 1752604 1619424 1412387 1173278 920786 651787
35507F51787l04350l52814l79620l48096k55759j30290P355J55154K98980L91200
$$ 651787 347437 -5377 -384997 -733093 -988852 -1119142 -1111787 -956633 -657653 -266453
35497b66453L84054K82744J48772M7051rp525K839J7968L0750L7464L3864P886
$$ -266453 117601 400345 549117 596168 596159 588634 591473 609441 640191 677655 711519 719405
35485G19405n1929j30288j82163j74481j20506n3865J6642R4972J50746J31153
$$ 719405 667476 537188 355025 180544 60038 6173 22815 117787 268533 399686
35475C99686L5024o2408q6295m2893ol286l4339l8507K6918J58467K95685L54420
$$ 399686 434710 372302 286007 243114 243108 239822 205483 166976 193894 352361 648046 1002466
35463A002466K98314J77065P6829L9381M7974P7199J20038J64886J83654J60108
$$ 1002466 1300780 1477845 1554674 1594055 1642029 1719228 1839266 2004152 2187806 2347914
35453B347914J07137M0556m3265j45838k41915l01962l29773l50682l62180l23156
$$ 2347914 2455051 2495607 2452342 2306504 2064589 1762627 1432854 1082172 719992 396836
35443C96836k06486m8264P1790R6478K9927q0667j83067k37634k19964j30766
$$ 396836 190350 142086 213876 310354 340281 259614 76547 -161087 -381051 -511817
35433e11817n740R9290J44526J30331Q9764O3119P5009J22610J80106K20033K32596
$$ -511817 -517557 -418267 -273741 -143410 -53646 9473 84482 207092 387198 607231 839827
35422H39827K20262J78928J00306l333r2319j28574j05487m6093J6262N0764M1376
$$ 839827 1060089 1239017 1339323 1335990 1243671 1115097 1009610 963517 979779 1030543 1071919
35411A071919K076l1572m2470n4441r7248j57609j88153j65046j15335q0817p0472
$$ 1071919 1073995 1042423 999953 945512 848264 690655 502502 337456 222121 141304 70832
35400G0832n6538p447Q0028J70557K07581J53508K4457j17102k09491k32225k03903
$$ 70832 14294 6847 86875 257432 465013 618521 642978 525876 316385 84160 -119743
35389a19743j50036p6451K9790J73415L22025M12151L99207L02850J90643J14641
$$ -119743 -269779 -346230 -316440 -143025 179000 591151 990358 1293208 1483851 1598492
35379A598492P4620M1432m494o6237j41240k19638k80268l05998l00496k77381
$$ 1598492 1673112 1714544 1710050 1643813 1502573 1282935 1002667 696669 396173 118792
35369A18792k36289j64128o0166N3064J47160K06862K29573K15961J67584Q9993
$$ 118792 -117497 -281625 -341791 -288727 -141567 65295 294868 510829 678413 768406
35359G68406n018r8235j66240j94168j88045j67706j43860j09011n7163n867J3827
$$ 768406 763388 665153 498913 304745 116700 -51006 -194866 -303877 -361040 -366907 -353080
35348c53080o915l6469k8963K9598J06198J55865J68532J72738J91783K08731
$$ -353080 -359995 -396464 -425427 -395829 -289631 -133766 34766 207504 399287 608018
35338F08018J86943J19561M2171o519k1940k5009l0832l9899n1437o8074q8198
$$ 608018 794961 914522 956693 950174 928234 903225 872393 832494 781057 712983 624785
35327F24785j06726j22386j31222j15611n9343K1865Q4461J01947Q8366O4905
$$ 624785 518059 395673 264451 148840 89497 111362 195823 297770 386136 451041
35317D51041K4626m4070j13006j29235p9592j2167J7925K254l3631p2586j11367
$$ 451041 475667 431597 318591 189356 109764 97597 115522 117776 84145 11559 -99808
35306i9808j36913j26126p3511k372N6893R1239J06609J12627J06451O9873q965
$$ -99808 -236721 -362847 -436358 -438730 -381837 -290598 -183989 -71362 35089 104962 95997
35295I5997j03629j53416j19085k8109N7498J13821J66830K29216K62136K22873
$$ 95997 -7632 -161048 -280133 -308242 -250744 -136923 29907 259123 521259 744132
35285G44132J26620L2810j6706k0602O436M6441O9111M7253m518l0956O223Q3960
$$ 744132 870752 903562 886856 866254 872690 919131 988242 1035495 1030977 1000021 1006244 1090204
35273A090204J40169J27779M2279q2639j91573k36659k11793j53246r6293m2780
$$ 1090204 1230373 1358152 1400431 1317792 1126219 889560 677767 524521 428228 385448
35263C85448J6928O8161Q2512N5282O423n3301j30452k17220k74068k58802j66491
$$ 385448 402376 470537 553049 608331 614754 561453 431001 213781 -60287 -319089 -485580
35252d85580l7672O5276R4315M7937k5715p0759p5177p2903r5911j39087j73032
$$ -485580 -523252 -457976 -363661 -315724 -341439 -412198 -487375 -560278 -656189 -795276 -968308
35241i68308j71852j22017k4458R7244K03152K64904K80915K59261K00682J08775
$$ -968308 -1140160 -1262177 -1286635 -1189391 -986239 -721335 -440420 -181159 19523 128298
35231A28298K465r5361j71179k13259k08083j62073j12658r4254r9573r4474o3690
$$ 128298 130763 35402 -135777 -349036 -557119 -719192 -831850 -926104 -1025677 -1120151 -1183841
35220a183841j7485M2227J30032K39895L23989L29353K49179J27000J6861n1731
$$ -1183841 -1201326 -1159099 -1029067 -789172 -465183 -135830 113349 240349 257210 205479
35210B05479p8219p7262o4433m6274j7149L2443R9155J58486J79899J54459J01456
$$ 205479 127260 49998 -14435 -60709 -77858 -45415 53740 212226 392125 546584 648040
35199F48040M2204k2034r0250j28560q7701L3663J65234K25903J98712J30435
$$ 648040 690244 668210 577960 449400 361699 395362 560596 786499 985211 1115646
35189A115646P0072L0674O325l70K0869O9159J21259J40889J08706N0729K5243
$$ 1115646 1185718 1216392 1222717 1222347 1243216 1312375 1433634 1574523 1683229 1733958 1759201
35178A759201O5417J40196J85274J65538R2441p460j12237j93718k18470j77005
$$ 1759201 1824618 1964814 2150088 2315626 2408067 2400607 2288370 2094652 1876182 1699177
35168A699177r8881k7160J4665K6481J5822j1800n3705j07809j65614k06805k10814
$$ 1699177 1600296 1573136 1587801 1614282 1630104 1618304 1564599 1456790 1291176 1084371 873557
35157H73557j79155j38986j16770j08678p9642M830J38288K61632L02857K41162
$$ 873557 694402 555416 438646 329968 250326 255156 393444 655076 957933 1199095
35147A199095J28597M0455J0330K0531M1171N8193O9775P8592Q9612R8844Q4617
$$ 1199095 1327692 1368147 1378477 1399008 1440179 1498372 1568147 1646739 1736351 1835195 1919812
35136A919812K8532n3464j19022j41316j26618q9909l6933J9602M7393J8810n6306
$$ 1919812 1948344 1894880 1775858 1634542 1507924 1418015 1381082 1400684 1448077 1466887 1410581
35125A410581j33152j66850j44154q8532l9439k3767m4420r1636j52198k02002
$$ 1410581 1277429 1110579 966425 877893 838454 814687 770267 678631 526433 324431
35115C24431k08464j60759q7712k4554K8933R1615J50226J60333J04580K1839
$$ 324431 115967 -44792 -132504 -157058 -128125 -36510 113716 274049 378629 400468
35105D00468l2121l0947K0401R9203J61672J49816L2515j56008l26215l86370
$$ 400468 368347 337400 357801 457004 618676 768492 801007 644999 318784 -67586
35095f7586l02217j27996K4023P3875M6927M2822J27964K74094L98725M38236
$$ -67586 -369803 -497799 -473776 -399901 -352974 -310152 -182188 91906 490631 928867
35085I28867L79474K55835J29863N3813K7130O999l2604p4296r3377q8548o6416
$$ 928867 1308341 1564176 1694039 1747852 1774982 1781981 1749377 1675081 1581704 1493156 1426740
35074A426740l1788j1360m8273j42828k29550k46721k04391j52752j12296p5440
$$ 1426740 1394952 1383592 1335319 1192491 962941 716220 511829 359077 246781 171341
35064A71341n0222m7904l8106K5722J27207J81761J32338J9896o1611n8461J1457
$$ 171341 121119 73215 35109 60831 188038 369799 502137 522033 460422 401961 413418
35053D13418R8243J63597J89873J71375J13696L9529k0227n4078q2728j28432
$$ 413418 511661 675258 865131 1036506 1150202 1189731 1169504 1115426 1032698 904266
35043I04266j75601j84865j47610r8710o7792n0693m5199p7358j58124k39898
$$ 904266 728665 543800 396190 297480 229688 178995 133796 56438 -101686 -341584
35033c41584k57321k00721j15511l8034L4507J16501K09427L03697L76751L90337
$$ -341584 -598905 -799626 -915137 -953171 -918664 -802163 -592736 -289039 87712 478049
35023D78049L15890J65191j9345j94545l18547l46870k68330j38695l7472J3234
$$ 478049 793939 959130 939785 745240 426693 79823 -188507 -327202 -364674 -351440
35013c51440N6000J25750K05478K56197K55183J99357J06397K0276j9768k6368
$$ -351440 -295440 -169690 35788 291985 547168 746525 852922 873198 853430 827062
35003H27062m5928q4522r4129n3265j9566o5953j89873l19629l90673l79943k80790
$$ 827062 781134 696612 602483 549218 529652 463699 273826 -45803 -436476 -816419 -1097209
34992a097209r2365J52289L75323M95199M82292L76038K52545J71460J42063J30823
$$ -1097209 -1189574 -1037285 -661962 -166763 315529 691567 944112 1115572 1257635 1388458
34982A388458R6462J9721q6757j83565k26434k03120j51738j28509j54047k01155
$$ 1388458 1484920 1504641 1417884 1234319 1007885 804765 653027 524518 370471 169316
34972A69316k31011k24311j80837j13610m8747p919J9981P1837J63970K64880
$$ 169316 -61695 -286006 -466843 -580453 -629200 -637119 -617138 -545301 -381331 -116451
34962a16451L19500K87172J58411l6225k21932l13940k84370j86041r4017l5862
$$ -116451 203049 490221 648632 612407 390475 76535 -207835 -393876 -487893 -523755
34952e23755N900M3119O6100P4689R3491J42176K06184K51396K61171K45531K14956
$$ -523755 -517855 -474736 -408636 -333947 -240456 -98280 107904 359300 620471 866002 1080958
34941A080958J62244Q3167M816l0372j3815J6942K5524J4339j263k9393p9439
$$ 1080958 1243202 1326369 1331185 1300813 1286998 1303940 1329464 1343803 1342540 1313147 1233708
34930A233708j21576j11631n3852O28K0273J8285O692k6356p2290p9159r792J02260
$$ 1233708 1112132 1000501 946649 947277 967550 985835 992527 966171 893881 814722 804930 907190
34918I07190J87001K08203J71445Q7537k8480j30434j58569r8957l925N6750N3449
$$ 907190 1094191 1302394 1473839 1561376 1532896 1402462 1243893 1144936 1141011 1197761 1251210
34907A251210N791m7818q1604r2876r1158q2481p0072o6917r0384j35471j66838
$$ 1251210 1257001 1209183 1127579 1034703 943545 861064 790992 724075 633691 498220 331382
34896C31382j50120q3492R686J06498J89296K36491K28682J66437P4768r081n2938
$$ 331382 181262 97770 107456 213954 403250 639741 868423 1034860 1109628 1100547 1047609
34885A047609m7485j4013J4067K0464N358m0499j31670k45535l13285k81272j67920
$$ 1047609 1000124 986111 1000178 1020642 1026000 985501 853831 608296 295011 13739 -154181
34874a54181l8779N9350J16008J28013R0663J7505o0810j22798j62060j69937
$$ -154181 -192960 -133610 -17602 110411 201074 218579 157769 34971 -127089 -297026
34864b97026j38664q5078m4082k6639m352M9772J19584J60232J46649R3913L2914
$$ -297026 -435690 -520768 -564850 -591489 -595841 -546069 -426485 -266253 -119604 -25691 7223
34853G223j9446n9579p6230m8406K4028R6322J07767M3840m4411r3924r2302p6820
$$ 7223 -12223 -71802 -148032 -196438 -172410 -76088 31679 75519 31108 -62816 -155118 -231938
34841b31938q3423j11838j32327j09713k5757J03883K32451L12490L25090K77595
$$ -231938 -315361 -427199 -559526 -669239 -694996 -591113 -358662 -46172 278918 556513
34831E56513J85950P2951k8448r3340j24958j38355j26299o3978M6563J56054
$$ 556513 742463 815414 786966 693626 568668 430313 304014 240036 286599 442653
34821D42653K05018J74070R2837R630m0272m6177j7950K3094N2913N4456K9743
$$ 442653 647671 821741 914578 924208 883936 837759 819809 842903 895816 950272 980015
34810I80015M002O872M0609P1426N9481m097r1081j60359j87718j82408j77208
$$ 980015 984017 990889 1031498 1102924 1162405 1158308 1067227 906868 719150 536742 359534
34799C59534j90538j98172j61014q3519j7459L674K212O594r71m7013j02495j10718
$$ 359534 168996 -29176 -190190 -273709 -291168 -287494 -285282 -278688 -279659 -326672 -429167 -539885
34787e39885p3922n6708r1551j30009j12139m5950J3554L8027M5321O0239Q6014
$$ -539885 -613807 -670515 -762066 -892075 -1004214 -1050164 -1036610 -998583 -953262 -893023 -807009
34776h07009J10780J21105J09451P9331L9241j1940p8577j40098j52922j02628
$$ -807009 -696229 -575124 -465673 -386342 -347101 -359041 -437618 -577716 -730638 -833266
34766h33266l8399k8139q4573j58128j97480j92466j59115j11590n9799j4505
$$ -833266 -871665 -899804 -984377 -1142505 -1339985 -1532451 -1691566 -1803156 -1862955 -1877460
34756a877460J9513M5623O4326P3045Q3080J18774J83376K37308K31439J61414
$$ -1877460 -1857947 -1812324 -1747998 -1674953 -1591873 -1473099 -1289723 -1052415 -820976 -659562
34746f59562P3550J6597K849J9457N8932J23636K07889K89926L41318L37731K66738
$$ -659562 -586012 -569415 -566566 -547109 -488177 -364541 -156652 133274 474592 812323 1079061
34735A079061J39242n762j21327j86078k14804k34625k56067k66920k44864j74735
$$ 1079061 1218303 1212541 1091214 905136 690332 455707 199640 -67280 -312144 -486879
34725d86879o6817L4835P6496M4592j1795k3577K9716J02021J30842R3740J3441
$$ -486879 -553696 -518861 -442365 -397773 -409568 -433145 -403429 -301408 -170566 -76826 -63385
34714f3385p5256j45894j73753j34521k7357J07706K13643K61707K62673K34764
$$ -63385 -138641 -284535 -458288 -592809 -620166 -512460 -298817 -37110 225563 460327
34704D60327J82169J16220P3603Q3528J23923J40431J12832P7706P8423J15747
$$ 460327 642496 758716 832319 915847 1039770 1180201 1293033 1370739 1449162 1564909
34694A564909J57284J73860J55206J11867P6317Q0501J13711J22510P4337L513
$$ 1564909 1722193 1896053 2051259 2163126 2239443 2319944 2433655 2556165 2630502 2634015
34684B634015l0657j6328P854R388j0200l7270o2394p4323o8890o8942j06682
$$ 2634015 2603358 2587030 2594884 2604272 2594072 2556802 2494408 2420085 2351195 2282253 2175571
34673B175571j77086k33320k38408k00026j45989r1354m5129k4690l5629m6444
$$ 2175571 1998485 1765165 1526757 1326731 1180742 1089388 1044259 1019569 983940 937496
34663I37496r532Q5239J86636K17395J38725j0834j40128j80905j44844r8975
$$ 937496 927964 1013203 1199839 1417234 1555959 1545125 1404997 1224092 1079248 980273
34653I80273q6090q5619n7566l925L2106J8998k9488p2906q2151n4655j985O5177
$$ 980273 894183 808564 750998 747073 779179 798177 768689 695783 613632 558977 556992 622169
34641F22169J34682J82242J79078J20678M0603j7502m0619n1797q1622j44582
$$ 622169 756851 939093 1118171 1238849 1279452 1261950 1221331 1169534 1087912 943330
34631I43330k31246l01119k90789j64289L1181J82860K02872R1457q9659k75958
$$ 943330 712084 410965 120176 -44113 -12932 169928 372800 464257 374598 98640
34621I8640m15395m60346l92478k58591j49450j26573j76825k37206k48572j85196
$$ 98640 -316755 -777101 -1169579 -1428170 -1577620 -1704193 -1881018 -2118224 -2366796 -2551992
34611b551992n5440J06939K55080L46622L60766L06914K20876J46356J09318J05771
$$ -2551992 -2607432 -2500493 -2245413 -1898791 -1538025 -1231111 -1010235 -863879 -754561 -648790
34601f48790J13742J12361Q8511L8754k0003m8472j5616O1426J23056J24478P9471
$$ -648790 -535048 -422687 -334176 -295422 -315425 -363897 -379513 -318087 -195031 -70553 8918
34590H918L8249L1385M9791P2947R3871J09206J04132O5689M868n0785q5739j04860
$$ 8918 47167 78552 128343 201290 295161 404367 508499 574188 579056 528271 442532 337672
34578C37672j14763j12785r7969p7303n3458k0440J8433M2040L5552J2592m354
$$ 337672 222909 110124 12155 -65148 -118606 -139046 -120613 -78573 -43021 -30429 -34783
34567c4783j8943n5775j19867j80619k03780j87649j60441j48941j54365j52942
$$ -34783 -53726 -109501 -229368 -409987 -613767 -801416 -961857 -1110798 -1265163 -1418105
34557a418105j15979l3560P6938J83274K54986K69064K14107J03577j9078j02741
$$ -1418105 -1534084 -1567644 -1490706 -1307432 -1052446 -783382 -569275 -465698 -484776 -587517
34547e87517j20876q3171k6375J789k7791q6893r2573J8281K12295L81783M48586
$$ -587517 -708393 -791564 -817939 -816150 -843941 -930834 -1023407 -1005126 -792831 -411048 37538
34536C7538M23511L60522K86302J96248R4684N235n6506r9319j42700j97413k57806
$$ 37538 461049 821571 1107873 1304121 1398805 1404040 1347534 1248215 1105515 908102 650296
34525F50296l02806l05452k52205j58344o2470k672P423j4524l6394l8463k0903
$$ 650296 347490 42038 -210167 -368511 -430981 -433653 -426230 -440754 -477148 -515611 -536514
34514e36514J5592Q0728J69975K40770K39987J57392L1720r5124k03630k73784
$$ -536514 -520922 -440194 -270219 -29449 210538 367930 399650 304526 100896 -172888
34504a72888k72335j86998n5707N9989J23144J33532J08163O5857J9507l0871
$$ -172888 -445223 -632221 -687928 -627939 -504795 -371263 -263100 -197243 -177736 -208607
34494b08607q9169j40949j58758j41278j24369j32782j42177j16829o8020l8715
$$ -208607 -297776 -438725 -597483 -738761 -863130 -995912 -1138089 -1254918 -1322938 -1361653
34484a361653l5707j4602N9221J62799K40829K57350K08808J04507m1780j98977
$$ -1361653 -1397360 -1411962 -1352741 -1189942 -949113 -691763 -482955 -378448 -420228 -619205
34474f19205l11540l20121k02197K014K09594L47504L86005L29457J99522L9869
$$ -619205 -930745 -1250866 -1453063 -1451049 -1241455 -893951 -507946 -178489 21033 60902
34464F0902q7773j45252j52736j57568j70172j57174j01645m0709k4508n3715
$$ 60902 -26871 -172123 -324859 -482427 -652599 -809773 -911418 -952127 -976635 -1030350
34454a030350p8457n5607O917O3353P8250N8502M2381O1310J12273J62154J73134
$$ -1030350 -1108807 -1164414 -1157497 -1094144 -1015894 -957392 -915011 -853701 -741428 -579274 -406140
34443d06140J27798M2360m0064p9379o7881k2612N0728J65005L10928M31060M61212
$$ -406140 -278342 -235982 -276046 -355425 -423306 -445918 -395190 -230185 80743 511803 973015
34432I73015L92410K73550J60770Q2956M3945K7569L857l7834o0351j8786O1739
$$ 973015 1365425 1638975 1799745 1882701 1926646 1954215 1958072 1920238 1859887 1841101 1902840
34421A902840Q6596n255j66851l00949l68104l98360m10579l75114k74703j61852
$$ 1902840 1989436 1984181 1817330 1516381 1148277 749917 339338 -35776 -310479 -472331
34411d72331j15576j48673j87101j46353j1962J56650K80682L10022K40115J12146
$$ -472331 -587907 -736580 -923681 -1070034 -1081996 -925346 -644664 -334642 -94527 17619
34401A7619k026m1669m663M8812M8788k4553j27470j90339j73607j03660n5918
$$ 17619 15593 -26076 -30739 18073 66861 42308 -85162 -275501 -449108 -552768 -608686
34390f08686q4820j63597k10559j82090j17271p7405o8724n1356k122O8135J45863
$$ -608686 -693506 -857103 -1067662 -1249752 -1367023 -1444428 -1513152 -1564508 -1566630 -1498495 -1352632
34379a352632K20327K60372K31960J52281Q8929Q5366J15243J27133J03244N1596
$$ -1352632 -1132305 -871933 -639973 -487692 -398763 -313397 -198154 -71021 32223 83819
34369H3819k6160j21502j95287k10899j85471j69753j76545j66091j09762l1377
$$ 83819 57659 -63843 -259130 -470029 -655500 -825253 -1001798 -1167889 -1277651 -1309028
34359a309028L2961Q5098J46639K09900K40165K22407J76896J25158O6577J010
$$ -1309028 -1276067 -1190969 -1044330 -834430 -594265 -371858 -194962 -69804 -3227 -2217
34349b217m5987m1716J6304R8233J74951K37882K84233K97672K54315J46287j399
$$ -2217 -48204 -89920 -73616 24617 199568 437450 721683 1019355 1273670 1419957 1418558
34338A418558j34569j98388j79019j19658q0526p8894q3736p1482o0314p4357
$$ 1418558 1283989 1085601 906582 786924 706398 627504 543768 472286 411972 337615
34328C37615j01391j14846j17149j22879j11025m3902N8498J11505O1445m3119
$$ 337615 236224 121378 4229 -118650 -229675 -273577 -215079 -103574 -42129 -85248
34318h5248j07202r5324n0433k4258k5787l3142j9672L6293J33641K25053K37128
$$ -85248 -192450 -287774 -338207 -362465 -388252 -421394 -441066 -404773 -271132 -46079 191049
34307A91049J38098k1224j45679j68460q4589O1984K00422K58510K06988R2807
$$ 191049 329147 307923 162244 -6216 -90805 -28821 171601 430111 637099 729906
34297G29906N305r715R778K053l5442n3333l5651l6166j04959k04889k41425j75502
$$ 729906 735211 725496 735274 737327 701885 648552 612901 576735 471776 266887 25462 -150040
34285a50040p2082k0906l2903m0206J1186R7815J54918J55142J31550J26970J40375
$$ -150040 -222122 -243028 -275931 -316137 -304951 -207136 -52218 102924 234474 361444 501819
34274E01819J33058P7805j1097r3425j35763j30140r6383p0729p5417q8358n7411
$$ 501819 634877 712682 701585 608160 472397 342257 245874 175145 99728 11370 -46041
34263d6041L8798J53763K15260K00338J52388J28817J50370J97490K31660K16983
$$ -46041 -7243 146520 361780 562118 714506 843323 993693 1191183 1422843 1639826
34253A639826J45624N4030l467q918M748J610j2704q869J8657M1612L0101j9689
$$ 1639826 1785450 1839480 1836013 1827095 1831843 1833453 1820749 1811880 1830537 1872149 1902250 1882561
34241A882561q6462j41379j68091j73880j77193j78658j52817p6292M3951J76341
$$ 1882561 1796099 1654720 1486629 1312749 1135556 956898 804081 727789 771740 948081
34231I48081K85025L35071K98416J81731M1832n4627r2342j10276j40934j68090
$$ 948081 1233106 1568177 1866593 2048324 2090156 2035529 1943187 1832911 1691977 1523887
34221A523887j54506r3031j3139N3491R4826J06042P2666j9925j59658k98086
$$ 1523887 1369381 1276350 1263211 1316702 1411528 1517570 1590236 1570311 1410653 1112567
34211A112567l76522l67383k91108j93292j08080m3857K528K7002J8823j9812
$$ 1112567 736045 368662 77554 -115738 -223818 -267675 -265147 -238145 -219322 -239134
34201b39134n9289n9540j2012M1170M6512k41m8686n3653k1919J1784L5183O2743
$$ -239134 -298423 -357963 -369975 -328805 -282293 -282534 -331220 -384873 -406792 -395008 -359825 -297082
34189b97082J01422J38682J64035J79751J85489J70079J26017O1227o925n9600
$$ -297082 -195660 -56978 107057 286808 472297 642376 768393 829620 822695 763095
34179G63095q1102p3515o9171j07039j84106k45728k39991j72906r5305m2557
$$ 763095 681993 608478 539307 432268 248162 2434 -237557 -410463 -505768 -548325
34169e48325n686L7816Q3754J05230R1545O9278P6491J18564J58026J51924R3956
$$ -548325 -554011 -516195 -432441 -327211 -235666 -166388 -89897 28667 186693 338617 432573
34158D32573J5675m6235p4635p0989m6483j7478K660J4366K8513M8683O3105N7522
$$ 432573 448248 402013 327378 256389 209906 192428 195088 209454 237967 286650 349755 407277
34146D07277L0322p180l9178n2943m6707l3837l2378m7359o8936q7155r8267r6527
$$ 407277 437599 430419 391241 338298 291591 257754 225376 178017 109081 21926 -76341 -172868
34134a72868p5752m6546l7559o6228j15157j48002j43012j02984m1729K5069Q0010
$$ -172868 -248620 -295166 -332725 -398953 -514110 -662112 -805124 -908108 -949837 -924768 -844758
34123h44758J10167J16166J07746Q9954N9548J4567l6909p6545q4186n4329q060
$$ -844758 -734591 -618425 -510679 -420725 -361177 -346610 -383519 -460064 -544250 -598579 -606639
34112f06639K0729J7482l289k4855m8854p7085r0570o9560k4453J7961N2881R4411
$$ -606639 -585910 -568428 -571717 -596572 -645426 -722511 -813081 -882641 -907094 -889133 -836252 -741841
34100g41841J35545J43156J02507M0954m245j7644P558Q5100K10847L39204M13537
$$ -741841 -606296 -463140 -360633 -319679 -323924 -341568 -334010 -248910 -38063 301141 714678
34089G14678M15709L66773K89320J94751J02143L9598J9007K7301M5738N9396
$$ 714678 1130387 1497160 1786480 1981231 2083374 2122972 2141979 2169280 2215018 2274414
34079B274414M6705j2084r8332j44823q8196O4434K29917L11815K69405J35360
$$ 2274414 2321119 2309035 2210703 2065880 1977684 2042118 2272035 2583850 2853255 2988615
34069B988615k1723j49750k36174k91822l26083l43277l50106l49417l30154k81063
$$ 2988615 2966892 2817142 2580968 2289146 1963063 1619786 1269680 920263 590109 309046
34059C09046k14301j56836j15706p2873k2474J0089K791k7564m6171m4371l9810
$$ 309046 94745 -62091 -177797 -250670 -273144 -263055 -260264 -287828 -333999 -378370 -418180
34048d18180l9924l0079J608M7971R3131J21370J15311O6697m033n6611o9168
$$ -418180 -458104 -488183 -486575 -438604 -345473 -224103 -108792 -42095 -46128 -102739 -171907
34037a71907n5996m2610l8430m0668m7336n4434n6316o3872j06180j90302k66756
$$ -171907 -227903 -270513 -308943 -349611 -396947 -451381 -507697 -571569 -677749 -868051 -1134807
34026a134807k62252j54342J250J23433J74746J75216J64266J63700J73572J89040
$$ -1134807 -1397059 -1551401 -1550151 -1426718 -1251972 -1076756 -912490 -748790 -575218 -386178
34016c86178K10261K34367K44851K20651J61735R9538P3893J01099J67123K41716
$$ -386178 -175917 58450 303301 523952 685687 785225 859118 960217 1127340 1369056
34006A369056K87756K68309J71415L5283p2217j15826j24848j48236j85684j82520
$$ 1369056 1656812 1925121 2096536 2131819 2059602 1943776 1818928 1670692 1485008 1302488
33996A302488r5422N0857J78042K17867J58461L9677q4489j77837k26418k24547
$$ 1302488 1207066 1257923 1435965 1653832 1812293 1851970 1767481 1589644 1363226 1138679
33986A138679j68596o9526L6592J04558J12646P6159K8910k438o750J4153M4114
$$ 1138679 970083 900557 937149 1041707 1154353 1230512 1259422 1256984 1250234 1264387 1308501
33975A308501N4765K4283m0353j05971j42314j46261j36837j31351j29527j18273
$$ 1308501 1363266 1387549 1347196 1241225 1098911 952650 815813 684462 554935 436662
33965D36662q9524n5054m3807p8986j52593k24086k48785k09632j22966j9693
$$ 436662 347138 292084 248277 169291 16698 -207388 -456173 -665805 -788771 -808464
33955h08464P3055J35224J51944J19773N6483j045j6277K2908R4547J56223J73262
$$ -808464 -735409 -600185 -448241 -328468 -271985 -273030 -289307 -266399 -171852 -15629 157633
33944A57633J41617Q8574N0412M4072N5696N5367K3734l4838j02485j65467k17678
$$ 157633 299250 387824 438236 482308 538004 593371 617105 582267 479782 314315 96637
33933I6637k49670k42434j78437o0202Q2874K06659K73205K64998J87031O3969
$$ 96637 -153033 -395467 -573904 -634106 -551232 -344573 -71368 193630 380661 444630
33923D44630o1906j41249j46919j02983p2877j01296j66949k03208j64896o4804
$$ 444630 382724 241475 94556 -8427 -81304 -182600 -349549 -552757 -717653 -782457
33913g82457N1279J45662K00775K13442J96411J75042J63089J43646Q7397j1982
$$ -782457 -731178 -585516 -384741 -171299 25112 200154 363243 506889 594286 582304
33903E82304j30768k36988l04229l09446k41003j17443J6767J24420J96793K39125
$$ 582304 451536 214548 -89681 -399127 -640130 -757573 -740806 -616386 -419593 -180468
33893a80468K51338K36269K16402K22400K59950K96013K83838K03249P9664l3835
$$ -180468 70870 307139 523541 745941 1005891 1301904 1585742 1788991 1868655 1834820
33883A834820r5385r9983p1115l3221M339M4152R2866J52441K05799K13719J45544
$$ 1834820 1739435 1639452 1568337 1535116 1539455 1583607 1676473 1828914 2034713 2248432 2393976
33872B393976J8701j09482j97521k50776k88905l07282k93275k61533k39610k23593
$$ 2393976 2412677 2303195 2105674 1854898 1565993 1258711 965436 703903 464293 240700
33862B40700j80831j01649k0587K3220K3644l714m3911p5350o2421J4845J26667
$$ 240700 59869 -41780 -62367 -39147 -15503 -19217 -63128 -138478 -200899 -186054 -59387
33851e9387K07223K03180J04960n2322k00804k69584k36772j56362j09989j25163
$$ -59387 147836 351016 455976 403654 202850 -66734 -303506 -459868 -569857 -695020
33841f95020j58835j64014j45931j36668j34953r8022P955J66089L20656M22325
$$ -695020 -853855 -1017869 -1163800 -1300468 -1435421 -1533443 -1525488 -1359399 -1038743 -616418
33831f16418M59725M52240M18100L56604K65749J66686R1564M4714o226r1590
$$ -616418 -156693 295547 713647 1070251 1336000 1502686 1594250 1638964 1632738 1541148
33821A541148k03688l03883l49005l05687j66291K4861J77832K21302J62859P0829
$$ 1541148 1337460 1033577 684572 378885 212594 237455 415287 636589 799448 870277
33811H70277L285k8468l9041m0737l5383j2338M2716J17433J62647J43438R0924
$$ 870277 873562 845094 806053 765316 729933 717595 760311 877744 1040391 1183829 1274753
33800A274753O2160N2317L54j05232j84307j63730p2963J700K1679N982l1197
$$ 1274753 1336913 1389230 1389584 1284352 1100045 936315 863352 865052 886731 892713 861516
33789H61516q9443j41753j50356j28411j28630j54960j37034j9921J57626L00852
$$ 861516 772073 630320 479964 351553 222923 67963 -69071 -88992 68634 369486
33779C69486L45437K84800J47533j3673j30656j60927j25130q2838p0982p9875
$$ 369486 714923 999723 1147256 1133583 1002927 842000 716870 634032 563050 483175
33769D83175q2511o6878l8568p779J9765M4896P0888R6868J17651J28589J24224
$$ 483175 400664 333786 295218 287439 307204 352100 422988 519856 637507 766096 890320
33758H90320R5360M0071k3249p0059r9437j31540j68890j78984j28506k4886Q2332
$$ 890320 985680 1025751 1002502 932443 833006 701466 532576 353592 225086 200200 282532
33747B82532J31100Q1674n0131j85491k37683j94964j28731j04462j11224j00256
$$ 282532 413632 495306 445175 259684 22001 -172963 -301694 -406156 -517380 -617636
33737f17636o0551j8475J4539M7164O9338N3132m801p6812j39744j79354j60936
$$ -617636 -678187 -696662 -682123 -634959 -565621 -512489 -517290 -594102 -733846 -913200 -1074136
33726a074136m6934J36730K95421L59279L55217L57489L91234M18138L99178L32132
$$ -1074136 -1121070 -984340 -688919 -329640 25577 383066 774300 1192438 1591616 1923748
33716A923748K31681J10588q966r2659j22751j22930j43325k17779l30996m21774
$$ 1923748 2155429 2266017 2257051 2164392 2041641 1918711 1775386 1557607 1226611 804837
33706H04837m24076l17828j44383K8221J50678K04649J91653J33513P6779O4962
$$ 804837 380761 62933 -81450 -53229 97449 302098 493751 627264 704043 769005
33696G69005R1170R5477K7767r2712j94213k23833j87438j21716m7845L5776J27110
$$ 769005 860175 955652 983419 890707 696494 472661 285223 163507 115662 151438 278548
33685B78548K03595K33236J97412J06692P79p3445r6393q8054p6549n8203m947
$$ 278548 482143 715379 912791 1019483 1020262 946817 850424 762370 685821 627618 622671
33674F22671Q6476J70515J88318J19001p110j31522j99738j93635j49893j32095
$$ 622671 709147 879662 1067980 1186981 1179871 1048349 848611 654976 505083 372988
33664C72988j65555k09333k06253j43847m7327O2667J67470K22367J86213Q9505
$$ 372988 207433 -1900 -208153 -352000 -399327 -336660 -169190 53177 239390 328895
33654C28895K6228N2541J25028J63345J44307J03726O9525L1200l3619j33581
$$ 328895 355123 407664 532692 696037 840344 944070 1013595 1044795 1011176 877595
33644H77595k59020l75869m30499l91536k89051j88463j24537q2778m1532n15
$$ 877595 618575 242706 -187793 -579329 -868380 -1056843 -1181380 -1264158 -1305690 -1306205
33634a306205L7826Q2481J32493J64468J58980J22380O8404j600q0423j35508
$$ -1306205 -1268379 -1185898 -1053405 -888937 -729957 -607577 -539173 -540773 -621196 -756704
33624g56704j35339q8925l6603o022K211p649l2657n0431k2601O0412J53902J99669
$$ -756704 -892043 -980968 -1017571 -1023593 -1021382 -1029031 -1061688 -1112119 -1134720 -1074308 -920406 -720737
33612g20737J86492J50977J19134O9084l3373j70723k65928k49662j30378J1746
$$ -720737 -534245 -383268 -264134 -195050 -228423 -399146 -665074 -914736 -1045114 -1033368
33602a033368R7966J07912O7998Q443m8630p1517k1360J11714K81978M06633M15532
$$ -1033368 -935402 -827490 -759492 -751049 -799679 -871196 -892556 -780842 -498864 -92231 323301
33591C23301K95943J06224n5715j19530r3893m9502n0303j06970j87810k49180
$$ 323301 619244 725468 669753 550223 456330 406828 356525 249555 61745 -187435
33581a87435k51302j75980n2257N2699R2386Q2084O5359N5387L3728o353m7683
$$ -187435 -438737 -614717 -666974 -614275 -521889 -439805 -374446 -319059 -285331 -291684 -339367
33570c39367p7066r5547j00350q5522o4086o0678p4524p6575n2167j9642M218
$$ -339367 -416433 -511980 -612330 -697852 -761938 -822616 -897140 -973715 -1025882 -1045524 -1041306
33559a041306K8378O1101Q6100Q6243O9982N5834N3811Q1534J68140L06864M24482
$$ -1041306 -1012928 -951827 -865727 -779484 -709502 -653668 -599857 -518323 -350183 -43319 381163
33548C81163M39560L45418K03596O6835m9612j25681j21488l1018Q2353J36719
$$ 381163 820723 1166141 1369737 1436572 1386960 1261279 1139791 1108773 1191126 1327845
33538A327845J08965M5480O746J4932M5348N1494j482j16486k67712m16478n22468
$$ 1327845 1436810 1482290 1489036 1503968 1549316 1600810 1599328 1482842 1215130 798652 276184
33527B76184n54079n06055m05372k86710j65908n0612L4162N9659L4867P926J6166
$$ 276184 -277895 -783950 -1189322 -1476032 -1641940 -1692552 -1658390 -1598731 -1563864 -1555938 -1539772
33516a539772N4221R8816J41386J81191K05703J98966J61693J08741N2267l639
$$ -1539772 -1485551 -1386735 -1245349 -1064158 -858455 -659489 -497796 -389055 -336788 -340427
33506c40427n9131j15625j66228j84946j44725o0776J422j3608q5601j32278r1582
$$ -340427 -399558 -515183 -681411 -866357 -1011082 -1071858 -1070436 -1084044 -1169645 -1301923 -1393505
33495a393505K1234J37731K01621K03320J63328J02531L8065n012m944K2095J8475
$$ -1393505 -1372271 -1234540 -1032919 -829599 -666271 -563740 -525675 -530687 -535631 -513536 -495061
33484d95061n6929j69789k32573j90881p2292N0832J27240J53277J57370J68812
$$ -495061 -551990 -721779 -954352 -1145233 -1217525 -1166693 -1039453 -886176 -728806 -559994
33474e59994J85950J70185R0799k0850q9633q0908l8688k2680l7004m8732n1250
$$ -559994 -374044 -203859 -113060 -133910 -223543 -304451 -343139 -365819 -402823 -451555 -502805
33463e02805o8962j06457j27716r0193J8192J69266L01070L45018K78343J52290
$$ -502805 -571767 -678224 -805940 -896133 -877941 -708675 -407605 -62587 215756 368046
33453C68046M6352n879k7075m2348m9265m6029n4830r5386j51846j84885j71184
$$ 368046 414398 408519 381444 339096 289831 243802 188972 93586 -58260 -243145 -414329
33442d14329j21415o4055j7740K2141O9516J20570J51854J53552J47227J48986
$$ -414329 -535744 -599799 -617539 -595398 -525882 -405312 -253458 -99906 47321 196307
33432A96307J29591M7406p7151j55951j19684R111J40537J95853J53925M7750
$$ 196307 325898 373304 296153 140202 20518 29629 170166 366019 519944 567694
33422E67694o0853j17174j09104o7659k6035J1222N2171R1669J21269J49798J88141
$$ 567694 506841 389667 280563 212904 186869 198091 250262 341931 463200 612998 801139
33411H01139K19072K08111J47271O6567m787o9712j43257k14900k49824k27766
$$ 801139 1020211 1228322 1375593 1442160 1437373 1367661 1224404 1009504 759680 531914
33401E31914j66823j02146m8973L072O1400J09813J24273J01794O4238L7969L8352
$$ 531914 365091 262945 213972 217044 278444 388257 512530 614324 678562 716531 754883
33390G54883O5963R9758R5438J4902j27910k62092l15365k72837j77357q3527
$$ 754883 820846 920604 1016042 1030944 903034 640942 325577 52740 -124617 -208144
33380b08144k1722M633P694M630N716O985L71p131P756O0173J33318J84302J76933
$$ -208144 -229866 -225233 -217539 -212909 -207193 -200208 -199837 -206968 -199212 -139039 -5721 178581 355514
33367C55514J09673J2277q1563j53674j96293k01473j68010j14711p1621n2173
$$ 355514 465187 477464 395901 242227 45934 -155539 -323549 -438260 -509881 -562054
33357e62054m0269q143N7128J43500K21695K61325K47041J83013Q1624m4893j74634
$$ -562054 -602323 -610466 -553338 -409838 -188143 73182 320223 503236 584860 539967 365333
33346C65333k70757l07448k98494k77723k51207j96211j13679m7810l0673l2352
$$ 365333 94576 -212872 -511366 -789089 -1040296 -1236507 -1350186 -1397996 -1428669 -1461021
33336a461021L659Q8166J75787K16182J90226J08037O704n2401k3224P3712J64267
$$ -1461021 -1457362 -1369196 -1193409 -977227 -787001 -678964 -672260 -724661 -747885 -674173 -509906
33325e09906J95879J77933J40925Q9258J8897m4467o3287m0370k2671m5926r4401
$$ -509906 -314027 -136094 4831 94089 112986 68519 5232 -35138 -57809 -103735 -198136
33314a98136j22563j02610m3862K1868O2865O2248K4027l0313p4651r3666r1100
$$ -198136 -320699 -423309 -467171 -445303 -382438 -320190 -296163 -326476 -401127 -494793 -585893
33303e85893q5125r2358j11491j21794r9830l8942M6091J29481J87562K07093
$$ -585893 -671018 -763376 -874867 -996661 -1096491 -1135433 -1089342 -959861 -772299 -565206
33293e65206J89246J49443J11152R4744J05660J27618J28535Q2176q663j11468
$$ -565206 -375960 -226517 -115365 -20621 85039 212657 341192 423368 414705 303237
33283C03237j90768k35816k60460k78254k81712k46620j57056l0006Q3978J34010
$$ 303237 112469 -123347 -383807 -662061 -943773 -1190393 -1347449 -1377455 -1293477 -1159467
33273a159467J14166P4677P7014J32921J93909K04416J58923J02384Q2367J09557
$$ -1159467 -1045301 -970624 -893610 -760689 -566780 -362364 -203441 -101057 -18690 90867
33263I0867J58570J92302J84060J31715O1560J1418n30J2916L4070O8476J29938
$$ 90867 249437 441739 625799 757514 819074 830492 829962 842878 876948 945424 1075362
33252A075362J98809K15795J29878n4125k78594m70342n70542n52797m40120l00633
$$ 1075362 1274171 1489966 1619844 1565719 1287125 816783 246241 -306556 -746676 -1047309
33242a047309k02146j62466j51591j35301r7634k7451Q2045K05297K82109K70383
$$ -1047309 -1249455 -1411921 -1563512 -1698813 -1796447 -1823898 -1741853 -1536556 -1254447 -984064
33232i84064J93201J14938P5675O3185M2103n901o6488j01143p4136J3576J17534
$$ -984064 -790863 -675925 -600250 -537065 -494962 -500863 -567351 -668494 -742630 -729054 -611520
33221f11520J87749K10646K04615J85225J53875J13379P0637K4130k9209p4319
$$ -611520 -423771 -213125 -8510 176715 330590 443969 514606 538736 509527 435208
33211D35208q8379p2299m6213j1045N2354J33369J76423J43156O5911Q604r753
$$ 435208 346829 274530 228317 217272 269626 402995 579418 722574 788485 797089 787336
33200G87336k1220m9620p9100q1289m5220K2730J03294J62158J65743J11446L1393
$$ 787336 766116 716496 637396 556107 510887 533617 636911 799069 964812 1076258 1107651
33189A107651l9744r2453j39003j95025k64330l29200l55704l21153k36386j31980
$$ 1107651 1067907 975454 836451 641426 377096 47896 -307808 -628961 -865347 -997327
33179i97327l0171N5058J02940R9576O4699L5955K3671R685n206J0176O3041J03008
$$ -997327 -1027498 -972440 -869500 -769924 -705225 -669270 -645599 -635914 -641120 -630944 -567903 -464895
33167d64895P2638k5002j34064k07440k36344k30599j99279j52342j00938n1106
$$ -464895 -392257 -417259 -551323 -758763 -995107 -1225706 -1424985 -1577327 -1678265 -1729371
33157a729371o700K3860L4359L1427K9310L6543N2127O6684O3214L1350j0552
$$ -1729371 -1736071 -1712211 -1677852 -1646425 -1617115 -1580572 -1528445 -1461761 -1398547 -1367197 -1377749
33146a377749k5516n226J0543j7072p1409r8781p0152K018R7130J98871K71023
$$ -1377749 -1403265 -1408491 -1397948 -1415020 -1486429 -1585210 -1655362 -1653344 -1556214 -1357343 -1086320
33135a086320K59438J43794k4760j54312j81073j11658j1131M9525M9328K8271
$$ -1086320 -826882 -683088 -707848 -862160 -1043233 -1154891 -1166022 -1116497 -1067169 -1038898
33125a038898L7036P9086J13268J06159O1817K885n1811q4133p3974j5000P5405
$$ -1038898 -1001862 -922776 -809508 -703349 -641532 -638647 -690458 -774591 -848565 -863565 -788160
33114g88160J66642K27064K31722J80032J06588M9715N685n6911j29616j49704
$$ -788160 -621518 -394454 -162732 17300 123888 173603 179288 122377 -7239 -156943
33104a56943q0768K1485O2843J8713m5116n4146L602Q4418J31287J02377p790
$$ -156943 -237711 -216226 -153383 -134670 -179786 -233932 -230330 -145912 -14625 87752 79962
33093G9962j52322k53762k63422j96506j03759k2657L3539N7370M3160k51n1262
$$ 79962 -72360 -326122 -589544 -786050 -889809 -912466 -878927 -821557 -778397 -778648 -829910
33082h29910r2719j15930j10960p2858k2541p35k5621o8931q9609p9929n9155
$$ -829910 -922629 -1038559 -1149519 -1222377 -1244918 -1245653 -1271274 -1340205 -1429814 -1509743 -1568898
$$ [...]
##END NTUPLES=NMR SPECTRUM
##END=
