##TITLE=31Pdec_DE-22_20minrm
 
  24 sc
 31.10.2023
##JCAMPDX= 6.0         $$ Bruker NMR JCAMP-DX V2.0
##DATA TYPE= NMR SPECTRUM
##DATA CLASS= NTUPLES
##ORIGIN= UXNMR, Bruker Analytische Messtechnik GmbH
##OWNER= root
$$ XWIN-NMR		Version 3.5
$$ Tue Oct 31 14:52:15 2023 Russian Standard Time (UT+4h)  she@DPX200
##.OBSERVE FREQUENCY= 81.013821
##.OBSERVE NUCLEUS= ^31P
##.ACQUISITION MODE= SIMULTANEOUS
##.ACQUISITION SCHEME= undefined
##.AVERAGES= 24
##.DIGITISER RES= 16
##SPECTROMETER/DATA SYSTEM= spect
##.PULSE SEQUENCE= zgpg30
##.SOLVENT NAME= CDCl3
##.SHIFT REFERENCE= (INTERNAL, CDCl3, 0, 248.564)
##AUDIT TRAIL= $$ (NUMBER, WHEN, WHO, WHERE, WHAT)
$$ ##TITLE= Audit trail, XWIN-NMR		Version 3.5
$$ ##JCAMPDX= 5.01
$$ ##ORIGIN= Bruker BioSpin GmbH
$$ ##OWNER= she
$$ F:/spectra/data/she/nmr/P31/1/pdata/1/auditp.txt
$$ ##AUDIT TRAIL=  $$ (NUMBER, WHEN, WHO, WHERE, WHAT)
(   1,<2023-10-31 14:51:23.75 +0400>,<she>,<DPX200>,
      <created by zg, POWCHK disabled, PULCHK disabled
       configuration hash MD5:
       00 E9 B6 7A A2 85 ED C7 34 08 36 98 17 FE 4E 26
       data hash MD5: 32K
       A9 66 65 55 C4 6A 15 1F A6 39 B9 9D FB 36 F9 34>)
(   2,<2023-10-31 14:51:26.46 +0400>,<she>,<DPX200>,
      <Start of raw data processing
       efp BC_mod = 2 LB = 5 FT_mod = 6 PKNL = 1 PHC0 = -10579.93 PHC1 = -116.7099 SI = 64K 
       data hash MD5: 64K
       06 07 32 0F C4 4D 4E FC 53 74 B3 E6 12 0B 0B 2A>)
(   3,<2023-10-31 14:51:41.76 +0400>,<she>,<DPX200>,
      <pk PHC0 = -116.8994 PHC1 = 257.4001 
       data hash MD5: 64K
       3A 3A FB 20 4C CE 39 E5 86 0B EB 56 07 2B 6C 59>)
$$ ##END=
$$ 
$$ hash MD5
$$ D3 22 6A 3D 51 CE 2B BC C3 82 EB CC 05 31 60 AC
##$RELAX= 
##$RELAX= 
##$RELAX= 
##$RELAX= 
##$RELAX= 
##$RELAX= 
##$RELAX= 
##$RELAX= 
##$RELAX= 
$$ Bruker specific parameters
$$ --------------------------
##$DU= <F:/spectra>
##$EXPNO= 1
##$NAME= <P31>
##$PROCNO= 1
##$TYPE= <nmr>
##$USER= <she>
##$AMP= (0..31)
100 100 100 100 100 100 100 100 100 100 100 100 100 100 100 100 100 100 
100 100 100 100 100 100 100 100 100 100 100 100 100 100 
##$AQSEQ= 0
##$AQ_mod= 1
##$AUNM= <au_zg>
##$AUTOPOS= <>
##$BF1= 81.014009
##$BF2= 200.13
##$BF3= 200.13
##$BF4= 200.13
##$BF5= 200.13
##$BF6= 200.13
##$BF7= 200.13
##$BF8= 200.13
##$BYTORDA= 1
##$CFDGTYP= 0
##$CFRGTYP= 5
##$CHEMSTR= <none>
##$CNST= (0..31)
1 1 145 1 1 1 1 1 1 1 1 1 1 1 1 1 1 1 1 1 1 1 1 1 1 1 1 1 1 1 1 1 
##$CPDPRG= <waltz16>
##$CPDPRG1= <>
##$CPDPRG2= <waltz16>
##$CPDPRG3= <>
##$CPDPRG4= <mlev>
##$CPDPRG5= <mlev>
##$CPDPRG6= <mlev>
##$CPDPRG7= <mlev>
##$CPDPRG8= <mlev>
##$CPDPRGB= <>
##$CPDPRGT= <>
##$D= (0..31)
0 1 0 0 0 0 0 0 0 0 0 0.03 2e-05 3e-06 0 0 0 0 0 0 0 0 0 0 0 0 0 0 0 0 
0 0 
##$DATE= 1698749483
##$DBL= (0..7)
120 120 120 11 120 120 24 19 
##$DBP= (0..7)
150 150 150 150 150 150 150 150 
##$DBP07= 0
##$DBPNAM0= <>
##$DBPNAM1= <>
##$DBPNAM2= <>
##$DBPNAM3= <>
##$DBPNAM4= <>
##$DBPNAM5= <>
##$DBPNAM6= <>
##$DBPNAM7= <>
##$DBPOAL= (0..7)
0.5 0.5 0.5 0.5 0.5 0.5 0.5 0.5 
$$ [...]
##$SUBNAM2= <"">
##$SUBNAM3= <"">
##$SUBNAM4= <"">
##$SUBNAM5= <"">
##$SUBNAM6= <"">
##$SUBNAM7= <"">
##$SUBNAM8= <"">
##$SUBNAM9= <"">
##$SW= 501.771253377433
##$SWIBOX= (0..15)
0 1 3 0 0 0 0 0 0 0 0 0 0 0 0 0 
##$SW_h= 40650.406504065
##$TD= 32768
##$TD0= 1
##$TE= 0
##$TE2= 300
##$TE3= 300
##$TEG= 300
##$TL= (0..7)
0 120 53 12 22 120 120 120 
##$TP= (0..7)
150 150 150 150 150 150 150 150 
##$TP07= 0
##$TPNAME0= <>
##$TPNAME1= <>
##$TPNAME2= <>
##$TPNAME3= <>
##$TPNAME4= <>
##$TPNAME5= <>
##$TPNAME6= <>
##$TPNAME7= <>
##$TPOAL= (0..7)
0.5 0.5 0.5 0.5 0.5 0.5 0.5 0.5 
##$TPOFFS= (0..7)
0 0 0 0 0 0 0 0 
##$TUNHIN= 0
##$TUNHOUT= 0
##$TUNXOUT= 0
##$USERA1= <user>
##$USERA2= <user>
##$USERA3= <user>
##$USERA4= <user>
##$USERA5= <user>
##$V9= 5
##$VALIST= <valist>
##$VCLIST= <CCCCCCCCCCCCCCC>
##$VD= 0
##$VDLIST= <DDDDDDDDDDDDDDD>
##$VPLIST= <PPPPPPPPPPPPPPP>
##$VTLIST= <TTTTTTTTTTTTTTT>
##$WBST= 1024
##$WBSW= 4
##$XGAIN= (0..3)
0 0 0 0 
##$XL= 0
##$YL= 0
##$YMAX_a= 10930
##$YMIN_a= -8553
##$ZGOPTNS= <>
##$ZL1= 120
##$ZL2= 120
##$ZL3= 120
##$ZL4= 120
##$ABSF1= 0
##$ABSF2= 0
##$ABSG= 0
##$ABSL= 0
##$ALPHA= 0
##$AQORDER= 0
##$ASSFAC= 0
##$ASSFACI= 0
##$ASSFACX= 0
##$ASSWID= 0
##$AUNMP= <proc_1d>
##$AZFE= 0.1
##$AZFW= 0.5
##$BCFW= 0
##$BC_mod= 2
##$BYTORDP= 0
##$COROFFS= 0
##$CY= -3
##$DATMOD= 1
##$DC= 0
##$DFILT= <>
##$DTYPP= 0
##$F1P= 0
##$F2P= 0
##$FCOR= 1
##$FTSIZE= 65536
##$FT_mod= 6
##$GAMMA= 0
##$GB= 0
##$INTBC= 1
##$INTSCL= 6.047779e-11
##$ISEN= 30
##$LB= 5
##$LEV0= 0
##$LPBIN= 0
##$MAXI= 10000
##$MC2= 0
##$MEAN= 0
##$ME_mod= 0
##$MI= 50
##$NCOEF= 0
##$NC_proc= -5
##$NLEV= 6
##$NOISF1= 182.463
##$NOISF2= 159.3651
##$NSP= 0
##$NTH_PI= 0
##$NZP= 0
##$OFFSET= 248.5645
##$PC= 4
##$PHC0= -10696.83
##$PHC1= 140.6902
##$PH_mod= 1
##$PKNL= yes
##$PPARMOD= 0
##$PSCAL= 0
##$PSIGN= 0
##$REVERSE= no
##$SF= 81.0140089999694
##$SI= 65536
##$SIGF1= 159.3651
##$SIGF2= -187.1042
##$SINO= 113.3802
##$SIOLD= 16384
##$SREGLST= <1H.CDCl3>
##$SSB= 0
##$STSI= 65536
##$STSR= 0
##$SW_p= 40650.406504065
##$SYMM= 0
##$S_DEV= 0
##$TDeff= 32768
##$TDoff= 0
##$TI= <>
##$TILT= no
##$TM1= 0
##$TM2= 0
##$TOPLEV= 0
##$USERP1= <user>
##$USERP2= <user>
##$USERP3= <user>
##$USERP4= <user>
##$USERP5= <user>
##$WDW= 1
##$XDIM= 65536
##$YMAX_p= 273213886
##$YMIN_p= -6109696
$$ End of Bruker specific parameters
$$ ---------------------------------
##NTUPLES= NMR SPECTRUM
##VAR_NAME=  FREQUENCY,     SPECTRUM/REAL,   SPECTRUM/IMAG
##SYMBOL=    X,             R,               I
##VAR_TYPE=  INDEPENDENT,   DEPENDENT,       DEPENDENT
##VAR_FORM=  AFFN,          ASDF,            ASDF
##VAR_DIM=   65536,         65536,           65536
##UNITS=     HZ,            ARBITRARY UNITS, ARBITRARY UNITS
##FACTOR=    0.620285442955139, 1,           1
##FIRST=     20137.2065510682, 0,            0
##LAST=      -20513.1999529968, 0,           0
##MIN=       -20513.1999529968, -6109696,    0
##MAX=       20137.2065510682, 273213886,    0
$$ Real data points
##PAGE= N=1
##DATA TABLE= (X++(R..R)), XYDATA
$$ [...]
$$ plain form
39192 -94804 -87310 -68938 -53986 -58781 -83316 -105918 -102680 -68803 -18057 31481 65386 74207
39180 74207 57445 25545 -7991 -35945 -55938 -63787 -54065 -25757 16179 62259 99270 116149
39168 116149 115829 116921 135532 166412 187578 181708 148574 101465 60394 46684 73308 136162
39156 136162 218603 304748 384292 446672 479123 473791 433440 369734 298740 235060 182816 131672
39144 131672 67864 -8970 -83318 -136700 -157632 -140934 -87081 -6180 83447 165592 233879
39133 233879 289499 335200 371365 393783 396017 378694 354240 334907 317434 288969 248461 210765
39121 210765 185529 162448 123963 64570 -8541 -84744 -149963 -183869 -170069 -111383 -30165
39110 -30165 46510 100886 130569 147608 167767 193354 208593 197907 166369 136078 125015 135797
$$ packed form
39192i4804P494J8372J4952m795k4535k2602L238L3877N0746M9538L3905Q821
39180G4207j6762l1900l3536k7954j9993p849R722K8308M1936M6080L7011J6879
39168A16149l20J092J8611L0880K1166n870l3134m7109m1071j3710K6624O2854
39156A36162Q2441Q6145P9544O2380L2451n332m0351o3706p0994o3680n2244n1144
39144A31672o3808p6834p4348n3382k0932J6698N3853Q0901Q9627Q2145O8287
39133B33879N5620M5701L6165K2418K234j7323k4454j9333j7473k8465m0508l7696
39121B10765k5236k3081l8485n9393p3111p6203o5219l3906J3800N8686Q1218
39110c0165P6675N4376K9683J7039K0159K5587J5239j0686l1538l0291j1063J0782
$$ plain form
39098 135797 161713 194569 226909 255135 282332 311929 337912 348329 340982 330200 334776 361444
39086 361444 399559 426526 417692 358153 251414 117262 -19245 -136581 -219115 -258814 -258598
39075 -258598 -232575 -201915 -189080 -208449 -253279 -292987 -294127 -250354 -188855 -145230 -134836 -147093
39063 -147093 -159143 -151593 -118947 -73073 -35403 -21126 -30333 -53551 -80918 -104666 -119896 -129197
39051 -129197 -143561 -173746 -222304 -286266 -362315 -443076 -511726 -549129 -549090 -523323 -490274 -460819
39039 -460819 -434085 -404595 -373181 -351245 -351655 -373359 -397892 -404412 -386610 -353391 -317785 -289764
39027 -289764 -275010 -271863 -269422 -256020 -232439 -213304 -214753 -243452 -295407 -357985 -410900 -431491
39015 -431491 -404880 -330171 -219144 -93450 18754 93673 126875 135557 141715 153539 163857
$$ packed form
39098A35797K5916L2856L2340K8226K7197K9597K5983J0417p347j0782M576K6668
39086C61444L8115K6967q834n9539j06739j34152j36507j17336q2534l9699K16
39075b58598K6023L0660J2835j9369m4830l9708j140M3773O1499M3625J0394j2257
39063a47093j2050P550L2646M5874L7670J4277r207k3218k7367k3748j5230r301
39051a29197j4364l0185m8558o3962p6049q0761o8650l7403L9K5767L3049K9455
39039d60819K6734K9490L1414K1936m10k1704k4533o520J7802L3219L5606K8021
39027b89764J4754L147K441J3402K3581J9135j449k8699n1955o2578n2915k0591
39015d31491K6611P4709J11027J25694J12204P4919L3202Q682O158J1824J0318
$$ plain form
39004 163857 162502 146586 121347 94633 68875 35669 -18986 -99116 -188123 -256756 -282890 -264109
38992 -264109 -215177 -158155 -114121 -98251 -117714 -171944 -252997 -344780 -425454 -476805 -494914
38981 -494914 -491919 -487434 -497851 -529733 -577207 -623749 -650479 -647083 -615291 -561942 -491846 -410222
38969 -410222 -329650 -268496 -239090 -238516 -251771 -261646 -254496 -221795 -164241 -95825 -36839 3343
38957 3343 34970 75490 129794 186126 228772 248403 240758 204274 144713 77927 21985 -13949
38945 -13949 -32312 -42633 -57452 -88455 -139608 -202365 -259520 -293375 -289835 -240450 -148757 -35501
38933 -35501 68695 140157 171655 167611 136390 89926 44998 16836 9080 12322 14313 11306
38921 11306 8920 12769 20401 23852 17968 1825 -27891 -77803 -146619 -217435 -269362 -296327 -307057
$$ packed form
39004A63857j355j5916k5239k6714k5758l3206n4655q0130q9007o8633k6134J8781
38992b64109M8932N7022M4034J5870j9463n4230q1053r1783q0674n1351j8109
38981d94914K995M485j0417l1882m7474m6542k6730L396L1792N3349P0096Q1624
38969d10222Q0572O1154K9406N74j3255r875P150L2701N7554O8416N8986M0182
38957C343L1627M0520N4304N6332M2646J9631p645l6484n9561o6786n5942l5934
38945a3949j8363j0321j4819l1003n1153o2757n7155l3855L540M9385R1693J13256
38933c5501J04196P1462L1498m044l1221m6464m4928k8162p756L242J991l007
38921A1306k386L849P632L451n884j6143k9716m9912o8816p0816n1927k6965j0730
$$ plain form
38908 -307057 -306318 -285815 -239031 -178191 -128264 -105555 -106959 -117627 -122421 -109998 -73112 -10939
38896 -10939 67927 145796 202120 225689 225715 228988 260466 324704 406833 488353 556890 602986
38884 602986 617114 595755 547123 486109 423987 364541 307349 250756 192129 128996 61835
38873 61835 -5215 -67191 -121341 -166683 -200716 -217891 -213480 -189568 -154894 -116588 -73862 -23001
38861 -23001 33068 85145 128120 166126 205650 248007 290950 332543 368653 390522 391653 376535
38849 376535 356796 337172 308544 255686 169837 55159 -71937 -188263 -272995 -315964 -318566
38838 -318566 -288253 -234069 -165882 -93622 -26150 27155 55276 51303 20655 -20825 -59507 -92664
38826 -92664 -124695 -159210 -196024 -230861 -255186 -260711 -247463 -224293 -199577 -175694 -153453 -133549
$$ packed form
38908c07057P39K0503M6784O0840M9927K2709j404j0668m794J2423L6886O2173
38896a0939P8866P7869N6324K3569K6L273L1478O4238Q2129Q1520O8537M6096
38884F02986J4128k1359m8632o1014o2122n9446n7192n6593n8627o3133o7161
38873F1835o7050o1976n4150m5342l4033j7175M411K3912L4674L8306M2726N0861
38861b3001N6069N2077M2975L8006L9524M2357M2943M1593L6110K1869J131j5118
38849C76535j9739j9624k8628n2858q5849j14678j27096j16326q4732m2969k602
38838c18566L0313N4184O8187P2260O7472N3305K8121l973l0648m1480l8682l3157
38826i2664l2031l4515l6814l4837k4325n525J3248K3170K4716K3883K2241J9904
$$ plain form
38814 -133549 -109036 -66177 -2774 61239 104372 131694 168987 229196 298589 357983 401831
38803 401831 429164 431220 402820 357888 317852 285855 244533 179655 95600 6466 -77607 -151432
38791 -151432 -211324 -257963 -298730 -341371 -386580 -429843 -468410 -502391 -529238 -540560 -527073
38780 -527073 -488091 -436280 -390900 -363423 -349575 -337036 -320687 -308941 -316363 -351907 -411774 -479085
38768 -479085 -531120 -552591 -544853 -520878 -492080 -463771 -442214 -437776 -455430 -485146 -506750 -504343
38756 -504343 -474964 -427151 -376104 -339013 -328565 -346657 -384995 -433814 -490327 -557529 -633873
38745 -633873 -705517 -752544 -765132 -751108 -724185 -687184 -632335 -557329 -474004 -399132 -342937
38734 -342937 -309687 -301891 -316069 -337836 -349531 -343506 -323665 -295165 -257860 -209020 -146960 -72500
$$ packed form
38814a33549K4513M2859O3403O4013M3133K7322L7293O0209O9393N9394M3848
38803D01831K7333K056k8400m4932m0036l1997m1322o4878q4055q9134q4073p3825
38791a51432n9892m6639m0767m2641m5209m3263l8567l3981k6847j1322J3487
38780e27073L8982N1811M5380K7477J3848J2539J6349J1746p422l5544n9867o7311
38768d79085n2035k1471P738K3975K8798K8309K1557M438j7654k9716k1604K407
38756e04343K9379M7813N1047L7091J0448j8092l8338m8819n6513o7202p6344
38745f33873p1644m7027j2588J4024K6923L7001N4849P5006Q3325P4872N6195
38734c42937L3250P796j4178k1767j1695O025J9841K8500L7305M8840O2060P4460
$$ plain form
38722 -72500 7060 75763 119116 139694 155610 178215 196656 191358 159616 120289 93549 82991
38710 82991 79428 75463 70617 64933 54755 38288 22631 20460 37609 65861 90438 103431 106639
38697 106639 101887 83769 44316 -19595 -107097 -216394 -338890 -451130 -522498 -537972 -511981
38686 -511981 -477246 -461040 -471413 -499157 -526506 -536196 -519004 -474900 -405906 -310818 -191949
38675 -191949 -65037 45798 126074 178529 209706 215655 188754 136443 84533 58783 67170
38664 67170 101870 153246 216070 283077 338768 364843 353137 312703 263927 225514 205034 197465
38652 197465 189374 167136 128444 89674 77742 108081 169541 233804 279721 305908 321333 330482
38640 330482 331325 322867 307437 284860 249913 199763 142461 93892 64557 51394 45035 44057 58519
$$ packed form
38722g2500P9560O8703M3353K0578J5916K2605J8441n298l1742l9327k6740j0558
38710H2991l563l965m846n684j0178j6467j5657k171J7149K8252K4577J2993L208
38697A06639m752j8118l9453o3911q7502j09297j22496j12240p1368j5474K5991
38686e11981L4735J6206j0373k7744k7349r690J7192M4104O8994R5088J18869
38675a91949J26912J10835Q0276N2455L1177N949k6901n2311n1910k5750Q387
38664F7170L4700N1376O2824O7007N5691K6075j1706m0434m8776l8413k0480p569
38652A97465q091k2238l8692l8770j1932L0339O1460O4263M5917K6187J5425R149
38640C30482Q43q458j5430k2577l4947n0150n7302m8569k9335j3163o359r78J4462
$$ plain form
38627 58519 98235 160088 228401 285095 317194 318142 288716 238876 185226 143002 119289 112442
38615 112442 116289 125989 142435 170157 207902 242903 260272 259144 253675 254674 255068 238388 198697
38602 198697 147255 101755 74248 67920 78330 95496 109752 119102 128661 141369 152751 157788
38590 157788 159829 167945 185998 208368 226499 234736 227346 194693 129207 36076 -66461 -160030
38578 -160030 -237162 -297963 -339482 -353661 -336742 -297609 -254555 -223464 -208119 -200270 -189348 -173581
38566 -173581 -161331 -160092 -165311 -163218 -145095 -116014 -88435 -69486 -55577 -36667 -3092 50341
38554 50341 122695 205794 284305 340770 367156 374424 385489 411791 437911 435779 394556 330523
38542 330523 267408 215563 173850 142290 123242 114166 109119 107798 115883 134740 156058 169208
$$ packed form
38627E8519L9716O1853O8313N6694L2099R48k9426m9840n3650m2224k3713o847
38615A12442L847R700J6446K7722L7745L5001J7369j128n469R99L94j6680l9691
38602A98697n1442m5500k7507o328J0410J7166J4256R350R559J2708J1382N037
38590A57788K041Q116J8053K2370J8131Q237p390l2653o5486r3131j02537r3569
38578a60030p7132o0801m1519j4179J6919L9133M3054L1091J5345P849J0922J5767
38566a73581J2250J239n219K093J8123K9081K7579J8949J3909J8910L3575N3433
38554E0341P2354Q3099P8511N6465K6386P268J1065K6302K6120k132m1223o4033
38542C30523o3115n1845m1713l1560j9048r076n047j321Q085J8857K1318J3150
$$ plain form
38530 169208 171301 169050 172731 187693 208409 220943 214598 191622 162588 132230 93234 34679
38518 34679 -46211 -140874 -234211 -311320 -363031 -387982 -389112 -368096 -324908 -263047 -193143 -130872
38506 -130872 -92445 -90036 -125538 -185056 -242280 -272707 -268000 -238056 -200101 -165434 -134624 -103636
38494 -103636 -73208 -50305 -39045 -32251 -16121 15016 49958 67537 51978 2969 -65723 -135620
38482 -135620 -193787 -238057 -275246 -315102 -364148 -421579 -478164 -519350 -531179 -504797 -438505
38471 -438505 -340793 -233602 -147665 -107605 -118868 -168487 -234879 -294206 -323085 -305810 -243360
38460 -243360 -152021 -50774 48869 142246 226458 298505 356032 398981 432540 467310 510782
38449 510782 556199 583893 577485 538358 484488 438493 417133 426533 462385 515525 579378 650867
$$ packed form
38530A69208K093k251L681J4962K0716J2534o345k2976k9034l0358l8996n8555
38518C4679q0890r4663r3337p7109n1711k4951j130K1016M3188O1861O9904O2271
38506a30872L8427K409l5502n9518n7224l0427M707K9944L7955L4667L0810L0988
38494a03636L0428K2903J1260O794J6130L1137L4942J7579j5559m9009o8692o9897
38482a35620n8167m4270l7189l9856m9046n7431n6585m1186j1829K6382O6292
38471d38505R7712J07191Q5937M0060j1263m9619o6392n9327k8879J7275O2450
38460b43360R1339J01247R9643R3377Q4212P2047N7527M2949L3559L4770M3472
38449E10782M5417K7694o408l9127n3870m5995k1360R400L5852N3140O3853P1489
$$ plain form
38437 650867 723758 784858 819650 820399 788764 735371 679514 643548 639482 659186 680186 681437
38425 681437 653524 598336 525482 450235 390955 365057 385875 460163 584114 740051 899515
38414 899515 1033875 1126289 1176533 1194540 1187367 1151683 1079935 973159 844982 712905 588776
38403 588776 478057 383131 303244 233551 168085 103460 38888 -24346 -80722 -121028 -139815
38392 -139815 -141706 -136684 -129317 -115572 -90061 -53645 -13772 19856 38969 38277 16416 -22051
38380 -22051 -64654 -94414 -101016 -89591 -74000 -60964 -47842 -38453 -50349 -95183 -156224 -198178
38368 -198178 -201589 -179179 -156861 -148513 -154367 -175201 -217358 -283694 -365229 -443740 -502126 -533809
38356 -533809 -543727 -540391 -528995 -514866 -509204 -521425 -543832 -553828 -537947 -506619 -477575 -451481
$$ packed form
38437F50867P2891O1100L4792P49l1635n3393n5857l5966m066J9704K1000J251
38425F81437k7913n5188p2854p5247n9280k5898K0818P4288J23951J55937J59464
38414H99515J34360R2414N0244J8007p173l5684p1748j06776j28177j32077j24129
38403E88776j10719r4926p9887o9693o5466o4625o4572o3234n6376m0306j8787
38392a39815j891N022P367J3745K5511L6416L9873L3628J9113o92k1861l8467
38380b2051m2603k9760o602J1425J5591J3036J3122R389j1896m4834o1041m1954
38368a98178l411K2410K2318Q348n854k0834m2157o6336q1535p8511n8386l1683
38356e33809r918L336J1396J4129N662j2221k2407r996J5881L1328K9044K6094
$$ plain form
38344 -451481 -414914 -362876 -303829 -241532 -167298 -78804 3801 52109 55928 26751 -21611 -85207
38332 -85207 -162528 -245220 -320921 -379863 -415331 -423099 -405664 -374050 -340472 -309745 -279758 -247306
38320 -247306 -209846 -164518 -111192 -56123 -7842 30555 59827 73931 56695 -5528 -108332
38309 -108332 -228407 -337334 -415441 -456020 -463044 -449213 -434467 -439301 -471422 -515820 -542203
38298 -542203 -528622 -479556 -419047 -367250 -327654 -296692 -279125 -289093 -337833 -423062 -528581
38287 -528581 -631737 -713173 -763342 -781675 -771652 -740477 -703663 -682940 -692448 -727163 -768331
38276 -768331 -799228 -812679 -806692 -780312 -735289 -676592 -609697 -542515 -491763 -479557 -514870 -578967
38264 -578967 -636092 -661554 -656939 -637493 -609169 -561907 -483903 -378926 -268996 -180932 -128341
$$ packed form
38344d51481L6567N2038N9047O2297P4234Q8494Q2605M8308L819k9177m8362o3596
38332h5207p7321q2692p5701n8942l5468p768J7435L1614L3578L0727K9987L2452
38320b47306L7460M5328N3326N5069M8281L8397K9272J4104j7236o2223j02804
38309a08332j20075j08927p8107m0579p024J3831J4746m834l2121m4398k6383
38298e42203J3581M9066O0509N1797L9596L0962J7567r968m8740q5229j05519
38287e28581j03156q1436n0169j8333J0023L1175L6814K0723r508l4715m1168
38276g68331l0897j3451N987K6380M5023N8697O6895O7182N0752J2206l5313o4097
38264e78967n7125k5462M615J9446K8324M7262P8004J04977J09930Q8064N2591
$$ plain form
38253 -128341 -102311 -77718 -31652 39078 114710 165810 172887 139403 90742 58764 60329 86761
38241 86761 115928 135384 149896 165274 172451 154957 108840 47387 -12882 -63517 -102302 -129882
38229 -129882 -151832 -176602 -205646 -229079 -234340 -215559 -172933 -109796 -35090 36999 96164 141149
38217 141149 171270 178470 155535 108240 50352 -11442 -78164 -144538 -195252 -219842 -224440 -223818
38205 -223818 -226321 -231041 -235927 -242783 -254009 -266911 -271539 -254117 -204777 -124001 -22131 86242
38193 86242 186604 266977 322226 357313 381821 397995 395701 361134 290224 193527 89378
38182 89378 -7254 -89634 -152642 -183077 -163832 -94413 -4160 64202 87217 73266 44119 12744
38170 12744 -17862 -43841 -59024 -63385 -66130 -78500 -105502 -143478 -182275 -209644 -216798 -202197
$$ packed form
38253a28341K6030K4593M6066P0730P5632N1100P077l3484m8661l1978J565K6432
38241H6761K9167J9456J4512J5378P177j7494m6117o1453o0269n0635l8785k7580
38229a29882k1950k4770k9044k3433n261J8781M2626O3137P4706P2089N9165M4985
38217A41149L0121P200k2935m7295n7888o1794o6722o6374n0714k4590m598O22
38205b23818k503m720m886o856j1226j2902m628J7422M9340Q0776J01870J08373
38193H6242J00362Q0373N5249L5087K4508J6174k294l4567p0910r6697j04149
38182H9378r6632q2380o3008l0435J9245O9419R0253O8362K3015j3951k9147l1375
38170A2744l0606k5979j5183m361k745j2370k7002l7976l8797k7369p154J4601
$$ plain form
38158 -202197 -170980 -131574 -92418 -59994 -38996 -34463 -51199 -86828 -125665 -145221 -132632 -93278
38146 -93278 -42880 4852 41737 63402 70945 71916 72935 70136 50802 5900 -60379 -132426 -191465
38133 -191465 -223107 -222220 -194515 -153128 -111577 -78255 -55883 -44472 -44110 -55011 -74966 -97176
38121 -97176 -111239 -106553 -75532 -16389 64717 156310 250974 352572 470290 605079 747056
38110 747056 889092 1038985 1214460 1428593 1683595 1977269 2311644 2692448 3114087 3535357
38100 3535357 3869143 4013613 3917496 3624894 3250542 2903239 2627313 2406220 2205445 2005002
38090 2005002 1802709 1604941 1422164 1268452 1157565 1096065 1080261 1100808 1150908 1229993
38080 1229993 1339289 1474169 1620431 1755527 1851833 1882601 1832798 1709314 1538982 1352183
$$ packed form
38158b02197L1217L9406L9156L2424K0998M533j6736l5629l8837j9556J2589L9354
38146i3278N0398M7732L6885K1665P543R71J019k799j9334m4902o6279p2047n9039
38133a91465l1642Q87K7705M1387M1551L3322K2372J1411L62j0901j9955k2210
38121i7176j4063M686L1021N9143Q1106R1593R4664J01598J17718J34789J41977
38110G47056J42036J49893J75475K14133K55002K93674L34375L80804M21639M21270
38100C535357L33786J44470r6117k92602l74352l47303k75926k21093k00775k00443
38090B005002k02293j97768j82777j53712j10887o1500j5804K0547N0100P9085
38080A229993J09296J34880J46262J35096R6306L0768m9803j23484j70332j86799
$$ plain form
38070 1352183 1165947 982307 801338 632989 494438 395833 329419 273967 211641 142137
38060 142137 81170 45547 39828 56236 84230 116667 147039 166355 168784 159951 153348 154969
38048 154969 155425 141905 115059 88100 70497 59503 48535 36396 24735 12798 288 -8487
38036 -8487 -8576 -129 12847 24031 19111 -25278 -124757 -267110 -415948 -535717 -607926 -626021
38024 -626021 -588750 -506199 -402861 -302946 -213131 -124836 -29376 76380 195630 331405 477349
38013 477349 615437 727118 804214 848560 866518 866237 854416 830223 784418 708161 601075
38002 601075 468706 316859 154834 2040 -117543 -192267 -231798 -256802 -280422 -299341
37992 -299341 -299361 -268146 -205454 -123709 -37833 46602 135059 235517 351177 479636 612324
$$ packed form
38070A352183j86236j83640j80969j68349j38551r8605o6414n5452o2326o9504
38060A42137o0967l5623n719J6408K7994L2437L0372J9316K429q833o603J621
38048A54969M56j3520k6846k6959j7603j0994j0968j2139j1661j1937j2510q775
38036h487q9Q447J2976J1184m920m4389r9479j42353j48838j19769p2209j8095
38024f26021L7271Q2551J03338R9915Q9815Q8295R5460J05756J19250J35775J45944
38013D77349J38088J11681P7096M4346J7958k81j1821k4193m5805p6257j07086
38002F01075j32369j51847j62025j52794j19583p4724l9531k5004k3620j8919
37992b99341k0L1215O2692Q1745Q5876Q4435Q8457J00458J15660J28459J32688
$$ plain form
37981 612324 732657 822169 875265 904805 927389 945833 951866 942027 920395 884689 820495 716582
37969 716582 582026 443337 327160 248242 208832 202247 216487 238820 259170 269773 264324
37958 264324 240376 202305 160943 131344 130001 168422 243959 337561 424142 486234 518208 521346
37946 521346 499119 456231 398400 332135 265681 208614 167676 143223 131338 128279 130520 130926
37934 130926 117357 76421 465 -105156 -219600 -314327 -367463 -371825 -331388 -256725 -167118
37923 -167118 -89631 -45677 -37075 -49894 -71144 -97029 -127324 -160169 -193604 -224036 -239579 -222572
37911 -222572 -166421 -87851 -16648 27235 44852 50006 55064 64371 76204 87520 97140 105547
37899 105547 112045 112958 104198 86729 69517 65890 84703 123104 167736 204206 226569 238784
$$ packed form
37981F12324J20333Q9512N3096K9540K2584J8444O033r839k1632l5706o4194j03913
37969G16582j34556j38689j16177p8918l9410o585J4240K2333K0350J0603n449
37958B64324k3948l8071m1362k9599j343L8421P5537R3602Q6581O2092L1974L138
37946E21346k2227m2888n7831o6265o6454n7067m0938k4453j1885l059K241M06
37934A30926j3569m0936p5956j05621j14444r4727n3136m362M0437P4663Q9607
37923a67118P7487M3954Q602j2819k1250k5885l0295l2845l3435l0432j5543J7007
37911b22572N6151P8570P1203M3883J7617N154N058R307J1833J1316R620Q407
37899A05547O498R13q760j7469j7212l627J8813L8401M4632L6470K2363J2215
$$ plain form
37887 238784 248192 257639 262875 257905 244562 235820 245135 270654 294115 298894 286499 272408 269423
37874 269423 278957 293535 300003 282761 233708 161534 85581 19759 -31630 -63548 -67317 -43875
37862 -43875 -11519 9051 16162 29131 70796 150249 257310 367789 457167 516108 553466
37851 553466 582038 604260 615372 615785 612244 607110 593364 562110 510987 444847 373164 308447
37839 308447 262495 239789 234431 234222 228011 211749 191216 178787 184536 209982 251616 307266
37827 307266 373435 437670 482026 498873 499239 500873 509867 517621 514179 500102 484511 474526 468566
37814 468566 458926 438825 405690 358811 298529 232627 182356 174344 219589 300299 381210 435881
37802 435881 462824 479494 505517 552421 624487 723547 850699 1004785 1181474 1375583 1584973
$$ packed form
37887B38784R408R447N236m970j3343q742R315K5519K3461M779j2395j4091k985
37874B69423R534J4578O468j7242m9053p2174p5953o5822n1389l1918l769K3442
37862d3875L2356K0570P111J2969M1665P9453J07061J10479Q9378N8941L7358
37851E53466K8572K2222J1112M13l541n134j3746l1254n1123o6140p1683o4717
37839C08447m5952k2706n358k09o211j6262k0533j2429N749K5446M1634N5650
37827C07266O6169O4235M4356J6847L66J634Q994P754l442j4077j5591r985n960
37814D68566r640k0101l3135m6879o0282o5902n0271q012M5245Q0710Q0911N4671
37802D35881K6943J6670K6023M6904P2066R9060J27152J54086J76689J94109K09390
$$ plain form
37791 1584973 1811459 2055835 2310156 2554459 2761918 2908461 2979071 2967723 2875071 2708834
37781 2708834 2486112 2232833 1977873 1744474 1544007 1375820 1233479 1112851 1015037 941970
37771 941970 891132 856925 836913 834233 853052 892965 947485 1005196 1051981 1076609 1078588 1070019
37759 1070019 1066734 1076578 1096136 1116652 1131262 1138717 1143396 1150578 1157609 1149249 1105608 1017628 894916
37746 894916 759131 631445 524754 442502 381500 337614 311229 306158 321179 343358 351779
37735 351779 328647 268272 179749 84905 11359 -20380 -9489 24698 57516 76461 85449 94934
37723 94934 112302 143710 201433 302788 458851 666716 915785 1200194 1521528 1879585
37713 1879585 2264416 2658531 3041564 3386277 3650288 3780654 3738446 3526972 3197511 2823730
$$ packed form
37791A584973K26486K44376K54321K44303K07459J46543P0610j1348r2652j66237
37781B708834k22722k53279k54960k33399k00467j68187j42341j20628r7814p3067
37771I41970n0838l4207k0012k680J8819L9913N4520N7711M6785K4628J979q569
37759A070019l285R844J9558K0516J4610P455M679P182P031q360m3641q7980j22712
37746H94916j35785j27686j06691q2252o1002m3886k6385n071J5021K2179Q421
37735C51779k3132o0375q8523r4844p3546l1739J0891L4187L2818J8945Q988R485
37723I4934J7368L1408N7723J01355J56063K07865K49069K84409L21334L58057
37713A879585L84831L94115L83033L44713K64011J30366m2208k11474l29461l73781
$$ plain form
37703 2823730 2464321 2143612 1861272 1614667 1409754 1253809 1143337 1061966 989181 910186
37693 910186 819239 717438 610584 509982 432553 394606 400505 436438 477666 503885 508144
37682 508144 493035 462882 422547 381006 350307 337974 341078 348249 346283 325388 283067 228564
37670 228564 183260 169906 194945 241268 282616 307384 326647 357475 400499 436685 445600 423982
37658 423982 385561 345451 308080 270375 232573 200740 177854 157584 132809 109778 107731 140654
37646 140654 201570 266949 313894 330844 316662 277262 224099 170034 123302 87731 69679
37635 69679 80944 132437 227453 362553 531086 722206 919582 1107157 1277797 1434645
37625 1434645 1584944 1735081 1889128 2044116 2181210 2264542 2257173 2145229 1949097 1711012
$$ packed form
37703B823730l59409l20709k82340k46605k04913j55945j10472q1371p2785p8995
37693I10186r0947j01801j06854j00602p7429l7947N899L5933M1228K6219M259
37682E08144j5109l0153m0335m1541l0699j2333L104P171j966k0895m2321n4503
37670B28564m5304j3354K5039M6323M1348K4768J9263L0828M3024L6186Q915k1618
37658D23982l8421m0110l7371l7705l7802l1833k2886k0270k4775k3031k047L2923
37646A40654O0916O5379M6945J6950j4182l9400n3163n4065m6732l5571j8052
37635F9679J1265N1493R5016J35100J68533J91120J97376J87575J70640J56848
37625A434645J50299J50137J54047J54988J37094Q3332p369j11944j96132k38085
$$ plain form
37615 1711012 1470702 1250362 1057335 893917 761141 656778 575538 511680 457398 398987
37605 398987 321898 225537 130832 67447 51192 73318 108374 129870 123026 90819 50050 17082
37593 17082 -5280 -25152 -46597 -62558 -65047 -57463 -51822 -55919 -68137 -83972 -101760 -119537
37581 -119537 -130288 -125429 -103814 -74792 -50084 -32331 -12662 19655 65606 115152 157020 188168
37569 188168 212934 234111 246534 240516 212411 172103 138701 126460 134437 150977 167333 183700
37557 183700 201938 217761 224645 222927 219446 217633 212359 196490 169484 136991 103908 70345
37545 70345 33102 -11618 -65963 -126548 -181021 -212242 -211629 -189957 -171217 -171403 -182888 -181697 -150457
37532 -150457 -93064 -29211 19802 39069 22662 -22182 -74210 -109930 -120508 -114001 -99747 -75682
$$ packed form
37615A711012k40310k20340j93027j63418j32776j04363q1240o3858n4282n8411
37605C98987p7089r6361r4705o3385j6255K2126L5056K1496o844l2207m0769l2968
37593A7082k2362j9872k1445j5961k489P584N641m097j2218j5835j7788j7777
37581a19537j0751M859K1615K9022K4708J7753J9669L2317M5951M9546M1868L1148
37569A88168K4766K1177J2423o018k8105m0308l3402j2241P977J6540J6356J6367
37557A83700J8238J5823O884j718l481j813n274j5869k7006l2493l3083l3563
37545G0345l7243m4720n4345o0585n4473l1221O13K1672J8740j86j1485J191L1240
37532a50457N7393O3853M9013J9267j6407m4844n2028l5720j0578O507J4254K4065
$$ plain form
37520 -75682 -33989 26138 97323 172623 248765 321687 385559 437579 478086 503619 505383 479380
37508 479380 435461 391832 360790 341412 324202 300875 272643 252612 257357 290752 336534 370998
37496 370998 382313 373566 350628 317704 287486 284501 327414 409596 503885 585978 649019 698221
37484 698221 738382 766443 770163 734437 656483 556545 466166 401675 354452 310495 272175 253567
37472 253567 260012 283415 318003 370629 449933 549996 650212 730410 783825 817556 844454
37461 844454 874775 911911 952772 992061 1028731 1070903 1133879 1229202 1351768 1477442 1575255
37450 1575255 1623385 1615642 1557917 1463535 1351267 1242035 1152882 1092790 1062582 1055838 1059860
37439 1059860 1060520 1051005 1036106 1025380 1021221 1015444 999539 977898 968403 987487 1034402 1090942
$$ packed form
37520g5682M1693O0127P1185P5300P6142P2922O3872N2020M0507K5533J764k6003
37508D79380m3919m3629l1042j9378j7210k3327k8232k0031M745L3395M5782L4464
37496C70998J1315q747k2938l2924l0218k985M2913Q2182R4289Q2093O3041M9202
37484F98221M0161K8061L720l5726p7954r9938r0379o4491m7223m3957l8320j8608
37472B53567O445K3403L4588N2626P9304J00063J00216Q0198N3415L3731K6898
37461H44454L0321L7136M0861L9289L6670M2172O2976R5323J22566J25674R7813
37450A575255M8130p743n7725r4382j12268j09232q9153o0092l0208o744M022
37439A059860O60r515j4899j0726m159n777j5905k1641r495J9084M6915N6540
$$ plain form
37427 1090942 1135376 1154032 1140933 1093981 1018472 932734 862922 827404 825751 842481 860218
37416 860218 871185 880841 902741 947200 1011285 1078572 1129355 1152948 1153047 1142841 1133248 1123861 1106724
37403 1106724 1080699 1059005 1057790 1078191 1105029 1124590 1139715 1165411 1211814 1271932 1323500
37392 1323500 1343405 1325433 1286576 1253570 1241872 1248960 1265647 1287261 1312599 1339158 1364581
37381 1364581 1389869 1418237 1453791 1502593 1569606 1651428 1736955 1817869 1891280 1947497 1965283
37370 1965283 1931735 1863847 1798620 1760621 1746760 1740894 1731364 1711649 1675752 1621268 1552188 1474247
37358 1474247 1392709 1317238 1259142 1215220 1161504 1075683 965213 862700 791181 742014 689554
37347 689554 618912 533857 446287 370349 325808 333410 396372 487946 564024 591725 567414 511429
$$ packed form
37427A090942M4434J8656j3099m6952p5509q5738o9812l5518j653J6730J7737
37416H60218J0967R656K1900M4459O4085O7287N0783K3593R9j0206r593r387j7137
37403A106724k6025k1694j215K0401K6838J9561J5125K5696M6403O0118N1568
37392A323500J9905j7972l8857l3006j1698P088J6687K1614K5338K6559K5423
37381A364581K5288K8368L5554M8802O7013Q1822Q5527Q0914P3411N6217J7786
37370A965283l3548o7888o5227l7999j3861n866r530j9715l5897n4484o9080p7941
37358A474247q1538p5471n8096m3922n3716q5821j10470j02513p1519m9167n2460
37347F89554p0642q5055q7570p5938m4541P602O2962R1574P6078K7701k4311n5985
$$ plain form
37335 511429 450292 403372 380488 386829 427768 506538 614926 728998 821273 881050 919747
37324 919747 953499 983738 998097 986780 952689 907172 861883 825389 802484 793830 797911 814046
37312 814046 841240 873501 898803 904709 885704 846947 802634 768199 749127 736069 713570 674892
37300 674892 627274 583259 548710 518425 481263 430969 375020 331246 311638 310896 315945 325250
37288 325250 350950 400099 461495 516004 555131 584714 614954 653290 704206 767277 831750
37277 831750 876522 880020 833495 747986 649400 563706 503291 467309 454860 473492 530658 618326
37265 618326 710473 777532 803712 793579 766216 742728 734370 737898 740078 726247 686875 621617
37253 621617 541614 466467 413540 386787 375485 363481 339565 301977 257732 219050 197381
$$ packed form
37335E11429o1137m6920k2884O341M0939P8770J08388J14072R2275N9777L8697
37324I19747L3752L0239J4359j1317l4091m5517m5289l6494k2905q654M081J6135
37312H14046K7194L2261K5302N906j9005l8757m4313l4435j9072j3058k2499l8678
37300F74892m7618m4015l4549l0285l7162n0294n5949m3774j9608p42N049R305
37288C25250K5700M9149O1396N4509L9127K9583L0240L8336N0916O3071O4473
37277H31750M4772L498m6525q5509r8586q5694o0415l5982j2449J8632N7166Q7668
37265F18326R2147O7059K6180j0133k7363k3488q358L528K180j3831l9372o5258
37253F21617q0003p5147n2927k6753j1302j2004k3916l7588m4245l8682k1669
$$ plain form
37242 197381 197406 215975 247409 290084 348126 427197 528201 643703 759691 861803 941523
37231 941523 997231 1029351 1035281 1011089 959595 895186 836994 795412 765939 735977 695292 640138
37219 640138 572847 502403 443179 407495 398327 411320 441840 485161 530425 560950 564283 540347
37207 540347 499309 454139 415047 386636 368668 362389 376450 422108 500555 597834 693110 768877
37195 768877 814387 827179 815741 796118 781261 774832 774690 775820 768316 741906 699554 660804
37183 660804 644440 651932 673454 703089 738630 772440 796511 816346 847300 894203 944756 986640
37171 986640 1021874 1059759 1104590 1156958 1219942 1295011 1374097 1441744 1484301 1495147 1476435
37160 1476435 1441356 1410692 1399436 1406117 1417963 1423990 1419965 1406559 1391982 1395290 1436375 1516555
$$ packed form
37242A97381K5J8569L1434M2675N8042P9071J01004J15502J15988J02112P9720
37231I41523N5708L2120N930k4192n1494o4409n8192m1582k9473k9962m0685n5154
37219F40138o7291p0444n9224l5684r168J2993L0520M3321M5264L0525L333k3936
37207E40347m1038m5170l9092k8411j7968o279J4061M5658P8447R7279R5276P5767
37195G68877M5510J2792j1438j9623j4857o429j42J130p504k6410m2352l8750
37183F60804j6364P492K1522K9635L5541L3810K4071J9835L0954M6903N0553M1884
37171I86640L5234L7885M4831N2368O2984P5069P9086O7647M2557J0846j8712
37160A476435l5079l0664j1256O681J1846O027m025j3406j4577L308M1085Q0180
$$ plain form
37148 1516555 1611732 1687360 1719508 1704703 1658202 1607054 1578984 1589861 1639574 1720219 1826206
37137 1826206 1955890 2108572 2285248 2491230 2734380 3021366 3357824 3750027 4203707
37128 4203707 4724137 5318141 5981783 6664104 7239499 7541116 7454270 6993385 6289664 5505771
37118 5505771 4759940 4110298 3577189 3161323 2850618 2629711 2490071 2427146 2427506 2463887
37108 2463887 2505013 2529124 2529561 2511529 2484773 2457011 2431774 2409655 2387452 2354636 2295814 2203619
37096 2203619 2090296 1982894 1904897 1862761 1848627 1852277 1869086 1898829 1939728 1985130 2026296
37085 2026296 2057647 2078225 2089638 2096425 2108584 2138200 2189941 2258631 2340142 2440328 2566029
37074 2566029 2708620 2844015 2950795 3023541 3068227 3092065 3101387 3101899 3092225 3059007 2987677
$$ packed form
37148A516555R5177P5628L2148j4805m6501n1148k8070J0877M9713Q0645J05987
37137A826206J29684J52682J76676K05982K43150K86986L36458L92203M53680
37128D203707N20430N94004O63642O82321N75395L01617q6846m60885p03721p83893
37118E505771p45831o49642n33109m15866l10705k20907j39640o2925L60L6381
37108B463887M1126K4111M37j8032k6756k7762k5237k2119k2203l2816n8822r2195
37096B203619j13323j07402p7997m2136j4134L650J6809K9743M0899M5402M1166
37085B026296L1351K0578J1413O787J2159K9616N1741O8690Q1511J00186J25701
37074B566029J42591J35395J06780P2746M4686K3838R322N12r674l3218p1330
$$ plain form
37063 2987677 2882958 2775595 2703833 2686407 2713413 2761397 2813522 2864403 2910987 2946314 2963499
37052 2963499 2960537 2939041 2904422 2872525 2870075 2917269 3007310 3109726 3197020 3263757 3318358
37041 3318358 3364443 3397842 3418493 3436154 3461394 3494689 3526328 3544426 3541407 3515607 3470635
37030 3470635 3414036 3354394 3297830 3247469 3207398 3186673 3196677 3241512 3310027 3378433 3422543
37019 3422543 3429784 3402929 3355902 3307233 3274754 3270741 3296057 3336736 3370124 3381079 3375437 3375768
37007 3375768 3401817 3455232 3522078 3585620 3634718 3665130 3679161 3683683 3683776 3677451 3659482 3630189
36995 3630189 3596748 3564817 3531550 3487835 3425932 3346069 3259733 3187458 3148754 3149118 3175293 3203431
36983 3203431 3212830 3195673 3159253 3121207 3099948 3105979 3139820 3194812 3258058 3309032 3322578 3278453
$$ packed form
37063B987677j04719j07363p1762j7426K7006M7984N2125N0881M6584L5327J7185
37052B963499k962k1496l4619l1897k450M7194R0041J02416Q7294O6737N4601
37041C318358M6085L3399K0651J7661K5240L3295L1639J8098l019k5800m4972
37030C470635n6599n9642n6564n0361m0071k0725J0004M4835O8515O8406M4110
37019C422543P241k6855m7027m8669l2479m013K5316M0679L3388J0955n642L31
37007C375768K6049N3415O6846O3542M9098L0412J4031M522R3o325j7969k9293
36995C630189l3441l1931l3267m3715o1903p9863q6336p2275l8704L64K6175K8138
36983C203431R399j7157l6420l8046k1259O031L3841N4992O3246N0974J3546m4125
$$ plain form
36971 3278453 3170599 3010020 2821757 2637444 2483415 2369451 2287911 2224946 2171958 2126180
36961 2126180 2083970 2038814 1987713 1937373 1901226 1888849 1898114 1917651 1936127 1948535 1956183 1965996
36949 1965996 1991869 2051317 2153519 2289241 2435868 2573685 2695955 2803671 2892602 2944837
36939 2944837 2931394 2826781 2628803 2367788 2093858 1851714 1664422 1533881 1447902 1386865
36929 1386865 1333812 1286145 1256453 1259469 1300223 1374478 1472580 1576756 1660544 1701901 1699965
36918 1699965 1674505 1647186 1625577 1604156 1575346 1537381 1495277 1457336 1429033 1407922 1385804
36907 1385804 1358417 1332932 1324107 1342416 1386645 1447741 1517507 1590905 1660068 1710071 1725380
36896 1725380 1701882 1650578 1588090 1524861 1462956 1401767 1341602 1282603 1225276 1174471 1139364
$$ packed form
36971C278453j07854j60579j88263j84313j54029j13964q1540o2965n2988m5778
36961B126180m2210m5156n1101n0340l6147j2377R265J9537J8476J2408P648R813
36949A965996K5873N9448J02202J35722J46627J37817J22270J07716Q8931N2235
36939B944837j3443j04613j97978k61015k73930k42144j87292j30541q5979o1037
36929A386865n3053m7667k9692L016M0754P4255R8102J04176Q3788M1357j936
36918A699965k5460k7319k1609k1421k8810l7965m2104l7941k8303k1111k2118
36907A385804k7387k5485q825J8309M4229O1096O9766P3398O9163N0003J5309
36896A725380k3498n1304o2488o3229o1905o1189o0165n8999n7327n0805l5107
$$ plain form
36885 1139364 1125372 1127013 1132674 1137270 1146974 1169500 1201727 1228821 1234206 1209496 1158342 1095172
36873 1095172 1039032 1003421 989932 993193 1010643 1043156 1085951 1124165 1140230 1123577 1073825
36862 1073825 1000540 921927 856653 810582 774036 735898 696944 665812 647470 642419 652726
36851 652726 679240 713196 738922 746587 736824 713325 679050 641861 615389 607067 607266 594639
36839 594639 552829 482372 398914 320555 254734 197032 143731 102827 88610 107294 152801
36828 152801 214520 282330 345208 393999 428187 453058 467917 464923 443771 420341 414162 430529
36816 430529 458746 483269 492184 480350 452193 420669 398103 387308 383073 379747 374898 368917
36804 368917 364778 365967 371695 376976 380307 387641 404668 428423 451430 471963 495327 526060 562413
$$ packed form
36885A139364j3992J641N661M596R704K2526L2227K7094N385k4710n1154o3170
36873A095172n6140l5611j3489L261J7450L2513M2795L8214J6065j6653m9752
36862A073825p3285p8613o5274m6071l6546l8138l8954l1132j8342n051J0307
36851F52726K6514L3956K5726P665r763k3499l4275l7189k6472q322J99j2627
36839E94639m1810p0457q3458p8359o5821n7702n3301m0904j4217J8684M5507
36828A52801O1719O7810O2878M8791L4188K4871J4859k994k1152k3430o179J6367
36816D30529K8217K4523Q915j1834k8157l1524k2566j0795m235l326m849n981
36804C68917m139J189N728N281L331P334J7027K3755K3007K0533K3364L0733L6353
$$ plain form
36791 562413 596586 616755 611690 579258 530224 479568 434190 391655 348468 304848 262983 226182
36779 226182 199363 185097 179398 177568 185412 217907 282216 365621 444315 501405 532360 536674
36767 536674 513572 469574 423616 395836 390376 395162 400885 414397 448273 501247 556447 598633
36755 598633 627144 651804 682653 724756 775464 822164 847658 842796 812043 765666 712109 661187
36743 661187 627697 623851 649744 695823 751651 807273 850543 872445 875941 873937 879160 902719
36731 902719 962024 1079669 1267733 1517779 1812581 2146055 2526819 2963320 3449171 3958456
36721 3958456 4442226 4823410 5009227 4935158 4613849 4138181 3625871 3155564 2750594 2407322
36711 2407322 2121107 1887107 1695651 1537831 1408376 1297523 1189464 1077077 970270
$$ packed form
36791E62413L4173K0169n065l2432m9034n0656m5378m2535m3187m3620m1865l6801
36779B26182k6819j4266n699j830P844L2495O4309Q3405P8694N7090L0955M314
36767E36674k3102m3998m5958k7780n460M786N723J3512L3876N2974N5200M2186
36755E98633K8511K4660L0849M2103N0708M6700K5494m862l0753m6377n3557n0922
36743F61187l3490l846K5893M6079N5828N5622M3270K1902L496k004N223K3559
36731I02719N9305J17645J88064K50046K94802L33474L80764M36501M85851N09285
36721C958456M83770L81184J85817p4069l21309m75668n12310m70307m04970l43272
36711B407322k86215k34000j91456j57820j29455j10853j08059j12387j06807
$$ plain form
36702 970270 879346 795648 701036 595155 500843 438465 402670 369634 323528 272046 237690
36691 237690 236406 264021 301118 328538 337262 327932 309312 299091 317186 369777 442008 511623
36679 511623 567532 610850 642491 658522 657645 645644 629517 611284 590512 571716 567160 589689
36667 589689 639296 697389 740552 762851 779738 807817 848281 894741 947447 1008530 1068588
36656 1068588 1111722 1134902 1152310 1177949 1210757 1237799 1245248 1225708 1183450 1136951 1111891
36645 1111891 1128061 1193198 1305377 1453902 1618557 1777090 1918146 2045003 2168672 2303417
36635 2303417 2466870 2674510 2931201 3233950 3580020 3956985 4318531 4585743 4692498
36626 4692498 4633878 4463958 4246003 4008983 3747952 3453349 3131763 2802757 2485472 2193006
$$ packed form
36702I70270r0924q3698r4612j05881r4312o2378l5795l3036m6106n1482l4356
36691B37690j284K7615L7097K7420Q724r330j8620j0221J8095N2591P2231O9615
36679E11623N5909M3318L1641J6031q77j2001j6127j8233k0772j8796m556K2529
36667E89689M9607N8093M3163K2299J6887K8079M0464M6460N2706O1083O0058
36656A068588M3134K3180J7408K5639L2808K7042P449j9540m2258m6499k5060
36645A111891J6170O5137J12179J48525J64655J58533J41056J26857J23669J34745
36635B303417J63453K07640K56691L02749L46070L76965L61546K67212J06755
36626D692498n8620j69920k17955k37020k61031k94603l21586l29006l17285k92466
$$ plain form
36616 2193006 1935954 1723820 1559443 1435106 1337745 1256186 1180169 1095828 989933 860831
36606 860831 720702 584574 459901 348355 253965 185301 149188 143541 157371 179034 204661
36595 204661 236136 269824 291274 285095 248409 191596 128737 71369 27714 397 -15463 -26315
36583 -26315 -31312 -22417 8123 63926 143733 236800 321754 380911 417563 449829 484174 503657
36571 503657 487487 435106 364667 292686 221393 142966 51208 -47763 -130650 -164647 -127161
36560 -127161 -22405 119922 261202 371593 439030 467201 465629 441415 401773 361981 343229
36549 343229 358607 404847 470586 548140 632514 712320 768898 787056 766304 723151 683637
36538 683637 669864 688167 728622 777336 829330 889211 961936 1047345 1145766 1267164 1430801
$$ packed form
36616B193006k57052k12134j64377j24337r7361q1559p6017q4341j05895j29102
36606H60831j40129j36128j24673j11546r4390o8664l6113n647J3830K1663K5627
36595B04661L1475L3688K1450o179l6686n6813o2859n7368m3655k7317j5860j0852
36583b6315m997Q895L0540N5803P9807R3067Q4954N9157L6652L2266L4345J9483
36571E03657j6170n2381p0439p1981p1293p8427r1758r8971q2887l3997L7486
36560a27161J04756J42327J41280J10391O7437K8171j572k4214l9642l9792j8752
36549C43229J5378M6240O5739P7554Q4374P9806N6578J8158k0752m3153l9514
36538F83637j3773J8303M0455M8714N1994N9881P2725Q5409R8421J21398J63637
$$ plain form
36527 1430801 1652427 1931558 2253981 2606895 2985882 3381164 3759380 4067258 4258658
36518 4258658 4319085 4266939 4136451 3959632 3757013 3537969 3308005 3076611 2857359 2659186
36508 2659186 2478031 2298493 2105760 1898501 1691445 1504673 1350409 1231328 1148948 1105989
36498 1105989 1097507 1106864 1118362 1132108 1161230 1216494 1298656 1402928 1523799 1656004 1796732
36487 1796732 1946765 2104759 2261747 2406716 2536178 2653023 2759747 2862271 2978980
36478 2978980 3133892 3336426 3576362 3843960 4148218 4509060 4936527 5425847 5973033
36469 5973033 6589113 7294384 8098790 8992117 9957830 10994026 12110962 13303405 14532979
36460 14532979 15743361 16882928 17900572 18726731 19277856 19486645 19324410 18802078 17968447
$$ packed form
36527A430801K21626K79131L22423L52914L78987L95282L78216L07878J91400
36518D258658O0427n2146j30488j76819k02619k19044k29964k31394k19252j98173
36508B659186j81155j79538j92733k07259k07056j86772j54264j19081q2380m2959
36498A105989q482R357J1498J3746K9122N5264Q2162J04272J20871J32205J40728
36487A796732J50033J57994J56988J44969J29462J16845J06724J02524J16709
36478B978980J54912K02534K39936K67598L04258L60842M27467M89320N47186
36469E973033O16080P05271Q04406Q93327R65713J036196J116936J192443J229574
36460A4532979J210382J139567J017644Q26159N51125K08789j62235n22332q33631
$$ plain form
36451 17968447 16911001 15738957 14546683 13389310 12290981 11266663 10331481 9496568
36443 9496568 8762287 8113811 7524840 6973931 6459102 5989842 5565155 5168708 4786105
36434 4786105 4416309 4065101 3740600 3459118 3240260 3085466 2970040 2865430 2763105
36425 2763105 2670453 2592096 2524022 2459034 2388821 2305944 2212381 2122441 2050458 1998840 1962206
36414 1962206 1935914 1912856 1877445 1812384 1711396 1583054 1447405 1331830 1260657 1238492
36404 1238492 1246048 1258709 1267804 1282120 1314728 1370961 1439953 1491642 1491420 1428418 1326065 1218924
36392 1218924 1124641 1043082 971492 907322 841719 765027 680958 608133 567074 568945 612014
36381 612014 681582 755796 818197 863943 892270 900107 888774 869595 854354 844728 837795 836094
$$ packed form
36451A7968447j057446j172044j192274j157373j098329j024318r35182q34913
36443I496568p34281o48476n88971n50909n14829m69260m24687l96447l82603
36434D786105l69796l51208l24501k81482k18858j54794j15426j04610j02325
36425B763105r2652p8357o8074o4988p0213q2877r3563q9940p1983n1618l6634
36414A962206k6292k3058l5411o5061j00988j28342j35649j15575p1173k2165
36404A238492P556J2661R095J4316L2608N6233O8992N1689k22o3002j02353j07141
36392A218924r4283q1559p1590o4170o5603p6692q4069p2825m1059J871M3069
36381F12014O9568P4214O2401M5746K8327P837j1333j9179j5241r626o933j701
$$ plain form
36369 836094 844893 865700 899965 951281 1013923 1067040 1093203 1097794 1097453 1094461 1077629 1045999
36357 1045999 1015015 996845 988286 981436 973780 962825 942224 911387 882831 873223 888849 921249
36345 921249 953535 971086 971769 967496 972307 989269 1012612 1039264 1070226 1101386 1122311 1127315
36333 1127315 1121649 1113633 1104905 1090662 1066345 1033032 999637 980645 988491 1026269 1087839 1163364
36321 1163364 1243998 1324789 1405247 1483116 1545586 1573539 1560304 1520464 1472739 1418824 1347740
36310 1347740 1257906 1165254 1089505 1039178 1008939 984851 953693 914939 883994 877863 898187
36299 898187 933232 973562 1018514 1070288 1132123 1213346 1327251 1480728 1671255 1894716 2149398
36288 2149398 2430692 2728390 3031458 3328324 3596865 3798171 3888974 3847312 3690920 3472212
$$ packed form
36369H36094Q799K0807L4265N1316O2642N3117K6163M591l41k992j6832l1630
36357A045999l0984j8170q559o850p656j0955k0601l0837k8556r608J5626L2400
36345I21249L2286J7551O83m273M811J6962K3343K6652L0962L1160K0925N004
36333A127315n666q016q728j4243k4317l3313l3395j8992P846L7778O1570P5525
36321A163364Q0634Q0791Q0458P7869O2470K7953j3235l9840m7725n3915p1084
36310A347740q9834r2652p5749n0327l0239k4088l1158l8754l0945o131K0324
36299H98187L5045M0330M4952N1774O1835Q1223J13905J53477J90527K23461K54682
36288B149398K81294K97698L03068K96866K68541K01306R0803m1662j56392k18708
$$ plain form
36278 3472212 3251580 3068444 2931290 2828805 2745136 2667444 2590754 2524494 2491811 2515705
36268 2515705 2602908 2738640 2892408 3030819 3135828 3217785 3307035 3429665 3596181 3814076
36258 3814076 4099641 4469346 4928140 5478031 6136880 6941410 7932466 9142339 10594075
36249 10594075 12298711 14224228 16228407 18005243 19139564 19300450 18446986 16857327
36241 16857327 14947183 13051226 11343307 9887257 8697147 7752985 7008390 6412367
36233 6412367 5923679 5511749 5160627 4870253 4639107 4448348 4276982 4128315 4026328
36224 4026328 3990290 4027668 4144386 4339878 4591513 4861918 5124163 5368730 5593228 5806910
36214 5806910 6044566 6352720 6753345 7232799 7767643 8348033 8976835 9662952 10417464
$$ packed form
36278C472212k20632j83136j37154j02485q3669p7692p6690o6260l2683K3894
36268B515705Q7203J35732J53768J38411J05009Q1957Q9250J22630J66516K17895
36258C814076K85565L69705M58794N49891O58849Q04530R91056J209873J451736
36249A0594075J704636J925517K004179J776836J134321J60886q53464j589659
36241A6857327j910144j895957j707919j456050j190110r44162p44595n96023
36233F412367m88688m11930l51122k90374k31146j90759j71366j48667j01987
36224D026328l6038L7378J16718J95492K51635K70405K62245K44567K24498K13682
36214E806910K37656L08154M00625M79454N34844N80390O28802O86117P54512
$$ plain form
36205 10417464 11239484 12100595 12954085 13758047 14473998 15045318 15401414 15495439 15328838
36196 15328838 14937456 14368482 13673406 12903395 12097006 11277809 10468353 9698273 8995108
36187 8995108 8374225 7838038 7375840 6964707 6582071 6220173 5881577 5564181 5262626
36178 5262626 4982838 4742767 4559305 4444742 4410615 4457142 4556315 4658276 4717160 4704312
36168 4704312 4604752 4419607 4173137 3902686 3638461 3399616 3202487 3057492 2961377 2905255
36158 2905255 2884289 2887068 2887686 2869058 2845398 2839654 2847593 2849730 2850754 2875912 2929736 2989041 3039858
36145 3039858 3092882 3157478 3227142 3296742 3368885 3435865 3478070 3487501 3473761 3444183 3399154
36134 3399154 3347541 3301785 3254708 3185788 3093724 2999207 2914818 2839514 2784907 2776698 2822491
$$ packed form
36205A0417464Q22020Q61111Q53490Q03962P15951N71320L56096R4025j66601
36196A5328838l91382n68974o95076p70011q06389q19197q09456p70080p03165
36187H995108o20883n36187m62198m11133l82636l61898l38596l17396l01555
36178E262626k79788k40071j83462j14563l4127M6527R9173J01961N8884j2848
36168D704312r9560j85145k46470k70451k64225k38845j97129j44995r6115n6122
36158B905255k0966K779O18j8628k3660n744P939K137J024K5158N3824N9305N0817
36145C039858N3024O4596O9664O9600P2143O6980M2205R431j3740k9578m5029
36134C399154n1613m5756m7077o8920r2064r4517q4389p5304n4607q209M5793
$$ plain form
36123 2822491 2903144 3000552 3109570 3222479 3331927 3452348 3607517 3792050 3974336 4140000
36113 4140000 4302014 4468514 4636546 4817854 5029669 5255298 5456104 5628956 5807689
36104 5807689 5999674 6170051 6304304 6439145 6610851 6815530 7040325 7292002 7573639
36095 7573639 7872798 8193698 8564856 8999125 9483374 10017356 10618367 11278405 11967953
36086 11967953 12694996 13508661 14434896 15466872 16627737 17974913 19528663 21269396
36078 21269396 23223208 25476406 28096021 31128110 34692669 38980351 44136241 50260928
36070 50260928 57549524 66303036 76789407 89263289 104153218 122017788 143240484
36063 143240484 167906020 195722970 225169886 252124774 270069387 273213886 260413672
$$ packed form
36123B822491Q0653R7408J09018J12909J09448J20421J55169J84533J82286J65664
36113D140000J62014J66500J68032J81308K11815K25629K00806J72852J78733
36104E807689J91985J70377J34253J34841J71706K04679K24795K51677K81637
36095G573639K99159L20900L71158M34269M84249N33982O01011O60038O89548
36086A1967953P27043Q13665R26235J031976J160865J347176J553750J740733
36078B1269396J953812K253198K619615L032089L564559M287682N155890O124687
36070E0260928P288596Q753512J0486371J2473882J4889929J7864570K1222696
36063A43240484K4665536K7816950K9446916K6954888J7944613L144499j2800214
$$ plain form
36056 260413672 236033759 206838032 178085808 152161837 129645424 110554088 94646406
36049 94646406 81423343 70378102 61172330 53510141 47046441 41518579 36820222 32867276
36041 32867276 29504818 26594269 24076602 21896175 19958316 18207617 16661686 15324032
36033 15324032 14135094 13040151 12034270 11111516 10239072 9411788 8669420 8031192 7469144
36024 7469144 6966903 6543791 6195243 5868169 5526536 5192162 4892911 4617178 4346987
36015 4346987 4092276 3863406 3647029 3435770 3249958 3108487 3007493 2941524 2909706 2884206
36005 2884206 2810161 2660467 2463219 2259473 2064610 1886007 1743374 1648305 1589683 1557685
35995 1557685 1556976 1580759 1599554 1593725 1571958 1540786 1482064 1380602 1252225 1126169 1019958
$$ packed form
36056B60413672k4379913k9195727k8752224k5923971k2516413j9091336j5907682
36049I4646406j3223063j1045241r205772p662189o463700n527862m698357l952946
36041C2867276l362458k910549k517667k180427j937859j750699j545931j337654
36033A5324032j188938j094943j005881r22754q72444q27284p42368o38228n62048
36024G469144n02241m23112l48548l27074l41633l34374k99251k75733k70191
36015D346987k54711k28870k16377k11259j85812j41471j00994o5969l1818k5500
36005B884206p4045j49694j97248k03746j94863j78603j42633r5069n8622l1998
35995A557685p09K3783J8795n829k1767l1172n8722j01462j28377j26056j06211
$$ plain form
35984 1019958 947890 931117 975651 1052414 1116214 1137212 1109176 1045518 976877 933521 916610
35973 916610 899519 864126 819369 779059 742968 709280 685151 673233 664870 655423 648160 635660
35961 635660 599658 541456 493115 486244 527058 611122 739950 907635 1090010 1263629 1420410
35950 1420410 1550078 1625898 1626348 1560195 1456303 1339099 1223849 1120190 1024480 919237
35940 919237 793838 657681 524932 400191 290617 217533 199119 228125 277369 320259
35930 320259 340139 333521 315587 310925 326537 342613 338556 316449 289296 260021 226444 196555
35918 196555 183539 191393 216766 258570 315053 376980 432894 476308 502505 507299 495334 478542
35906 478542 457399 414419 337089 239124 149482 88105 59964 61377 79979 96810 101572 101945
$$ packed form
35984A019958p2068j6773M4534P6763O3800K0998k8036o3658o8641m3356j6911
35973I16610j7091l5393m4757m0310l6091l3688k4129j1918q363r447p263j2500
35961F35660l6002n8202m8341o871M0814Q4064J28828J67685J82375J73619J56781
35950A420410J29668P5820M50o6153j03892j17204j15250j03659r5710j05243
35940I19237j25399j36157j32749j24741j09574p3084j8414K9006M9244M2890
35930C20259J9880o618j7934m662J5612J6076m057k2107k7153k9275l3577k9889
35918A96555j3016P854K5373M1804N6483O1927N5914M3414K6197M794j1965j6792
35906D78542k1143m2980p7330r7965q9642o1377k8141J413J8602J6831M762L73
$$ plain form
35894 101945 109591 123107 132825 135967 139506 154838 195746 272114 376905 487094 584704 668164
35882 668164 737224 780562 789970 775142 750366 715193 662058 595666 530705 475682 431601 400385
35870 400385 379904 354101 302600 220604 120323 16305 -79384 -150660 -180659 -166234 -123712
35859 -123712 -79453 -56473 -62891 -83991 -89048 -55954 10287 87262 158220 219084 269238 306946
35847 306946 332736 347973 349677 333778 304227 273700 254125 247840 245721 233336 204668 172527
35835 172527 159091 172800 201718 233070 269558 319781 382029 446328 504083 545435 554595 520910
35823 520910 452592 370989 294079 231295 186457 154594 121294 77981 36397 18064 31046
35812 31046 65328 107013 146001 172046 176026 158284 129326 102494 91156 108188 156614 220050
$$ packed form
35894A01945P646J3516R718L142L539J5332M0908P6368J04791J10189R7610Q3460
35882F68164O9060M3338R408j4828k4776l5173n3135o6392o4961n5023m4081l1216
35870D00385k0481k5803n1501q1996j00281j04018r5689p1276k9999J4425M2522
35859a23712M4259K2980o418k1100n057L3094O6241P6975P0958O0864N0154L7708
35847C06946K5790J5237J704j5899k9551l0527j9575o285k119j2385k8668l2141
35835A72527j3436J3709K8918L1352L6488N0223O2248O4299N7755M1352R160l3685
35823E20910o8318q1603p6910o2784m4838l1863l3300m3313m1584j8333J2982
35812C1046L4282M1685L8988K6045L980j7742k8958k6832j1338J7032M8426O3436
$$ plain form
35800 220050 271369 293218 285957 259055 224006 194900 185203 198571 225611 250538 260188 251980
35788 251980 239452 246214 286571 353643 431969 516848 612469 715440 812611 895748 968421
35777 968421 1037837 1110001 1194861 1305563 1446610 1608501 1778675 1954286 2142197 2350878
35767 2350878 2584852 2843999 3126920 3438226 3794100 4218277 4729871 5330083 5989221
35758 5989221 6636352 7165930 7472256 7494945 7241973 6776325 6182286 5534948 4885930 4267020
35748 4267020 3702181 3211294 2800894 2458339 2163200 1903396 1675863 1475600 1292815
35739 1292815 1121333 964223 831305 735790 690764 700025 749028 808953 852264 864235 842829
35728 842829 792748 719850 628785 527296 433437 371633 354400 370467 396312 415824 423235
$$ packed form
35800B20050N1319K1849p261k6902l5049k9106r697J3368K7040K4927R650q208
35788B51980j2528O762M0357O7072P8326Q4879R5621J02971R7171Q3137P2673
35777I68421O9416P2164Q4860J10702J41047J61891J70174J75611J87911K08681
35767B350878K33974K59147K82921L11306L55874M24177N11594O00212O59138
35758E989221O47131N29578L06326K2689k52972m65648n94039o47338o49018o18910
35748D267020n64839m90887m10400l42555k95139k59804k27533k00263j82785
35739A292815j71482j57110j32918r5515m5026R261M9003N9925M3311J1971k1406
35728H42829n0081p2898r1065j01489r3859o1804j7233J6067K5845J9512P411
$$ plain form
35717 423235 413755 383941 341170 302073 278541 270828 273092 276887 269145 237874 185710 132811
35705 132811 103182 111260 159892 242113 342518 446076 551541 670856 811045 962605
35695 962605 1111446 1257926 1417743 1606025 1824861 2062295 2293933 2482415 2582789 2560216
35685 2560216 2411212 2170035 1891529 1623311 1390237 1198998 1048825 934373 845101 770783
35675 770783 708530 660539 625312 594377 556687 503525 431829 347574 264387 193756 137400
35664 137400 93842 70422 81270 131243 206482 282938 341904 377723 394987 400283 395066 376620
35652 376620 346910 317462 301474 302800 316241 335733 356874 374258 383966 388466 392129 391569 377797
35639 377797 349811 319456 299653 292443 290545 285239 269741 240396 199939 157260 119409 84053
$$ packed form
35717D23235r480k9814m2771l9097k3532p713K264L795p742l1271n2164n2899
35705A32811k9629Q078M8632Q2221J00405J03558J05465J19315J40189J51560
35695I62605J48841J46480J59817J88282K18836K37434K31638J88482J00374k2573
35685B560216j49004k41177k78506k68218k33074j91239j50173j14452q9272p4318
35675G70783o2253m7991l5227l0935l7690n3162p1696q4255q3187p0631n6356
35664A37400m3558k3420J0848M9973P5239P6456N8966L5819J7264N296n217j8446
35652C76620k9710k9448j5988J326J3441J9492K1141J7384R708M500L663n60j3772
35639C77797k7986l0355j9803p210j898n306j5498k9345m0457m2679l7851l5356
$$ plain form
35627 84053 42385 -10189 -67308 -116243 -150408 -177604 -213097 -262254 -312782 -347388 -360834 -359267
35615 -359267 -345464 -313012 -256804 -183425 -108270 -45427 -1270 25957 41880 48532 40165 8665
35603 8665 -46986 -118685 -194622 -263083 -314023 -344461 -362966 -382520 -407265 -431314 -450737 -468785
35591 -468785 -485601 -489715 -466904 -415806 -350157 -286061 -229536 -175113 -113265 -38523 47385 136888
35579 136888 218145 276556 301155 293974 269479 239433 201141 146642 80497 19463 -25774 -59843
35567 -59843 -91170 -118980 -135822 -136848 -121574 -90922 -47878 815 47201 85386 111884 126863
35555 126863 136966 151730 172403 187018 181344 154171 118747 90001 73517 67073 69366 83090
35543 83090 107580 130769 134745 113394 81441 60903 60094 70770 83460 97411 113961 127490
$$ packed form
35627H4053m1668n2574n7119m8935l4165k7196l5493m9157n0528l4606j3446J567
35615c59267J3803L2452N6208P3379P5155O2843M4157K7227J5923O652q367l1500
35603H665n5651p1699p5937o8461n0940l0438j8505j9554k4745k4049j9423j8048
35591d68785j6816m114K2811N1098O5649O4096N6525N4423O1848P4742Q5908Q9503
35579A36888Q1257N8411K4599p181k4495l0046l8292n4499o6145o1034m5237l4069
35567e9843l1327k7810j6842j026J5274L0652M3044M8693M6386L8185K6498J4979
35555A26863J0103J4764K0673J4615n674k7173l5424k8746j6484o444K293J3724
35543H3090K4490K3189L976k1351l1953k0538q09J0676J2690J3951J6550J3529
$$ plain form
35531 127490 127120 103875 54975 -12791 -80152 -121290 -119910 -80876 -25559 22170 45834 39472
35519 39472 8333 -32650 -64090 -68738 -36853 29873 117905 207513 280376 322390 324055 284946
35507 284946 217326 138188 55266 -34482 -131692 -226499 -306392 -366201 -406560 -428378 -434866 -435986
35495 -435986 -445158 -471098 -513048 -559372 -588373 -576965 -516748 -422322 -321312 -237433 -183376
35484 -183376 -162453 -168474 -185487 -196190 -194702 -189347 -192582 -210292 -239616 -272515 -299673 -314058
35472 -314058 -314202 -305009 -294945 -291355 -296401 -305701 -310911 -304936 -286055 -258371 -229017 -204224 -187297
35459 -187297 -180526 -187228 -206604 -224152 -213738 -158575 -71345 11635 56974 52446 4780 -67599
35447 -67599 -136757 -173860 -169046 -141849 -124464 -133816 -162981 -197061 -230664 -267984 -309392 -341589
$$ packed form
35531A27490l70k3245m8900o7766o7361m1138J380L9034N5317M7729K3664o362
35519C9472l1139m0983l1440m648L1885O6726Q8032Q9608P2863M2014J665l9109
35507B84946o7620p9138q2922q9748r7210r4807p9893n9809m0359k1818o488j120
35495d35986r172k5940m1950m6324k9001J1408O0217R4426J01010Q3879N4057
35484a83376K0923o021j7013j0703J488N355l235j7710k9324l2899k7158j4385
35472c14058j44R193J0064L590n046r300n210N975J8881K7684K9354K4793J6927
35459a87297O771o702j9376j7548J0414N5163Q7230Q2980M5339m528m7666p2379
35447f7599o9158l7103M814K7197J7385r352k9165l4080l3603l7320m1408l2197
$$ plain form
35435 -341589 -343205 -302429 -229948 -153486 -99769 -82073 -100058 -142945 -191584 -226076 -238017 -233404
35423 -233404 -221812 -207081 -190057 -172938 -155100 -129677 -90913 -42305 7218 51381 85195
35412 85195 99684 86181 45585 -12537 -79921 -154443 -236983 -328888 -430504 -535177 -625239
35401 -625239 -681972 -702372 -701030 -693450 -682025 -659822 -622176 -570336 -507637 -437450 -364243 -293000
35389 -293000 -227111 -168968 -123578 -100208 -107800 -145849 -199123 -244667 -268507 -276951 -290367 -325294
35377 -325294 -381729 -444281 -492342 -511029 -498183 -464455 -426349 -398282 -390345 -409813 -458964 -529250
35365 -529250 -600921 -653059 -676744 -679680 -678602 -686226 -703174 -720222 -726995 -718211 -693086 -651952
35353 -651952 -595825 -528899 -459875 -400261 -361163 -350255 -369454 -413343 -468948 -518984 -550352
$$ packed form
35435c41589j616M0776P2481P6462N3717J7696j7985m2887m8639l4492j1941M613
35423b33404J1592J4731J7024J7119J7838K5423L8764M8608M9523M4163L3814
35412H5195J4489j3503m0596n8122o7384p4522q2540r1905j01616j04673r0062
35401f25239n6733k0400J342P580J1425K2203L7646N1840O2699P0187P3207P1243
35389b93000O5889N8143M5390K3370p592l8049n3274m5544k3840q444j3416l4927
35377c25294n6435o2552m8061j8687J2846L3728L8106K8067P937j9468m9151p0286
35365e29250p1671n2138k3685k936J078p624j6948j7048o773Q784K5125M1134
35353f51952N6127O6926O9024N9614L9098J0908j9199m3889n5605n0036l1368
$$ plain form
35342 -550352 -563947 -575702 -604049 -653965 -713035 -761644 -785338 -779706 -748446 -698484 -635394 -564073
35330 -564073 -495261 -447048 -432559 -446115 -468184 -484797 -495469 -501836 -498962 -482983 -458386 -430172
35318 -430172 -396095 -355918 -322308 -309943 -314103 -310467 -278684 -220036 -152377 -96617 -69974 -81900
35306 -81900 -127532 -187408 -239390 -271535 -282413 -272043 -236979 -174826 -91352 -1450 77703 135030
35294 135030 168225 180961 180711 177792 179550 181614 169526 133881 80225 19140 -47776 -122199
35282 -122199 -191703 -231364 -228862 -200630 -176196 -169686 -171025 -160864 -127961 -74463 -12280 43104
35270 43104 80276 98927 110574 130609 166968 213809 254494 271518 256589 214402 157768 97047
35258 97047 31671 -47309 -142908 -239545 -308286 -327957 -301049 -249902 -201568 -176839 -185423 -222690
$$ packed form
35342e50352j3595j1755k8347m9916n9070m8609k3694N632L1260M9962O3090P1321
35330e64073O8812M8213J4489j3556k2069j6613j0672o367K874J5979K4597K8214
35318d30172L4077M0177L3610J2365m160L636L1783N8648O7659N5760K6643j1926
35306h1900m5632n9876n1982l2145j0878J0370L5064O2153Q3474Q9902P9153N7327
35294A35030L3195J2736k50k919J758K064j2088l5645n3656o1085o6916p4423
35282a22199o9504l9661K502K8232K4434O510j339J0161L2903N3498O2183N5384
35270D3104L7172J8651J1647K0035L6359M6841M0685J7024j4929m2187n6634o0721
35258I7047o5376p8980r5599r6637o8741j9671K6908N1147M8334K4729q584l7267
$$ plain form
35246 -222690 -272199 -318206 -356297 -387166 -401251 -377604 -302182 -184002 -50691 69928 163512
35235 163512 229247 270462 285687 269532 223871 165945 119777 97347 90671 82949 64343 36347
35223 36347 5085 -27114 -66016 -123368 -208284 -318722 -441851 -561435 -661758 -726866 -745217
35212 -745217 -720893 -676378 -637744 -615212 -597969 -565849 -506505 -427056 -352792 -310164 -305239 -319566
35200 -319566 -330151 -330931 -330661 -333368 -328888 -303711 -254522 -187816 -111226 -30531 46638 109180 145887
35187 145887 148998 116402 56060 -9333 -47996 -39113 8172 58638 77977 57266 13000 -30702
35175 -30702 -56496 -57890 -40496 -20784 -14792 -22714 -28807 -20105 -1338 11764 8823 -10283 -41824
35162 -41824 -81794 -124812 -166839 -209910 -259400 -316907 -380456 -449349 -519846 -575269 -591870 -562615
$$ packed form
35246b22690m9509m6007l8091l0869j4085K3647P5422J18180J33311J20619R3584
35235A63512O5735M1215J5225j6155m5661n7926m6168k2430o676p722j8606k7996
35223C6347l1262l2199l8902n7352q4916j10438j23129j19584j00323o5108j8351
35212g45217K4324M4515L8634K2532J7243L2120N9344P9449P4264M2628M925j4327
35200c19566j0585p80K70k707M480K5177M9189O6706P6590Q0695P7169O2542L6707
35187A45887L111l2596o0342o5393l8663Q883M7285N0466J9339k0711m4266m3702
35175c0702k5794j394J7394J9712N992p922o093Q702J8767J3102k941j9106l1541
35162d1824l9970m3018m2027m3071m9490n7507o3549o8893p0497n5423j6601K9255
$$ plain form
35150 -562615 -509274 -462549 -433281 -410869 -386999 -370012 -373472 -399148 -435910 -469254 -486893 -481114
35138 -481114 -454461 -422276 -402583 -401101 -408787 -413323 -409172 -397488 -382158 -367224 -352445 -327964
35126 -327964 -277678 -192835 -81591 36364 141646 219215 255392 238715 166770 51289 -83102
35115 -83102 -205351 -289284 -326961 -332879 -330447 -331362 -329585 -314993 -288398 -260840 -241851 -232479 -228471
35102 -228471 -226010 -222910 -216216 -200730 -170771 -124416 -68009 -18227 1184 -30223 -115299 -231403
35090 -231403 -339113 -404575 -417859 -392681 -351368 -310785 -278353 -255577 -243438 -245386 -264091
35079 -264091 -292935 -312584 -301471 -252255 -176559 -94185 -21983 26072 35516 -2675 -80264 -169598
35067 -169598 -237413 -263550 -248876 -208052 -156785 -106480 -68749 -59196 -90314 -158340 -239715 -304165
$$ packed form
35150e62615N3341M6725K9268K2412K3870J6987l460k5676l6762l3344j7639N779
35138d81114K6653L2185J9693J482p686m536M151J1684J5330J4934J4779K4481
35126c27964N0286Q4843J11244J17955J05282P7569L6177j6677p1945j15481j34391
35115h3102j22249q3933l7677n918K432r15J777J4592K6595K7558J8989R372M008
35102b28471K461L100O694J5486K9959M6355N6407M9782J9411l1407q5076j16104
35090b31403j07710o5462j3284K5178M1313M0583L2432K2776J2139j948j8705
35079b64091k8844j9649J1113M9216P5696Q2374P2202M8055R444l8191p7589q9334
35067a69598o7815k6137J4674M0824N1267N0305L7731R553l1118o8026q1375o4450
$$ plain form
35055 -304165 -333591 -330449 -310558 -288959 -270967 -254229 -237295 -224069 -218504 -216765 -209021 -191559
35043 -191559 -175393 -179333 -212337 -262207 -302240 -310594 -285310 -242367 -201293 -174854 -171235 -199263
35031 -199263 -264011 -356260 -450630 -517350 -537012 -507427 -442366 -366204 -305461 -278314 -286609 -314745
35019 -314745 -336881 -331313 -295278 -247419 -212173 -200087 -204554 -215393 -229232 -245125 -256662 -254070
35007 -254070 -232569 -196209 -156384 -129465 -132061 -172168 -242916 -325720 -398935 -444649 -453857 -431141
34995 -431141 -392347 -352022 -312753 -269949 -225128 -188784 -169564 -165720 -169060 -173059 -174431 -170270
34983 -170270 -158103 -138709 -116811 -98834 -90576 -95788 -115066 -145804 -184054 -226659 -270876 -311162
34971 -311162 -336776 -334889 -298999 -234977 -157662 -81880 -18577 22923 37303 32775 32201 54869
$$ packed form
35055c04165k9426L142J9891K1599J7992J6738J6934J3226N565J739P744J7462
35043a91559J6166l940l3004m9870m0033q354K5284M2943M1074K6439L619k8028
35031a99263o4748r2249r4370o6720j9662K9585O5061P6162O0743K7147q295k8136
35019c14745k2136N568L6035M7859L5246J2086m467j0839j3839j5893j1537K592
35007b54070K1501L6360L9825K6919k596m0107p0748q2804p3215m5714r208K2716
34995d31141L8794M0325L9269M2804M4821L6344J9220L844l340l999j372M161
34983a70270J2167J9394K1898J7977Q258n212j9278l0738l8250m2605m4217m0286
34971c11162k5614J887L5890O4022P7315P5782O3303M1500J4380m528n74K2668
$$ plain form
34959 54869 95514 126602 122689 79000 7666 -75328 -154936 -215828 -245701 -241194 -207636 -153939
34947 -153939 -90662 -30972 12478 34231 37912 30710 17141 -2364 -29102 -62178 -94082 -110173
34935 -110173 -97452 -58034 -12586 13573 9154 -19045 -59357 -109037 -174100 -259241 -361217
34924 -361217 -469572 -568067 -634671 -647020 -595361 -491718 -364363 -243045 -149030 -93478 -76938
34913 -76938 -88561 -111946 -136614 -162439 -191705 -221467 -248088 -275996 -314837 -366123 -416417 -446514
34901 -446514 -447577 -429567 -416030 -429586 -478243 -552104 -631225 -695259 -727731 -718902 -671417 -601000
34889 -601000 -524560 -446710 -362840 -275227 -199279 -151112 -133512 -135678 -141102 -134117 -107629 -71837
34877 -71837 -50186 -58332 -88562 -120516 -143984 -163934 -186105 -207450 -221194 -222367 -207180 -177105
$$ packed form
34959E4869M0645L1088l913m3689p1334q2994p9608o0892k9873M507L3558N3697
34947a53939O3277N9690M3450K1753L681p202j3569j9505k6738l3076l1904j6091
34935a10173J2721L9418M5448K6159m419k8199m0312m9680o5063q5141j01976
34924c61217j08355r8495o6604j2349N1659J03643J27355J21318R4015N5552J6540
34913g6938j1623k3385k4668k5825k9266k9762k6621k7908l8841n1286n0294l0097
34901d46514j063J8010J3537j3556m8657p3861p9121o4034l2472Q829M7485P0417
34889f01000P6440P7850Q3870Q7613P5948M8167J7600k166n424O985K6488L5792
34877g1837K1651q146l0230l1954k3468j9950k2171k1345j3744j173J5187L0075
$$ plain form
34865 -177105 -147955 -144881 -178837 -231862 -273349 -288948 -287695 -284103 -282389 -279222 -273587 -268498 -265951
34852 -265951 -264121 -258931 -247055 -229023 -210858 -200802 -202151 -210418 -220150 -234099 -261973 -308122
34840 -308122 -363326 -412750 -451324 -486679 -525887 -564303 -590809 -599562 -591453 -567833 -530926 -489630
34828 -489630 -456049 -433840 -417585 -406940 -412388 -438883 -469874 -478885 -457442 -423603 -401452 -399111
34816 -399111 -409210 -423037 -436649 -445500 -441357 -418942 -384131 -352419 -337977 -344514 -366543 -397135
34804 -397135 -431698 -465257 -491205 -506348 -515244 -525727 -539802 -551261 -552775 -543258 -526864 -505862
34792 -505862 -477269 -438533 -395268 -358524 -331026 -299022 -243175 -157407 -53082 53684 151652
34781 151652 231774 286272 318182 345484 385724 436302 475095 479643 442033 368389 271024 161172
$$ packed form
34865a77105K9150L074l3956n3025m1487j5599J253L592J714L167N635N089K547
34852b65951J830N190J1876J8032J8165J0056j349q267r732j3949k7874m6149
34840c08122n5204m9424l8574l5355l9208l8416k6506q753Q109K3620L6907M1296
34828d89630L3581K2209J6255J0645n448k6495l0991r011K1443L3839K2151K341
34816c99111j0099j3827j3612q851M143K2415L4811L1712J4442o537k2029l0592
34804c97135l4563l3559k5948j5143q896j0483j4075j1459j514R517J6394K1002
34792e05862K8593L8736M3265L6744K7498L2004N5847Q5768J04325J06766R7968
34781A51652Q0122N4498L1910K7302M0240N0578L8793M548l7610p3644r7365j09852
$$ plain form
34769 161172 44017 -79693 -203420 -307427 -366706 -367221 -312839 -220815 -116802 -30002 19658
34758 19658 35160 37909 45960 59841 70079 71526 66421 58718 50441 40634 24185 -5110 -45869
34745 -45869 -85315 -108460 -111304 -103060 -96129 -95690 -98792 -102579 -113328 -146114 -212878 -310084 -419370
34732 -419370 -519325 -594560 -636486 -642960 -619903 -578337 -526215 -465584 -398710 -331254 -264781 -190382
34720 -190382 -97552 8559 102388 153940 151595 110954 62044 26956 8437 -2260 -10782 -14604
34708 -14604 -7360 17592 65002 131210 199583 249808 274079 278851 270670 248852 215270 182395
34696 182395 164662 166762 185137 214116 243112 254007 232871 184768 129991 85685 56587 41425
34684 41425 38813 43929 46373 36931 15363 -10007 -28956 -35540 -29734 -13129 17652 70036 143812
$$ packed form
34769A61172j17155j23710j23727j04007n9279n15N4382R2024J04013Q6800M9660
34758A9658J5502K749Q051J3881J0238J447n105p703q277r807j6449k9295m0759
34745d5869l9446k3145k844Q244O931M39l102l787j0749l2786o6764r7206j09286
34732d19370r9955p5235m1926o474K3057M1566N2122O0631O6874O7456O6473P4399
34720a90382R2830J06111R3829N1552k345m0641m8910l5088j8519j0697q522l822
34708a4604P244K4952M7410O6208O8373N0225K4271M772q181k1818l3582l2875
34696A82395j7733K100J8375K8979K8996J0895k1136m8103n4777m4306k9098j5162
34684D1425k612N116K444r442k1568k5370j8949o584N806J6605L0781N2384P3776
$$ plain form
34671 143812 222529 283169 316387 333669 353441 383412 416956 441707 448093 431875 393064 335286
34659 335286 267634 206380 169900 165849 182687 198017 197472 184138 170390 164992 169677 183597
34647 183597 206026 234602 263041 280754 274863 236004 166636 84534 15119 -23125 -28092 -11464
34635 -11464 10642 24258 18948 -10597 -60116 -114233 -153999 -169446 -166212 -161169 -171885 -207062
34623 -207062 -262065 -321961 -371316 -403266 -419817 -425661 -424599 -420095 -413548 -400870 -376155 -341792
34611 -341792 -311271 -299033 -310162 -340920 -383006 -422306 -438865 -416921 -356050 -268989 -170431
34600 -170431 -72741 10063 63438 82312 77890 72323 85825 124766 176364 214990 219700 189261
34588 189261 139183 84581 28708 -33328 -105764 -188785 -278126 -363326 -428903 -461762 -458335 -424573
$$ packed form
34671A43812P8717O0640L3218J7282J9772K9971L3544K4751O386j6218l8811n7778
34659C35286o7652o1254l6480m051J6838J5330n45j3334j3748n398M685J3920
34647A83597K2429K8576K8439J7713n891l8859o9368q2102o9415l8244m967J6628
34635a1464K2106J3616n310k9545m9519n4117l9766j5447L234N043j0716l5177
34623b07062n5003n9896m9355l1950j6551n844J062M504O547J2678K4715L4363
34611c41792L0521J2238j1129l0758m2086l9300j6559K1944O0871Q7061R8558
34600a70431R7690Q2804N3375J8874m422n567J3502L8941N1598L8626M710l0439
34588A89261n0078n4602n5873o2036p2436q3021q9341q5200o5577l2859L427L3762
$$ plain form
34576 -424573 -372173 -317021 -277190 -265012 -277962 -299705 -312906 -310941 -296572 -271641 -232242 -175429
34564 -175429 -107848 -45210 -4762 -330 -40960 -126429 -240953 -356061 -445284 -497076 -513870
34553 -513870 -502204 -466514 -410364 -340995 -273205 -228034 -221945 -253053 -301078 -345163 -379764 -409753
34541 -409753 -433616 -438169 -410073 -348614 -267608 -187869 -125580 -82583 -48234 -15001 8423 3987
34529 3987 -36537 -103597 -178936 -245495 -289273 -302392 -291118 -275355 -272635 -282936 -292511 -290663
34517 -290663 -278828 -264596 -251971 -239447 -225042 -209875 -195575 -179398 -154827 -118856 -77145
34506 -77145 -39264 -8943 19045 52776 96168 148008 205627 268735 339823 419573 501120 571960
34494 571960 624794 664180 697918 723142 726740 700992 654590 605750 566404 534359 499203 454607
$$ packed form
34576d24573N2400N5152L9831J2178j2950k1743j3201J965J4369K4931L9399N6813
34564a75429O7581O2638M0448M432m0630q5469j14524j15108q9223n1792j6794
34553e13870J1666L5690N6150O9369O7790M5171O089l1108m8025m4085l4601k9989
34541d09753k3863m553K8096O1459Q1006P9739O2289M2997L4349L3233K3424m436
34529C987m0524o7060p5339o6559m3778j3119J1274J5763K720j0301r575J848
34517b90663J1835J4232J2625J2524J4405J5167J4300J6177K4571L5971M1711
34506g7145L7881L0321K7988L3731M3392N1840N7619O3108P1088P9750Q1547P0840
34494E71960N2834L9386L3738K5224L598k5748m6402m8840l9346l2045l5156m4596
$$ plain form
34482 454607 405052 359957 321824 284094 242786 205150 181545 172414 169633 167090 161129 143219
34470 143219 105105 55040 18178 12804 30666 45317 34573 -9057 -81316 -168240 -246391 -290834
34458 -290834 -288725 -245822 -180941 -114374 -57744 -11432 27513 55449 65453 62692 69039 104383
34446 104383 165304 228496 273720 296767 300230 279632 223960 128489 5481 -116869 -207513
34435 -207513 -249987 -251331 -234329 -219902 -215609 -217426 -217166 -205794 -173496 -114136 -34973 39361
34423 39361 79561 74768 43816 20349 25071 52303 80958 95108 95317 95049 106531 125419 128136
34410 128136 89502 6457 -98088 -196313 -277224 -347216 -415639 -484437 -547966 -597111 -624374
34399 -624374 -629105 -618472 -601997 -585346 -568492 -546551 -512594 -465455 -417825 -391957 -402623 -445286
$$ packed form
34482D54607m9555m5095l8133l7730m1308l7636k3605r131k781k543n961j7910
34470A43219l8114n0065l6862n374J7862J4651j0744m3630p2259q6924p8151m4443
34458b90834K109M2903O4881O6567N6630M6312L8945K7936J0004k761O347L5344
34446A04383O0921O3192M5224K3047L463k0598n5672r5471j23008j22350r0644
34435b07513m2474j344J7002J4427M293j817K60J1372L2298N9360P9163P4334
34423C9361M0200m793l0952k3467M722K7232K8655J4150K09k68J1482J8888K717
34410A28136l8634q3045j04545r8225q0911o9992o8423o8798o3529m9145k7263
34399f24374m731J0633J6475J6651J6854K1941L3957M7139M7630K5868j0666m2663
$$ plain form
34387 -445286 -501166 -548713 -568883 -548821 -490183 -412233 -340295 -290787 -268303 -269964 -284837 -293781
34375 -293781 -281376 -250721 -220942 -208984 -217506 -239048 -265701 -294339 -327932 -373074 -432542 -500052
34363 -500052 -565120 -621032 -664175 -689607 -695095 -687530 -676076 -658652 -624761 -574062 -522729 -486422
34351 -486422 -464169 -444345 -419664 -389060 -349624 -295522 -224856 -142438 -55715 28507 103885
34340 103885 164350 204447 218838 203535 160097 97574 28493 -36310 -88783 -123184 -137509
34329 -137509 -133912 -115757 -85867 -49476 -17189 -2715 -17245 -63912 -133086 -202361 -246953 -254747
34317 -254747 -230280 -184850 -129643 -81144 -63542 -94579 -170420 -271954 -383657 -496480 -592600
34306 -592600 -641072 -619081 -535233 -426745 -335134 -285599 -281828 -309382 -342353 -355553 -339251
$$ packed form
34387d45286n5880m7547k0170K0062N8638P7950P1938M9508K2484j661j4873q944
34375b93781J2405L0655K9779J1958q522k1542k6653k8638l3593m5142n9468o7510
34363e00052o5068n5912m3143k5432n488P565J1454J7424L3891N0699N1333L6307
34351d86422K2253J9824K4681L0604L9436N4102P0666Q2418Q6723Q4222P5378
34340A03885O0465M0097J4391j5303m3438o2523o9081o4803n2473l4401j4325
34329a37509L597J8155K9890L6391L2287J4474j4530m6667o9174o9275m4592p794
34317b54747K4467M5430N5207M8499J7602l1037p5841j01534j11703j12823r6120
34306e92600m8472K1991Q3848J08488R1611M9535L771k7554l2971j3200J6302
$$ plain form
34295 -339251 -304235 -270256 -247144 -226266 -190997 -136943 -82235 -56041 -74549 -127483 -188028
34284 -188028 -234268 -259381 -263764 -244715 -199596 -137198 -78502 -41289 -25373 -15661 2468 35073
34272 35073 84635 153643 236843 314033 359077 358318 316597 245580 152820 45545 -61147 -148056
34260 -148056 -203915 -228954 -226913 -199461 -150460 -90224 -30464 23285 70896 111435 142326 164330
34248 164330 182696 201941 222828 246395 277821 322636 379030 435040 472669 475031 433666 353787
34236 353787 252818 150496 58195 -22368 -91837 -148228 -190142 -221496 -249348 -277181 -302975
34225 -302975 -324835 -346353 -373528 -405556 -429983 -428861 -390826 -318199 -224114 -124684 -33608 39239
34213 39239 88548 115292 126918 133297 140038 144643 139848 122004 96552 74723 64463 64386 65625
$$ packed form
34295c39251L5016L3979K3112K0878L5269N4054N4708K6194j8508n2934o0545
34284a88028m6240k5113m383J9049M5119O2398N8696L7213J5916R712J8129L2605
34272C5073M9562O9008Q3200P7190M5044p59m1721p1017r2760j07275j06692q6909
34260a48056n5859k5039K041K7452M9001O0236N9760N3749M7611M0539L0891K2004
34248A64330J8366J9245K0887K3567L1426M4815N6394N6010L7629K362m1365p9879
34236C53787j00969j02322r2301q0563o9469n6391m1914l1354k7852k7833k5794
34225c02975k1860k1518k7175l2028k4427J122L8035P2627R4085R9430R1076P2847
34213C9239M9309K6744J1626O379O741M605m795j7844k5452k1829j0260p7J239
$$ plain form
34200 65625 58800 40558 15655 -7862 -29031 -60834 -123065 -223619 -346068 -457773 -531802
34189 -531802 -562625 -564224 -556204 -550204 -544871 -531253 -503998 -468468 -436786 -417534 -410861 -413361 -425543
34176 -425543 -453795 -506203 -585387 -680838 -765730 -805760 -779659 -696373 -591930 -506667 -462217
34165 -462217 -455956 -471991 -494585 -513766 -524318 -523894 -512615 -492875 -468068 -440393 -409128 -371954
34153 -371954 -330270 -293684 -276299 -285515 -315078 -351605 -387760 -426729 -474051 -528161 -580015 -619454
34141 -619454 -640682 -644129 -635208 -619525 -597044 -562649 -515555 -467833 -440184 -446996 -485067 -536338
34129 -536338 -580896 -608446 -619664 -617890 -599848 -555140 -475803 -366588 -245590 -134709 -48677
34118 -48677 8932 41460 52481 43854 19673 -11110 -39589 -63591 -84895 -99140 -95175 -70291
$$ packed form
34200F5625o825j8242k4903k3517k1169l1803o2231j00554j22449j11705p4029
34189e31802l0823j599Q020O000N333J3618K7255L5530L1682J9252O673k500j2182
34176d25543k8252n2408p9184r5451q4892m0030K6101Q3286J04443Q5263M4450
34165d62217O261j6035k2594j9181j0552M24J1279J9740K4807K7675L1265L7174
34153c71954M1684L6586J7385r216k9563l6527l6155l8969m7322n4110n1854l9439
34141f19454k1228l447Q921J5683K2481L4395M7094M7722K7649o812l8071n1271
34129e36338m4558k7550j1218J774J8042M4708P9337J09215J20998J10881Q6032
34118d8677N7609L2528J1021q627k4181l0783k8479k4002k1304j4245L965K4884
$$ plain form
34106 -70291 -42591 -39615 -71468 -118897 -150569 -149979 -123877 -88224 -52279 -18959 3150 -4265
34094 -4265 -56034 -146802 -251433 -342457 -403239 -423725 -392462 -303814 -173912 -40812 57940
34083 57940 108026 118869 106419 79661 41601 -3666 -49738 -92911 -134586 -175868 -210401 -225805
34071 -225805 -214808 -184346 -151226 -127138 -107885 -78352 -29776 26644 64558 63386 24759 -33513
34059 -33513 -98108 -170028 -254154 -346654 -437387 -519189 -588719 -642951 -683440 -721638 -769168 -819875
34047 -819875 -848975 -834485 -776006 -691802 -604361 -532043 -486727 -470006 -471013 -472012 -457346 -418285
34035 -418285 -354605 -275325 -194970 -125572 -73820 -46082 -48617 -76367 -106856 -115612 -99428 -78919
34023 -78919 -77283 -100825 -138984 -175673 -198516 -205193 -207979 -229156 -284296 -366730 -449705 -505559
$$ packed form
34106g0291K7700K976l1853m7429l1672N90K6102L5653L5945L3320K2109p415
34094d265n1769r0768j04631r1024o0782k0486L1263Q8648J29902J33100R8752
34083E7940N0086J0843j2450k6758l8060m5267m6072m3173m1675m1282l4533j5404
34071b25805J0997L0462L3120K4088J9253K9533M8576N6420L7914j172l8627n8272
34059c3513o4595p1920q4126r2500r0733q1802o9530n4232m0489l8198m7530n0707
34047h19875k9100J4490N8479Q4204Q7441P2318M5316J6721j007r99J4666L9061
34035d18285O3680P9280Q0355O9398N1752K7738k535k7750l0489q756J6184K0509
34023g8919J636k3542l8159l6689k2843o677k786k1177n5140q2434q2975n5854
$$ plain form
34011 -505559 -525119 -522236 -521781 -541431 -581165 -627387 -665377 -687319 -690893 -674301 -634050 -566014
33999 -566014 -469009 -350735 -230512 -130697 -60356 -8445 43612 103038 161013 204342 227817
33988 227817 235805 236261 234739 231622 224034 212158 203438 206996 222437 237422 238936 225191 204778
33975 204778 186935 175776 171480 171664 170493 159994 134675 94440 43432 -12081 -65372 -112642
33963 -112642 -156614 -204134 -257095 -305999 -334580 -332002 -301515 -258982 -223654 -207708 -210404 -219886
33951 -219886 -221681 -208734 -186007 -165379 -154037 -147217 -134577 -115011 -102362 -113010 -148833 -195657
33939 -195657 -237614 -268948 -291542 -305842 -307047 -287776 -242355 -170657 -80211 16226 106567 182988
33927 182988 241264 279495 296922 290001 249626 168100 52055 -75368 -188707 -274603 -332116
$$ packed form
34011e05559j9560K883M55j9650l9734m6222l7990k1942l574J6592M0251O8036
33999e66014R7005J18274J20223R9815P0341N1911N2057N9426N7975M3329K3475
33988B27817P988M56j522l117p588j1876q720L558J5441J4985J514j3745k0413
33975B04778j7843j1159m296J84j171j0499k5319m0235n1008n5513n3291m7270
33963a12642m3972m7520n2961m8904k8581K578L0487M2533L5328J5946k696r482
33951b19886j795J2947K2727K0628J1342O820J2640J9566J2649j0648l5823m6824
33939a95657m1957l1334k2594j4300j205J9271M5421P1698R0446R6437R0341P6421
33927A82988N8276L8231J7427o921m0375q1526j16045j27423j13339q5896n7513
$$ plain form
33916 -332116 -365788 -383740 -397359 -414556 -433745 -449851 -464977 -486416 -513060 -529694 -518410
33905 -518410 -474350 -409873 -345617 -297497 -269023 -253694 -243789 -235100 -222765 -196749 -146369 -69357
33893 -69357 25239 121143 200002 246971 257672 240276 208603 175309 153361 156860 190758 240772
33881 240772 281406 294856 277397 231085 160484 79416 10554 -28000 -31704 -4644 45497 103759
33869 103759 148922 167860 166463 160553 158106 154118 138898 105970 54960 -6569 -64020 -102810
33857 -102810 -115555 -101802 -63958 -6890 60473 126915 182026 216225 220427 189464 126109 41201
33845 41201 -48963 -126006 -174963 -190020 -175026 -140229 -101842 -80807 -90527 -121220 -144771 -142536
33833 -142536 -124184 -113778 -122649 -143168 -164627 -184701 -203726 -214663 -203509 -160687 -93628 -27053
$$ packed form
33916c32116l3672j7952j3619j7197j9189j6106j5126k1439k6644j6634J1284
33905e18410M4060O4477O4256M8120K8474J5329R905Q689J2335K6016N0380P7012
33893f9357R4596R5904P8859M6969J0701j7396l1673l3294k1948L499L3898N0014
33881B40772M0634J3450j7459m6312p0601q1068o8862l8554l704K7060N0141N8262
33869A03759M5163J8938j397n910k447l988j5220l2928n1010o1529n7451l8790
33857a02810j2745J3753L7844N7068O7363O6442N5111L4199M202l0963o3355q4908
33845D1201r0164p7043m8957j5057J4994L4797L8387K1035r720l0693k3551K235
33833a42536J8352J0406q871k0519k1459k0074j9025j0937J1154M2822O7059O6575
$$ plain form
33821 -27053 15680 34994 53793 90466 139401 182050 207338 211717 188507 133690 61544 241
33809 241 -31741 -35854 -20019 12636 57166 99956 127200 136252 134394 130370 128876 126650 110620
33796 110620 67128 -969 -70281 -114252 -121565 -96379 -49182 5155 46114 55750 31448 -12630
33784 -12630 -56902 -87328 -98062 -89501 -67019 -41446 -29144 -47284 -103263 -187411 -279958 -366351
33772 -366351 -442586 -506938 -555248 -588899 -620641 -665018 -724882 -791344 -853406 -902445 -930537
33761 -930537 -931281 -902320 -843384 -754188 -639621 -515709 -404040 -318111 -257221 -213003 -179373
33750 -179373 -157503 -153494 -167995 -184353 -172374 -113805 -25457 49603 75781 46489 -24042 -117889
33738 -117889 -217379 -302261 -354858 -368397 -345674 -291982 -215414 -132532 -65339 -28389 -21873 -40184
$$ packed form
33821b7053M2733J9314J8799L6673M8935M2649K5288M379k3210n4817p2146o1303
33809B41l1982m113J5835L2655M4530M2790K7244R052j858m024j494k226j6030
33796A10620m3492o8097o9312m3971p313K5186M7197N4337M0959R636k4302m4078
33784a2630m4272l0426j0734Q561K2482K5573J2302j8140n5979q4148r2547q6393
33772c66351p6235o4352m8310l3651l1742m4377n9864o6462o2062m9039k8092
33761i30537p44K8961N8936Q9196J14567J23912J11669Q5929O0890M4218L3630
33750a79373K1870M009j4501j6358J1979N8569Q8348P5060K6178k9292p0531r3847
33738a17889r9490q4882n2597j3539K2723N3692P6568Q2882O7193L6950O516j8311
$$ plain form
33726 -40184 -84699 -163526 -276451 -400708 -494372 -519377 -468079 -371260 -278832 -228068 -225812
33715 -225812 -257660 -310632 -384118 -479619 -585159 -675571 -729155 -741282 -721263 -679994 -623273
33704 -623273 -553428 -472226 -382889 -293377 -216946 -164047 -132076 -107259 -78774 -48029 -23330
33693 -23330 -11025 -15523 -42355 -93378 -159758 -226605 -286429 -343748 -404724 -466152 -516930 -547432
33681 -547432 -555372 -545705 -528159 -512751 -503176 -493643 -474355 -441244 -400404 -364335 -344952 -347789
33669 -347789 -368362 -392834 -405911 -402717 -394228 -398590 -423300 -453559 -458958 -415151 -322712 -207031
33657 -207031 -100842 -26017 12426 21859 15010 3176 -9521 -26042 -48942 -74868 -100081 -129574
33645 -129574 -174161 -236347 -303554 -357966 -389378 -395835 -377334 -336515 -284880 -240978 -218106 -215257
$$ packed form
33726d0184m4515p8827j12925j24257r3664k5005N1298R6819R2428N0764K256
33715b25812l1848n2972p3486r5501j05540r0412n3584j2127K0019M1269N6721
33704f23273O9845Q1202Q9337Q9512P6431N2899L1971K4817K8485L0745K4699
33693b3330J2305m498k6832n1023o6380o6847n9824n7319o0976o1428n0778l0502
33681e47432p940R667J7546J5408R575R533J9288L3111M0840L6069J9383k837
33669c47789k0573k4472j3077L194Q489m362k4710l0259n399M3807R2439J15681
33657b07031J06189P4825L8443R433o849j1834j2697j6521k2900k5926k5213k9493
33645a29574m4587o2186o7207n4412l1412o457J8501M0819N1635M3902K2872K849
$$ plain form
33633 -215257 -221234 -225512 -223904 -215963 -199409 -167457 -112420 -34801 49788 116005 145947 142761
33621 142761 125486 108776 87546 41803 -43350 -161353 -285626 -386830 -450800 -482192 -492358
33610 -492358 -485620 -459794 -419591 -384287 -377048 -407246 -466553 -540220 -614923 -674637 -699241 -677720
33598 -677720 -621256 -555522 -499611 -458363 -434165 -435631 -468263 -521773 -573539 -604252 -608666 -595299
33586 -595299 -579243 -570287 -561290 -530473 -462472 -367578 -274673 -204974 -158501 -126540 -108796 -112273
33574 -112273 -137750 -174474 -208276 -230784 -240638 -239954 -231787 -218740 -200818 -174086 -133629 -80395
33562 -80395 -25248 16335 35613 35313 21546 -5862 -49535 -101463 -141526 -155361 -151765 -156799
33550 -156799 -189249 -243470 -294846 -318246 -302501 -254595 -195454 -148779 -127238 -126740 -134636 -141244
$$ packed form
33633b15257n977m278J608P941J6554L1952N5037P7619Q4589O6217K9942l186
33621A42761j7275j6710k1230m5743q5153j18003j24273j01204o3970l1392j0166
33610d92358O738K5826M0203L5304P239l0198n9307p3667p4703n9714k4604K1521
33598f77720N6464O5734N5911M1248K4198j466l2632n3510n1766l0713m414J3367
33586e95299J6056Q956Q997L0817O8001R4894R2905O9699M6473L1961J7744l477
33574a12273k5477l6724l3802k2508r854O84Q167J3047J7922K6732M0457N3234
33562h0395N5147M1583J9278l00j3767k7408m3673n1928m0063j3835L596n034
33550a56799l2450n4221n1376k3400J5745M7906N9141M6675K1541M98p896o608
$$ plain form
33538 -141244 -139569 -116786 -57144 38760 141834 211529 228133 204308 164289 118503 62588
33527 62588 -5361 -77084 -145352 -215226 -297069 -388453 -467491 -507120 -495660 -442354 -364425 -272482
33515 -272482 -169834 -62406 35077 103244 128165 111554 75397 52575 63477 98795 130313
33504 130313 140046 133220 122510 110498 94849 81904 82813 98763 121511 149188 190558 248772
33492 248772 308283 343952 340298 299729 237474 172908 120315 79252 32513 -41314 -149445
33481 -149445 -277734 -399861 -492051 -541676 -548107 -520104 -471906 -417660 -365830 -317798 -272043
33470 -272043 -228977 -190864 -158751 -132658 -114933 -110198 -120924 -145784 -182678 -228847 -275940 -310229
33458 -310229 -322409 -313785 -288068 -240546 -162312 -54805 64831 172440 247136 276261 258446
$$ packed form
33538a41244J675K2783N9642R5904J03074O9695J6604k3825m0019m5786n5915
33527F2588o7949p1723o8268o9874q1843r1384p9038l9629J1460N3306P7929R1943
33515b72482J02648J07428R7483O8167K4921j6611l6157k2822J0902L5318L1518
33504A30313R733o826j0710j2012j5649j2945R09J5950K2748K7677M1370N8214
33492B48772N9511L5669l654m0569o2255o4566n2593m1063m6739p3827j08131
33481a49445j28289j22127r2190m9625o431K8003M8198N4246N1830M8032M5755
33470b72043M3066L8113L2113K6093J7725M735j0726k4860l6894m6169m7093l4289
33458c10229j2180Q624K5717M7522P8234J07507J19636J07609P4696K9125j7815
$$ plain form
33447 258446 203792 126717 38292 -50727 -122681 -158915 -156657 -134336 -116872 -118923 -141545 -176077
33435 -176077 -206234 -213198 -187163 -134479 -71417 -12679 33789 66289 87835 102151 108580 104316
33423 104316 93501 88347 96323 110536 119060 121658 131008 157170 195563 231702 255246 267836
33411 267836 277663 287220 288485 272156 239210 198139 151609 93384 21164 -54189 -117115 -160682
33399 -160682 -187879 -205357 -221709 -247398 -288730 -342546 -400654 -456068 -499898 -517180 -495868
33388 -495868 -440922 -372624 -309047 -254351 -203898 -154314 -106113 -61383 -23383 2162 7260 -15380
33376 -15380 -66595 -135746 -203451 -252428 -275392 -273006 -250493 -220976 -205779 -220726 -260629 -303171
33364 -303171 -328723 -332003 -316719 -288128 -253368 -220946 -193848 -166397 -132193 -93691 -62047 -49644
$$ packed form
33447B58446n4654p7075q8425q9019p1954l6234K258K2321J7464k051k2622l4532
33435a76077l0157o964K6035N2684O3062N8738M6468L2500K1546J4316O429m264
33423A04316j0815n154P976J4213Q524K598R350K6162L8393L6139K3544J2590
33411B67836R827R557J265j6329l2946m1071m6530n8225p2220p5353o2926m3567
33399a60682k7197j7478j6352k5689m1332n3816n8108n5414m3830j7282K1312
33388d95868N4946O8298O3577N4696N0453M9584M8201M4730L8000K5545N098k2640
33376a5380n1215o9151o7705m8977k2964K386K2513K9517J5197j4947l9903m2542
33364c03171k5552l280J5284K8591L4760L2422K7098K7451L4204L8502L1644J2403
$$ plain form
33352 -49644 -63691 -103380 -160230 -222665 -282163 -334904 -379523 -417904 -458332 -511803 -580910 -654444
33340 -654444 -715334 -752146 -762511 -751276 -731194 -722796 -745055 -800767 -871762 -930771 -958746 -951607
33328 -951607 -914175 -853416 -779866 -710603 -662867 -641902 -637611 -633475 -615702 -576370 -518182 -460866
33316 -460866 -432841 -445403 -478535 -501583 -505156 -502521 -502300 -494434 -466970 -424170 -380218 -343652
33304 -343652 -316288 -300946 -300428 -311573 -328388 -350290 -381325 -421988 -466414 -506011 -530990 -530636
33292 -530636 -499547 -445578 -387336 -341566 -313605 -297580 -281490 -253636 -211363 -166847 -140368
33281 -140368 -143724 -170656 -204403 -232024 -249034 -252863 -237787 -199057 -139206 -66224 14376 101672
33269 101672 191945 273064 330253 355514 347850 307843 240372 162812 99932 63222 40206 11536
$$ packed form
33352d9644j4047l9689n6850o2435n9498n2741m4619l8381m0428n3471o9107p3534
33340f54444o0890l6812j0365J1235K0082Q398k2259n5712p0995n9009k7975P139
33328i51607L7432O0759P3550O9263M7736K0965M291M136J7773L9332N8188N7316
33316d60866K8025j2562l3132k3048l573K635K21P866K7464M2800M3952L6566
33304c43652K7364J5342N18j1145j6815k1902l1035m0663m4426l9597k4979L54
33292e30636L1089N3969N8242M5770K7961J6025J6090K7854M2273M4516K6479
33281a40368l356k6932l3747k7621j7010l829J5076L8730N9851P2982Q0600Q7296
33269A01672R0273Q1119N7189K5261p664m0007o7471p7560o2880l6710k3016k8670
$$ plain form
33257 11536 -24542 -52867 -65166 -73538 -96477 -138090 -186419 -227638 -254809 -264560 -254384 -228028
33245 -228028 -198487 -178229 -165924 -148472 -118994 -89060 -78744 -96019 -129690 -161567 -180826
33234 -180826 -186152 -179909 -165167 -146839 -131271 -122900 -122001 -126263 -134433 -147490 -164532 -177664 -175295
33221 -175295 -154735 -129106 -115310 -114032 -107112 -77676 -29763 13633 28304 3178 -56889 -136424
33209 -136424 -218168 -290012 -343563 -367545 -349690 -290159 -209021 -134273 -83995 -64277 -79555
33198 -79555 -133475 -216137 -298493 -347376 -346670 -302387 -230125 -142512 -49795 31865 79806 78193
33186 78193 33040 -28931 -78879 -103467 -106181 -97246 -85634 -76018 -66755 -51926 -31588 -20196
33174 -20196 -38088 -91038 -161707 -223883 -262092 -275235 -266487 -237070 -190236 -135027 -81538 -33579
$$ packed form
33257A1536l6078k8325j2299q372k2939m1613m8329m1219k7171r751J0176K6356
33245b28028K9541K0258J2305J7452K9478K9934J0316j7275l3671l1877j9259
33234a80826n326O243J4742J8328J5568Q371Q99m262q170j3057j7042j3132K369
33221a75295K0560K5629J3796J278O920K9436M7913M3396J4671k5126o0067p9535
33209a36424q1744p1844n3551k3982J7855N9531Q1138P4748N0278J9718j5278
33198g9555n3920q2662q2356m8883P06M4283P2262Q7613R2717Q1660M7941j613
33186G8193m5153o1971m9948k4588k714Q935J1612R616R263J4829K0338J1392
33174b0196j7892n2950p0669o2176l8209j3143Q748K9417M6834N5209N3489M7959
$$ plain form
33162 -33579 11549 56940 102022 143018 172353 176195 139465 61459 -34184 -113519 -160546 -187789
33150 -187789 -216743 -253647 -289457 -318154 -345798 -380807 -421051 -451853 -453261 -410412 -323192 -208588
33138 -208588 -90804 12091 90433 135850 141106 110626 64851 27420 8743 4686 8073 15977
33126 15977 26097 31782 24723 1572 -35589 -86929 -160097 -262031 -383318 -495886 -572750
33115 -572750 -609634 -622742 -627003 -623154 -605368 -571504 -521544 -454938 -378093 -309087 -264079 -238757
33103 -238757 -211213 -164680 -101122 -31366 39584 111294 176789 220888 231088 207058 159564
33092 159564 103715 53582 18107 -3542 -23108 -55473 -105567 -161528 -201022 -204764 -166053 -92028
33080 -92028 391 91271 165765 218785 251774 266154 262837 247165 228589 212249 193869 165629
$$ packed form
33162c3579M5128M5391M5082M0996K9335L842l6730p8006r5643p9335m7027k7243
33150a87789k8954l6904l5810k8697k7644l5009m0244l0802j408M2849Q7220J14604
33138b08588J17784J02895P8342M5417N256l0480m5775l7431j8677m057L387P904
33126A5977J0120N685p059k3151l7161n1340p3168j01934j21287j12568p6864
33115e72750l6884j3108m261L849J7786L3864M9960O6606P6845O9006M5008K5322
33103b38757K7544M6533O3558O9756P0950P1710O5495M4099J0200k4030m7494
33092A59564n5849n0133l5475k1649j9566l2365n0094n5961l9494l742L8711P4025
33080i2028R2419R0880P4494N3020L2989J4380l317j5672j8576j6340j8380k8240
$$ plain form
33068 165629 124431 72398 14050 -41933 -81881 -96019 -88746 -74156 -60732 -47028 -34783 -38674
33056 -38674 -75458 -145093 -228174 -301701 -352826 -377701 -374854 -347174 -309678 -287458 -298486 -337045
33044 -337045 -377438 -395921 -387049 -358157 -313931 -253577 -181929 -114839 -68510 -45578 -33716 -15719
33032 -15719 19395 69738 120693 154904 167217 168982 174524 184904 188265 173976 141482 95623
33020 95623 38300 -33219 -121354 -221033 -315486 -382263 -409939 -410042 -407762 -419002 -439243 -454157
33008 -454157 -455364 -445047 -432462 -430032 -446472 -476962 -503569 -512373 -509398 -514309 -539174 -578359
32996 -578359 -618040 -648443 -664726 -662121 -635787 -584553 -512314 -426434 -335982 -250022 -175098 -113333
32984 -113333 -63196 -23226 3065 5641 -25664 -90089 -172520 -253999 -324721 -383966 -429654 -454961
$$ packed form
33068A65629m1198n2033n8348n5983l9948j4138P273J4590J3424J3704J2245l891
33056c8674l6784o9635q3081p3527n1125k4875K847K7680L7496K2220j1028l8559
33044c37045m0393j8483Q872K8892M4226O0354P1648O7090M6329K2932J1862J7997
33032a5719L5114N0343N0955L4211J2313J765N542J0380L361j4289l2494m5859
33020I5623n7323p1519q8135r9679r4453o6777k7676j03K280j1240k0241j4914
33008d54157j207J0317J2585K430j6440l0490k6607q804K975m911k4865l9185
32996e78359l9681l0403j6283K605K6334N1234P2239Q5880R0452Q5960P4924O1765
32984a13333N0137L9970K6291K576l1305o4425q2431q1479p0722n9245m5688k5307
$$ plain form
32972 -454961 -458378 -453152 -461538 -497485 -553812 -605408 -626580 -608776 -562831 -504298 -440260 -374182
32960 -374182 -319390 -297338 -318435 -370175 -428470 -476895 -511496 -531910 -534618 -514059 -466298 -393439
32948 -393439 -309055 -237266 -199157 -196704 -212047 -223287 -219342 -200536 -169726 -126233 -68385 -1551
32936 -1551 57066 86003 78373 54850 52899 97401 180345 270411 342963 400882 467263 558693
32924 558693 664972 752899 788757 759317 676980 569855 465548 377012 298420 215828 125139
32913 125139 39858 -19286 -40321 -25097 16849 74783 139305 203665 263118 310741 335869
32902 335869 331139 300191 253851 199292 138272 75625 21613 -18408 -51721 -90404 -137699 -185745
32890 -185745 -224699 -249921 -260994 -258079 -240864 -209051 -162115 -98948 -19427 71424 159621 224600
$$ packed form
32972d54961l417N226q386l5947n6327n1596k1172J7804M5945N8533O4038O6078
32960c74182N4792K2052k1097n1740n8295m8425l4601k0414k708K0559M7761P2859
32948c93439Q4384P1789L8109K453j5343j1240L945J8806L0810M3493N7848O6834
32936a551N8617K8937p630k3523j951M4502Q2944R0066P2552N7919O6381R1430
32924E58693J06279Q7927L5858k9440q2337j07125j04307q8536p8592q2592r0689
32913A25139q5281n9144k1035J5224M1946N7934O4522O4360N9453M7623K5128
32902C35869m730l0948m6340n4559o1020o2647n4012m0021l3313l8683m7295m8046
32890a85745l8954k5222j1073K915J7215L1813M6936O3167P9521R0851Q8197O4979
$$ plain form
32878 224600 249612 232043 183792 123030 66943 27817 7396 -7072 -33476 -75061 -113114
32867 -113114 -124624 -105079 -69297 -33153 -2037 23719 41565 49527 50832 50456 49706 48430 50049
32854 50049 58660 70756 74648 60965 31971 -1695 -33033 -66417 -113693 -182655 -267420 -348175
32842 -348175 -401481 -414883 -394890 -361149 -331113 -308660 -286550 -259274 -232984 -222556 -238383
32831 -238383 -275718 -317691 -349555 -368715 -379052 -378166 -357461 -318216 -281461 -273307 -300143 -343913
32819 -343913 -381687 -402310 -401723 -372371 -308275 -218632 -126056 -47453 18659 83803 153844 225239
32807 225239 292135 350824 398448 433874 461916 492063 529177 567580 598097 619838 640464
32796 640464 663450 678938 671068 634106 579134 524688 482334 451589 427620 412629 418250 454149
$$ packed form
32878B24600K5012j7569m8251o0762n6087l9126k0421j4468k6404m1585l8053
32867a13114j1510J9545L5782L6144L1116K5756J7846P962J305l76p50j276J619
32854E0049Q611J2096L892j3683k8994l3666l1338l3384m7276o8962q4765q0755
32842c48175n3306j3402J9993L3741L0036K2453K2110K7276K6290J0428j5827
32831b38383l7335m1973l1864j9160j0337Q86K0705L9245L6755Q154k6836m3770
32819c43913l7774k0623N87K9352O4096Q9643R2576P8603O6112O5144P0041P1395
32807B25239O6896N8689M7624L5426K8042L0147L7114L8403L0517K1741K0626
32796F40464K2986J5488p870l6962n4972n4446m2354l0745k3969j4991N621L5899
$$ plain form
32784 454149 512452 565188 581042 546956 474208 385869 301237 230688 178729 146568 132736
$$ packed form
32784D54149N8303N2736J5854l4086p2748q8339q4632p0549n1959l2161j3832
$$ [...]
##END NTUPLES=NMR SPECTRUM
##END=
