##TITLE=31Pdec_DE-22_1hrm
 
  24 sc
 31.10.2023
##JCAMPDX= 6.0         $$ Bruker NMR JCAMP-DX V2.0
##DATA TYPE= NMR SPECTRUM
##DATA CLASS= NTUPLES
##ORIGIN= UXNMR, Bruker Analytische Messtechnik GmbH
##OWNER= root
$$ XWIN-NMR		Version 3.5
$$ Tue Oct 31 15:35:10 2023 Russian Standard Time (UT+4h)  she@DPX200
##.OBSERVE FREQUENCY= 81.013821
##.OBSERVE NUCLEUS= ^31P
##.ACQUISITION MODE= SIMULTANEOUS
##.ACQUISITION SCHEME= undefined
##.AVERAGES= 24
##.DIGITISER RES= 16
##SPECTROMETER/DATA SYSTEM= spect
##.PULSE SEQUENCE= zgpg30
##.SOLVENT NAME= CDCl3
##.SHIFT REFERENCE= (INTERNAL, CDCl3, 0, 248.564)
##AUDIT TRAIL= $$ (NUMBER, WHEN, WHO, WHERE, WHAT)
$$ ##TITLE= Audit trail, XWIN-NMR		Version 3.5
$$ ##JCAMPDX= 5.01
$$ ##ORIGIN= Bruker BioSpin GmbH
$$ ##OWNER= she
$$ F:/spectra/data/she/nmr/P31/1/pdata/1/auditp.txt
$$ ##AUDIT TRAIL=  $$ (NUMBER, WHEN, WHO, WHERE, WHAT)
(   1,<2023-10-31 15:34:11.84 +0400>,<she>,<DPX200>,
      <created by zg, POWCHK disabled, PULCHK disabled
       configuration hash MD5:
       00 E9 B6 7A A2 85 ED C7 34 08 36 98 17 FE 4E 26
       data hash MD5: 32K
       3B 50 79 30 96 24 93 7E 16 89 E8 23 F4 3B 7D D7>)
(   2,<2023-10-31 15:34:14.20 +0400>,<she>,<DPX200>,
      <Start of raw data processing
       efp BC_mod = 2 LB = 5 FT_mod = 6 PKNL = 1 PHC0 = -10696.83 PHC1 = 140.6902 SI = 64K 
       data hash MD5: 64K
       7E 95 4F 50 E2 D7 59 11 63 31 11 7B E1 A5 46 E4>)
(   3,<2023-10-31 15:34:29.06 +0400>,<she>,<DPX200>,
      <pk PHC0 = 5.261086 PHC1 = -2 
       data hash MD5: 64K
       73 1D FD 72 3A 47 A8 E1 1F 18 8F 68 28 99 1F 6F>)
(   4,<2023-10-31 15:34:32.32 +0400>,<she>,<DPX200>,
      <abs ABSG = 5 
       data hash MD5: 64K
       04 EC 20 3C AA FB 68 19 38 83 5C A5 DE 37 9E A2>)
$$ ##END=
$$ 
$$ hash MD5
$$ 1F 3E 1E FF C3 3A 8E 1F C1 1D 7E C2 AD 91 1F 8E
##$RELAX= 
##$RELAX= 
##$RELAX= 
##$RELAX= 
##$RELAX= 
##$RELAX= 
##$RELAX= 
##$RELAX= 
##$RELAX= 
$$ Bruker specific parameters
$$ --------------------------
##$DU= <F:/spectra>
##$EXPNO= 1
##$NAME= <P31>
##$PROCNO= 1
##$TYPE= <nmr>
##$USER= <she>
##$AMP= (0..31)
100 100 100 100 100 100 100 100 100 100 100 100 100 100 100 100 100 100 
100 100 100 100 100 100 100 100 100 100 100 100 100 100 
##$AQSEQ= 0
##$AQ_mod= 1
##$AUNM= <au_zg>
##$AUTOPOS= <>
##$BF1= 81.014009
##$BF2= 200.13
##$BF3= 200.13
##$BF4= 200.13
##$BF5= 200.13
##$BF6= 200.13
##$BF7= 200.13
##$BF8= 200.13
##$BYTORDA= 1
##$CFDGTYP= 0
##$CFRGTYP= 5
##$CHEMSTR= <none>
##$CNST= (0..31)
1 1 145 1 1 1 1 1 1 1 1 1 1 1 1 1 1 1 1 1 1 1 1 1 1 1 1 1 1 1 1 1 
##$CPDPRG= <waltz16>
##$CPDPRG1= <>
##$CPDPRG2= <waltz16>
##$CPDPRG3= <>
##$CPDPRG4= <mlev>
##$CPDPRG5= <mlev>
##$CPDPRG6= <mlev>
##$CPDPRG7= <mlev>
##$CPDPRG8= <mlev>
##$CPDPRGB= <>
##$CPDPRGT= <>
##$D= (0..31)
0 1 0 0 0 0 0 0 0 0 0 0.03 2e-05 3e-06 0 0 0 0 0 0 0 0 0 0 0 0 0 0 0 0 
0 0 
##$DATE= 1698752051
##$DBL= (0..7)
120 120 120 11 120 120 24 19 
##$DBP= (0..7)
150 150 150 150 150 150 150 150 
##$DBP07= 0
##$DBPNAM0= <>
##$DBPNAM1= <>
$$ [...]
##$SUBNAM3= <"">
##$SUBNAM4= <"">
##$SUBNAM5= <"">
##$SUBNAM6= <"">
##$SUBNAM7= <"">
##$SUBNAM8= <"">
##$SUBNAM9= <"">
##$SW= 501.771253377433
##$SWIBOX= (0..15)
0 1 3 0 0 0 0 0 0 0 0 0 0 0 0 0 
##$SW_h= 40650.406504065
##$TD= 32768
##$TD0= 1
##$TE= 0
##$TE2= 300
##$TE3= 300
##$TEG= 300
##$TL= (0..7)
0 120 53 12 22 120 120 120 
##$TP= (0..7)
150 150 150 150 150 150 150 150 
##$TP07= 0
##$TPNAME0= <>
##$TPNAME1= <>
##$TPNAME2= <>
##$TPNAME3= <>
##$TPNAME4= <>
##$TPNAME5= <>
##$TPNAME6= <>
##$TPNAME7= <>
##$TPOAL= (0..7)
0.5 0.5 0.5 0.5 0.5 0.5 0.5 0.5 
##$TPOFFS= (0..7)
0 0 0 0 0 0 0 0 
##$TUNHIN= 0
##$TUNHOUT= 0
##$TUNXOUT= 0
##$USERA1= <user>
##$USERA2= <user>
##$USERA3= <user>
##$USERA4= <user>
##$USERA5= <user>
##$V9= 5
##$VALIST= <valist>
##$VCLIST= <CCCCCCCCCCCCCCC>
##$VD= 0
##$VDLIST= <DDDDDDDDDDDDDDD>
##$VPLIST= <PPPPPPPPPPPPPPP>
##$VTLIST= <TTTTTTTTTTTTTTT>
##$WBST= 1024
##$WBSW= 4
##$XGAIN= (0..3)
0 0 0 0 
##$XL= 0
##$YL= 0
##$YMAX_a= 13387
##$YMIN_a= -10706
##$ZGOPTNS= <>
##$ZL1= 120
##$ZL2= 120
##$ZL3= 120
##$ZL4= 120
##$ABSF1= 248.5645
##$ABSF2= -253.2056
##$ABSG= 5
##$ABSL= 3
##$ALPHA= 0
##$AQORDER= 0
##$ASSFAC= 0
##$ASSFACI= 0
##$ASSFACX= 0
##$ASSWID= 0
##$AUNMP= <proc_1d>
##$AZFE= 0.1
##$AZFW= 0.5
##$BCFW= 0
##$BC_mod= 2
##$BYTORDP= 0
##$COROFFS= 0
##$CY= -3
##$DATMOD= 1
##$DC= 0
##$DFILT= <>
##$DTYPP= 0
##$F1P= 0
##$F2P= 0
##$FCOR= 1
##$FTSIZE= 65536
##$FT_mod= 6
##$GAMMA= 0
##$GB= 0
##$INTBC= 1
##$INTSCL= 6.047779e-11
##$ISEN= 30
##$LB= 5
##$LEV0= 0
##$LPBIN= 0
##$MAXI= 10000
##$MC2= 0
##$MEAN= 0
##$ME_mod= 0
##$MI= 50
##$NCOEF= 0
##$NC_proc= -6
##$NLEV= 6
##$NOISF1= 182.463
##$NOISF2= 159.3651
##$NSP= 0
##$NTH_PI= 0
##$NZP= 0
##$OFFSET= 248.5645
##$PC= 4
##$PHC0= -10691.57
##$PHC1= 138.6902
##$PH_mod= 1
##$PKNL= yes
##$PPARMOD= 0
##$PSCAL= 0
##$PSIGN= 0
##$REVERSE= no
##$SF= 81.0140089999694
##$SI= 65536
##$SIGF1= 159.3651
##$SIGF2= -187.1042
##$SINO= 113.3802
##$SIOLD= 16384
##$SREGLST= <1H.CDCl3>
##$SSB= 0
##$STSI= 65536
##$STSR= 0
##$SW_p= 40650.406504065
##$SYMM= 0
##$S_DEV= 0
##$TDeff= 32768
##$TDoff= 0
##$TI= <>
##$TILT= no
##$TM1= 0
##$TM2= 0
##$TOPLEV= 0
##$USERP1= <user>
##$USERP2= <user>
##$USERP3= <user>
##$USERP4= <user>
##$USERP5= <user>
##$WDW= 1
##$XDIM= 65536
##$YMAX_p= 407631873
##$YMIN_p= -11349986
$$ End of Bruker specific parameters
$$ ---------------------------------
##NTUPLES= NMR SPECTRUM
##VAR_NAME=  FREQUENCY,     SPECTRUM/REAL,   SPECTRUM/IMAG
##SYMBOL=    X,             R,               I
##VAR_TYPE=  INDEPENDENT,   DEPENDENT,       DEPENDENT
##VAR_FORM=  AFFN,          ASDF,            ASDF
##VAR_DIM=   65536,         65536,           65536
##UNITS=     HZ,            ARBITRARY UNITS, ARBITRARY UNITS
##FACTOR=    0.620285442955139, 1,           1
##FIRST=     20137.2065510682, 0,            0
##LAST=      -20513.1999529968, 0,           0
##MIN=       -20513.1999529968, -11349986,   0
##MAX=       20137.2065510682, 407631873,    0
$$ Real data points
##PAGE= N=1
##DATA TABLE= (X++(R..R)), XYDATA
$$ [...]
39114g9312Q3116J70462J93896J57561R7486N4015L7294K5941J583k7047m0992
39103F74003l9351l7077m1756m8412n5128o7435q4072r2771q6854p4621o4034
39092a7508m8035j6781K0452L8060K0519j9741n1288m7645n885N2565J00231J26481
39080A51425J40815J52801J56462J41994J16871J03770J17352J50214J80247J84577
39070A596528J50733Q7337K5030o058n625k443k1640o1542j05188j41846j68636
39059A346650j81076j74225j49503j11436o0870l24N5838Q5921P8625M3592M227
39048I37419j9042k2541k0819l2751o3724j02715j34895j49749j36902q7143o115
39037A61023Q1546J50666J91303J98991J62897Q2891o972n6176m8488k2373l1639
$$ y = [-79312, 3804, 174266, 368162, 525723, 623209, 677224, 714518, 740459, 742042, 714995, 674003, 634652, 597575, 555819, 507407, 452279, 384844, 300772, 208001, 121147, 46526, -17508, -65543, -82324, -61872, -23812, -3293, -23034, -74322, -121967, -127852, -75287, 24944, 151425, 292240, 445041, 601503, 743497, 860368, 964138, 1081490, 1231704, 1411951, 1596528, 1747261, 1834598, 1859628, 1853570, 1847945, 1845502, 1823862, 1762320, 1657132, 1515286, 1346650, 1165574, 991349, 841846, 730410, 669540, 669216, 725054, 810975, 889600, 933192, 937419, 918377, 895836, 875017, 842266, 778542, 675827, 540932, 391183, 254281, 167138, 161023, 242569, 393235, 584538, 783529, 946426, 1029317, 1022345, 966169, 917681, 895308, 863669]
39026H63669r2087j71128k20664k13426j56632q3560l2132k2128m6209q1218j07661
39015c63176j19270j17801j02990p0198j9193L6234P3120P8475O1281M1422K9320
39004d72776K1660J3548N473k522j4006k7265k7427N861P9649J74265K48388K64562
38992B69410K19670J50891J03809R1775R1022P4828M3271J6641R806K1522M2977
38981A135622O6456Q5956R7893J04266J09877J11685R2650L2406p0480j86221
38971A580110k68078k84239k38062j59289p9758j8387J8955L5188L7459L0379
38961F54278J3920p261j6863j19L5946O6853P8259P8212P7562P1057M7821R909
38949A109574l3173q0914j35163j78795j81537j36651p8670n1301o2603q2921
$$ y = [863669, 771582, 600454, 379790, 166364, 9732, -73828, -105960, -128088, -174297, -255515, -363176, -482446, -600247, -703237, -773435, -792628, -756394, -683274, -604799, -543518, -502096, -472776, -451116, -437568, -432095, -434617, -448623, -475888, -503315, -497454, -417805, -243540, 4848, 269410, 489080, 639971, 743780, 835555, 926577, 1001405, 1044676, 1061317, 1071123, 1092645, 1135622, 1202078, 1288034, 1385927, 1490193, 1600070, 1711755, 1804405, 1836811, 1766331, 1580110, 1312032, 1027793, 789731, 630442, 550684, 532297, 551252, 586440, 623899, 654278, 668198, 660937, 644074, 643955, 679901, 746754, 825013, 903225, 980787, 1051844, 1099665, 1109574, 1076401, 995487, 860324, 681529, 499992, 363341, 284671, 233370, 170767, 87846]
38939H7846q4568p1482o7014q1989j01888j02277p2035k2954K0019L8966L6401
38928d20975K8833K7739L0802L2166L2523L2270K3020k06k0207p282M5902J10130
38916h5285J47916J47577J22291Q6062M3581q90l8363o1318o8999o7405o8317
38905A56850q3776j14256j45259j61250j58390j38877j03201n8808k5918j8037
38895h50922k3359k3717k6016n1587r5229j21268j07275o8231k7732J1103N1182
38884a333051Q0275Q5717P5619O4987N3283L6986L2178N7552R9435J20262J03260
38873e23497O5977K7593j1825n1714p5925p5063o7880p9667j04868j08179o3182
38862a068230K0714J09168J69635J83892J44365N2175p3164j85609k28728j75393
$$ y = [87846, 3278, -68204, -135218, -217207, -319095, -421372, -493407, -516361, -496342, -457376, -420975, -392142, -364403, -333601, -301435, -268912, -236642, -213622, -213828, -234035, -241317, -195415, -85285, 62631, 210208, 332499, 418561, 462142, 461252, 422889, 361571, 292572, 225167, 156850, 73074, -41182, -186441, -347691, -506081, -644958, -748159, -806967, -832885, -850922, -874281, -897998, -924014, -975601, -1070830, -1192098, -1299373, -1367604, -1395336, -1384233, -1333051, -1252776, -1167059, -1091440, -1026453, -973170, -936184, -904006, -846454, -747019, -626757, -523497, -457520, -429927, -441752, -493466, -569391, -644454, -712334, -792001, -896869, -1005048, -1068230, -1047516, -938348, -768713, -584821, -440456, -388281, -461445, -647054, -875782, -1051175]
38852a051175n4770O7291J39541J57350J49684J45485J54515J68510J69857J42423
38842A88711Q4564J5986l2237m0481j7250P364Q324j3117l7461n3877o8795q4219
38830d2488q1970m4307J7062P0087R8439J11513J18720J14160R2315N9455J9696
38819E32682l1074q2373r8198n2726K9384Q8977Q7349L1268m8533j19878j51062
38808A85816j19115l2583O6885J38200J68651J63646J25068N4748l0322j04241
38798F16753j52976j77611j79582j55885j09997n5774o412L3066O0970P5932Q1481
38787B9965Q2840P3072L4332l3475r1615q9374j9343O5201R8767O5989R159k1361
38775B04157j3106J0946K5813K5334J6461O128l292j2657k4314l8283m7953m3345
$$ y = [-1051175, -1105945, -1038654, -899113, -741763, -592079, -446594, -292079, -123569, 46288, 188711, 273275, 289261, 257024, 216543, 199293, 206657, 214981, 201864, 164403, 110526, 41731, -42488, -124458, -168765, -151703, -81616, 16823, 128336, 247056, 361216, 453531, 512986, 532682, 501608, 419235, 321037, 268311, 297695, 386672, 474021, 505289, 456756, 336878, 185816, 66701, 34118, 101003, 239203, 407854, 571500, 696568, 751316, 720994, 616753, 463777, 286166, 106584, -49301, -159298, -215072, -221484, -188418, -127448, -51516, 29965, 112805, 185877, 220209, 186734, 95119, 5745, -13598, 51603, 150370, 216359, 225518, 204157, 191051, 201997, 227810, 253144, 269605, 275733, 272441, 259784, 235470, 197187, 149234, 105889]
38763A05889k1979O330K8971M2734N2344N8252N2337K9156j842k0853j6104M711
38751C19946K3167K8124K1799R358j1364m6406r6331j54617k11300k51182k51975
38740f20781j97606j00276k498N2271N3108K6477J2813L9040J03531J76744K18988
38729b38189K08063J53760Q4026K0846k5988m9898m8009l1709k1641k3596j8565
38718I100J3399O4263J01907J00843O2215O024m7245q5098j00239q6518m1395
38707b744K5765R0355J25719J25744J10232J01497R8128P9117L2592k8137p8465
38696F79803j03663j02183p7407l7602j972P105j2889l4382k3714K1715O7306
38685C82117P6605M6912M345k8286m6045m8450l0418N735M2657O3723O8095N9759
$$ y = [105889, 83910, 90240, 119211, 161945, 214289, 272541, 324878, 354034, 352192, 331339, 315235, 319946, 343113, 371237, 393036, 402394, 391030, 344624, 248293, 93676, -117624, -368806, -620781, -818387, -918663, -921161, -868890, -815782, -789305, -776492, -737452, -633921, -457177, -238189, -30126, 123634, 207660, 228506, 202518, 152620, 104611, 72902, 51261, 27665, 9100, 22499, 86762, 188669, 289512, 351727, 357751, 310506, 225408, 125169, 38651, -2744, 23021, 113376, 239095, 364839, 475071, 576568, 674696, 753813, 786405, 758268, 679803, 576140, 473957, 396550, 358948, 356976, 364081, 351192, 316810, 293096, 314811, 382117, 458722, 505634, 509979, 481693, 435648, 387198, 356780, 362515, 405172, 468895, 536990, 596749]
38673E96749L1494k3232q5680j17412r5968l5178L1033P3398P5883L8851j4378
38662D75560m7259m3245k6323l6217q4516j45585j87795j98851j77361j16973
38652e88565j5604J02914J92294K17449J82284J22486P5803O1367P7521J06552
38642E34501J23063J12974R1215Q9602J16983J39627J14184L6378n5354j20696
38632A182477j46278j35478r2292k7565L3524O7942P6053P6249Q1434Q8805Q8570
38621A293441P3206M1078N79l0991m2621m3623n2892p2419q0795n8271j3220K1590
38609A035062J8694j8245n6120o1556l3336o173j7944p1483j30224j49927j13309
38598C95439m0227K6535M8249J7596l2311n1806j5418N9545J33033J74427J74401
$$ y = [596749, 628243, 605011, 519331, 401919, 305951, 270773, 301806, 375204, 451087, 489938, 475560, 428301, 385056, 358733, 322516, 238000, 92415, -95380, -294231, -471592, -588565, -604169, -501255, -308961, -91512, 90772, 213258, 289061, 350428, 427949, 534501, 657564, 770538, 861753, 951355, 1068338, 1207965, 1322149, 1358527, 1303173, 1182477, 1036199, 900721, 808429, 780864, 814388, 882330, 958383, 1034632, 1116066, 1204871, 1293441, 1366647, 1407725, 1408304, 1377313, 1334692, 1291069, 1238177, 1165758, 1084963, 1026692, 1013472, 1035062, 1053756, 1035511, 979391, 917835, 884499, 878326, 860382, 788899, 658675, 508748, 395439, 355212, 381747, 429996, 447592, 415281, 363475, 348057, 407602, 540635, 715062, 889463]
38587H89463J37170P3926L105n4316q7656j03898j18440j37317j50140j42556
38577C09341j14527q1616n5734k9585J2935P2000J24925J46688J33302J03418
38567F21147Q0822P6181Q0191P1622L6362j8208o9747j01242j09365r5386o2224
38556E10153k7024k0241n2658q8483p3643K544Q9811J31014J21879J05174J15961
38545H14487J50550J86074K08600K12632J88693J29072M3618m1691j01901j22133
38535A668001r6524l6076K0006K2024m3109j29815j75000j59294j15247q0180
38525H74786o1195m8839m1724m2720m5363m1191l2398k2001J72M2611Q7597J02886
38513G72621Q0024M1966R401j8831m2949m4097j0779L0141L4547q222o4597r6025
$$ y = [889463, 1026633, 1100559, 1103664, 1049348, 961692, 857794, 739354, 602037, 451897, 309341, 194814, 113198, 57464, 27879, 40814, 112814, 237739, 384427, 517729, 621147, 701969, 778150, 858341, 929963, 966325, 948117, 878370, 777128, 667763, 572377, 510153, 483129, 462888, 410230, 321747, 248104, 250648, 340459, 471473, 593352, 698526, 814487, 965037, 1151111, 1359711, 1572343, 1761036, 1890108, 1933726, 1892035, 1790134, 1668001, 1571477, 1535401, 1555407, 1577431, 1534322, 1404507, 1229507, 1070213, 954966, 874786, 813591, 764752, 723028, 680308, 634945, 593754, 561356, 539355, 539527, 582138, 669735, 772621, 852645, 894611, 904012, 885181, 842232, 798135, 787356, 817497, 852044, 843822, 779225, 683200]
38501F83200q9960n0241J9230J05315J73879J88368J42626O5767o739o0429j01431
38490A069585j38451j70174j85533j70486j17131l4652M5153Q1041N4090q552
38480D24890m8861k6491M5648J15663J39649J11900N5925j972m7907p9898j00703
38469E87843j10050j02035p4567m3367l8402p6345j37053j75471j60358r7508
38459d27313j3991P2122J57046K29907K62844K36004J67587J02743O7951M9563
38449I04463K6171Q102K4491P3816J09449Q5752Q427p1148j06546r4174o6115
38438I02688n4729o4531p3329n8580k2783P128L200m2556j13727j75853j91274
38427A15654j45777o9063j7829k8146q8171j59162k09710k21760j81734q8911
$$ y = [683200, 593240, 542999, 562229, 667544, 841423, 1029791, 1172417, 1238184, 1231445, 1171016, 1069585, 931134, 760960, 575427, 404941, 287810, 253158, 298311, 379352, 433442, 424890, 376029, 349538, 395186, 510849, 650498, 762398, 818323, 816351, 768444, 688546, 587843, 477793, 375758, 301191, 257824, 219422, 143077, 6024, -169447, -329805, -427313, -441304, -369182, -212136, 17771, 280615, 516619, 684206, 786949, 854900, 904463, 930634, 938736, 963227, 1037043, 1146492, 1232244, 1240671, 1169523, 1062977, 968803, 902688, 847959, 783428, 710099, 651519, 628736, 635864, 639064, 596508, 482781, 306928, 115654, -30123, -99186, -117015, -145161, -233332, -392494, -602204, -823964, -1005698, -1094609]
38417a094609L1075J40017K15930K56201K57781K15879J45400Q1549M6748L1214
38407C27185J8169J3364L1027N8683N9030J1646o1500j18567j36370j22102r8326
38396a7761q6392r7010j22983j40641j29231r1746m8757j0510L2909Q7714J35661
38385d88747J50953J31197R6881O4252L6223J9958L2203P6552J29070J57988J49946
38374E56476J10987N4449k007m0113n6418o6036p8412p8904n0975r499P832j7804
38362C29576o7957j08666j16382q5766l1202J6190K9502J0377j7241l7034m9893
38351a28496n4681m0116l338L9850P2645R1935R7387Q0619L7702j7291o2548q5552
38339B8116q3278n6867j6918J5651K7862K9256L7939N6585P2030P4213O5558N4061
$$ y = [-1094609, -1063534, -923517, -707587, -451386, -193605, 22274, 167674, 249223, 295971, 327185, 345354, 358718, 389745, 448428, 507458, 519104, 457604, 339037, 202667, 80565, -17761, -104153, -201163, -324146, -464787, -594018, -685764, -734521, -745031, -712122, -624408, -488747, -337794, -206597, -109716, -45464, -9241, 10717, 42920, 119472, 248542, 406530, 556476, 667463, 721912, 719905, 679792, 623374, 557338, 478926, 400022, 349047, 339548, 347380, 329576, 261619, 152953, 36571, -49195, -80397, -64207, -34705, -24328, -41569, -78603, -128496, -183177, -223293, -226631, -186781, -114136, -22201, 75186, 155805, 193507, 176216, 113668, 28116, -55162, -112029, -128947, -113296, -85434, -56178, -18239, 38346, 110376, 184589, 250147, 304208]
38327C04208M5794M3167M4883M9474O1675Q8858J26375J54229J56540J38674J17724
38316A331601J02042Q8253P1921N0632K0588j9403o2058r7243j20715j30919j23163
38305A111536r7807p1002o4837q4538j12317j23811j05090n6929O698O1776Q3909
38294E47588O1382P75p7324j47125j89035k00454j94823j86493j77703j60288
38284g23500j23305n7543L5272J29445J83212J75137J28898Q9409P7350P8859
38274f766P4910O3086M8420L0006N941j7421k9645k6517j4583j1499m1787j19348
38262d5203k23625k98193k86399j76949j5866J28519K15919K53979K72684K85109
38252A09975K78242K37814J70145R6225L5087j466j0599p550k3901p8902j52317
$$ y = [304208, 350002, 393169, 438052, 487526, 549201, 638059, 764434, 918663, 1075203, 1213877, 1331601, 1433643, 1521896, 1593817, 1644449, 1665037, 1645634, 1583576, 1486333, 1365618, 1234699, 1111536, 1013729, 942727, 877890, 793352, 681035, 557224, 452134, 395205, 401903, 463679, 547588, 608970, 609745, 532421, 385296, 196261, -4193, -199016, -385509, -563212, -723500, -846805, -904348, -869076, -739631, -556419, -381282, -252384, -162975, -85625, -6766, 68144, 131230, 179650, 209656, 215597, 198176, 168531, 142014, 127431, 115932, 74145, -45203, -268828, -567021, -853420, -1030369, -1046235, -917716, -701797, -447818, -175134, 109975, 388217, 626031, 796176, 892401, 927488, 926022, 915423, 907873, 883972, 805070, 652753]
38241F52753j98810j91666j43483q4195l0796J7732O5930J10086J37665J34886
38231D70102R7304L5091l2640q8311j21237j27674j09263o9375j1369N3701J00794
38220A97123J08728R0618Q9164J27426J77832J97569J83269J69733J83615K23501
38210A748578K80741L49915M13523M43717M32373M02010L77676L65960L71723
38201E186216M15900N18478O72699Q49407J022633J185209J344305J497246J594654
38192A4286747J536530J251215Q05056L96269J84670J24923O976l26114q24444
38183A7441828j297078j593232j694435j661032j544714j369841j164653r69267
38175F147576q06645o66557n30644m02689l01290k29586j69684j09635o2385n1208
$$ y = [652753, 453943, 262277, 118794, 34599, 3803, 21535, 87465, 197551, 335216, 470102, 567406, 602497, 569857, 481546, 360309, 232635, 123372, 53997, 42628, 96329, 197123, 305851, 396469, 485633, 613059, 790891, 988460, 1171729, 1341462, 1525077, 1748578, 2029319, 2379234, 2792757, 3236474, 3668847, 4070857, 4448533, 4814493, 5186216, 5602116, 6120594, 6793293, 7642700, 8665333, 9850542, 11194847, 12692093, 14286747, 15823277, 17074492, 17879548, 18275817, 18460487, 18585410, 18592386, 18266272, 17441828, 16144750, 14551518, 12857083, 11196051, 9651337, 8281496, 7116843, 6147576, 5340931, 4674374, 4143730, 3741041, 3439751, 3210165, 3040481, 2930846, 2868461, 2817253]
38165B817253q4302j47832k14597k54004k44827j90720j20460o4347l1355j3284
38155A451525m538q074k4304m4332n6959n7141m5615k3994O268L8331N3729K7558
38143A312454n0179j55492k40173k66952k33727j64215q3966j0128M5385P5396
38133B28403Q1151P1183N5733M2403L2690K0760J438j7749j9857P98K7964M0557
38121E65474L6066L1029M2714P5417J18760J52781J61284J49713J46415J77754
38111A657407K43322L19140L77006L93033L50178K53754J44397P5537O6682Q5629
38101C966085Q1211K7578o3822j62429k40038k83056k96062k93931k85129k63264
38091B187143k18687j56268r6120n6005l7815l4209m4367p4618j20024j53037
$$ y = [2817253, 2732951, 2585119, 2370522, 2116518, 1871691, 1680971, 1560511, 1496164, 1464809, 1451525, 1446987, 1438913, 1414609, 1370277, 1313318, 1256177, 1210562, 1186568, 1192836, 1231167, 1284896, 1312454, 1262275, 1106783, 866610, 599658, 365931, 201716, 117750, 107622, 153007, 228403, 309554, 380737, 436470, 478873, 511563, 532323, 533761, 516012, 496155, 496953, 524917, 565474, 601540, 632569, 675283, 750700, 869460, 1022241, 1183525, 1333238, 1479653, 1657407, 1900729, 2219869, 2596875, 2989908, 3340086, 3593840, 3738237, 3813774, 3880456, 3966085, 4047296, 4074874, 4011052, 3848623, 3608585, 3325529, 3029467, 2735536, 2450407, 2187143, 1968456, 1812188, 1716068, 1660063, 1622248, 1588039, 1543672, 1469054, 1349030, 1195993]
38081A195993j42858q8992k7346K383r591m3860p5630q9492q0925n9388m8120
38070E32174o5450j02333j29620j31678j23037j27290j49451j74667j83787j62780
38060h17919j08366l8092J2319J8578n190k1860j3111R876L8357Q5326J57018
38049f83064K22032K35505J93311J40488J20170J31254J43983J39650J20883R5964
38039H60176P1430N4525M6108L4086J0662n117J8239Q0940J38194J41690Q7404
38028A538337J5209l0987l5145j0083J9614L3907K4099r447n9461j07741j27770
38017A250532j07569p1384o1855r1279j23116j13877o4277j5197J500o471r477
38006E87530Q578L6053M7440K7540j6052o3546j04164j40414j70853j81084j61568
$$ y = [1195993, 1053135, 964143, 936797, 939180, 929589, 885729, 810099, 720607, 639682, 580294, 532174, 466724, 364391, 234771, 103093, -19944, -147234, -296685, -471352, -655139, -817919, -926285, -964377, -952058, -933480, -938670, -960530, -973641, -963765, -925408, -840082, -683064, -461032, -225527, -32216, 108272, 228442, 359696, 503679, 643329, 764212, 860176, 931606, 986131, 1032239, 1066325, 1076987, 1071870, 1090109, 1171049, 1309243, 1450933, 1538337, 1553546, 1522559, 1487414, 1477331, 1496945, 1530852, 1554951, 1545504, 1486043, 1378302, 1250532, 1142963, 1071579, 1009724, 918445, 795329, 681452, 617175, 601978, 603478, 597007, 587530, 596108, 632161, 679601, 707141, 691089, 627543, 523379, 382965, 212112, 31028, -130540]
37995a30540j25490r4951p2815m1786Q216O4038J04341J21564J24004J21589J14960
37984A93130R7632O7014L1759N699n137m180O619K8534N1623N1359J3769m1654
37972D96167p8244p9582n8661l2305k011L6140P5765J02894J09652J00478Q6200
37961G56493P1217M4934p675q0127j37416j48718j22476r2273o9968l5025K3203
37950B02169P5178Q1966M5810J0234R671L2902M1937K0645k483J7049Q9008J71395
37938G95481K08927J84916J29185Q2480O7685R1607J50097K19570K61195K52662
37928B443805K10795J71244J53127J56262J84541K50868L54458M65837N40013
37919D930950N39909M50808K87173R2318p9009j91222k46523k74876l07719l58693
$$ y = [-130540, -256030, -350981, -423796, -465582, -457366, -393328, -288987, -167423, -43419, 78170, 193130, 290762, 357776, 389535, 395234, 390097, 385917, 392536, 421070, 472693, 524052, 537821, 496167, 417923, 338341, 279680, 247375, 245364, 281504, 357269, 460163, 569815, 670293, 756493, 827710, 872644, 864969, 784842, 647426, 498708, 376232, 283959, 213991, 178966, 202169, 277347, 359313, 405123, 415357, 425028, 457930, 499867, 520512, 518029, 535078, 624086, 795481, 1004408, 1189324, 1318509, 1400989, 1468674, 1560281, 1710378, 1929948, 2191143, 2443805, 2654600, 2825844, 2978971, 3135233, 3319774, 3570642, 3925100, 4390937, 4930950, 5470859, 5921667, 6208840, 6301158, 6222149, 6030927, 5784404, 5509528, 5201809, 4843116]
37909D843116m21197m77304n08086m98520m39151l32599k03229r3044l5557k9263
37899A805166m0287l2410N999N8655R5308R0149L8469l7413j03128j39084j51854
37888A589570j58097j62283j54703j28110q9838n6312l8656l4682l2855k2465
37878G11569r42K6059M9294O1427O2126O0356O9126R4267J29008J61524J85664
37867A609478K02459K16060K33395K62000K98463L22268L14144K81003K48204
37858C987474K22542J78590R2568k3259j34408k21859k87646l29983l37669l14020
37848B832330k85374k72903k67165k41915j86647j17588o2648m1680n3363p2778
37838A230269o8368l1799J0703K2954p477o2614j13033j37304j31618j11125r6498
$$ y = [4843116, 4421919, 3944615, 3436529, 2938009, 2498858, 2166259, 1963030, 1869986, 1834429, 1805166, 1764879, 1732469, 1738468, 1797123, 1892431, 1982580, 2021049, 1983636, 1880508, 1741424, 1589570, 1431473, 1269190, 1114487, 986377, 896539, 840227, 801571, 766889, 734034, 711569, 710627, 736686, 785980, 847407, 909533, 969889, 1039015, 1133282, 1262290, 1423814, 1609478, 1811937, 2027997, 2261392, 2523392, 2821855, 3144123, 3458267, 3739270, 3987474, 4210016, 4388606, 4481174, 4457915, 4323507, 4101648, 3814002, 3484019, 3146350, 2832330, 2546956, 2274053, 2006888, 1764973, 1578326, 1460738, 1398090, 1356410, 1303047, 1230269, 1161901, 1130102, 1140805, 1163759, 1156282, 1093668, 980635, 843331, 711713, 600588, 504090]
37827E04090q9742p0303k7639R441m428p6099j56168j81621j27131j3910J15588
37816a17922K22026K80078K81733K33553J49704M9259m2466j00458j14818r6443
37806G44246o5589l7633j9171j0355p355p478j4314l3198n9972q0295q3042o9770
37794B56074m8461k2485J1712N8893J17826J76746K17346K27656K09384J68824
37784A373515J06639K5677n6541j16729j46513j53011j41921j14907q1837n6336
37774F38036l5846m527L8505P2201Q1993P6111O4498M2610J0917r990n739M500
37762I73269q497l9745n2005k1366L6359Q4941R9837Q2456N6617N2799Q6199J47474
37750A498338K15958K75952L19592L48844L80484M26700M53788L83983J72854
$$ y = [504090, 414348, 344045, 316406, 325847, 321419, 245320, 89152, -92469, -219600, -233510, -117922, 104104, 384182, 665915, 899468, 1049172, 1098431, 1055965, 955507, 840689, 744246, 678657, 641024, 621853, 611498, 604143, 596665, 582351, 549153, 489181, 408886, 325844, 256074, 207613, 185128, 196840, 255733, 373559, 550305, 767651, 995307, 1204691, 1373515, 1480154, 1505831, 1449290, 1332561, 1186048, 1033037, 891116, 776209, 694372, 638036, 602190, 597663, 636168, 708369, 790362, 866473, 930971, 973581, 984498, 974508, 968769, 973269, 964772, 925027, 873022, 851656, 888015, 972956, 1072793, 1155249, 1211866, 1264665, 1350864, 1498338, 1714296, 1990248, 2309840, 2658684, 3039168, 3465868, 3919656, 4303639, 4476493]
37741D476493j20009l66501m78170m60968l73806k69950j85186j45222j55315
37732A921366j92628k25813k38677k30722k06592j72939j35920r4840m5563P603
37722C85275N4002R1807J26802J52355J47287J02884L9007j6772n5650q3853j03066
37711H40078j07331r4801p2594n1161l8283l5733l9438m6806o2746r0040j13897
37700H7248j08753o6110o734M0101O2350O7356O7578O9238O7817N1160J3724l0560
37688C14415n7398n4280k4563K7095R5639J59445J84478J57972J05336O1418L4947
37677A004504J2372j4226l8240n1891n4450m8655l9400l5226m2588n7121o5128
37666E69951n5672l1804j1440j3538l7344n9366o0890n4407o7550j01080j21321
$$ y = [4476493, 4356484, 3989983, 3511813, 3050845, 2677039, 2407089, 2221903, 2076681, 1921366, 1728738, 1502925, 1264248, 1033526, 826934, 653995, 518075, 423235, 377672, 385275, 439277, 531084, 657886, 810241, 957528, 1060412, 1099419, 1082647, 1026997, 943144, 840078, 732747, 637946, 565352, 514191, 475908, 440175, 400737, 353931, 291185, 201145, 87248, -21505, -87615, -94349, -54248, 8102, 75458, 143036, 212274, 280091, 331251, 344975, 314415, 257017, 202737, 178174, 205269, 300908, 460353, 644831, 802803, 908139, 969557, 1004504, 1016876, 1002650, 964410, 912519, 858069, 809414, 770014, 734788, 692200, 635079, 569951, 514279, 482475, 471035, 457497, 420153, 360787, 299897, 245490, 177940, 76860, -44461]
37655d4461j00266m7258O160L7488M1690K6308J2174K5985P6151J41377J90854
37644C66202K07225J85650J28564N4666k680k3279j6872r4K7475O6251R2089P6521
37632A161718K6554k0799m3924n5658p5765j04490j29036j40898j39943j30188
37622C47571j14586q8264m0400K8345R5980J38912J56185J60449J51836J19963
37612I55991O8971J9166j8324m8885p2451p4572m8349r094K3536M5545O1275O7786
37600I70595N8059L1973n936n3550j05888j45922j49683j03380j6042Q1181J49901
37589G11308J68653J49291J26580J27938J53715J84682K02157J99588J80372J48476
37579B352760J01986L9438k5844o6595o6854m2570k6895l7283o5442r4403j12440
$$ y = [-44461, -144727, -191985, -185825, -148337, -106647, -80339, -68165, -42180, 33971, 175348, 366202, 573427, 759077, 887641, 942307, 939627, 916348, 899476, 899382, 926857, 993108, 1085197, 1161718, 1188272, 1167473, 1123549, 1067891, 992126, 887636, 758600, 617702, 477759, 347571, 232985, 144721, 104321, 132666, 228646, 367558, 523743, 684192, 836028, 955991, 1024962, 1044128, 1025804, 976919, 904468, 829896, 781547, 772453, 795989, 841534, 902809, 970595, 1028654, 1060627, 1054691, 1001141, 895253, 749331, 599648, 496268, 480226, 561407, 711308, 879961, 1029252, 1155832, 1283770, 1437485, 1622167, 1824324, 2023912, 2204284, 2352760, 2454746, 2494184, 2468340, 2401745, 2334891, 2292321, 2265426, 2228143, 2162701, 2068298, 1955858]
37568A955858j13826j01446q8205q1467o7335k8069K3699M8485K4442k9260q1369
37557A461507j22083j54926j71462j53236r4947j5265N1525P2461L9036j6923
37547H95687m3543j8070L2312O5618O5604L6990j6938q6022j35601j28832o7529
37536E99676J1963Q3150J46167J99984K27065K18006J89192J59479J24143O8022
37526B026847n402p2768j12926j19966j00838o9912l9964j0508K7596O8637Q5301
37515A676097N9511J0990k2631k9676l0140l9341m6744l7098j5521j039n498k6657
37503A492253n1682n8672k5518M8515J33169J89266J98981J69082J12930M3385
37493B251709j9848n4139n3169l2799j0202J6115N6864J05994J34933J18011O1507
$$ y = [1955858, 1842032, 1740586, 1652381, 1570914, 1503579, 1475510, 1499209, 1547694, 1572136, 1542876, 1461507, 1339424, 1184498, 1013036, 859800, 764853, 749588, 801113, 873574, 912610, 895687, 852144, 834074, 866386, 932004, 997608, 1034598, 1017660, 931638, 796037, 667205, 599676, 611639, 694789, 840956, 1040940, 1268005, 1486011, 1675203, 1834682, 1958825, 2026847, 2021445, 1948677, 1835751, 1715785, 1614947, 1545035, 1505071, 1494563, 1522159, 1590796, 1676097, 1735608, 1746598, 1723967, 1694291, 1664151, 1624810, 1578066, 1540968, 1525447, 1524408, 1518910, 1492253, 1440571, 1381899, 1356381, 1404896, 1538065, 1727331, 1926312, 2095394, 2208324, 2251709, 2231861, 2177722, 2124553, 2091754, 2081552, 2097667, 2154531, 2260525, 2395458, 2513469, 2574976]
37482B574976L390j8022L968M2866O6616O3438M1202R688k7624o4957q6985p7752
37470B530804l6591J9270P0498J12359J50660J79146J68807R3120l2961j51000
37460C104112k06493j94274j50288j06466o7811l1425r373k0830o6234j17383
37450B133535j35859j04595m6181q374k3904q2353j44488j81318j92409j90216
37440A023838j79962j57980j19351o2376O600O9329J04897J07047Q5659N0324
37430I28025L946m4192p4489p7846p0828p7288j00135j22112j29544j23185j07483
37419D869q1404m2976M017N0981Q9940J18319J39529J56184J62291J48490J17006
37408H67246Q3144N7736L7681K0047J3355K2183L0041J5844j4276k8298n192M1542
$$ y = [2574976, 2578366, 2560344, 2564312, 2607178, 2673794, 2737232, 2778434, 2788122, 2760498, 2695541, 2608556, 2530804, 2494213, 2513483, 2583981, 2696340, 2847000, 3026146, 3194953, 3288073, 3255112, 3104112, 2897619, 2703345, 2553057, 2446591, 2378780, 2347355, 2337982, 2317152, 2250918, 2133535, 1997676, 1893081, 1846900, 1838526, 1814622, 1732269, 1587781, 1406463, 1214054, 1023838, 843876, 685896, 566545, 504169, 510769, 580098, 684995, 792042, 877701, 928025, 931971, 887779, 813290, 735444, 664616, 587328, 487193, 365081, 235537, 112352, 4869, -76535, -119511, -115494, -64513, 25427, 143746, 283275, 439459, 601750, 750240, 867246, 950390, 1008126, 1045807, 1065854, 1079209, 1101392, 1131433, 1147277, 1133001, 1104703, 1099511, 1141053]
37396A141053Q0996R4175P9593L9227k8060j16142k00621k46727k35285j81208
37386D27001j19807p2139l0008K2477Q2668J32623J60021J64345J47271J09895
37376A024347N9292P919l4761o4719q1127q9954j05202j34202j61659j59618j16278
37365A44038m8491J3859M9434N5256M6369M5142O0375P7138P7356O8080P4254
37354F62810J01129J19527R6635L2339m0001p9611o2496N793R1427J55499J85568
37343A268619J98815K10469K12204J91093J54898J19548P9611J5201o8638j31193
37333B250627j38537j06161q4861j06675j55097j88323j81409j41372q9619m1471
37323A017102m987R324r867n7367r9711r1359j1870J12487K29858L07560L50301
$$ y = [1141053, 1222049, 1316224, 1395817, 1435044, 1406984, 1290842, 1090221, 843494, 608209, 427001, 307194, 235055, 205047, 227524, 310192, 442815, 602836, 767181, 914452, 1024347, 1083639, 1091558, 1056797, 992078, 910951, 820997, 715795, 581593, 419934, 260316, 144038, 95547, 109406, 158840, 214096, 260465, 305607, 365982, 443120, 520476, 588556, 662810, 763939, 883466, 980101, 1012440, 972439, 892828, 830332, 836125, 927552, 1083051, 1268619, 1467434, 1677903, 1890107, 2081200, 2236098, 2355646, 2435257, 2450458, 2381820, 2250627, 2112090, 2005929, 1921068, 1814393, 1659296, 1470973, 1289564, 1148192, 1058573, 1017102, 1012115, 1021439, 1011572, 954205, 854494, 763135, 751265, 863752, 1093610, 1401170, 1751471]
37312A751471L72545L65405L05882J95855P5195q968l4927p292N4835J18320J43216
37301C331537J14968O6172M5314O2285Q2944P9253O2664N7887O4127O1985M8116
37290D077252M1043N3525P7413R9214J14119J15769Q6514J5645p4989j39518j48791
37279D317196j14889p0746l4987o459J4076J4233j3402n6314r2329j10626j16928
37268C728825j20957j23228j12548p5238j1559N4258Q6307O5980Q749m8549p4323
37257C377717n8554j3848L2846N6010M8167K2078l871j8776j9491p761R743K7741
37245C452001N2631R5730J50033J85063J74993J24886O1750Q713k4725l9433m6987
37234D194655o3764r0428j03842q2531l3955J5275M7635N9194M6506R783l4333
$$ y = [1751471, 2124016, 2489421, 2795303, 2991158, 3066353, 3057385, 3022458, 3015166, 3070001, 3188321, 3331537, 3446505, 3512677, 3557991, 3620276, 3703220, 3782473, 3845137, 3903024, 3967151, 4029136, 4077252, 4118295, 4171820, 4249233, 4348447, 4462566, 4578335, 4664849, 4680494, 4605505, 4465987, 4317196, 4202307, 4131561, 4096574, 4090115, 4104191, 4118424, 4105022, 4048708, 3956379, 3845753, 3728825, 3607868, 3484640, 3372092, 3296854, 3285295, 3339553, 3425860, 3491840, 3500589, 3452040, 3377717, 3319163, 3305315, 3338161, 3394171, 3442338, 3464416, 3460545, 3441769, 3422278, 3414517, 3424260, 3452001, 3504632, 3600362, 3750395, 3935458, 4110451, 4235337, 4297087, 4305800, 4281075, 4241642, 4194655, 4130891, 4040463, 3936621, 3854090, 3820135, 3835410, 3883045, 3942239, 3988745, 3998528, 3964195]
37223C964195o1664o1486l5257J8773R9713J86102K46865K75673L00109L54466
37213E287489M54158N91878P42715Q77389R85300J071235J102720R78586O06611
37204A2698081L3115n43442r20457j039772r82196q54627p18558o01628n19606
37195F550910m68339m20718l51606k61539j73131j11501q8418r6541j15414j25876
37185D337827j18921r2330m7439O841N6105R3327J21977J40642J35485R8998M8085
37174D780597R971p219j9692m5735q6640j27996j52049j48777j20533p7529k9796
37163C974602J2872L5698K4521j9606p9907j41159j97550k40209k51386k21304
37153B896572j61333r1238k2929L3888O2662N3280J8922j5770m1202o4430q6052
$$ y = [3964195, 3902531, 3841045, 3805788, 3824561, 3924274, 4110376, 4357241, 4632914, 4933023, 5287489, 5741647, 6333525, 7076240, 7953629, 8938929, 10010164, 11112884, 12091470, 12698081, 12731196, 12187754, 11267297, 10227525, 9245329, 8390702, 7672144, 7070516, 6550910, 6082571, 5661853, 5310247, 5048708, 4875577, 4764076, 4675658, 4579117, 4463703, 4337827, 4218906, 4126576, 4079137, 4085978, 4142083, 4235410, 4357387, 4498029, 4633514, 4732512, 4780597, 4790568, 4783349, 4763657, 4717922, 4631282, 4503286, 4351237, 4202460, 4081927, 4004398, 3974602, 3987474, 4023172, 4047693, 4028087, 3948180, 3807021, 3609471, 3369262, 3117876, 2896572, 2735239, 2644001, 2621072, 2654960, 2717622, 2770902, 2789824, 2774054, 2732852, 2668422, 2582370]
37142B582370r0112o1657o178N2110Q7254Q7601O1700L1174J5038J8979L7515
37131B815794O1693Q3364R7656J04993J07505J03017Q7640O3759L7394Q396k5083
37120C546128n1234n0121k2790o50j2486m9890p6350o4500j6250M4669Q8492R5022
37108C430040O6998K6756o107k7624l5958k0138K2767O9226Q7082O9893L9722
37097C722657J8641J1526J4506K3717L2142K9816J2160j6827m8349o9503o6287
37086C664199l8669j0514j0675m2674q4392j17656j43638j64608j65509j26418
37076B759446m9361L5466Q9865R2556N0450o936m4334l9983K497N6643R0860R1718
37064C128887P2738N7779N8084P3354J11532J88026K94777L85352M10924L69173
$$ y = [2582370, 2492258, 2430601, 2424423, 2476533, 2563787, 2651388, 2713088, 2744262, 2759300, 2778279, 2815794, 2877487, 2960851, 3058507, 3163500, 3271005, 3374022, 3461662, 3525421, 3562815, 3571211, 3546128, 3494894, 3444773, 3421983, 3421333, 3408847, 3358957, 3282607, 3218107, 3201857, 3246526, 3335018, 3430040, 3497038, 3523794, 3517687, 3490063, 3454105, 3433967, 3456734, 3525960, 3613042, 3682935, 3722657, 3741298, 3752824, 3767330, 3791047, 3823189, 3853005, 3865165, 3848338, 3799989, 3730486, 3664199, 3625530, 3615016, 3604341, 3561667, 3477275, 3359619, 3215981, 3051373, 2885864, 2759446, 2710085, 2745551, 2835416, 2927972, 2978422, 2971486, 2927152, 2887169, 2889666, 2946309, 3037169, 3128887, 3201625, 3259404, 3317488, 3390842, 3502374, 3690400, 3985177, 4370529, 4781453, 5150626]
37054E150626L04142K60532K52617K74994L20258L73308M03765L86459L31724
37045H058425K81149K64974K70175K58624K11561J44317P8642J7350m5993j08454
37035I430770j64087k16163k61819k73722k26706j45635r7739j24400k01262k76847
37025G442390l26918l53613l55194l26323k78671k34580k02096j74973j52987
37016E037035j41925j34968j14041p3772l1083r063k1127o8598j40783k16820
37006D084855k77570l15447l26527l01803k41202j70955j28228j25517j42171
36997B055435j51209j42506j20623r4899p5147o4817n3513k4880K3843P5301J05446
36986A532431R8464N1690k3527j02845j56758j62806j16148l7978K6535L5656
$$ y = [5150626, 5454768, 5715300, 5967917, 6242911, 6563169, 6936477, 7340242, 7726701, 8058425, 8339574, 8604548, 8874723, 9133347, 9344908, 9489225, 9567867, 9585217, 9539224, 9430770, 9266683, 9050520, 8788701, 8514979, 8288273, 8142638, 8044899, 7920499, 7719237, 7442390, 7115472, 6761859, 6406665, 6080342, 5801671, 5567091, 5364995, 5190022, 5037035, 4895110, 4760142, 4646101, 4572329, 4541246, 4532183, 4511056, 4442458, 4301675, 4084855, 3807285, 3491838, 3165311, 2863508, 2622306, 2451351, 2323123, 2197606, 2055435, 1904226, 1761720, 1641097, 1546198, 1471051, 1406234, 1352721, 1327841, 1351684, 1426985, 1532431, 1630895, 1682585, 1659058, 1556213, 1399455, 1236649, 1120501, 1082523, 1109058, 1144714]
36976A144714j1245p2225j07837j15986j13160j00394o9471k9463r44J0536J1287
36965E45812l661m1562p9911p4811j2788O7178J13994J09940O9971J8074k1184
36954F91052k4836J4507P9541J41787J80730J88402J67222J31218J00100Q2269
36944A751992O6540L5572j4177o5222q8007o2180R36N9352P5151M8245Q080k2021
36932A794261l8730m3978l8342l1527m0291o8808j03330j28446j35716j18061
36922A047032p5578k9651r424j6049j9410J89K5209K6655o51m1592q3146j16664
36910G06920j29962j15769q3798n1558k6669o305J2838L3492N9711Q9189J08654
36899E96743J06920R0162P6771P8438Q9668R2390O9126J8145m1208q4021j02784
$$ y = [1144714, 1133469, 1061244, 953407, 837421, 724261, 623867, 554396, 524933, 523989, 534525, 545812, 542151, 500589, 420678, 345867, 333079, 400257, 514251, 624191, 694162, 712236, 691052, 666216, 680723, 760264, 902051, 1082781, 1271183, 1438405, 1569623, 1669723, 1751992, 1818532, 1854104, 1839927, 1774705, 1686698, 1624518, 1625454, 1684806, 1759957, 1808202, 1816282, 1794261, 1755531, 1711553, 1673211, 1641684, 1601393, 1532585, 1429255, 1300809, 1165093, 1047032, 971454, 941803, 932379, 916330, 896920, 897109, 922318, 948973, 948322, 906730, 823584, 706920, 576958, 461189, 377391, 325833, 299164, 292859, 305697, 339189, 398900, 488089, 596743, 703663, 793825, 870596, 949034, 1038702, 1131092, 1200218, 1218363, 1177155, 1093134, 990350]
36888I90350j09725j18377j32479j50380j64806j56540j06397k1784O1622J11552
36878B03036J20972R5896M1606k7119p8885q6271m7077K3290J08524J89971K42784
36867G86727K50652K17995J56079O7022m3474j45889j98494j81169j09322j7650
36857G82477O1620J10379J27204J19745R1383M0026k8469r6847j52544j95963
36847H59011k25952k30959k05056j59323j04593l6400M7860J29426J83358K03061
36837D60433J94053J57731J03413O2889O3031Q8939J03222R8894J00848J12887
36827A546340J00671M2994l0305p3293p4007m7100K772P9462J67503K39434K96471
36816B250942L77372N13820O89766Q58370R95480J125797J292597J508741J750112
$$ y = [990350, 880625, 762248, 629769, 479389, 314583, 158043, 51646, 29862, 91484, 203036, 324008, 419904, 461510, 434391, 355506, 269235, 222158, 245448, 353972, 543943, 786727, 1037379, 1255374, 1411453, 1478475, 1435001, 1289112, 1090618, 909449, 800127, 782477, 844097, 954476, 1081680, 1201425, 1292808, 1332834, 1304365, 1207518, 1054974, 859011, 633059, 402100, 197044, 37721, -66872, -103272, -55412, 74014, 257372, 460433, 654486, 812217, 915630, 978519, 1041550, 1130489, 1233711, 1332605, 1433453, 1546340, 1647011, 1690005, 1659700, 1586407, 1512400, 1465300, 1468072, 1547534, 1715037, 1954471, 2250942, 2628314, 3142134, 3831900, 4690270, 5685750, 6811547, 8104144, 9612885, 11362997]
36807A1362997J996416K244392K436267K383875J846430P64772n86054j743159
36799B0705936k389866k535856k388686k121794j801370j464871j167498r39761
36791E896234p62232o07609m72704l57514k54032j75155j54459j88275k11511
36782B712743j66704p3688K924L2406K5260j6090j01160k08604k88963l20927
36772A597197l26813l21478k83955j97972q8504M803O7620J05144J19379J14727
36762G90148J07963J08493J00626O6546J7289j8539k8024j7066J1267N8860J14186
36751A311749J51644J54694J29354R2997N8469L0338R145l235k77K4891O8444
36740B028213J12125J34642J26324R3977N7462M2110O6150J29603K15158K95789
$$ y = [11362997, 13359413, 15603805, 18040072, 20423947, 22270377, 23035149, 22449095, 20705936, 18316070, 15780214, 13391528, 11269734, 9468364, 8003493, 6835995, 5896234, 5134002, 4526393, 4053689, 3696175, 3442143, 3266988, 3112529, 2924254, 2712743, 2546039, 2472351, 2475275, 2507681, 2532941, 2516851, 2415691, 2207087, 1918124, 1597197, 1270384, 948906, 664951, 466979, 378475, 383278, 450898, 556042, 675421, 790148, 898111, 1006604, 1107230, 1173776, 1191065, 1172526, 1144502, 1127436, 1138703, 1197563, 1311749, 1463393, 1618087, 1747441, 1840438, 1898907, 1929245, 1938390, 1935155, 1934878, 1959769, 2028213, 2140338, 2274980, 2401304, 2495281, 2552743, 2594853, 2661003, 2790606, 3005764, 3301553]
36730C301553L38050L11498K17636J11594P3891J46177K98288M58021N63513N90755
36720F410976N51636M75252L81717K72262J54737P1221P5023J75241L23621M59108
36710I350794N46155N74571N58066N42748N83870O99070Q71839J106789J437192
36701A6271094J857647K294017K666005K925159K988176K702310J983225R89487
36693C4677120P9290m41248n09590k86082l2618j4886m00974j145386j983181
36684B9942445k604265k857701k791000k535885k203536j867481j577434j353973
36676A2151170j185017j043425r05576p57665o00568m52820l38572k68442k35485
36667F363600k25690k25658k26877k33911k63295l20724l81778m09930l93612
$$ y = [3301553, 3639603, 3951101, 4168737, 4280331, 4354222, 4500399, 4798687, 5256708, 5820221, 6410976, 6962612, 7437864, 7819581, 8091843, 8246580, 8317801, 8392824, 8568065, 8891686, 9350794, 9896949, 10471520, 11029586, 11572334, 12156204, 12855274, 13727113, 14833902, 16271094, 18128741, 20422758, 23088763, 26013922, 29002098, 31704408, 33687633, 34677120, 34756410, 34315162, 33805572, 33519490, 33486872, 33471986, 33071012, 31925626, 29942445, 27338180, 24480479, 21689479, 19153594, 16950058, 15082577, 13505143, 12151170, 10966153, 9922728, 9017152, 8259487, 7658919, 7206099, 6867527, 6599085, 6363600, 6137910, 5912252, 5685375, 5451464, 5188169, 4867445, 4485667, 4075737, 3682125]
36658C682125l50178k91918k08832r7738P920O0049M6712M686k0376j1569K3242
36647B844123P1655J17155J33598J03969M5927M76j0887n573j1909l4292n3796
36636C200446n3368l2689k980K5209N0191P7098J05639J24322J25744J23128J36112
36625C878852J61367J76938J79243J92902K33219K80091L05516L10127L15109
36616F033364L31831L56490L79694L81266L30510K19315R0456R510Q173O9094
36606H209703J58132K51161L34656M02077M50765M71382M51678M09279M06459
36597A1545292N03263P00616R52796J224199J502872J772787K018320K248609
36589B2468754K455239K530957K300943J696202Q76580J40094k85930l62474k14222
$$ y = [3682125, 3331947, 3040029, 2831197, 2733459, 2741379, 2801428, 2848140, 2852826, 2832450, 2820881, 2844123, 2915778, 3032933, 3166531, 3270500, 3316427, 3316903, 3306016, 3300443, 3288534, 3254242, 3200446, 3147078, 3114389, 3111409, 3136618, 3186809, 3263907, 3369546, 3493868, 3619612, 3742740, 3878852, 4040219, 4217157, 4396400, 4589302, 4822521, 5102612, 5408128, 5718255, 6033364, 6365195, 6721685, 7101379, 7482645, 7813155, 8032470, 8122926, 8132436, 8140609, 8209703, 8367835, 8618996, 8953652, 9355729, 9806494, 10277876, 10729554, 11138833, 11545292, 12048555, 12749171, 13701967, 14926166, 16429038, 18201825, 20220145, 22468754, 24923993, 27454950, 29755893, 31452095, 32328675, 32468769, 32182839, 31820365, 31606143]
36580C1606143n8527j27833n51570j247602j954467k416015k546723k428238k186819
36571A8088349j904075j617347j347823j105529q89319p02580n61745m77579m34668
36562I047684m01247l56061k96376k25172j45641o8663r702K8320N7860Q7368
36552G718370J12937J37496J81498K56992L42984M08738M56493N17594O06716
36543A0739818P06035Q02730R16811J072484J257214J432014J578426J716148
36535B0221680J871190K040169K191768K294145K332468K303263K201027K014771
36527C7470481J733673J350057Q58866K65907l93504j047687j611885k025935
36519C6599973k272397k365605k333293k210128k038661j863194j713211j588895
$$ y = [31606143, 31547616, 31419783, 30868213, 29620611, 27666144, 25250129, 22703406, 20275168, 18088349, 16184274, 14566927, 13219104, 12113575, 11224256, 10521676, 9959931, 9482352, 9047684, 8646437, 8290376, 7994000, 7768828, 7623187, 7554524, 7544822, 7573142, 7631002, 7718370, 7831307, 7968803, 8150301, 8407293, 8750277, 9159015, 9615508, 10133102, 10739818, 11445853, 12248583, 13165394, 14237878, 15495092, 16927106, 18505532, 20221680, 22092870, 24133039, 26324807, 28618952, 30951420, 33254683, 35455710, 37470481, 39204154, 40554211, 41413077, 41678984, 41285480, 40237793, 38625908, 36599973, 34327576, 31961971, 29628678, 27418550, 25379889, 23516695, 21803484, 20214589]
36511B0214589j467114j330099j189319j073210r91282r24045q54046p89705p42868
36502A0852901o95894o14954m94907l71169k84099k46931k50262k78961l15983
36493G299741l43557l52059l41167l08003k45147j58250p5863l0310l0814n9870
36483E354701r0348j01485q6132n2883k0522m208o409k2332n0442r3666j52217
36472D674057k17864k73880l00259k83865k28168j52912q2358l2180l344J6508
36462C115735M5189R3253J54635K09447K35469K17979J55776O6439j5371n5553
36452D222998m5228q590J6976J1315j5983m2822o3093r2788j43169j94201k07676
36441C437739j68079r8177l0389K3493O7004R8912J13285J10369R2040N2308j1791
$$ y = [20214589, 18747475, 17417376, 16228057, 15154847, 14163565, 13239520, 12385474, 11595769, 10852901, 10157007, 9542053, 9047146, 8675977, 8391878, 8144947, 7894685, 7615724, 7299741, 6956184, 6604125, 6262958, 5954955, 5709808, 5551558, 5475695, 5445385, 5414571, 5354701, 5264353, 5162868, 5076736, 5023853, 5003331, 4999123, 4992714, 4970382, 4919940, 4826274, 4674057, 4456193, 4182313, 3882054, 3598189, 3370021, 3217109, 3134751, 3102571, 3099227, 3115735, 3160924, 3254177, 3408812, 3618259, 3853728, 4071707, 4227483, 4293922, 4278551, 4222998, 4177770, 4169180, 4186156, 4197471, 4181488, 4138666, 4075573, 3982785, 3839616, 3645415, 3437739, 3269660, 3171483, 3141094, 3164587, 3231591, 3330503, 3443788, 3554157, 3646197, 3698505, 3686714]
36430C686714q2093j26405j25289q4449k5011K8447N6665N8000N1282N5695P1699
36419C565255R2992J27720J86577K53466K93592K96179K87766K96337L24842L71300
36409F096026M50567N74413P26155Q79747J034712J208905J406539J621957J860568
36400A5859589K096181K185487J893727J099738q622j006087j544830j592241
36392A8982942j360955j064238p85139n30108l04293j04097J00103L25266N44782
36383A5804263P24454Q64652R81591J074785J146456J231873J372045J565194
36375B4765313J776056J982717K180709K348033K445660K461301K425824K377292
36367D2762905K326355K257872K142866J942052J618802J163222N99186l1433
$$ y = [3686714, 3604621, 3478216, 3352927, 3268478, 3243467, 3271914, 3328579, 3386579, 3437861, 3493556, 3565255, 3658247, 3785967, 3972544, 4226010, 4519602, 4815781, 5103547, 5399884, 5724726, 6096026, 6546593, 7121006, 7847161, 8726908, 9761620, 10970525, 12377064, 13999021, 15859589, 17955770, 20141257, 22034984, 23134722, 23126100, 22120013, 20575183, 18982942, 17621987, 16557749, 15772610, 15242502, 14938209, 14834112, 14934215, 15259481, 15804263, 16528717, 17393369, 18374960, 19449745, 20596201, 21828074, 23200119, 24765313, 26541369, 28524086, 30704795, 33052828, 35498488, 37959789, 40385613, 42762905, 45089260, 47347132, 49489998, 51432050, 53050852, 54214074, 54813260, 54781827]
36359E4781827o81075j297842j833381k256258k552483k718556k765382k721721
36351C7955129k616609k460668k259003k038027j841330j697238j601213j527205
36343B1913836j446389j342852j225966j121646j038938r55617q52484p48004
36335A3181940o75667o37386o05898n66006n23399m74991m04055l13484k37264
36326H743790k04383k05891k06955j81908j34950r6279r6976j36581j78286j86392
36316G115189j61395j27172r8042p8626q1636j15558j59121j76937j61605j36958
36306E818139j20918j10456j04028j12873j44185j92018k46512k93498l06533
36297D187118k62709j70712o6265K0757P9462J04545R3457N7974J9085j1610l2186
$$ y = [54781827, 54100752, 52802910, 50969529, 48713271, 46160788, 43442232, 40676850, 37955129, 35338520, 32877852, 30618849, 28580822, 26739492, 25042254, 23441041, 21913836, 20467447, 19124595, 17898629, 16776983, 15738045, 14782428, 13929944, 13181940, 12506273, 11868887, 11262989, 10696983, 10173584, 9698593, 9294538, 8981054, 8743790, 8539407, 8333516, 8126561, 7944653, 7809703, 7713424, 7616448, 7479867, 7301581, 7115189, 6953794, 6826622, 6728580, 6649954, 6568318, 6452760, 6293639, 6116702, 5955097, 5818139, 5697221, 5586765, 5482737, 5369864, 5225679, 5033661, 4787149, 4493651, 4187118, 3924409, 3753697, 3687432, 3708189, 3787651, 3892196, 3985653, 4043627, 4062712, 4051102, 4018916]
36286D018916l7323k1909O420L2458M4940L4109l959m5600m6580L850N7766O5114
36274D108202L2716k023k6489m3020l5733q25J4260l5054j08961j19877m8856
36263C734340L4010O5724M7097J266n8580j05358j02177n2466K226N0468J27390
36252C743940K45777L60058M19625M15160L57561K59584J57349J01261R9631J09902
36242F269848J03822J00445J18718J42964J55968J63959J69025J58833J43493
36233G527075J60857K23688K97488L45970L62667L51286L19832K98894L09925
36224A0197682L03800J92243l6775k88494m66174n52800n73495n44337m90173
36215G741477m51717m34308l95444l13229k20477j46902q1059j7115J5555J099
$$ y = [4018916, 3981593, 3959684, 3966104, 3998562, 4043502, 4077611, 4073652, 4028052, 3981472, 3985322, 4043088, 4108202, 4140918, 4138895, 4112406, 4069386, 4033653, 4032828, 4047088, 4012034, 3903073, 3783196, 3734340, 3768350, 3834074, 3881171, 3882437, 3823857, 3718499, 3616322, 3563856, 3566082, 3616550, 3743940, 3989717, 4349775, 4769400, 5184560, 5542121, 5801705, 5959054, 6060315, 6159946, 6269848, 6373670, 6474115, 6592833, 6735797, 6891765, 7055724, 7224749, 7383582, 7527075, 7687932, 7911620, 8209108, 8555078, 8917745, 9269031, 9588863, 9887757, 10197682, 10501482, 10693725, 10656950, 10368456, 9902282, 9349482, 8775987, 8231650, 7741477, 7289760, 6855452, 6460008, 6146779, 5926302, 5779400, 5698341, 5681226, 5696781, 5697880]
36205E697880l3164o1101q2251q4757m4578J6330L5029l852m7110o0847o7948
36194E263631p5468m5933K5151Q2136R6425J03816J21158J10971O8983N8124J07474
36183E916468J62560J83551K05454K52537K84904K82692K90616L26509L41963
36174H247254L25575L40927M07591M57617M70107N28064O74392Q36393R62884
36165A3250804J101054J263262J368017J402694J490578J700810J954755K217851
36157B5749825K598269L142601L739968M362518N180524O291312P580507R019613
36149F7665137J0820709J3104809J5750879J8809699K2666075K7479546L2904600
36142B09201454L8593611M3980550M6602887M1703116K5843258J706997k2124749
$$ y = [5697880, 5664716, 5603615, 5521364, 5436607, 5392029, 5408359, 5443388, 5439536, 5392426, 5331579, 5263631, 5188163, 5142230, 5167381, 5249517, 5345942, 5449758, 5570916, 5681887, 5750870, 5808994, 5916468, 6079028, 6262579, 6468033, 6720570, 7005474, 7288166, 7578782, 7905291, 8247254, 8572829, 8913756, 9321347, 9778964, 10249071, 10777135, 11451527, 12287920, 13250804, 14351858, 15615120, 16983137, 18385831, 19876409, 21577219, 23531974, 25749825, 28348094, 31490695, 35230663, 39593181, 44773705, 51065017, 58645524, 67665137, 78485846, 91590655, 107341534, 126151233, 148817308, 176296854, 209201454, 247795065, 291775615, 338378502, 380081618, 405924876, 407631873, 385507124]
36135C85507124l7454187m2264949m0165663l5512311l0354577k5184613k0447570
36128A54123254j6537631j3333684j0546870q190761o358979m911513l707457
36121I0536359k868745k548535k656659l007588l522000m105063m534662m661340
36113F2631767m570273m404420m174070l858507l534298l265530k995081k663862
36105C3165726k324481k039332j783179j537162j359784j272548j190401j057676
36097B0601163r43955r15464r17263q74490q11550p80666p64701p37925p32429
36088A3122720p55176p25636n89972m23350l28776k99118k61969j97683j31442
36079I409598o7134r643j887o5726j52262k13603k70919l48696m00438l73917
$$ y = [385507124, 348052937, 305787988, 265622325, 230110014, 199755437, 174570824, 154123254, 137585623, 124251939, 113705069, 105514308, 99155329, 94243816, 90536359, 87667614, 85119079, 82462420, 79454832, 75932832, 71827769, 67293107, 62631767, 58061494, 53657074, 49483004, 45624497, 42090199, 38824669, 35829588, 33165726, 30841245, 28801913, 27018734, 25481572, 24121788, 22849240, 21658839, 20601163, 19657208, 18741744, 17824481, 16949991, 16138441, 15357775, 14593074, 13855149, 13122720, 12367544, 11641908, 11051936, 10628586, 10299810, 10000692, 9738723, 9541040, 9409598, 9342464, 9332821, 9330934, 9265208, 9112946, 8899343, 8628424, 8279728, 7879290, 7505373]
36069G505373l03175k64512k78984l17269l55428l65207k98433j52064j0754M2974
36059E202521K9287K1932L4681K2139l4640j08137j70387k03198j82642j08061
36049D503495l2222j4905n7112j15025j57600j76203j64884j30610r8974p4643
36039C481317k4242O6385J51121J80532J68625J59791J59885J47646J28192J23610
36029D742862J25204R9313L1158o8214j80362k75704l16725k98936k64424k43304
36019C350868k12075j45278p2483l7071k9184j2607N753r708n3888q1975p4846
36008B627506n4615l7052j3870J5743L5335L7270K7363L066m4061j04368j53382
35997B338935j76477j70404j31196o5398k396L1120M0143M2245L4508P240k4866
$$ y = [7505373, 7202198, 6937686, 6658702, 6341433, 5986005, 5620798, 5322365, 5170301, 5159547, 5202521, 5231808, 5253740, 5288421, 5310560, 5275920, 5167783, 4997396, 4794198, 4611556, 4503495, 4471273, 4456368, 4399256, 4284231, 4126631, 3950428, 3785544, 3654934, 3555960, 3481317, 3457075, 3523460, 3674581, 3855113, 4023738, 4183529, 4343414, 4491060, 4619252, 4742862, 4868066, 4967379, 4998537, 4930323, 4749961, 4474257, 4157532, 3858596, 3594172, 3350868, 3138793, 2993515, 2921032, 2883961, 2854777, 2842170, 2847923, 2838215, 2784327, 2702352, 2627506, 2572891, 2535839, 2521969, 2537712, 2573047, 2610317, 2637680, 2640746, 2596685, 2492317, 2338935, 2162458, 1992054, 1860858, 1795460, 1793064, 1824184, 1864327, 1906572, 1941080, 1948320, 1923454]
35986A923454l8913m1905n9894r4022j16648j07668o9688j3351M6805Q7631R3279
35975A609080P1883L8354o895n9750q9972p0347k1010O796j0571n1405q3610r0480
35963A242073o6697j8791K7556M4320K9718N486j0408j1881O133M3325Q0521R1150
35951A462505O8455K9436l540j2740J3724P2042J36778J77694J79793J43205P9015
35940B346367J5013j5257q059Q62k0761o4807j04159j29422j42564j35613j03921
35929A637679o5688m2280l3500l5675o3423j21983j75843j81385j39461q2041
35919F96400k0626N1950J18353J41892J17821P9740M8907J3842l1146o3489o4824
35908A088820m9518m5079o2716r6491j31553j43644j09913l3518N2612J11682
$$ y = [1923454, 1884541, 1842636, 1782742, 1688720, 1572072, 1464404, 1394716, 1381365, 1428170, 1515801, 1609080, 1680963, 1719317, 1712422, 1652672, 1562700, 1492353, 1471343, 1478139, 1467568, 1416163, 1332553, 1242073, 1175376, 1156585, 1184141, 1228461, 1258179, 1263665, 1253257, 1241376, 1247509, 1290834, 1371355, 1462505, 1530960, 1560396, 1556856, 1544116, 1557840, 1629882, 1766660, 1944354, 2124147, 2267352, 2346367, 2361380, 2346123, 2338064, 2338926, 2318165, 2253358, 2149199, 2019777, 1877213, 1741600, 1637679, 1571991, 1529711, 1496211, 1460536, 1397113, 1275130, 1099287, 917902, 778441, 696400, 675774, 727724, 846077, 987969, 1105790, 1185530, 1234437, 1248279, 1217133, 1153644, 1088820, 1039302, 994223, 931507, 835016, 703463, 559819, 449906, 416388, 469000, 580682]
35898E80682J23556Q4847J1124n6761p1231j8054O8281J33370J42311R6717K8060
35887A122902k5371m7756n4253o5504q2168r3801r7845r0983n6255J2768Q1311
35876F03045R8106N4935j934k3517j622L8942O7330O2645K8033k760O272M9349
35864I78824Q1023P0873L9237K8821N5322R6773J20815J12674Q3511N8226N1608
35853A777707N6113N8563O3778Q9172J38004J91879K29962K42995K29434J93123
35843C270730J47883J12716J00424J19215J80412K88287M22828N49703O52115
35834E844313P42269Q42261R67663J129318J332518J566678J806392K025471K195052
35825A8451935K259198K125654J704901R80996O0116q53266j555327j949922k073334
$$ y = [580682, 704238, 789085, 800209, 743448, 672217, 654163, 722444, 855814, 998125, 1094842, 1122902, 1097531, 1049775, 995522, 930018, 847850, 754049, 656204, 565221, 508966, 521734, 603045, 701151, 756086, 754152, 730635, 729013, 767955, 835285, 897930, 925963, 923203, 929475, 978824, 1059847, 1130720, 1169957, 1198778, 1254100, 1350873, 1471688, 1584362, 1667873, 1726099, 1777707, 1833820, 1892383, 1956161, 2045333, 2183337, 2375216, 2605178, 2848173, 3077607, 3270730, 3418613, 3531329, 3631753, 3750968, 3931380, 4219667, 4642495, 5192198, 5844313, 6586582, 7428843, 8396506, 9525824, 10858342, 12425020, 14231412, 16256883, 18451935, 20711133, 22836787, 24541688, 25522684, 25582800, 24729534, 23174207, 21224285, 19150951]
35816A9150951k023808j882601j699837j514088j344446j173443r74872p62774
35808G775082n87953m83706m37713m19367m10277m01696l84689l55252l16902
35799C977527k71696k18350j59952j02038m5149P674M1138M3291K6294J1055n156
35788C304638m1353r3508j29260j27243r8237o1321k2996J1369K9288K9027K9727
35777B830131N1247R4618J48693K04645K61359L28090M15646N02061N13149L76231
35767E725870J08239j78100l73609m57084m71732m53842m14967l69700l39671
35758B775404l30217l28146l23331l15533l01886k73649k25838j60264q1794J600
35748D36346Q2268J63601K56136L52365M17541M20602L65085K74618J58631J4212
$$ y = [19150951, 17127143, 15244542, 13544705, 12030617, 10686171, 9512728, 8537856, 7775082, 7187129, 6703423, 6265710, 5846343, 5436066, 5034370, 4649681, 4294429, 3977527, 3705831, 3487481, 3327529, 3225491, 3180342, 3188016, 3229154, 3272445, 3298739, 3309794, 3304638, 3263285, 3169777, 3040517, 2913274, 2815037, 2753716, 2730720, 2742089, 2771377, 2800404, 2830131, 2881378, 2975996, 3124689, 3329334, 3590693, 3918783, 4334429, 4836490, 5349639, 5725870, 5834109, 5656009, 5282400, 4825316, 4353584, 3899742, 3484775, 3115075, 2775404, 2445187, 2117041, 1793710, 1478177, 1176291, 902642, 676804, 516540, 434746, 436346, 518614, 682215, 938351, 1290716, 1708257, 2128859, 2493944, 2768562, 2927193, 2941405]
35738B941405j41415k63497l13487k90573k26901j60237j13204q9319q1186q1440
35728A180146q6160r0257q5979o8357l7551M377N1421Q8836J03199J01308J04881
35717A265864J18051J13777O5776j5288r0547j30448j31112j01913n5042n873
35707A033245L2879O2286R3107J27613J52470J52448J27112R3244P2477P3167
35697B020048Q0965P1158L3562k0054p5282j29866j80188k04768j79697j09732
35687A306146l0251K3873M2488L5484J7481N90q431j0091o938L788K5318N0184
35675A449641O5416P2041Q7378J20611J55421J66347J45138J00758M1202k7925
35665B376028q8136j12353r6085p1899p6630j07710j26199j03708n3084q889R781
$$ y = [2941405, 2799990, 2536493, 2223006, 1932433, 1705532, 1545295, 1432091, 1342772, 1261586, 1180146, 1093986, 1003729, 917750, 849393, 811842, 816219, 867640, 956476, 1059675, 1160983, 1265864, 1383915, 1497692, 1563468, 1548180, 1457633, 1327185, 1196073, 1094160, 1039118, 1033245, 1066124, 1128410, 1221517, 1349130, 1501600, 1654048, 1781160, 1874404, 1946881, 2020048, 2101013, 2172171, 2205733, 2185679, 2110397, 1980531, 1800343, 1595575, 1415878, 1306146, 1275895, 1299768, 1342256, 1377740, 1395221, 1395811, 1387380, 1377289, 1370351, 1374139, 1399457, 1449641, 1515057, 1587098, 1674476, 1795087, 1950508, 2116855, 2261993, 2362751, 2403953, 2376028, 2287892, 2175539, 2079454, 2007555, 1930925, 1823215, 1697016, 1593308, 1540224, 1531335, 1541116]
35654A541116R086M041N583J9435M3476O2973N7572J8853m1304j00632j40825
35643A479374j52037j30560q0064j6178L5946N6817M9364L6863L8601M9933N2153
35632A420212L7685J3800j6729o1335j17699j64120j81873j76199j63074j46100
35622D44568j20834r1877o7759m4949j4787J7964M1172N5785P0244P7279N9853
35611D26659K3291j618M954L2197O2698R3466J19499J17604O8353j5909j02378
35600H28816j68145k02841j92336j26161k3626O9019J18682J32830J40117J53276
35590G29631J61228J52387J32699J16500J06927R2593O1477J1923m8105j02913
35580A414347j28928j06735m4804J6578L9032K2144m137j8789k7534m3311o6209
$$ y = [1541116, 1550202, 1554243, 1559826, 1579261, 1622737, 1685710, 1743282, 1762135, 1720831, 1620199, 1479374, 1327337, 1196777, 1116713, 1100535, 1136481, 1193298, 1242662, 1279525, 1318126, 1368059, 1420212, 1457897, 1471697, 1454968, 1393633, 1275934, 1111814, 929941, 753742, 590668, 444568, 323734, 231857, 164098, 119149, 104362, 122326, 163498, 219283, 289527, 366806, 426659, 449950, 448332, 453286, 485483, 548181, 641647, 761146, 878750, 947103, 931194, 828816, 660671, 457830, 265494, 139333, 115707, 184726, 303408, 436238, 576355, 729631, 890859, 1043246, 1175945, 1292445, 1399372, 1491965, 1553442, 1565365, 1517260, 1414347, 1285419, 1178684, 1133880, 1150458, 1189490, 1211634, 1207497, 1188708, 1161174, 1117863, 1051654]
35569A051654q7653j01049j01275q4039n3108k0426O840L2475N9270P8008P4744
35558H55441M5637K001l5311m7301l1595q501m483k6120n6143p5393q0424p8922
35546D58886p7811p8277p4552n8177l3324k4417n1255r5759j13884q7805m7343
35535b83718k9618l6826m8462n6021o2973o1792l7043R145N4402Q2191R6857J10327
35523b63531J25182J33679J24935R1453L6935j9934n5904o1007m4893k6772k0806
35512A9337k7293l3425k4724J302L4800O5951R0301J01353R0846O3964M3331M6329
35500D72072O5087P9481Q3852Q9431J05073J27233J45685J48305J24538P7818
35490A518575L2831J5235K0382J3095l6797j24992k18102k77433k75874k07179
$$ y = [1051654, 964001, 862952, 761677, 677638, 624530, 604104, 610944, 643419, 702689, 780697, 855441, 901078, 903079, 867768, 820467, 788872, 780371, 775888, 749768, 693625, 618232, 537808, 458886, 381075, 302798, 228246, 170069, 136745, 112328, 61073, -34686, -148570, -236375, -283718, -313336, -350162, -398624, -454645, -517618, -579410, -616453, -607308, -552906, -470715, -373858, -263531, -138349, -4670, 120265, 211718, 248653, 228719, 172815, 111808, 66915, 40143, 19337, -7956, -41381, -66105, -64803, -30003, 35948, 126249, 227602, 318448, 382412, 425743, 472072, 537159, 616640, 700492, 789923, 894996, 1022229, 1167914, 1316219, 1440757, 1518575, 1551406, 1566641, 1587023, 1600118, 1563321, 1438329, 1220227, 942794, 666920, 459741]
35480D59741r3699J7249P7936P1328K1041l0439n5596n6246m7630l6060j9289
35469C08336k691K447K331K5952R1288J73545K22906K11840J52589P2702p449
35458A253796p0363r6345p8812l7096r42J6553K4488L7403O1407R3532J24149
35447A327770J38213J22857P9481K5227k0569m9174o1432o1102n4901n2726n6337
35436A337307m8347o019O6224J26626J29709O9822j3103o7912o9611l2687M44
35425A492453j0936p2966j50669k01147k11077j93485j56905r9459l4548K414
35415C63675j2104o1568j06818j21823j03474o0254p389L5048N6401O5507P4461
35404A21662P6689N5428J2634k4380k7939O384O0014J06145J26450J24333J21533
$$ y = [459741, 366042, 383291, 461227, 532555, 553596, 523157, 467561, 411315, 363685, 327625, 308336, 305645, 308092, 310423, 336375, 427663, 601208, 824114, 1035954, 1188543, 1261245, 1253796, 1183433, 1087088, 1008276, 971180, 970238, 986791, 1011279, 1048682, 1110089, 1203621, 1327770, 1465983, 1588840, 1668321, 1693548, 1672979, 1623805, 1562373, 1501271, 1446370, 1393644, 1337307, 1288960, 1282941, 1349165, 1475791, 1605500, 1675322, 1662219, 1594307, 1524696, 1492009, 1492453, 1481517, 1408551, 1257882, 1056735, 845658, 652173, 495268, 395809, 361261, 363675, 351571, 290003, 183185, 61362, -42112, -102366, -109755, -74707, -18306, 47201, 121662, 198351, 253779, 266413, 242033, 214094, 220478, 280492, 386637, 513087, 637420, 758953]
35393G58953J30584J30989Q6730p778j11208j72381j75411j40999r3250m0273
35383C65956J3270N0114M9433J1963l1068m0633m513N0704Q3163P2164L3047p24
35371F52876p803O538K0548J6271r639m9693r3636j31093j50963j44075j08404
35360I27n1579J0539N8297P6668O4128L2542l236l3067m9538m7250l0129j3159
35348A5143j0091k4406n6380j06322j58639j75426j28320l4970N5183J10891J35867
35337c77470J37736J08320M6615k0427n8629n8842l7746j6012l854K652J8270
35326b59387N0318P8884P2233L0156p755j0185R249K0188J9354K1283K1923L828
35314E0089k8044m6921m3279l7427m6815o2156o4159m7170j8160J3178L4271L0319
$$ y = [758953, 889537, 1020526, 1107256, 1099478, 988270, 815889, 640478, 499479, 406229, 365956, 379226, 429340, 478773, 490736, 459668, 419035, 414522, 465226, 548389, 620553, 653600, 652876, 645073, 651611, 672159, 688430, 678791, 629098, 535462, 404369, 253406, 109331, 927, -50652, -40113, 18184, 94852, 158980, 191522, 188286, 155219, 105681, 58431, 28302, 15143, 5052, -19354, -75734, -182056, -340695, -516121, -644441, -679411, -624228, -513337, -377470, -239734, -131414, -84799, -105226, -163855, -222697, -260443, -276455, -280309, -277657, -259387, -209069, -130185, -57952, -27796, -35551, -45736, -36487, -16299, 3055, 24338, 46261, 50089, 22045, -24876, -68155, -105582, -152397, -214553, -278712, -325882, -344042, -330864, -296593, -266274]
35302b66274m449n8173j05556j19678q8824l4026l593l1808j00921j56827j61025
35291a131154j12866k6427Q6575K02008K77292K82985K32374J64590J04662N3900
35281A33939J3698o42K2011O4438Q4839N0224l1490j13605j48295j24470p0495
35270a19848k5244r727j9139l1409k4240O443M2540O3019O5275O0609N2595L2135
35258I3009n095m8345q3088j04570j17055j26416j34098j30215r3714j3302Q7301
35247f75588J58402J68967J35437R8590P8732O3339L4203n069l1643k8480l748
35236f858J4748N018k9090o3902p9442p3334n3737k6104R681N1819Q8667R9970
35224f2564P1256J1292m8445p6883o4019j8632M2331R2982J02167O0701K445k4102
$$ y = [-266274, -270723, -328896, -434452, -554130, -642954, -676980, -680573, -712381, -813302, -970129, -1131154, -1244020, -1270447, -1183872, -981864, -704572, -421587, -189213, -24623, 80039, 133939, 147637, 146995, 169006, 233444, 318283, 368507, 337017, 223412, 75117, -49353, -119848, -145092, -154819, -173958, -205367, -229607, -223164, -180624, -117605, -52330, 8279, 60874, 93009, 87914, 39569, -43519, -148089, -265144, -391560, -525658, -655873, -749587, -762889, -675588, -517186, -348219, -212782, -114192, -35460, 27879, 62082, 57013, 25370, -3110, -6858, 7890, 12908, -16182, -80084, -159526, -232860, -286597, -312701, -303020, -251201, -162534, -62564, 8692, 19984, -28461, -105344, -169363, -187995, -145664, -52682, 49485, 110186, 112631, 88529]
35212H8529r442J0582P343l165J1831N4349R4312J05886Q7170M8905K171l9986
35200D58485o1800n3533j9818K0979M6425M5349K7351J1403K233j3512m3157p2552
35188C47853q5690q9154j00747j19095j22532r8225n5607p515M5028R9882J38733
35177d7069J39506J00900M5156k568l1982m7271n6016n9902n4011l5984j5997
35166f5238j2402l2943o3895q2619p7025m8108j208N2226Q7542Q0736L8952N193
35154a18789J9620P9760J46895J85429J85971J57092J11311O0545J1828l6600
35144H03062q5774j22260j26536r7533n5001j3060L2782Q3771J20154J21767R6044
35133G57416O7709M5653J6221l3379j00219j72051k32322k58801k35081j70172
$$ y = [88529, 79087, 89669, 97012, 93847, 105678, 160027, 254339, 360225, 447395, 496300, 498471, 458485, 396685, 343152, 323334, 344313, 390738, 436087, 463438, 474841, 477074, 463562, 420405, 347853, 262163, 173009, 72262, -46833, -169365, -267590, -323197, -330712, -285684, -185802, -47069, 92437, 193337, 238493, 235925, 203943, 156672, 100656, 40754, -13257, -49241, -65238, -77640, -110583, -174478, -257097, -334122, -382230, -383438, -331212, -243670, -162934, -123982, -118789, -99169, -19409, 127486, 312915, 498886, 655978, 767289, 827834, 839662, 803062, 717288, 595028, 468492, 370959, 315958, 302898, 335680, 419451, 539605, 661372, 757416, 825125, 870778, 886999, 853620, 753401, 581350, 349028, 90227, -144854, -315026]
35123c15026r4217k9071K5628P1938R4730P9091M0950K2754N0848J03350J28894
35112A79869R9240L8325o022j5459j5084l1653n2654m1534J2688P8771J18634
35101C65121J25511J20462J20784J20706J00101M7103k5779q5163r9078o0440
35091G29328Q287P0178R4089O9972J5699l2425m6679l1305j6808l0290p2139j17051
35079F40856j32487j01268l6308K6247N5264M7119J8824j3368l9921n1531m3444
35068C69983k5364j1657k84K3615N9681Q3845P5999M4090J1526r843k4958m1486
35056E55147n9831p2319o5851l1908J8179N3849N0994J5751k2895m1072l5238
35045C64806j5588M822J4242N321k0393n3542q4568j07445j14230r1233l0311
$$ y = [-315026, -409243, -438314, -412686, -340748, -246018, -166927, -125977, -103223, -52375, 50975, 179869, 279109, 317434, 311412, 295953, 280869, 249216, 196562, 155028, 167716, 246487, 365121, 490632, 611094, 731878, 852584, 952685, 999788, 974009, 888846, 789768, 729328, 737615, 807793, 901882, 971854, 987553, 955128, 908449, 877144, 860336, 830046, 757907, 640856, 508369, 407101, 370793, 397040, 452304, 499423, 518247, 504879, 464958, 413427, 369983, 344619, 332962, 332678, 356293, 415974, 499819, 575818, 619908, 631434, 621591, 596633, 555147, 495316, 422997, 357146, 325238, 343417, 397266, 448260, 464011, 441116, 400044, 364806, 349218, 354040, 368282, 373603, 353210, 299668, 215100, 107655, -6575, -97808, -128119]
35034a28119N2000J14737J24739R0779N5822N0565O3515O2090L1132k0219p7127
35023D19914j24900j42347j13989n5663j0316p220l4841o0748o7941o2594n4912
35012c15557m5274k9266r009M051r59k0102l3285k2635R342M5468P4508R7875
35000b44843J18071J30915J30252J12732P9359M0807J7298J9894L2830K8877L346
34989D69538k2147l2202l7040n2294p3629q1485o2597k0706K5466N1294M4850
34978B09048K1829J1137K0882L0732K2857N288m115j843O991K8111P4762J44618
34966E70297K07745K19241J48370P807j43189k37932k53077k15048j59043r9300
34956D5871m2205l507N142o259j7273j6962l278K4259N8872Q5734R9704J12567
$$ y = [-128119, -76119, 38618, 163357, 254136, 309958, 360523, 424038, 486128, 517260, 497041, 419914, 295014, 152667, 38678, -16985, -27301, -34521, -69362, -130110, -198051, -260645, -315557, -360831, -390097, -399106, -395055, -396014, -416116, -449401, -472036, -462694, -417226, -342718, -244843, -126772, 4143, 134395, 247127, 326486, 367293, 384591, 404485, 437315, 466192, 469538, 447391, 415189, 378149, 325855, 252226, 170741, 108144, 87438, 112904, 164198, 209048, 230877, 242014, 262896, 293628, 316485, 321773, 317658, 315815, 322806, 350917, 425679, 570297, 778042, 997283, 1145653, 1153460, 1010271, 772339, 519262, 304214, 145171, 45871, 3666, 159, 5301, -958, -18231, -35193, -38471, -14212, 44660, 130394, 230098, 342665]
34944C42665J30683J38975J21365Q3750M1281k659m5558o7473m8587j25M2321
34933G36638N2358K4114l8783j20547j83687j88597j29539l8068M7866J04959
34923B66714J22528J01918N8284N631n7949j33046j93584k04152j63305j05690
34913c02651n9242k4711L39Q443N546J9150O2237J07214J15879Q2153K7807l0241
34901A1923q6129j27103j34693j07968o9883m3962l1959j7381J4159N9282R7065
34890d36649J03969P1996J5079l9951o7482n4423p736M7801Q7438J05282J10559
34879f4117J06877Q6718M9833J4696J548R061J5347l02l9437q1720r5994o2992
34867f0482K714N6797O1961K4226j1173k099N2106J12338J37639J22468R7527
$$ y = [342665, 473348, 612323, 733688, 817438, 858719, 856060, 810502, 743029, 694442, 694317, 736638, 788996, 813110, 774327, 653780, 470093, 281496, 151957, 113889, 161755, 266714, 389242, 491160, 549444, 555075, 497126, 364080, 170496, -33656, -196961, -302651, -361893, -386604, -386265, -377822, -372276, -353126, -290889, -183675, -67796, 14357, 42164, 11923, -74206, -201309, -336002, -443970, -513853, -557815, -589774, -607155, -592996, -533714, -436649, -332680, -260684, -245605, -285556, -353038, -407461, -415197, -367396, -279958, -174676, -64117, 42760, 129478, 179311, 194007, 195555, 204616, 219963, 219661, 180224, 98504, 2510, -60482, -57768, -971, 60990, 85216, 74043, 71944, 124050, 236388, 374027, 496495, 594022]
34856E94022R4323J12326J24801J12178P9739M2393M623l6987p9971j16120j43233
34845G88094j66373j84884j85818j56730j02730m5157k364K3551L8699M1996K5087
34834G3371j4024o4974j11899j37488j21623n2973M8150J31110J55669J28734
34824C4053Q9550O2747L9519L332m1890p5604q4499p7470p9744j10692j61403
34813d02101j95631j79981j13014k1111O7691J36762J76332J84306J73719J65254
34803g774J66682J67566J55488J27903Q7533L8124j0693m3814n2005m0114k5517
34792E63379l2516p8974j53226k08649k00972j33787n1281J4229O6294J12790
34782a02713J38245J24685Q0669K9352j8879o1011p9776n3627J0865P6563J10827
$$ y = [594022, 688345, 800671, 925472, 1037650, 1117389, 1159782, 1164405, 1127418, 1047447, 931327, 788094, 621721, 436837, 251019, 94289, -8441, -53598, -55962, -32411, 6288, 48284, 73371, 59347, -5627, -117526, -255014, -376637, -429610, -381460, -250350, -94681, 34053, 123603, 186350, 225869, 229201, 187311, 111707, 27208, -50262, -130006, -240698, -402101, -597732, -777713, -890727, -911838, -844147, -707385, -531053, -346747, -173028, -7774, 158908, 326474, 481962, 609865, 697398, 735522, 724829, 681015, 629010, 588896, 563379, 530863, 451889, 298663, 90014, -110958, -244745, -296026, -281797, -215503, -102713, 35532, 160217, 240886, 270238, 251359, 190348, 110572, 56945, 67810, 144373, 255200]
34771B55200J10079Q7538N2229R147l0260n1877n5027n8003q2063j29420j79802
34760g2259k09608k10415j86568j42446q1586j3847M9162J05020J55160J90410
34750d16977J97709J81790J60395J32433P3281k4535j26601j93115k25514k52438
34740d93572k78654k75793k24464j41232n7917O467M6196O0784O0134O5682R1256
34729a141113J26004J44622J31091Q7170K5200l6376p4140p2163m1592k0043l8889
34718i10229q8379j23158j08433n5266j996L4373P3450J34943K01577K30687J97173
34707d15258J15752K5993l4220m5029j0522M4642R0593J10366J05171Q6523O7574
34696A41585N8022N9046O2235N7677M2775K0850m509k8326m2930m6629n0751o7787
$$ y = [255200, 365279, 452817, 505046, 514193, 483933, 432056, 377029, 319026, 236963, 107543, -72259, -281867, -492282, -678850, -821296, -902882, -916729, -867567, -762547, -607387, -416977, -219268, -37478, 122917, 255350, 328631, 304096, 177495, -15620, -241134, -493572, -772226, -1048019, -1272483, -1413715, -1471632, -1465165, -1418969, -1358185, -1298051, -1232369, -1141113, -1015109, -870487, -739396, -652226, -627026, -663402, -737542, -809705, -851297, -871340, -910229, -998608, -1121766, -1230199, -1285465, -1287461, -1253088, -1179638, -1044695, -843118, -612431, -415258, -299506, -273513, -307733, -352762, -363284, -318642, -228049, -117683, -12512, 74011, 141585, 199607, 258653, 320888, 378565, 421340, 442190, 437681, 409355, 366425, 319796, 269045, 201258]
34684B01258r2434j03358q4371l6862K6283Q6727J20884J11237O7876K7950K0082
34673C45272L3378L2705K194l8801o4012p1144p6043q4473q3215o0605k5235L493
34661h6486J9145L4135O0713R2203J07242R1820N4989K2165J1476J7201K0898
34650D45501J9926L4638P6626J17639J10063M2282m3165r4992j01334q2201n2529
34639D72454j5910J4029J5424j1320l4110k1918K2414O8425Q7627P1317K9707
34628F98139j7372n4445q1499j06216j22605j08693n4360J7881P2582R6424J00593
34617D40429R2342O2534O796n6061r9629j18214j27710j38385j37189j03037l5946
34606b14070L5264P6387P7461N7903M3092L8559K9014J80m3610q4665j08697j10997
$$ y = [201258, 108824, 5466, -78905, -115767, -89484, -2757, 118127, 229364, 297240, 325190, 345272, 378650, 411355, 413549, 374748, 310736, 239592, 163549, 79076, -4139, -64744, -89979, -86486, -67341, -33206, 27507, 119710, 226952, 318772, 373761, 395926, 407402, 424603, 445501, 465427, 500065, 576691, 694330, 804393, 846675, 803510, 708518, 607184, 524983, 472454, 456544, 470573, 485997, 474677, 440567, 418649, 441063, 509488, 597115, 668432, 698139, 680767, 626322, 544823, 438607, 316002, 207309, 152949, 170830, 243412, 339836, 440429, 532771, 595305, 602101, 546040, 446411, 328197, 200487, 62102, -75087, -178124, -214070, -178806, -102419, -24958, 32945, 76037, 114596, 143610, 143790, 100180, 15515, -93182, -204179]
34594b04179r0670m9975k526K7553K4072o361m4018p5939r6839r5165n6169J3802
34582f56414P9330J05155Q8526N3196J7514j7890n2887p4568o8545l5678Q469
34571e53792M6535O9165P7765Q0546Q0101O3561J5141n5203j05869r9400m1444
34560d22894K6601P1300R1281R8897R5438P4049L5500j2146o3498j12148j39461
34549b57081j22400n8806K2892Q4580J05818R1109N9151K9226J0778R7r180j0212
34537e4028J4537O9623J32950J72969J73633J36572O9540j3477q6832j24781j20351
34526C70355q3775k6580L8988Q9668J02000P8794M8076K9853K0011J2346J5267
34515F95003L3098M9550M9065M1509M4796N2365M1411J0109j6428j9842q955j756
$$ y = [-204179, -294849, -344824, -347350, -319797, -295725, -302086, -346104, -422043, -518882, -614047, -670216, -656414, -577084, -471929, -383403, -330207, -312693, -330583, -383470, -458038, -526583, -562261, -553792, -507257, -438092, -360327, -279781, -199680, -136119, -120978, -176181, -282050, -381450, -422894, -396293, -324993, -233712, -134815, -39377, 34672, 70172, 58026, -5472, -117620, -257081, -379481, -438287, -415395, -330815, -224997, -133888, -74737, -45511, -34733, -34636, -43816, -54028, -39491, 30132, 163082, 336051, 509684, 646256, 715796, 702319, 615487, 490706, 370355, 286580, 260000, 298988, 388656, 490656, 569450, 617526, 647379, 667390, 679736, 695003, 728101, 777651, 826716, 868225, 913021, 965386, 1006797, 1016906, 1000478, 980636, 971681, 969925]
34503I69925m065j3831l3216o5737j06882j43442j60344j50725j26769j16596
34493D8318j36991j68957j73982j36959p9349k7479J5343N7705R7680J24824J34310
34482b45537J26598J00968O1455K3185J019m399m59J1095K9752M2708L0340j2012
34470A64713o5585j02602j04843p1807j9000L2914P3767J07323J35467J46450
34460B96797J27917Q4275K8659l5240j05303j58799j62835j15360n5770k0773
34450a16432m246K2580O1459P8626M5660k7007j00849j42418j42206j11412o9413
34439e05658l2569q827K006P236K0607N4110J01890J35958J29031Q4126L4355
34428B2265J0512J4128K3931K1589O613q558j1689K62K2068M9615Q6044J32897
$$ y = [969925, 965860, 952029, 918813, 853076, 746194, 602752, 442408, 291683, 164914, 48318, -88673, -257630, -431612, -568571, -647920, -675399, -660056, -602351, -504671, -379847, -245537, -118939, -17971, 43484, 66669, 67688, 63289, 62830, 73925, 103677, 146385, 176725, 164713, 99128, -3474, -108317, -180124, -199124, -166210, -92443, 14880, 150347, 296797, 424714, 508989, 537648, 502408, 397105, 238306, 75471, -39889, -95659, -116432, -120678, -98098, -36639, 41987, 87647, 60640, -40209, -182627, -324833, -436245, -505658, -538227, -547054, -545048, -537812, -517205, -463095, -361205, -225247, -96216, -12090, 22265, 32777, 46905, 70836, 92425, 99038, 90480, 78791, 79053, 101121, 150736, 236780, 369677]
34416C69677J75350J85845J48975P7927O98o4403j12066j34820j18926o0301K2558
34405D90514R6892J35732J30912R2781M0440j1474n9414j03315j34188j36661
34395E42219j07978o9525n2242o8868j01731j17515r4763m0741J6114N1431O3273
34384A9674O4560O1736N0603L3630K7082L9675N3486M3169J3173j553K1900O5414
34372D92549R3720R5815Q7201P7167N4255R825l9393o5164n8809l8721k9514m1493
34360F37438o7923r2224r6678p4058l6606p817P97J800J5855M5987P2872P4877
34348D74320M8868J2144j2291j3400q4P142m498k7937m4669m3420k7344n290J6734
34335C80275L3194L4007Q443m3643j04241j42523j34113q1632j5065L3823N6793
$$ y = [369677, 545027, 730872, 879847, 957774, 958472, 894069, 782003, 647183, 528257, 467956, 490514, 587406, 723138, 854050, 946831, 987271, 975797, 916383, 813068, 678880, 542219, 434241, 364716, 312474, 243606, 141875, 24360, -70403, -111144, -95030, -43599, 19674, 84234, 145970, 196573, 230203, 257285, 296960, 350446, 393615, 406788, 405235, 427135, 492549, 586269, 682084, 769285, 846452, 900707, 910532, 871139, 805975, 747166, 708445, 678931, 637438, 569515, 477291, 380613, 306555, 269949, 262132, 262929, 264729, 280584, 326571, 399443, 474320, 523188, 535332, 523041, 509641, 509557, 516699, 512201, 484264, 439595, 396175, 368831, 363541, 380275, 413469, 447476, 455919, 412276, 308035, 165512, 31399, -50233, -65298, -31475, 25318]
34324B5318O5226O6815N8436M1044K4893J2593q775m6288q2620r3921p9251n6222
34312g2752l3659r844L578j6827o9170j12396j08698o6663k2427J1158N0871J01060
34300c45769J34260J26401R2961P4320R4328J44746K00275K33817K24004J67322
34290A146665Q6574J5277l1006o1200q7357j07884j15471j11693j07115j12084
34280E14706j30620j56708j72943j60743j18637o5537k1187J1269L9412O6968
34270a94020R2694J15227J27362J11307N4941k6552r7769j35794j47356j51409
34260b51369j54278j46919j18609o7181j348O1034J01598J15958J18902J29653
34250b12559J50676J64297J52442J19173R1268R3584J23287J50925J47430J06545
$$ y = [25318, 90544, 157359, 215795, 256839, 281732, 294325, 285550, 239262, 156642, 62721, -16530, -72752, -106411, -116255, -112677, -129504, -198674, -311070, -419768, -486431, -508858, -497700, -446829, -345769, -211509, -85108, 7853, 82173, 176501, 321247, 521522, 755339, 979343, 1146665, 1233239, 1248516, 1217510, 1156310, 1068953, 961069, 845598, 733905, 626790, 514706, 384086, 227378, 54435, -106308, -224945, -290482, -311669, -300400, -260988, -194020, -101326, 13901, 141263, 252570, 307511, 280959, 183190, 47396, -99960, -251369, -405647, -552566, -671175, -738356, -739704, -678670, -577072, -461114, -342212, -212559, -61883, 102414, 254856, 374029, 465297, 558881, 682168, 833093, 980523, 1087068]
34240A087068M2117k5487p3976q3344n4250k1387l0962r6560j84400k44534k48172
34229F6113j95349j03840j842P9612J22288J28799J10597P4778K9809n142j1317
34218B94506R951L9176O0099P0003O9956N8092L8704K8445M2852P7170J06767
34207H95721J08312P8640L3741o285k9805l7079l8965n1887q5176j28081j55516
34196E83620j54071j38396j33853j46238j58373j54839j38090j18166r7516p1453
34186g27375l6213P892N6094J00390J37100J72341K10219K36106K25079J70850
34176E52483R4716K2598l3749p0366q4889q5970r1307j03133j00435o9209k5501
34165E238P415K9377N2091P3608Q8621J10614J51704J85306J62452P1219m5346
$$ y = [1087068, 1129185, 1103698, 1029722, 946378, 892128, 870741, 839779, 743219, 558819, 314285, 66113, -129236, -233076, -234918, -155306, -33018, 95781, 206378, 281156, 310965, 305823, 294506, 304457, 343633, 403732, 473735, 543691, 601783, 640487, 668932, 711784, 788954, 895721, 1004033, 1082673, 1116414, 1110129, 1080324, 1043245, 1004280, 952393, 867217, 739136, 583620, 429549, 291153, 157300, 11062, -147311, -302150, -440240, -558406, -655922, -727375, -763588, -755696, -699602, -599212, -462112, -289771, -79552, 156554, 381633, 552483, 647199, 669797, 636048, 565682, 480793, 394823, 303516, 200383, 99948, 30739, 5238, 12653, 42030, 94121, 167729, 256350, 366964, 518668, 703974, 866426, 937645, 892299]
34154H92299j34388j71235j50754p6540K3739J00029J22711J10264R6756Q7388
34144I00269O6463L5001J3370R419O379j4648n4584r9472j30326j29115q8900
34133E13856k4544L3262N9170M7920J1493l3329p6530j17872j55468j71617j42355
34122e6014p0078M633L8921L0702J2677R584J9382L4292N7187Q8516J14523J21739
34110D06064J12771R5665O6156J4828n0752j04148j23300j10150q7221p9515r7671
34099D2727j31100j55383j50537j14566o0202l154M2958O7034O6574N2619L8868
34088c04162K4656j400l7703o0742m7807j547N5406J02546J28602J25575R3792
34077G7216N3871L7598N9172J03628J47097J77318J88496J70022J16816M8403
$$ y = [892299, 757911, 586676, 435922, 359382, 383121, 483150, 605861, 716125, 812881, 900269, 966732, 1001733, 1015103, 1024522, 1030901, 1016253, 961669, 862197, 731871, 602756, 513856, 489312, 522574, 581744, 629664, 641157, 607828, 531298, 413426, 257958, 86341, -56014, -126092, -121459, -82538, -51836, -39159, -29575, -10193, 24099, 81286, 169802, 284325, 406064, 518835, 614500, 680656, 695484, 644732, 540584, 417284, 307134, 219913, 140398, 42727, -88373, -243756, -394293, -508859, -569061, -572215, -529257, -462223, -395649, -343030, -304162, -279506, -280906, -318609, -379351, -427158, -428705, -373299, -270753, -142151, -16576, 77216, 131087, 168685, 227857, 331485, 478582, 655900, 844396, 1014418, 1131234, 1179637]
34067A179637L792J1214O4464J27046J56047J26500M2699o7588j68104k25511
34057A250196k17047j43842m1212L8748O7463N7265L2647k664n5845j15440j56723
34046G13546j74653j86002j92227j64441q2022K8511J11958J35937J10239O1382
34036C62228O329m5794q1211q3145m6170J4619P0499R7523R0033N6474N551n5754
34024C91182j09726j26085q5674m570P5021J19481J23679R8897N4723O61m4049
34013D93540n8058l8796o849J5649K4775K7757K3860M394k9116n9087o8836n7335
34001B71898l3217l582K4539M0813M0601L3085L1115L6148M1214M3753M4821L9302
33989F10490J9145j4296n1490q6245j14627j25681j10183q1088o8480q6669j18547
$$ y = [1179637, 1183429, 1194643, 1259107, 1386153, 1542200, 1668700, 1711399, 1643811, 1475707, 1250196, 1033149, 889307, 848095, 886843, 954306, 1011571, 1044218, 1041554, 985709, 870269, 713546, 538893, 352891, 160664, -3777, -85799, -57288, 54670, 190607, 300846, 362228, 368557, 322763, 241552, 158407, 112237, 126856, 197355, 294878, 384911, 441385, 446936, 391182, 281456, 155371, 69697, 65127, 140148, 259629, 383308, 482205, 536928, 537589, 493540, 435482, 396686, 389837, 405486, 430261, 458018, 481878, 486272, 457156, 398069, 329233, 271898, 238681, 235099, 259638, 300451, 341052, 374137, 405252, 441400, 482614, 526367, 571188, 610490, 629635, 615339, 563849, 477604, 362977, 237296, 127113, 46025, -22455, -109124, -227671]
33978b27671j38912j39706j23506q7005k7894L8201Q4695J00316R8833R9913J05911
33967b16825J00553O9090J8315k6021m4819m5891n2673p5684j04353j24321j27716
33956f30345j04147m0117N9745J60858K20705K19581J66897R0012K4998K331K2216
33945A92734M9606M9244K1820p165k5750m1938n4803m4541j247N3357Q6147Q6068
33933C63532O8048N1101M2928M1828M2970M1156L3222K0064M503j2692l2211n0643
33921F13806n7935m4989j6397Q414J4174R367J7371M4411O6759N8340K3134j0701
33909G25754k2304j0549J9174O0937R8146J06629P9888M0686J6349J0537J0343
33898A135590J2269K2755L3624J7506l9713j11604j50909j36292r0576n3141m4168
$$ y = [-227671, -366583, -506289, -629795, -716800, -744694, -706493, -621798, -521482, -422649, -322736, -216825, -116272, -47182, -28867, -54888, -99707, -145598, -198271, -273955, -378308, -502629, -630345, -734492, -774609, -714864, -554006, -333301, -113720, 53177, 143189, 168187, 170518, 192734, 242340, 291584, 313404, 306239, 280489, 238551, 183748, 139207, 137960, 191317, 277464, 363532, 431580, 482681, 525609, 567437, 610407, 651563, 684785, 704849, 709352, 696660, 664449, 613806, 555871, 510882, 494485, 502899, 517073, 526440, 543811, 588222, 654981, 713321, 736455, 725754, 703450, 692901, 712075, 773012, 871158, 977787, 1057675, 1098361, 1114710, 1125247, 1135590, 1147859, 1170614, 1204238, 1221744, 1182031, 1070427, 919518, 783226, 692650, 639509, 595341]
33887E95341n7451p5140p9279n6480n891N5046J00398J13384R1772M1849k1841
33876G01708p3467q9083p0155m5251m2524o6653j02668j27942j15260m3679P4374
33865f00J84967K32279K09031J56464J14740Q5558M5342j7319q5594j31578j43916
33854F49374j36605j29485j22557r7701m7589Q327M4244N4151M7034K6467q017
33843B87643m3521n6024l3484J3028N9788Q1772O0083k340p0779j03426r3646
33832I9094p4505p5586q9219q7668o1424k9524j8774l9562p5300r0881o0656N732
33820e98273P2382J14258J34283J41915J34705J13829J00112J11613J30431J12612
33810E67867L5310p5421j63124j80283j17420r852Q4178J26408J25019J12876
$$ y = [595341, 537890, 462750, 383471, 326991, 321100, 376146, 476544, 589928, 681700, 723549, 701708, 628241, 539158, 469003, 423752, 381228, 314575, 211907, 83965, -31295, -74974, -600, 184367, 416646, 625677, 782141, 896881, 982439, 1027781, 1010462, 924868, 793290, 649374, 512769, 383284, 260727, 163026, 115437, 123764, 168008, 222159, 269193, 295660, 287643, 244122, 188098, 154614, 167642, 227430, 309202, 369285, 366945, 296166, 192740, 99094, 24589, -50997, -140216, -227884, -289308, -318832, -337606, -377168, -452468, -543349, -604005, -598273, -525891, -411633, -277350, -135435, -730, 113099, 213211, 324824, 455255, 567867, 603177, 527756, 364632, 184349, 66929, 57077, 141255, 267663, 392682, 505558]
33800E05558J03248P9372K6519m1835r5869j15943j01636o6175l1651k1873m7467
33789A92248r6735j44908j70197j59372j06698j8372Q2299J62670J98766J86700
33779A26401J40377Q3068L9520K7330M7831Q3102J04690R0818M0377k8600r6037
33768F58877j55259k08365k47997k52394k05176j16514j8152O1506J13092J41799
33758b28583J57598J70334J82812J82291J47620P4974p889o4253q5223r3971j11651
33747C24059j30518j28263j00913o9997n8509o9835r2335j15571j35144j45884
33737g22910j39440j12256p2957l8692k4197l4697o5595j02460j20272r2144j1319
33726a536939R3149J71507J91545J61071J11478O5579K6786p595l5646n4980o7142
$$ y = [505558, 608806, 688178, 714697, 672862, 576993, 461050, 359414, 293239, 261588, 239715, 192248, 95513, -49395, -219592, -378964, -485662, -504034, -421735, -259065, -60299, 126401, 266778, 349846, 389366, 416696, 464527, 547629, 652319, 743137, 783514, 754914, 658877, 503618, 295253, 47256, -205138, -410314, -526828, -544980, -483474, -370382, -228583, -70985, 99349, 282161, 464452, 612072, 687046, 679157, 614904, 529681, 435710, 324059, 193541, 65278, -35635, -105632, -164141, -233976, -326311, -441882, -577026, -722910, -862350, -974606, -1047563, -1086255, -1110452, -1145149, -1210744, -1313204, -1433476, -1525620, -1536939, -1443790, -1272283, -1080738, -919667, -808189, -742610, -715824, -723419, -759065, -814045, -881187]
33715h81187p2118o4803m2767j3002J5550M3169P5353J08095J25418J16071Q8542
33704e01679O4869O0182O9963P5173N8364J8905k3099m0989k6212K055J8847K4191
33692a99430M1691Q3155J26530J39161J14944P5712M0803J0880j8549m5537p0292
33681B99068j00297j34831j54284j39358r7747n9739m6288m9089m2436r500M1746
33670d92755Q2447Q4610M6729j448k5222j6705L300J2101O248l128n783J543J7939
33657b90124M0228O3132Q1335R1588R1708P9243N4014K2600k679j3379j4304j7921
33645A85441k5039j7352J9388O6495Q2902N2140N552j3909j696J0194o03k1759
33633C41754l0099k3186j7199k2751l3678l7428k9670j7931j2937j6604j9326
$$ y = [-881187, -953305, -1018108, -1060875, -1073877, -1058327, -1015158, -939805, -831710, -706292, -590221, -501679, -436810, -376628, -306665, -231492, -173128, -154223, -177322, -218311, -244523, -242468, -223621, -199430, -157739, -74584, 51946, 191107, 306051, 381763, 422566, 433446, 414897, 369360, 299068, 198771, 63940, -90344, -229702, -327449, -387188, -433476, -482565, -525001, -534501, -492755, -410308, -325698, -278969, -280417, -305639, -322344, -319044, -306943, -300695, -303823, -309606, -308063, -290124, -249896, -186764, -105429, -13841, 77867, 157110, 211124, 233724, 231045, 217666, 203362, 185441, 160402, 143050, 162438, 228933, 311835, 363975, 369527, 355618, 353922, 364116, 363513, 341754, 311655, 288469, 271270, 248519, 214841, 177413, 147743, 129812, 116875, 100271, 80945]
33622H0945j0675Q581K6230K6868m18n3430j08122j27378r3427l0873J4736K1544
33610b45419M730j1320j7997j8819k0101l2871o6491j07302j17511p3139L386
33599g02854O4145Q5580Q3356Q1155Q3414Q3385Q1353Q2152Q1714O8688L9467
33588A31555L885k5566m4438n3895n3303m1077k0934j143J2666J8400J1884r932
33576g1898l6223m4226k5035m92r95k9747o3274q5629j03939j25396j37506j24733
33564h49093r4096o9277o3380o9359p4722p3538o1861l1349K4708R9040J67257
33553a095670K01432J91291J52747J13247Q9839Q3306Q6253Q6013O4372J2595
33543a4575m8476p9594o4422k8511p927j0682j9881k1765j4284K795K6402M1952
$$ y = [80945, 70270, 78851, 105081, 131949, 131531, 78101, -30021, -157399, -250826, -281699, -266963, -245419, -240689, -252009, -270006, -288825, -308926, -341797, -408288, -515590, -633101, -706240, -702854, -638709, -553129, -469773, -388618, -305204, -221819, -140466, -58314, 23400, 92088, 131555, 135440, 109874, 65436, 11541, -41762, -82839, -103773, -104916, -92250, -73850, -61966, -71898, -108121, -152347, -177382, -177874, -178869, -208616, -271890, -357519, -461458, -586854, -724360, -849093, -943189, -1012466, -1075846, -1145205, -1219927, -1293465, -1355326, -1386675, -1361967, -1262927, -1095670, -894238, -702947, -550200, -436953, -347114, -263808, -177555, -91542, -27170, -14575, -63051, -142645, -207067, -235578, -243505, -254187, -274068, -295833, -310117, -307322, -280920, -238968]
33531b38968L4502Q799j5203k4590j6645J5109P4351J37088J57715J15974M5306
33520B93438P97P387M9743J01410J46981J79930J94887J85314J42806O2565m1627
33509A323631j33329j78886j77994j57661j36091j07625o7959l6581l8394p0438
33499B18673j02862j12726j03868r0993p6368n0707j1302K9151N1823M6694K0230
33488a82255q564k1335j3319O139K5498M0173M8742M5794K5338q414l7271l7753
33476a17227L969P9103J54165J88142J61781R2865K0351k5213l4841j3761K7177
33465E36511P2599J04776J09340P7930R940p9748j57221j86186j53568p4677K3872
33454B83568J15021J67427J52752P2959k7608r3081j01628p6597n7059o3419q6199
$$ y = [-238968, -204466, -195667, -210870, -235460, -252105, -236996, -162645, -25557, 132158, 248132, 293438, 294235, 301622, 351365, 452775, 599756, 779686, 974573, 1159887, 1302693, 1365258, 1323631, 1190302, 1011416, 833422, 675761, 539670, 432045, 364086, 327505, 289111, 218673, 115811, 3085, -100783, -191776, -268144, -318851, -330153, -301002, -249179, -202485, -182255, -190819, -212154, -225473, -219334, -193836, -153663, -104921, -59127, -33789, -42203, -79474, -117227, -113258, -34155, 120010, 308152, 469933, 562798, 583149, 557936, 523095, 509334, 536511, 609110, 713886, 823226, 901156, 911096, 831348, 674127, 487941, 334373, 259696, 283568, 398589, 566016, 718768, 791727, 764119, 671038, 569410, 492813, 435754, 372335, 286136]
33443B86136r7603p3544j2871O0413J14679J31756J14229P9679N0449M0547M3121
33432G36991L2153j6731j04125k03483k75345k86625k27821j20449m346Q8075
33422c81706J44739J65552J54834J26024R7024O7765J5821o6655j40536j49387
33412C3475q4117K561N3394O1454N8556O5143O8866M7545j897n9531r8791j04171
33400D2487p8739l9954q858L5j4893m1036n9305n9937n1362m9293n7870o6335
33388d85060o2261m0284J506O2452J30461J79553J85806J47468Q7642L7510J4875
33377B59668J3046P856k0732p0504j20133j48495j48067j22980q2339l5933J1652
33366d56961O5161J28975J90091K19780J99735J41942P7348K9641M891j105M451
$$ y = [286136, 188533, 114989, 102118, 162531, 277210, 408966, 523195, 602874, 653323, 693870, 736991, 769144, 752413, 648288, 444805, 169460, -117165, -344986, -465435, -469781, -381706, -236967, -71415, 83419, 209443, 306467, 374232, 390053, 323398, 182862, 33475, -50642, -48081, 5313, 66767, 125323, 190466, 259332, 306877, 304980, 245449, 146658, 42487, -36252, -76206, -85064, -85029, -99922, -140958, -200263, -260200, -311562, -360855, -418725, -485060, -547321, -587605, -586099, -523647, -393186, -213633, -27827, 119641, 207283, 244793, 259668, 272714, 280570, 259838, 189334, 69201, -79294, -227361, -350341, -432680, -468613, -456961, -391800, -262825, -72734, 147046, 346781, 488723, 566071, 595712, 600603, 599498, 603949]
33355F03949J4986L0701N8568R5425J13011P6074j6413j18532j77954j85884j76684
33344C17247j79726j85333j64851j13977o1837l7335l9827n0042n9144p1807q2266
33333g28898o5756o425P3542J27454J29307R6916O7516N9570O5390P3241Q2400
33322b5743R3791R6488P2768J5043o6044j46798j98908j98333j39248m5028M2249
33311d99763R2485J08247J11416J12249R9497O2819J6911n838J1970N2518P8569
33300B41080O7247K5293k5483o9126r8939j08361q9400m2148J9439P3723J02861
33289I6186J01805Q2305O6633O8719P8589P1926L8373n450l4431m0063l2376k3831
33277D68385j9626k0364k5187l1713l8655m8703o3745p7545p8800o2852l6472
$$ y = [603949, 618935, 649636, 708204, 803629, 916640, 992714, 976301, 857769, 679815, 493931, 317247, 137521, -47812, -212663, -326640, -388477, -425812, -465639, -515681, -574825, -646632, -728898, -794654, -801079, -727537, -600083, -470776, -373860, -306344, -246774, -181384, -108143, -25743, 68048, 164536, 237304, 252347, 186303, 39505, -159403, -357736, -496984, -542012, -499763, -407278, -299031, -187615, -75366, 24131, 86950, 103861, 98023, 109993, 162511, 241080, 308327, 333620, 308137, 239011, 140072, 31711, -57689, -99837, -80398, -6675, 96186, 197991, 280296, 346929, 415648, 494237, 566163, 604536, 599086, 564655, 524592, 492216, 468385, 448759, 428395, 403208, 371495, 332840, 284137, 220392, 142847, 64047, 1195, -35277]
33266c5277r974J2009L1126N0555P1140Q9082R4967P7628L3829k3687o9897q4489
33254B37012o9185m7873m6663p2389j09296j32834j25158q4237k5634K7903O6446
33243c81908R9198J31993J46048J18450O3532K9105L9547O2951N2723N522m4755
33232C22406p8190j03908j25581j23351q2912k2534K3652L7558K1630j5014n8893
33221b05137q7810q2336m5793n214J0098j0706n5604r7857j10380q3403l5593
33210h09735m853k0233p6821j36840j57535j21608m4638M1482J08182J38139J26610
33199i57850Q3511L0442j1116k8754j6662K6436Q8687J41440J57856J36266R6103
33188b53641N1120j978o4577j17296j31524r9734m8466j7388k4392n1851o8434
$$ y = [-35277, -45251, -33242, -2116, 48439, 119579, 208661, 303628, 381256, 415085, 391398, 321501, 237012, 167827, 119954, 73291, 902, -108394, -241228, -366386, -450623, -476257, -448354, -381908, -282710, -150717, -4669, 113781, 177313, 206418, 245965, 308916, 361639, 367161, 322406, 244216, 140308, 14727, -108624, -191536, -214070, -190418, -152860, -131230, -146244, -205137, -292947, -375283, -421076, -426290, -416192, -426898, -482502, -580359, -690739, -774142, -809735, -814588, -834821, -911642, -1048482, -1206017, -1327625, -1372263, -1330781, -1222599, -1084460, -957850, -874339, -843897, -855013, -883767, -900429, -873993, -785306, -643866, -486010, -349744, -253641, -202521, -204499, -269076, -386372, -517896, -617630, -666096, -683484, -707876, -759727, -828161]
33177h28161o1541m2942k6450j4045p465j5694l6999m6858k3835J8290M4031L9480
33165a002189K3483J7473K5881M7648Q2411J16831J28062J15444J10556J39077
33155a95323J86273K16252K12726J83675J38475Q3191L2013n41j9626m2427o8047
33144G26641p4443n2087k3258j5364k5578k4874O655N7701R6524R7172N8021K573
33132H29683l8170n1750n6390q2547j38144j94832k13778j83512j26425o9382
33122c25247j9281K6906O0537O6195M5944K2040J0526N023n829j7035j5997n887
33110a52105n072k1920m1443m2615k3810n749j0670m2272q7184j32773j77246
33099g42859k18850k41101k20081j50457n8074J9180O1719P8024Q8495J04293
$$ y = [-828161, -889702, -932644, -959094, -973139, -980604, -996298, -1033297, -1080155, -1103990, -1085700, -1041669, -1002189, -978706, -961233, -935352, -887704, -805293, -688462, -560400, -444956, -334400, -195323, -9050, 207202, 419928, 603603, 742078, 825269, 857282, 856741, 837115, 794688, 726641, 652198, 600111, 576853, 561489, 535911, 511037, 517692, 575393, 671917, 769089, 827110, 829683, 791513, 739763, 683373, 600826, 462682, 267850, 54072, -129440, -255865, -325247, -344528, -317622, -257085, -190890, -144946, -122906, -112380, -107357, -113186, -130221, -146218, -152105, -157177, -179097, -220540, -263155, -286965, -292714, -303384, -345656, -432840, -565613, -742859, -961709, -1202810, -1422891, -1573348, -1631422, -1612242, -1550523, -1472499, -1384004, -1279711]
33089a279711J21047J28620J22757J05556P8543M4289J6504J5959M4846P2918
33079e28672O5145K2095k0922l4374j9633N749K8339L8201K6948r77k6898l8130
33067d83129l8739l2125q070L9130R2617J29369J45089J47201J34225J02764O7312
33056B95644M7855L7206M229o3347j37581j80383j80039j48173r4885k4158M9542
33045c94090R6044R0424L9163j8800m3259k8268l533J653j0454j5562M71K8850
33033b57361N1003N2832L0657l115k3183j6268k604j4392m8273n8475r654P6295
33021b22538J40526J47195J10756O9622M8412M7004N2969N5779N2262M3953L0667
33010E76607P105l1810q0542j19313j24891q8228k1038N6363J29712J87167K06118
$$ y = [-1279711, -1158664, -1030044, -907287, -801731, -723188, -678899, -662395, -646436, -601590, -528672, -463527, -441432, -462354, -496728, -516361, -510612, -482273, -444072, -417124, -418101, -444999, -483129, -521868, -553993, -562063, -522933, -430316, -300947, -155858, -8657, 125568, 228332, 295644, 343499, 380705, 384934, 321587, 184006, 3623, -176416, -324589, -419474, -443632, -394090, -298046, -207622, -168459, -187259, -230518, -258786, -262319, -260666, -271120, -286682, -286211, -257361, -206358, -153526, -122869, -125984, -149167, -165435, -168039, -182431, -230704, -289179, -298833, -222538, -82012, 65183, 175939, 245561, 293973, 340977, 393946, 449725, 501987, 545940, 576607, 583712, 551902, 471360, 352047, 227156, 138928, 117890, 174253, 303965, 491132, 697250]
32999F97250J61188N5126o9520j63340k09035k16537j90985j29981n2010J680
$$ y = [697250, 858438, 913564, 844044, 680704, 471669, 255132, 64147, -65834, -117844, -116164]
$$ [...]
##END NTUPLES=NMR SPECTRUM
##END=
