##TITLE=31Pdec_DE-22_1drm
 
  24 sc
 1.11.2023
##JCAMPDX= 6.0         $$ Bruker NMR JCAMP-DX V2.0
##DATA TYPE= NMR SPECTRUM
##DATA CLASS= NTUPLES
##ORIGIN= UXNMR, Bruker Analytische Messtechnik GmbH
##OWNER= root
$$ XWIN-NMR		Version 3.5
$$ Wed Nov  1 14:49:20 2023 Russian Standard Time (UT+4h)  she@DPX200
##.OBSERVE FREQUENCY= 81.013821
##.OBSERVE NUCLEUS= ^31P
##.ACQUISITION MODE= SIMULTANEOUS
##.ACQUISITION SCHEME= undefined
##.AVERAGES= 24
##.DIGITISER RES= 16
##SPECTROMETER/DATA SYSTEM= spect
##.PULSE SEQUENCE= zgpg30
##.SOLVENT NAME= CDCl3
##.SHIFT REFERENCE= (INTERNAL, CDCl3, 0, 248.564)
##AUDIT TRAIL= $$ (NUMBER, WHEN, WHO, WHERE, WHAT)
$$ ##TITLE= Audit trail, XWIN-NMR		Version 3.5
$$ ##JCAMPDX= 5.01
$$ ##ORIGIN= Bruker BioSpin GmbH
$$ ##OWNER= she
$$ F:/spectra/data/she/nmr/P31/1/pdata/1/auditp.txt
$$ ##AUDIT TRAIL=  $$ (NUMBER, WHEN, WHO, WHERE, WHAT)
(   1,<2023-11-01 14:47:46.89 +0400>,<she>,<DPX200>,
      <created by zg, POWCHK disabled, PULCHK disabled
       configuration hash MD5:
       00 E9 B6 7A A2 85 ED C7 34 08 36 98 17 FE 4E 26
       data hash MD5: 32K
       6D 51 72 42 7A FC A4 CA A9 98 BF 2A BE 21 A7 3A>)
(   2,<2023-11-01 14:47:49.46 +0400>,<she>,<DPX200>,
      <Start of raw data processing
       efp BC_mod = 2 LB = 5 FT_mod = 6 PKNL = 1 PHC0 = -10623.52 PHC1 = 193.8902 SI = 64K 
       data hash MD5: 64K
       97 1F CF 21 39 3E D1 EF ED 7D F9 17 A9 46 BA 32>)
(   3,<2023-11-01 14:48:01.57 +0400>,<she>,<DPX200>,
      <pk PHC0 = -92.18745 PHC1 = 0 
       data hash MD5: 64K
       79 B8 4A E2 3A 05 6D 95 F7 53 DE EB 6F 65 35 42>)
(   4,<2023-11-01 14:48:04.57 +0400>,<she>,<DPX200>,
      <abs ABSG = 5 
       data hash MD5: 64K
       B1 19 10 91 79 24 ED B2 AF 67 92 58 84 0C 09 A4>)
(   5,<2023-11-01 14:48:40.48 +0400>,<she>,<DPX200>,
      <pk PHC0 = 70.76772 PHC1 = -157.4 
       data hash MD5: 64K
       1D 67 D2 E5 A8 B1 66 30 E5 3D E1 CA DA D1 64 FC>)
(   6,<2023-11-01 14:48:46.34 +0400>,<she>,<DPX200>,
      <abs ABSG = 5 
       data hash MD5: 64K
       51 2E 9B 14 DB 49 3A 99 4B 85 9A B3 87 18 B6 63>)
$$ ##END=
$$ 
$$ hash MD5
$$ C8 C0 2B 3F 2F 53 3E 5C 27 46 6C 24 E9 08 4A 73
##$RELAX= 
##$RELAX= 
##$RELAX= 
##$RELAX= 
##$RELAX= 
##$RELAX= 
##$RELAX= 
##$RELAX= 
##$RELAX= 
$$ Bruker specific parameters
$$ --------------------------
##$DU= <F:/spectra>
##$EXPNO= 1
##$NAME= <P31>
##$PROCNO= 1
##$TYPE= <nmr>
##$USER= <she>
##$AMP= (0..31)
100 100 100 100 100 100 100 100 100 100 100 100 100 100 100 100 100 100 
100 100 100 100 100 100 100 100 100 100 100 100 100 100 
##$AQSEQ= 0
##$AQ_mod= 1
##$AUNM= <au_zg>
##$AUTOPOS= <>
##$BF1= 81.014009
##$BF2= 200.13
##$BF3= 200.13
##$BF4= 200.13
##$BF5= 200.13
##$BF6= 200.13
##$BF7= 200.13
##$BF8= 200.13
##$BYTORDA= 1
##$CFDGTYP= 0
##$CFRGTYP= 5
##$CHEMSTR= <none>
##$CNST= (0..31)
1 1 145 1 1 1 1 1 1 1 1 1 1 1 1 1 1 1 1 1 1 1 1 1 1 1 1 1 1 1 1 1 
##$CPDPRG= <waltz16>
##$CPDPRG1= <>
##$CPDPRG2= <waltz16>
##$CPDPRG3= <>
##$CPDPRG4= <mlev>
##$CPDPRG5= <mlev>
$$ [...]
##$SUBNAM3= <"">
##$SUBNAM4= <"">
##$SUBNAM5= <"">
##$SUBNAM6= <"">
##$SUBNAM7= <"">
##$SUBNAM8= <"">
##$SUBNAM9= <"">
##$SW= 501.771253377433
##$SWIBOX= (0..15)
0 1 3 0 0 0 0 0 0 0 0 0 0 0 0 0 
##$SW_h= 40650.406504065
##$TD= 32768
##$TD0= 1
##$TE= 0
##$TE2= 300
##$TE3= 300
##$TEG= 300
##$TL= (0..7)
0 120 53 12 22 120 120 120 
##$TP= (0..7)
150 150 150 150 150 150 150 150 
##$TP07= 0
##$TPNAME0= <>
##$TPNAME1= <>
##$TPNAME2= <>
##$TPNAME3= <>
##$TPNAME4= <>
##$TPNAME5= <>
##$TPNAME6= <>
##$TPNAME7= <>
##$TPOAL= (0..7)
0.5 0.5 0.5 0.5 0.5 0.5 0.5 0.5 
##$TPOFFS= (0..7)
0 0 0 0 0 0 0 0 
##$TUNHIN= 0
##$TUNHOUT= 0
##$TUNXOUT= 0
##$USERA1= <user>
##$USERA2= <user>
##$USERA3= <user>
##$USERA4= <user>
##$USERA5= <user>
##$V9= 5
##$VALIST= <valist>
##$VCLIST= <CCCCCCCCCCCCCCC>
##$VD= 0
##$VDLIST= <DDDDDDDDDDDDDDD>
##$VPLIST= <PPPPPPPPPPPPPPP>
##$VTLIST= <TTTTTTTTTTTTTTT>
##$WBST= 1024
##$WBSW= 4
##$XGAIN= (0..3)
0 0 0 0 
##$XL= 0
##$YL= 0
##$YMAX_a= 18571
##$YMIN_a= -15773
##$ZGOPTNS= <>
##$ZL1= 120
##$ZL2= 120
##$ZL3= 120
##$ZL4= 120
##$ABSF1= 248.5645
##$ABSF2= -253.2056
##$ABSG= 5
##$ABSL= 3
##$ALPHA= 0
##$AQORDER= 0
##$ASSFAC= 0
##$ASSFACI= 0
##$ASSFACX= 0
##$ASSWID= 0
##$AUNMP= <proc_1d>
##$AZFE= 0.1
##$AZFW= 0.5
##$BCFW= 0
##$BC_mod= 2
##$BYTORDP= 0
##$COROFFS= 0
##$CY= -3
##$DATMOD= 1
##$DC= 0
##$DFILT= <>
##$DTYPP= 0
##$F1P= 0
##$F2P= 0
##$FCOR= 1
##$FTSIZE= 65536
##$FT_mod= 6
##$GAMMA= 0
##$GB= 0
##$INTBC= 1
##$INTSCL= 6.047779e-11
##$ISEN= 30
##$LB= 5
##$LEV0= 0
##$LPBIN= 0
##$MAXI= 10000
##$MC2= 0
##$MEAN= 0
##$ME_mod= 0
##$MI= 50
##$NCOEF= 0
##$NC_proc= -8
##$NLEV= 6
##$NOISF1= 182.463
##$NOISF2= 159.3651
##$NSP= 0
##$NTH_PI= 0
##$NZP= 0
##$OFFSET= 248.5645
##$PC= 4
##$PHC0= -10644.94
##$PHC1= 36.4902
##$PH_mod= 1
##$PKNL= yes
##$PPARMOD= 0
##$PSCAL= 0
##$PSIGN= 0
##$REVERSE= no
##$SF= 81.0140089999694
##$SI= 65536
##$SIGF1= 159.3651
##$SIGF2= -187.1042
##$SINO= 113.3802
##$SIOLD= 16384
##$SREGLST= <1H.CDCl3>
##$SSB= 0
##$STSI= 65536
##$STSR= 0
##$SW_p= 40650.406504065
##$SYMM= 0
##$S_DEV= 0
##$TDeff= 32768
##$TDoff= 0
##$TI= <>
##$TILT= no
##$TM1= 0
##$TM2= 0
##$TOPLEV= 0
##$USERP1= <user>
##$USERP2= <user>
##$USERP3= <user>
##$USERP4= <user>
##$USERP5= <user>
##$WDW= 1
##$XDIM= 65536
##$YMAX_p= 519311965
##$YMIN_p= -10165523
$$ End of Bruker specific parameters
$$ ---------------------------------
##NTUPLES= NMR SPECTRUM
##VAR_NAME=  FREQUENCY,     SPECTRUM/REAL,   SPECTRUM/IMAG
##SYMBOL=    X,             R,               I
##VAR_TYPE=  INDEPENDENT,   DEPENDENT,       DEPENDENT
##VAR_FORM=  AFFN,          ASDF,            ASDF
##VAR_DIM=   65536,         65536,           65536
##UNITS=     HZ,            ARBITRARY UNITS, ARBITRARY UNITS
##FACTOR=    0.620285442955139, 1,           1
##FIRST=     20137.2065510682, 0,            0
##LAST=      -20513.1999529968, 0,           0
##MIN=       -20513.1999529968, -10165523,   0
##MAX=       20137.2065510682, 519311965,    0
$$ Real data points
##PAGE= N=1
##DATA TABLE= (X++(R..R)), XYDATA
$$ [...]
38802D085669j97689m19333n52465n04094l28371j33256N4318K67208M76626N72371
38792C320984M81922K69278R3063P4878K06827L69922M36674L67911K25432J03884
38782E950775N5509O7993R5143J07552J24507J91540L14121M27095M55247L93373
38772H182855K91610J68485j1516k59107n04399o52647o73774o16460n57292n52580
38762D815175o07565o64893o50943n63829m88045m86451n08236m55440l18459
38753G1314j76152n8977J11504M04174P46402R64752R45048P17876M02328J08295
38743D236564j09637k52957l62855m79427n87443o06269m51656j11600L37558
38734A612278P73520J077388J170170J046641P86258N06097K82973J22147n992
$$ y = [4085669, 3887980, 3468647, 2916182, 2412088, 2083717, 1950461, 2004779, 2271987, 2748613, 3320984, 3802906, 4072184, 4165247, 4240125, 4446952, 4816874, 5253548, 5621459, 5846891, 5950775, 6006284, 6074277, 6169420, 6276972, 6401479, 6593019, 6907140, 7334235, 7789482, 8182855, 8474465, 8642950, 8631434, 8372327, 7867928, 7215281, 6541507, 5925047, 5367755, 4815175, 4207610, 3542717, 2891774, 2327945, 1839900, 1353449, 845213, 389773, 71314, -104838, -163815, -52311, 351863, 1098265, 2063017, 3008065, 3725941, 4128269, 4236564, 4126927, 3873970, 3511115, 3031688, 2444245, 1837976, 1386320, 1274720, 1612278, 2385798, 3463186, 4633356, 5679997, 6466255, 6972352, 7255325, 7377472, 7371480]
38725G371480j22493k32342l24016l57256k81524r9577J01510K13809K01495J15854
38715F586940L3983O601M7374J29728J84594J26839r8900m88157r61669j362259
38705D205074j510118j326421r09586m55990j10070Q2133J15155R986j37465j89965
38695b27267j06677N393K7410k3766l0369P8908K64276M28742M87831M10980K51245
38684A566706J28174J34543K55388M00486M96310N14574M45981L12433J97134
38675D451729J91950K96300M21057N13185O22147Q02792R91399J034771Q39943
38666A0165273M59596K8605l48606o33940q15458q82842q56775q06965p98146
38657E510742q17430p85479o46827m24768j85435J3068J20337R2039n9704k31447
$$ y = [7371480, 7248987, 7016645, 6692629, 6335373, 6053849, 5954272, 6055782, 6269591, 6471086, 6586940, 6620923, 6627524, 6674898, 6804626, 6989220, 7116059, 7017159, 6529002, 5567333, 4205074, 2694956, 1368535, 458949, 2959, -107111, -24978, 90177, 100163, -37302, -227267, -333944, -328551, -301141, -324907, -355276, -276368, -12092, 416650, 904481, 1315461, 1566706, 1694880, 1829423, 2084811, 2485297, 2981607, 3496181, 3942162, 4254595, 4451729, 4643679, 4939979, 5361036, 5874221, 6496368, 7299160, 8290559, 9325330, 10165273, 10624869, 10653474, 10304868, 9670928, 8855470, 7972628, 7115853, 6308888, 5510742, 4693312, 3907833, 3261006, 2836238, 2650803, 2663871, 2784208, 2876247, 2816543, 2585096]
38647B585096k96438k20996r1277k0421m5078j11979j47479j29342q6649k9825
38637A405612R0073L07439N35871O07665M54802J94319j2526j30271k16071k76380
38627B960533k61067j79334j04535m0237J15449M15523P46451R33304R21135P88284
38617F295506O06785L63994L6904l08446n39267n80461m86977l63590k28551j6121
38607D779776K66614M64787M40485K72825J87995K86460M37112M63645L35884
38598G935583J30057j00048l21525m53206m05013j84884R5164L16129M17139L92209
38588G821605K81877J57624O1176l8398j87367l60387m78528n05331m73051m13211
38578E866009l13643j59314K2828J77141K55039K36511J49383P6491J12769K91521
$$ y = [2585096, 2288658, 2067662, 1976385, 1955964, 1910886, 1798907, 1651428, 1522086, 1435437, 1405612, 1495685, 1803124, 2338995, 2946660, 3401462, 3595781, 3583255, 3452984, 3236913, 2960533, 2699466, 2520132, 2415597, 2375360, 2490809, 2906332, 3652783, 4586087, 5507222, 6295506, 6902291, 7266285, 7303189, 6994743, 6455476, 5875015, 5388038, 5024448, 4795897, 4779776, 5046390, 5511177, 5951662, 6224487, 6412482, 6698942, 7136054, 7599699, 7935583, 8065640, 7965592, 7644067, 7190861, 6785848, 6600964, 6696128, 7012257, 7429396, 7821605, 8103482, 8261106, 8322282, 8283884, 8096517, 7736130, 7257602, 6752271, 6279220, 5866009, 5552366, 5393052, 5415880, 5593021, 5848060, 6084571, 6233954, 6310445, 6423214, 6714735]
38568F714735N53089P80114Q58472P35267M61721J73372j6673j16351k19040l69178
38558I555528n02153n28352m35894k84918j34822j9237K0641p0076l02545n93058
38548F705114p99463q27584p00686n19826l70382k85599k80030l61053m85206
38539B075285n50617m81841l07477j19787K4683J27606J94881K17074K05458J96840
38529A582105K06517K11022J90278J56799J33377J31197J56893K06496K40346
38520C215030K01522Q2401n2822j31108j31386o8282M8032K02068L46399M23395
38510D135249M08707L13006J60181l311r5338m8842J08818K64751L32833L29316
38500E905370L07189K44505O1635k35863m92545n42101l93992k20650j56033j72587
$$ y = [6714735, 7267824, 8047938, 8906410, 9641677, 10103398, 10276770, 10260097, 10143746, 9924706, 9555528, 9053375, 8525023, 8089129, 7804211, 7669389, 7650152, 7670793, 7600717, 7298172, 6705114, 5905651, 5078067, 4377381, 3857555, 3487173, 3201574, 2921544, 2560491, 2075285, 1524668, 1042827, 735350, 615563, 640246, 767852, 962733, 1179807, 1385265, 1582105, 1788622, 1999644, 2189922, 2346721, 2480098, 2611295, 2768188, 2974684, 3215030, 3416552, 3498953, 3446131, 3315023, 3183637, 3115355, 3163387, 3365455, 3711854, 4135249, 4543956, 4856962, 5017143, 5013832, 4918494, 4869652, 4978470, 5243221, 5576054, 5905370, 6212559, 6457064, 6518699, 6282836, 5790291, 5248190, 4854198, 4633548, 4477515, 4304928]
38490D304928j81456j76965k08713k56899k33472j06857O0229K16715L89357O09194
38480D416061Q44552J058827J271324J489642J627673J579439J362814J112352
38472A4762684R26742P91514O56790N11544L51562J47708r7467l08414m12627
38463A7330036m34259m61139n38166o44057p56203q75880r87394j052732j065028
38454A0515178j057995j039411r61150p86909n50394l09455p9339J38826K89506
38445F158857K87563J20025j15571k81118k84450j18002J33811L26227L54863
38436F582205K52858J52081J31858J45689J11174J6003j02193k29895l72331n01712
38426F185737n72733n85415n83916n89422n71138m87321l25565j02466J45965
$$ y = [4304928, 4123472, 3946507, 3737794, 3480895, 3247423, 3140566, 3200795, 3417510, 3806867, 4416061, 5260613, 6319440, 7590764, 9080406, 10708079, 12287518, 13650332, 14762684, 15689426, 16480940, 17137730, 17649274, 18000836, 18148544, 18051077, 17742663, 17330036, 16895777, 16434638, 15896472, 15252415, 14496212, 13620332, 12632938, 11580206, 10515178, 9457183, 8417772, 7456622, 6669713, 6119319, 5809864, 5730525, 5869351, 6158857, 6446420, 6566445, 6450874, 6169756, 5885306, 5767304, 5901115, 6227342, 6582205, 6835063, 6987144, 7119002, 7264691, 7375865, 7391868, 7289675, 7059780, 6687449, 6185737, 5613004, 5027589, 4443673, 3854251, 3283113, 2795792, 2470227, 2367761, 2513726]
38417B513726L67676N11385N52259N06237M40307M70528O97496J096316J496952
38408H652882J719935J710520J503880J118964N87661O5356k25105k18972r6088
38399A4819033p7193j88535k83578k41159p0213J41718L00607L38821K53394J26121
38389A5119016N7438P0265J12281J43752J71223J93943J81048J32008J13064J89151
38379A6483189L37875M62266M75162L47123R4604k32788n53805p93369r47132
38370A5673125j084109j258636j438536j549979j572570j541632j462604j286894
38362D478165r95809o51369l24657k7552K28774L63139L06290J35256K5694N5293
38352C593224J37706J69782J54656J45390J61785K21774L64207N51324O17776
$$ y = [2513726, 2881402, 3392787, 3945046, 4451283, 4891590, 5362118, 6059614, 7155930, 8652882, 10372817, 12083337, 13587217, 14706181, 15293842, 15359198, 15134093, 14915121, 14819033, 14741840, 14553305, 14269727, 14028568, 13958355, 14100073, 14400680, 14739501, 14992895, 15119016, 15176454, 15246719, 15359000, 15502752, 15673975, 15867918, 16048966, 16180974, 16294038, 16483189, 16821064, 17283330, 17758492, 18105615, 18200219, 17967431, 17413626, 16620257, 15673125, 14589016, 13330380, 11891844, 10341865, 8769295, 7227663, 5765059, 4478165, 3482356, 2830987, 2506330, 2478778, 2707552, 3070691, 3376981, 3512237, 3537931, 3593224, 3730930, 3900712, 4055368, 4200758, 4362543, 4584317, 4948524, 5499848, 6117624]
38343F117624M28437O0770k61479l94048l47726j79766N8754K60763K87004J21126
38333F151459q0305j53760q4470M6472J88241L13003L42591J93860r6057l60324
38323F460710m37821k87705J7382L56799O12240P05098O24082M15557J42936j43055
38313H466223m12996o62507q96774j084130j136939r82082o61046l23234r2989
38304B213526M1121J81496L74069N32196N24020L31716J04150K9444J51817L30742
38294D814297L85719K58707K4650k16553m08608n16916n09302l94305k45338j48325
38284C044026j32721j69825k16415k30520j63681J4162K69966N14873O65963O80008
38274D275836N28461J89554k92068p58048j002827r16170n60465j15837K39059
$$ y = [6117624, 6546061, 6606831, 6345352, 5951304, 5603578, 5423812, 5482566, 5743329, 6030333, 6151459, 6071154, 5917394, 5832924, 5879396, 6067637, 6380640, 6723231, 6917091, 6821034, 6460710, 6022889, 5735184, 5752566, 6109365, 6721605, 7426703, 8050785, 8466342, 8609278, 8466223, 8053227, 7390720, 6493946, 5409816, 4272877, 3290795, 2629749, 2306515, 2213526, 2254647, 2436143, 2810212, 3342408, 3866428, 4198144, 4302294, 4331738, 4483555, 4814297, 5200016, 5458723, 5483373, 5266820, 4858212, 4341296, 3831994, 3437689, 3192351, 3044026, 2911305, 2741480, 2525065, 2294545, 2130864, 2145026, 2414992, 2929865, 3595828, 4275836, 4804297, 4993851, 4701783, 3943735, 2940908, 2024738, 1464273, 1348436, 1587495]
38265A587495M16113M42896M25016M58226N47866O17315O05215N41208N12583
38256F153933N72293P02316Q57279J011482J151883J247936J260479J196360J146176
38247A5300137J240221J543826K003658K518408L049094L617375M191242M624233
38239C8088194M742589M475964L909135L273656K911039L135167M010482N286822
38231F9833048O623345P796426Q530447Q196897O031653J920501l109805p422216
38223I8400296r888829j0488503r933680q927922p806559o652387n513018m473797
38215C4715601l615957k959846k455917k044711j721785j508084j362388j194211
38207A7852702r90842q54300q48036q66079p45719m88249k76339k60721m00093
$$ y = [1587495, 2003608, 2446504, 2871520, 3329746, 3877612, 4494927, 5100142, 5641350, 6153933, 6726226, 7428542, 8285821, 9297303, 10449186, 11697122, 12957601, 14153961, 15300137, 16540358, 18084184, 20087842, 22606250, 25655344, 29272719, 33463961, 38088194, 42830783, 47306747, 51215882, 54489538, 57400577, 60535744, 64546226, 69833048, 76456393, 84252819, 92783266, 100980163, 107011816, 108932317, 105822512, 98400296, 88511467, 78022964, 68089284, 59161362, 51354803, 44702416, 39189398, 34715601, 31099644, 28139798, 25683881, 23639170, 21917385, 20409301, 19046913, 17852702, 16861860, 16007560, 15159524, 14293445, 13547726, 13059477, 12783138, 12522417, 12122324]
38198A2122324n32096n42881m40089l14556k74657l82637o00667p98793q46788
38189G389160p11904m71827k46296j14296o7129k2589R7771K87671M62583N54494
38179G157638N78254N88376N96398N62905M62304L27605K30872K31986L32560
38170A1068898M59450N12340M65019M13292M80125O67426Q45454R06097Q79621
38161A6697722Q61964Q68055Q25061P03437N78082N21446M85071L47645P2555
38152B1961038k30689m14383m34786l78097l68914m64340o19401p42299p91037
38143A7517092q13985q76080r51405r31992p60241n09107k96121j58096o5798
38134A2154267l3444j32260l80235o79840q94473r47609q31800n78356k63467
$$ y = [12122324, 11590228, 11047347, 10607258, 10292702, 10018045, 9635408, 9034741, 8235948, 7389160, 6677256, 6205429, 5959133, 5844837, 5777708, 5755119, 5852890, 6140561, 6603144, 7157638, 7735892, 8324268, 8920666, 9483571, 9945875, 10273480, 10504352, 10736338, 11068898, 11528348, 12040688, 12505707, 12918999, 13399124, 14066550, 14912004, 15818101, 16697722, 17559686, 18427741, 19252802, 19956239, 20534321, 21055767, 21540838, 21888483, 21961038, 21730349, 21315966, 20881180, 20503083, 20134169, 19669829, 19050428, 18308129, 17517092, 16703107, 15827027, 14875622, 13943630, 13183389, 12674282, 12378161, 12220065, 12154267, 12120823, 11988563, 11608328, 10928488, 10034015, 9086406, 8254606, 7676250, 7412783]
38125G412783o001R8681M2587j16203l15263n03455o28053o52566n76627m08712
38115D347171j43672J90710M89202O30769N84797M12338J71487j21230m34645
38106F126927o93114q26372q05398o20690k89109Q7952L38698L55218J89586j8768
38096C844930j73868k43931k11595r1299K2190J7649r5488j80580j36610j5548
38086B735850N6934K8369n9394j53438k26747k47445j84125o0720M6303R3645
38076B029232J14247J44504J50522P9625l9623j17003j24089j33760k13394l38842
38066A551419m56251n73924p23119q58158q78378p51766n44252l12528m3391K64351
38056c325997N27366O51201O37465N58458M56527L35033K24216J66261J21926
$$ y = [7412783, 7406782, 7505463, 7548050, 7431847, 7116584, 6613129, 5985076, 5332510, 4755883, 4347171, 4203499, 4394209, 4883411, 5514180, 6098977, 6511315, 6682802, 6561572, 6126927, 5433813, 4607441, 3802043, 3181353, 2892244, 2980196, 3318894, 3674112, 3863698, 3844930, 3671062, 3427131, 3215536, 3124237, 3146427, 3164076, 3068588, 2888008, 2751398, 2735850, 2792784, 2821153, 2761759, 2608321, 2381574, 2134129, 1950004, 1889284, 1935587, 2029232, 2143479, 2287983, 2438505, 2518130, 2478507, 2361504, 2237415, 2103655, 1890261, 1551419, 1095168, 521244, -201875, -1060033, -1938411, -2690177, -3234429, -3546957, -3590348, -3325997, -2798631, -2147430, -1509965, -951507, -494980, -159947, 64269, 230530, 352456]
38047C52456k2168k98750n58272n81954k89132J95230O57912R47569J032870R74372
38037B410133Q58844P28319N52145K86304l0318k68282l25822k41579j56669j62888
38027C650187k17423k19462j45462p9446j11930k33691l44427l58896k86287j98180
38017A454983j37773r1457m8499l9475p6177q7524J4910K03003L32295L09917
38007A834203K09876J74110K37420L06752K92879K09294J51302K19845M45034
37998D080715P30901Q93710Q22700O02834M21290L61147L55397L28855K80406
37989H877955K07199O5656j29703k69214k98704l28653m85095p03016p88106o65814
37979E482505m54868k91552j95807j42890j60341k78707m40323n26919m64644
$$ y = [352456, 330288, 31538, -526734, -1108688, -1397820, -1202590, -544678, 402891, 1435761, 2410133, 3268977, 3997296, 4549441, 4835745, 4805427, 4537145, 4211323, 3969744, 3813075, 3650187, 3432764, 3213302, 3067840, 2988394, 2876464, 2642773, 2298346, 1939450, 1653163, 1454983, 1317210, 1225753, 1177254, 1137779, 1061602, 974078, 988988, 1191991, 1524286, 1834203, 2044079, 2218189, 2455609, 2762361, 3055240, 3264534, 3415836, 3635681, 4080715, 4811616, 5705326, 6528026, 7130860, 7552150, 7913297, 8268694, 8597549, 8877955, 9085154, 9150810, 9021107, 8751893, 8453189, 8124536, 7639441, 6936425, 6148319, 5482505, 5027637, 4736085, 4540278, 4397388, 4237047, 3958340, 3518017, 2991098, 2526454]
37970B526454k71546k5862J84847L08695L56583L75928L85978L58468K69358J38043
37960D606946r6j25562k15302k27282j46235k6964N2294Q1496J30441K58186M31201
37949D819123N42655N01003K93645j7844l40473n87465p02521o78772n61611m20393
37939B847347l08896k49287k35642k32064j84457p5723L1229N3267J098j9968
37929A626904N2130J58262K24575K85878M21024N95002O57983N13575K27049m2237
37919D720145j67269j20244J8178J05752N7014o5510j23811o9963J7809O0220
37909D432321N6248K3656m2183j00484m1777J89602N00820P51853R20496J106879
37899G797431J400778J789868K152439K276984J943534J103530J032r57635j494800
$$ y = [2526454, 2254908, 2229046, 2413893, 2722588, 3079171, 3455099, 3841077, 4199545, 4468903, 4606946, 4606850, 4481288, 4265986, 4038704, 3892469, 3865505, 3917799, 3999295, 4129736, 4387922, 4819123, 5361778, 5862781, 6156426, 6138582, 5798109, 5210644, 4508123, 3829351, 3267740, 2847347, 2538451, 2289164, 2053522, 1821458, 1637001, 1561278, 1592507, 1645774, 1646872, 1626904, 1679034, 1837296, 2061871, 2347749, 2768773, 3363775, 4021758, 4535333, 4762382, 4720145, 4552876, 4432632, 4450810, 4556562, 4613576, 4548066, 4424255, 4354292, 4372101, 4432321, 4488569, 4512225, 4470042, 4369558, 4327781, 4517383, 5018203, 5770056, 6690552, 7797431, 9198209, 10988077, 13140516, 15417500, 17361034, 18464564, 18465596, 17507961, 16013161]
37890A6013161j612891j489002j288145j080836q64985o15836l34221p2271R6663
37881H751637J40356R0005M645p1381j25433j71936k19055k18754p4373K57886
37871H363597O85064J045863J269917J422150J567907J633210J441427Q92329
37863A8321464R4584o79794j177691j320456j202121r65192p10440n14197m55345
37854A1390812n59973p42221q59837q30216o59462l82228l8614K90660N01887
37845H110808N60787N40441N40128N96555O93143Q11430R27769R81521Q98732
37836A4661314O60619L30179R269k14973k85721j74441J01114M57555P83206J031112
37826A7359233J268867J610638K111176K754103L495348M200843M519540L977584
$$ y = [16013161, 14400270, 12911268, 11623123, 10542287, 9677302, 9061466, 8727245, 8654974, 8751637, 8891993, 8981998, 8986643, 8915262, 8789829, 8617893, 8398838, 8180084, 8105711, 8363597, 9048661, 10094524, 11364441, 12786591, 14354498, 15987708, 17429135, 18321464, 18416048, 17736254, 16558563, 15238107, 14035986, 13070794, 12360354, 11846157, 11390812, 10830839, 10088618, 9228781, 8398565, 7739103, 7356875, 7318261, 7608921, 8110808, 8671595, 9212036, 9752164, 10348719, 11041862, 11853292, 12781061, 13762582, 14661314, 15321933, 15652112, 15661381, 15446408, 15160687, 14986246, 15087360, 15544915, 16328121, 17359233, 18628100, 20238738, 22349914, 25104017, 28599365, 32800208, 37319748, 41297332]
37818D1297332K378234J14480k026476l413743l914632l773519l311816k773415
37810B4576445k302182j924168j569181j183407q13008n39992l64488j96418N1516
37801A5735117L91808P58108J043066J165690J133112J022951R02506Q09972Q15250
37792B3777580R95738J269150J319831Q29869j80496j306280k079708k312155
37784B2313529k136365j798958j466195j188594r63684p75810n82333l16877M2228
37775A3126941M14583O77813P93770Q30023Q47354Q26794P37144O11942N09899
37766A9376263M47901M20666M30554M40950L70677K29983K12798N37974J209257
37757B3677023K018831K741428L185656L088076K192250N69932j250234k621633
$$ y = [41297332, 43675566, 43790046, 41763570, 38349827, 34435195, 30661676, 27349860, 24576445, 22274263, 20350095, 18780914, 17597507, 16784499, 16244507, 15880019, 15683601, 15735117, 16126925, 16885033, 17928099, 19093789, 20226901, 21249852, 22152358, 22962330, 23777580, 24773318, 26042468, 27362299, 28192168, 28011672, 26705392, 24625684, 22313529, 20177164, 18378206, 16912011, 15723417, 14759733, 13983923, 13401590, 13084713, 13126941, 13541524, 14219337, 15013107, 15843130, 16690484, 17517278, 18254422, 18866364, 19376263, 19824164, 20244830, 20675384, 21116334, 21487011, 21716994, 21929792, 22467766, 23677023, 25695854, 28437282, 31622938, 34711014, 36903264, 37473196, 36222962, 33601329]
37749C3601329l239951l237244k922226k533805k182153j881032j600749j343930
37741A4660239j170699j113754j105700j055564r69590r22640r27790r11615q13827
37732E669060o41835m33247k37203j25609j35362j88779j59507m2293K8631l2245
37722C701611j40369j64187r4475j8024J7487K5526P016n0048j09161j14782r4960
37711B965634j54644l34626n35531o19672n47774l81111j87472P223J91595L43330
37701G46952M42697M88915M92427M60541L97355L14404K34169J74279J25920O3616
37691C941275p789l2586L2828J34050J38191l1137k97411m95209n19496l94299
37681B468417k15708o1663N0145J52532K83770M26186M88915L86435J46703r0868
$$ y = [33601329, 30361378, 27124134, 24201908, 21668103, 19485950, 17604918, 16004169, 14660239, 13489540, 12375786, 11270086, 10214522, 9244932, 8322292, 7394502, 6482887, 5669060, 5027225, 4593978, 4356775, 4231166, 4095804, 3907025, 3747518, 3705225, 3733856, 3701611, 3561242, 3397055, 3302580, 3284556, 3302043, 3327569, 3334585, 3284537, 3175376, 3060594, 2965634, 2810990, 2476364, 1940833, 1321161, 773387, 392276, 204804, 212027, 403622, 746952, 1189649, 1678564, 2170991, 2631532, 3028887, 3343291, 3577460, 3751739, 3877659, 3941275, 3933486, 3900900, 3933728, 4067778, 4205969, 4174832, 3877421, 3382212, 2862716, 2468417, 2252709, 2191046, 2241191, 2393723, 2677493, 3103679, 3592594, 3979029, 4125732, 4034864]
37671D034864k07372k11774j96199k11212k22213j78537q5890j370K1255k2807
37661B718745p9584p2801K5513J57347K36089K45793K52548L04689L57172L24916
37651D470427J86338k155j74614k89908l05768j86123L0039K12402K50818J78436
37641D369892J40252K34123M19389N90013O91703P37065P46813P33151P25861
37632I388262P48120P53236O49671M30284K28369J83364K72216L37125K75690
37623A3266337J36837J3217r2454k42691m41817n93482n84007l85634q4769J73189
37613A1164726K79469K30142J07635j495n6401m2826M0735J48157J82101Q1566
37603A2133809r8187k35059k62806k12282j47184j05067r8805j32872k09574l40729
$$ y = [4034864, 3827492, 3615718, 3419519, 3208307, 2986094, 2807557, 2721667, 2720297, 2741552, 2718745, 2639161, 2566360, 2591873, 2749220, 2985309, 3231102, 3483650, 3788339, 4145511, 4470427, 4656765, 4654610, 4479996, 4190088, 3884320, 3698197, 3728236, 3940638, 4191456, 4369892, 4510144, 4744267, 5163656, 5753669, 6445372, 7182437, 7929250, 8662401, 9388262, 10136382, 10889618, 11539289, 11969573, 12197942, 12381306, 12653522, 12990647, 13266337, 13403174, 13416391, 13323937, 13081246, 12639429, 12045947, 11461940, 11076306, 10991537, 11164726, 11444195, 11674337, 11781972, 11780477, 11724076, 11681250, 11721985, 11870142, 12052243, 12133809, 12035622, 11800563, 11537757, 11325475, 11178291, 11073224, 10974419, 10841547, 10631973, 10291244]
37593A0291244n37938p57329q81612q23242o42541m95044m48475m16226k93931
37584D994906r7420P0724J36885R8409j828r9957j51260j84141k67613l85385
37574D113320m06588k55289o0657l9843k39680m79777n59278m46995k55676j05208
37564A264329m6471o1527q7581n8900M9346K23926M44940O73477Q18212P82783
37554D002534N72037L01546P6366r1635k22259k87933k52086j43614k9343O4111
37544C989724J41972J74615J09741m3923k05944l15351l83889m36828m48846l79501
37534B201770k46584j22605o5055p8891j39740k17415k66029k20518l4718K69240
37524A079455N94833Q19270Q58976P09218M39376J54181n0041j10399q232K16802
$$ y = [10291244, 9753306, 8995977, 8114365, 7291123, 6648582, 6153538, 5705063, 5288837, 4994906, 4897486, 4968210, 5105095, 5203504, 5201676, 5101719, 4950459, 4766318, 4498705, 4113320, 3706732, 3451443, 3390786, 3350943, 3111263, 2631486, 2072208, 1625213, 1369537, 1264329, 1217858, 1156331, 1068750, 1009850, 1059196, 1283122, 1728062, 2401539, 3219751, 4002534, 4574571, 4876117, 4952483, 4860848, 4638589, 4350656, 4098570, 3954956, 3925613, 3989724, 4131696, 4306311, 4416052, 4372129, 4166185, 3850834, 3466945, 3030117, 2581271, 2201770, 1955186, 1832581, 1767526, 1688635, 1548895, 1331480, 1065451, 844933, 810215, 1079455, 1674288, 2493558, 3352534, 4061752, 4501128, 4655309, 4605268, 4494869, 4486637, 4703439]
37514D703439M60792N95605N51877L71305J67074L3105n767J8281M0808r569j56010
37503F770940l28792m25137m40721m90110o47472q11051q01740n83911l12167
37494A929839j49504j09791j03297o4133K1739J61550L50915N33369O25104N90843
37484C786634M60579K72440M4547j80416l06421k48799l3667J89141K48832P6533
37474D309403k61902o33382r19480j041562r54080o69174k96495r736P7611Q769
37464c90028o4629l0989R2071K05285K28173J36092o7215l57780o56636q30028
37454a735684p76520n20479j92487Q6652K76785L78665L79436K75630J16070l0399
37444a742331j42546k42187l27578l51635k67686o2404K52468O35485R94745J217754
$$ y = [4703439, 5164231, 5759836, 6311713, 6683018, 6850092, 6883197, 6877430, 6895711, 6936519, 6926950, 6770940, 6442148, 6017011, 5576290, 5086180, 4438708, 3627657, 2825917, 2242006, 1929839, 1780335, 1670544, 1567247, 1503114, 1524853, 1686403, 2037318, 2570687, 3195791, 3786634, 4247213, 4519653, 4564200, 4383784, 4077363, 3828564, 3794897, 3984038, 4232870, 4309403, 4047501, 3414119, 2494639, 1453077, 498997, -170177, -466672, -476408, -398797, -390028, -454657, -485646, -393575, -188290, 39883, 175975, 108760, -249020, -905656, -1735684, -2512204, -3032683, -3225170, -3138518, -2861733, -2483068, -2103632, -1828002, -1711932, -1742331, -1884877, -2127064, -2454642, -2806277, -3073963, -3136367, -2883899, -2248414, -1253669, -35915]
37434c5915J246126J099577Q27879M83557J47963q0139j64299j59963j24829l7032
37424C202925J45955L72751N05115M44205K10768r7390l81414n66265o01877m88098
37414B746675k96486j36499p6376r0247q9633j7350R1174J50933J30497R6796
37404B509484J51905L32273N64164P04985O47291M23165K06124J61882K75385
37395E976658L58089K44807m6263l56144n35306n28290l73900j83931q5228j11988
37385D358504j62150j12830K7852J32055J08263l802r1672p3538N6918K30201
37375D469801L26357K53015L9382j68405k36881j67160p6727o7630j21425j24425
37365D125902q94J79453K49487J20425j06141k24662j10024K02018N82761R06884
$$ y = [-35915, 1210211, 2309788, 3137667, 3621224, 3769187, 3689048, 3524749, 3364786, 3239957, 3202925, 3348880, 3721631, 4226746, 4670951, 4881719, 4784329, 4402915, 3836650, 3234773, 2746675, 2450189, 2313690, 2237314, 2147067, 2057434, 2040084, 2131258, 2282191, 2412688, 2509484, 2661389, 2993662, 3557826, 4262811, 4910102, 5333267, 5539391, 5701273, 5976658, 6334747, 6579554, 6533291, 6177147, 5641841, 5113551, 4739651, 4555720, 4470492, 4358504, 4196354, 4083524, 4111376, 4243431, 4351694, 4347892, 4256220, 4182682, 4239600, 4469801, 4796158, 5049173, 5088555, 4920150, 4683269, 4516109, 4439382, 4371752, 4250327, 4125902, 4125008, 4304461, 4553948, 4674373, 4568232, 4343570, 4233546, 4435564, 5018325, 5925209]
37355E925209J095796J129749J040898Q69011O21509L03266k7063k77370l98193
37346A0282812l93444k60752J1119L63108O46649P31500O07410L59020Q2239j47532
37336A2282129k79286l18038l28063l54026l57563k82654j68469j34916k45947
37327I813167m32270n61087n42528l58013l8896L36737O50059P96822P51591N62914
37317A0978496K88514m1715l95681p00691q62687q28927o27827l50179r4761P6245
37307G440787J44183J12014q254j75607l05883l21601k36601j58848j74410k48904
37297F066876k82112k39157j72678j24949q0819l6968m8336j59498l33392m90291
37287D098676n81652n91244n12413l76930k63876k13986j64069l4105J43622K57477
$$ y = [5925209, 7021005, 8150754, 9191652, 10060663, 10682172, 10985438, 10958375, 10681005, 10282812, 9889368, 9628616, 9639735, 10002843, 10649492, 11380992, 11988402, 12347422, 12429661, 12282129, 12002843, 11684805, 11356742, 11002716, 10645153, 10362499, 10194030, 10059114, 9813167, 9380897, 8819810, 8277282, 7919269, 7880373, 8217110, 8867169, 9663991, 10415582, 10978496, 11267010, 11225295, 10829614, 10128923, 9266236, 8437309, 7809482, 7459303, 7364542, 7440787, 7584970, 7696984, 7688730, 7513123, 7207240, 6885639, 6649038, 6490190, 6315780, 6066876, 5784764, 5545607, 5372929, 5247980, 5167161, 5130193, 5081857, 4922359, 4588967, 4098676, 3517024, 2925780, 2413367, 2036437, 1772561, 1558575, 1394506, 1360401, 1504023, 1761500]
37277A761500K66643K38773K35564K41040K21591J81947J29343M9334l6829m3124
37267C245782R5187L27778N22461N81317N03639L57373K16330J09683P382j37223
37257E829709l14994m42145m31905k85748j06767j4661l3462o2726J1943J67981
37247D317225K46209J33881r6627k82245l55092l54465k88629r9605K16661N52531
37237C989844P92920R11423R35531Q91952Q33577Q63378J078338J508463K114793
37228A3920219K805588L472094M080124M683858N197538N160455L981117J601102
37220D4902095j201660l365376m378957m478648m153149l691157l185500k695430
37212A7752218k252213j829659j431845j143253j013234r60718q75420p59289
$$ y = [1761500, 2028143, 2266916, 2502480, 2743520, 2965111, 3147058, 3276401, 3325735, 3288906, 3245782, 3340969, 3668747, 4191208, 4772525, 5276164, 5633537, 5849867, 5959550, 5966932, 5829709, 5514715, 5072570, 4640665, 4354917, 4248150, 4233489, 4200027, 4137301, 4149244, 4317225, 4563434, 4697315, 4600688, 4318443, 3963351, 3608886, 3320257, 3220652, 3437313, 3989844, 4782764, 5694187, 6629718, 7521670, 8355247, 9218625, 10296963, 11805426, 13920219, 16725807, 20197901, 24278025, 28961883, 34159421, 39319876, 43300993, 44902095, 43700435, 40335059, 35956102, 31477454, 27324305, 23633148, 20447648, 17752218, 15500005, 13670346, 12238501, 11095248, 10082014, 9121296, 8245876, 7486587]
37204G486587o88439o78304o69828o25480n57894m65318l10463q5196J48299L05885
37194C859849L49934K99311J96332Q3898j587m9098r7402k15755m24697o35638
37184C365147p06091n73594l07256j1672K73990N39348P15279P13457N59286M06782
37174D974676L81648M54280N02624M62133L70273K84545K03004P1881j47206m18600
37164G139258o33351o81066n39166k89883m3093J48059K87505L72739L66854K50661
37154F378517Q4252k0805j0675M8663M8637l2212j16654j48302j67671k39817
37144E823933l54395m45234m74579m43355l47779j97480o5448l6926q6982p6930
37134C294825Q8923L51051N78914P29002Q72589J088596J374314J653018J825987
$$ y = [7486587, 6798148, 6119844, 5450016, 4824536, 4266642, 3801324, 3490861, 3405665, 3553964, 3859849, 4209783, 4509094, 4705426, 4789324, 4787737, 4738639, 4641237, 4425482, 4000785, 3365147, 2659056, 2085462, 1778206, 1766534, 2040524, 2579872, 3295151, 4008608, 4567894, 4974676, 5356324, 5810604, 6313228, 6775361, 7145634, 7430179, 7633183, 7705064, 7557858, 7139258, 6505907, 5824841, 5285675, 4995792, 4952699, 5100758, 5388263, 5761002, 6127856, 6378517, 6462769, 6441964, 6431289, 6479952, 6528589, 6496377, 6379723, 6231421, 6063750, 5823933, 5469538, 5024304, 4549725, 4106370, 3758591, 3561111, 3495663, 3458737, 3371755, 3294825, 3383748, 3734799, 4313713, 5042715, 5915304, 7003900, 8378214, 10031232, 11857219]
37125A1857219J811604J575596J160335O84954K93035P8027N0426J71759M01759
37116A8084714O95130R75111J164191J254639J301609J325600J281460J170396
37108B7252850J117694J246623J500888J692882J734445J726268J794495J930277
37100C9996422K038361K064260K005200J856675J633534J415707J290482J247228
37092E3547869J186778J041158Q40181O56101N24273M28237L27644J82666k8454
37083E8706453k96939n88694q60737j070859j186515j202146j143890j048330
37075E1308343r46759q77043q86391r95195j167501j340436j476535j568745j607946
37066D0441792j577759j480750j340557j171994r76238p80635o61264o93393q67294
$$ y = [11857219, 13668823, 15244419, 16404754, 17089708, 17382743, 17460770, 17511196, 17682955, 18084714, 18779844, 19754955, 20919146, 22173785, 23475394, 24800994, 26082454, 27252850, 28370544, 29617167, 31118055, 32810937, 34545382, 36271650, 38066145, 39996422, 42034783, 44099043, 46104243, 47960918, 49594452, 51010159, 52300641, 53547869, 54734647, 55775805, 56615986, 57272087, 57796360, 58224597, 58552241, 58734907, 58706453, 58409514, 57820820, 56960083, 55889224, 54702709, 53500563, 52356673, 51308343, 50361584, 49484541, 48598150, 47602955, 46435454, 45095018, 43618483, 42049738, 40441792, 38864033, 37383283, 36042726, 34870732, 33894494, 33113859, 32452595, 31759202, 30891908]
37057C0891908j061896j118872r58721o33151k71478R822J41222Q1613j74641
37048B6905806n54345r13548j134287j208184j202132j157670j059270q98385
37040A8777985p29532o41376o79479q00019q92157q58409p01099n32200m71351
37031A2472363n23655n78714n37522m11150k75688j64143m9455P5094J54392J36793
37021A0298315N0978j5959r989M0894O1902o033j75781m19741o87747r17713j036894
37010G182232r79188p43005m41787k47358k31636k80976k16509N439K54749L75950
37000D677911L17249J20735j27906l06533k95023q3184J86861L40835L25718K25637
36990E382300J65969K28345M00391N53774N22836K76680j9930j82582k06311k15950
$$ y = [30891908, 29830012, 28711140, 27752419, 27119268, 26847790, 26857612, 26998834, 27080447, 26905806, 26351461, 25437913, 24303626, 23095442, 21893310, 20735640, 19676370, 18777985, 18048453, 17407077, 16727598, 15927579, 15035422, 14177013, 13475914, 12943714, 12472363, 11948708, 11369994, 10832472, 10421322, 10145634, 9981491, 9932036, 10007130, 10161522, 10298315, 10349293, 10333334, 10323345, 10364239, 10426141, 10420108, 10244327, 9824586, 9136839, 8219126, 7182232, 6203044, 5460039, 5018252, 4770894, 4539258, 4258282, 4041773, 4047212, 4301961, 4677911, 4995160, 5115895, 4987989, 4681456, 4386433, 4303249, 4490110, 4830945, 5156663, 5382300, 5548269, 5776614, 6177005, 6730779, 7253615, 7530295, 7510365, 7327783, 7121472, 6905522]
36980F905522k64704k89479k47383j77278j10398k5876P6310J55972K22692L46536
36970F591914N21084O01601M58950J45325j58565l23182l45833k93174k33626
36961F964494k04582j95360j72540j43036j56528k19087k51918j77595r064J84060
36951E618844L51146M55988M44824K87246L3456k14171l70264l83234k32413L6053
36941F027475L02468M61259N02336M71714L86331K37257N0574j04540j55308n4914
36931H124652J77166M09648M62643K84758J8717j73447k90717m17187n31433n15952
36921G548848l37692j04714O3689J37213J49911J59098K15814K87584K33815l1074
36911H322492l65790n25477m64633l79629m24566n34124n84980n82596n87408
$$ y = [6905522, 6640818, 6351339, 6103956, 5926678, 5816280, 5790404, 5866714, 6022686, 6245378, 6591914, 7112998, 7714599, 8173549, 8318874, 8160309, 7837127, 7491294, 7198120, 6964494, 6759912, 6564552, 6392012, 6248976, 6092448, 5873361, 5621443, 5443848, 5434784, 5618844, 5969990, 6425978, 6870802, 7158048, 7191504, 6977333, 6607069, 6223835, 5991422, 6027475, 6329943, 6791202, 7293538, 7765252, 8151583, 8388840, 8439414, 8334874, 8179566, 8124652, 8301818, 8711466, 9174109, 9458867, 9477584, 9304137, 9013420, 8596233, 8064800, 7548848, 7211156, 7106442, 7170131, 7307344, 7457255, 7616353, 7832167, 8119751, 8353566, 8322492, 7956702, 7431225, 6966592, 6586963, 6162397, 5628273, 5043293, 4460697, 3873289]
36902C873289n75626m96243l86988l15639k59840j50469O791J46341K38619K82173
36892B362408K44927J17732q19J7478J65590K98184K93507J48686o7965k66175
36882C313553l34060j91695J11408M11411N79221O19410O08940N86548N30018
36873F234754M12678K57570J40158J27765J98845K44262J80901M2805p5028j29462
36863G635248j30514o2030J13582L63966N71499O37884N66555M32008L07533K31744
36853A0667475K08073K22136K76176L98733O00853Q43334J071410J252106J356688
36844A6896984J364980J332569J384017J566558J777159J924294K095208K456803
36836C0798572L061081L875844M932543O284096P883105R679338J1761137J4193949
$$ y = [3873289, 3297663, 2801420, 2414432, 2098793, 1838953, 1688484, 1695275, 1841616, 2080235, 2362408, 2607335, 2725067, 2724248, 2741726, 2907316, 3205500, 3499007, 3647693, 3579728, 3313553, 2979493, 2787798, 2899206, 3310617, 3889838, 4509248, 5118188, 5704736, 6234754, 6647432, 6905002, 7045160, 7172925, 7371770, 7616032, 7796933, 7839738, 7764710, 7635248, 7504734, 7442704, 7556286, 7920252, 8491751, 9129635, 9696190, 10128198, 10435731, 10667475, 10875548, 11097684, 11373860, 11772593, 12373446, 13216780, 14288190, 15540296, 16896984, 18261964, 19594533, 20978550, 22545108, 24322267, 26246561, 28341769, 30798572, 33859653, 37735497, 42668040, 48952136, 56835241, 66514579, 78275716, 92469665]
36828I2469665J6826950J9506634K2207537K4300180K3736338J8030294O936325
36821B24013923o176525j6464590k1294706k1552447j9691643j7364057j5021027
36814A06448928j2783867j0832572r175780p674226o344083n326101m583354l901552
36806D5827393l182377k529159k062065j821867j812361j957278k048291j909400
36798B8504595j595105j283023j015992p11853l80891j40709k3317M7504P1286
36789B3472495n9406l57462o54132p72458o87913m88761k80123j50964j30133
36780A9891143j39291o8196Q9682K50084L71487M80202N82065O65658P82690R97511
36770B3903035J255260J430371J515266J631381J843647K098992K355290K614726
$$ y = [92469665, 109296615, 128803249, 151010786, 175310966, 199047304, 217077598, 224013923, 217837398, 201372808, 180078102, 158525655, 138834012, 121469955, 106448928, 93665061, 82832489, 73656709, 65982483, 59638400, 54312299, 49728945, 45827393, 42645016, 40115857, 38053792, 36231925, 34419564, 32462286, 30413995, 28504595, 26909490, 25626467, 24610475, 23898622, 23517731, 23377022, 23353705, 23401209, 23472495, 23413089, 23055627, 22401495, 21629037, 20941124, 20452363, 20172240, 20021276, 19891143, 19751852, 19683656, 19773338, 20023422, 20394909, 20875111, 21457176, 22122834, 22905524, 23903035, 25158295, 26588666, 28103932, 29735313, 31578960, 33677952, 36033242, 38647968]
36762C8647968K803931K788558K566612K309432K165991K167430K353043K806738
36754E8609703L500714M280348N087660O034179P189480Q510221J0075783J2155402
36746A15443490J4890747J8115029K1538993K4641027K6023430K3434706J5440949
36739B59528371L399877q741196j7081817k0246794j9440295j6672437j3312500
36732A67433209r941037o826103m226326k431526j671008j895345k600792l016269
36724A34824803k606861j393699K31696J914492L485476M809378N701592O114155
36716A53081032O336992O891155Q195023J0358990J3237480J6556852K0018883
36709B34676407K3445685K6806448K9782288L1113451K8757346K1393671J0110346
$$ y = [38647968, 41451899, 44240457, 46807069, 49116501, 51282492, 53449922, 55802965, 58609703, 62110417, 66390765, 71478425, 77512604, 84702084, 93212305, 103288088, 115443490, 130334237, 148449266, 169988259, 194629286, 220652716, 244087422, 259528371, 262928248, 254187052, 237105235, 216858441, 197418146, 180745709, 167433209, 157492172, 150666069, 146439743, 144008217, 142337209, 140441864, 137841072, 134824803, 132217942, 130824243, 131055939, 132970431, 136455907, 141265285, 146966877, 153081032, 159418024, 166309179, 174504202, 184863192, 198100672, 214657524, 234676407, 258122092, 284928540, 314710828, 345824279, 374581625, 395975296, 406085642]
36702D06085642j646105j0186435j3853876j3410855j0608319o793625k894144
36695C46692283k01342m36236m593069j1731790j9215700k4416935k6316172k5595189
36687B34185850k3508336k0918862j8225839j5686015j3484503j1624705r987031
36680A20750559q506337p209037o126116n258639m585715m031255l474916k878117
36672G8680427k353138k022203j844209j662336j388881j057427p22439m08937
36664F7220857j61731n1673j03254k71730n11964q22643j198361j571309j832831
36655F0695361j915987j854016j750166j674456j594893j433691j179106q99238
36647D8393808o55806m65218l39723k80920k15710l9418K30050M38552N04383
$$ y = [406085642, 404439537, 394253102, 380399226, 366988371, 356380052, 349586427, 346692283, 346490941, 346054705, 341461636, 329729846, 310514146, 286097211, 259781039, 234185850, 210677514, 189758652, 171532813, 155846798, 142362295, 130737590, 120750559, 112244222, 105035185, 98909069, 93650430, 89064715, 85033460, 81558544, 78680427, 76327289, 74305086, 72460877, 70798541, 69409660, 68352233, 67629794, 67220857, 67059126, 67007453, 66904199, 66632469, 66120505, 65297862, 64099501, 62528192, 60695361, 58779374, 56925358, 55175192, 53500736, 51905843, 50472152, 49293046, 48393808, 47738002, 47272784, 46933061, 46652141, 46436431, 46397013, 46627063, 47065615, 47569998]
36638D7569998N45649P03822R22710J027107R71047Q74984Q37376Q46514Q97150
36629E5196357J073951J464305K057850K774923L547681M341329N116925N770073
36621H1343394O080866N773351M732992L205502J727808Q12282O74318J209636
36613A05560149K161474L299476M479164N560477O324606O586100O442410O308411
36605A46722267O588214P362562Q489235R923401J1793586J4215947J7144505
36598B22239717K0215235K2403951K1963164J7384833Q982339n99551p915571
36591C04674117j1015447j0307585p440980l760097M8403L207897M356766K197942
36583B81961016l250446j0173830j5972468j8966593j9223931j7876706j5898744
$$ y = [47569998, 48115647, 48819469, 49742179, 50769286, 51740333, 52615317, 53452693, 54299207, 55196357, 56270308, 57734613, 59792463, 62567386, 66115067, 70456396, 75573321, 81343394, 87424260, 93197611, 97930603, 101136105, 102863913, 103676195, 104350513, 105560149, 107721623, 111021099, 115500263, 121060740, 127385346, 133971446, 140413856, 146722267, 153310481, 160673043, 169162278, 179085679, 190879265, 205095212, 222239717, 242454952, 264858903, 286822067, 304206900, 313189239, 312589688, 304674117, 293658670, 283351085, 275910105, 272150008, 272198411, 275406308, 279763074, 281961016, 278710570, 268536740, 252564272, 233597679, 214373748, 196497042, 180598298]
36576A80598298j3645001j1253305r018012p259389o086031n437816n213483n234242
36568A17451019n220690m975266m547955m122580l792447l537810l353649l265223
36560H4635399l230948l143657k946839k678015k388862k081856j731271j321922
36552F5112029q79696n13625l98229o27443j080326j508275j774017j940501k113080
36543E4276837k280275k356519k309247k170744j964631j695931j398763j121269
36535C8979458q52446n22615j09766K83232M92527M37074J92277p6095k50858
36526C8572788l44898m47499n90120o81805o01232l49436p9835M0559j9168j59087
36516C5340267k77550l54358m09910m33720l87494k55127n3222J97361M72343
$$ y = [180598298, 166953297, 155699992, 146681980, 139422591, 133336560, 127898744, 122685261, 117451019, 112230329, 107255063, 102707108, 98584528, 94792081, 91254271, 87900622, 84635399, 81404451, 78260794, 75313955, 72635940, 70247078, 68165222, 66433951, 65112029, 64232333, 63718708, 63320479, 62693036, 61612710, 60104435, 58330418, 56389917, 54276837, 51996562, 49640043, 47330796, 45160052, 43195421, 41499490, 40100727, 38979458, 38127012, 37604397, 37494631, 37777863, 38270390, 38707464, 38899741, 38823646, 38572788, 38227890, 37780391, 37190271, 36508466, 35907234, 35557798, 35477963, 35518522, 35499354, 35340267, 35062717, 34708359, 34298449, 33864729, 33477235, 33222108, 33168886, 33366247, 33838590]
36507C3838590P16086Q52953Q46237P23854N32915K97570M6395j42845j69222
36498C7542533J0457L42306P17787J042279J264727J363382J325020J148451Q65519
36489D5622461N40781K31945m2524k76483m30129m54344l67717k58105j74626
36480D4391259n6969J79537N05359P67480Q19698O43243L56300J31530Q4390K06859
36470D8028686M15097O70948J021251J502728K075049K693169L350622L931257
36462F3688807M082427L431721J999561K89929j092375j850283k026335j797931
36454F6725521j356705q76123m24717Q7342P74390J593205K371381K995752L484795
36445G5374841L889077M219963M487653M720112M918393N067093N216633N485183
$$ y = [33838590, 34554676, 35407629, 36253866, 36977720, 37510635, 37808205, 37854600, 37711755, 37542533, 37552990, 37895296, 38613083, 39655362, 40920089, 42283471, 43608491, 44756942, 45622461, 46163242, 46395187, 46352663, 46076180, 45646051, 45191707, 44823990, 44565885, 44391259, 44334290, 44513827, 45019186, 45786666, 46606364, 47249607, 47605907, 47737437, 47821827, 48028686, 48443783, 49114731, 50135982, 51638710, 53713759, 56406928, 59757550, 63688807, 67771234, 71202955, 73202516, 73492445, 72400070, 70549787, 68523452, 66725521, 65368816, 64492693, 64067976, 64155318, 64929708, 66522913, 68894294, 71890046, 75374841, 79263918, 83483881, 87971534, 92691646, 97610039, 102677132, 107893765, 113378948]
36437A13378948N939034O522023P137119P747492Q355303Q920736R350538R549019
36429A76900212R448709R009927Q221870P094042N627523L815469J705332n41934
36421B21281150k682101m498957n906801o968144p814501q524631r059948r322020
36413A66504047r272064q975113q524856p962126p303061o630076o095131n792357
36405A05949263n644297n459216n113240m645983m168165l729920l328500k995615
36397G0864327k780054k644689k483495k280760k162322k217238k336871k324060
36389E1634838k129386j891481j755529j730614j724964j649117j472468j238381
36381C8042898j044516r72634j026822j153460j290458j362614j284463j052124
$$ y = [113378948, 119317982, 125840005, 132977124, 140724616, 149079919, 158000655, 167351193, 176900212, 186348921, 195358848, 203580718, 210674760, 216302283, 220117752, 221823084, 221281150, 218599049, 214100092, 208193291, 201225147, 193410646, 184886015, 175826067, 166504047, 157231983, 148256870, 139732014, 131769888, 124466827, 117836751, 111741620, 105949263, 100304966, 94845750, 89732510, 85086527, 80918362, 77188442, 73859942, 70864327, 68084273, 65439584, 62956089, 60675329, 58513007, 56295769, 53958898, 51634838, 49505452, 47613971, 45858442, 44127828, 42402864, 40753747, 39281279, 38042898, 36998382, 36025748, 34998926, 33845466, 32555008, 31192394, 29907931, 28855807]
36373B8855807q04923o98709p18974p05853n62157l40195j20583P4051K08504
36364B5186968K03163N3640j07714j61142j44714j59144j86710j23806J9968P1861
36354B4652370j13952m78642q10797r45907q88389p57167o43555n37471l86856
36345A9089634j97018l3887O1118J07763J28680J10419N3621J0769K2803N1563
36335A9405465L4497p897J7855J45768K70293K28426m4827m49425p96991r47850
36325A7855314q87216o95838m71151k75526j31128m1088j9926j02194k92254n01470
36315A4437523n91622n18320l80365k77487j82559l7498Q9998Q6671J5711R4115
36305A2736167L92010O87700P16282M74882J88345M1043M2617J11767J81126K17396
$$ y = [28855807, 28050884, 27352175, 26633201, 25927348, 25365191, 25024996, 24904413, 24978464, 25186968, 25390131, 25443771, 25336057, 25174915, 25030201, 24871057, 24684347, 24560541, 24580509, 24652370, 24538418, 24059776, 23248979, 22303072, 21414683, 20657516, 20013961, 19476490, 19089634, 18892616, 18858729, 18919847, 19027610, 19156290, 19266709, 19320330, 19331099, 19353902, 19405465, 19439962, 19432065, 19449920, 19595688, 19865981, 20094407, 20049580, 19600155, 18803164, 17855314, 16968098, 16272260, 15801109, 15525583, 15394455, 15353367, 15333441, 15231247, 14938993, 14437523, 13845901, 13327581, 12947216, 12669729, 12487170, 12449672, 12539670, 12626341, 12642052, 12736167, 13128177, 13815877, 14532159, 15007041, 15195386, 15236429, 15279046, 15390813, 15571939, 15789335]
36295A5789335K12808J72743Q5086p4900k73089l86520l04549m9127K45183M54461
36285A5871431N40351N40811N36334N98161P18106Q07363Q06052P65672P72677
36276B1956958Q19373Q17417P30085O24448N79068N87060N71411M72092L04541
36267B7462453J39261K2564p8402k24893l96129m75139l75693j46819Q9441K79214
36257B6295858M80220P88874J255846J839076K397590K774671K960733L147984
36249D1940852L510308L878078L717154K563055N32754j633099l098736l535291
36241D7875075l229525k684483k209926j868355j631195j448130j240730r79278
36233C2583453p56815o77536o89955o48936n29368m42977m41226m53516m51244
$$ y = [15789335, 16002143, 16174886, 16259972, 16185072, 15911983, 15525463, 15220914, 15171787, 15416970, 15871431, 16411782, 16952593, 17488927, 18087088, 18805194, 19612557, 20418609, 21184281, 21956958, 22776331, 23593748, 24323833, 24948281, 25527349, 26114409, 26685820, 27157912, 27462453, 27601714, 27624278, 27545876, 27320983, 26924854, 26449715, 26074022, 25927203, 26016644, 26295858, 26776078, 27564952, 28820798, 30659874, 33057464, 35832135, 38792868, 41940852, 45451160, 49329238, 53046392, 55609447, 56142201, 54509102, 51410366, 47875075, 44645550, 41961067, 39751141, 37882786, 36251591, 34803461, 33562731, 32583453, 31826638, 31149102, 30459147, 29810211, 29280843, 28837866, 28396640, 27943124, 27491880]
36224B7491880n13323o59018p57268o96611n35601l94536k98260k17499j71938
36215B3247826j92394k52731l21856m09358m88350m65541l15824j59466j10073
36206B0532233j21358p2512P1931K68486M66925N81585M90970J89437j29385k52391
36196B2025921j55971M3181K53647M19131M52470K97341K2985k28550l49784k82073
36186B2498298j7747L52950O98830R99847J321411J616165J744487J749856J884141
36177C2848238K262424K737512L225633L856381M635704N302492N779457O453966
36169F7101807P712483R486090J1548888J3925832J6675322J9681635K3091880
36162A69223937K7514068L3273781L9950701M7050989N3959807N7841868N2742716
$$ y = [27491880, 26978557, 26319539, 25562271, 24865660, 24330059, 23935523, 23637263, 23419764, 23247826, 23055432, 22802701, 22480845, 22071487, 21583137, 21117596, 20801772, 20642306, 20532233, 20410875, 20338363, 20410294, 20678780, 21145705, 21727290, 22218260, 22407697, 22278312, 22025921, 21869950, 21913131, 22166778, 22585909, 23038379, 23335720, 23358705, 23130155, 22780371, 22498298, 22480551, 22833501, 23532331, 24532178, 25853589, 27469754, 29214241, 30964097, 32848238, 35110662, 37848174, 41073807, 44930188, 49565892, 54868384, 60647841, 67101807, 74814290, 84300380, 95849268, 109775100, 126450422, 146132057, 169223937, 196738005, 230011786, 269962487, 317013476, 370973283, 428815151, 481557867]
36155D81557867L3849514L904584k6415124m6313316n2755843n0227595m4420098
36148B99179989l8005480l1541032k5572204k0673833j6746651j3415132j0678440
36141A42547217q636848p052167n639368m415649l407801k374566j137210J47360
36133A10030968J339153K632824M235471N999471P653714R164555J0606919J1882943
36125A63546018J2799951J3220562J2901725J1394682Q407072M202006n22315
36118B25949701n039699q783633j1374451j2736754j3122809j2853652j2106257
36111A49932446j1033156r894246q878179p929011o940186o009264n317851m862460
36103H9068093m496465m163771l909652l716316l497742l226833k937172k643179
$$ y = [481557867, 515407381, 519311965, 492896841, 446583525, 393827682, 343600087, 299179989, 261174509, 229633477, 204061273, 183387440, 166640789, 153225657, 142547217, 133910369, 126858202, 121218834, 116803185, 113395384, 111020818, 109883608, 110030968, 111370121, 114002945, 118238416, 124237887, 131891601, 141056156, 151663075, 163546018, 176345969, 189566531, 202468256, 213862938, 222270010, 226472016, 225949701, 220910002, 212126369, 200751918, 188015164, 174892355, 162038703, 149932446, 138899290, 129005044, 120126865, 112197854, 105257668, 99248404, 93930553, 89068093, 84571628, 80407857, 76498205, 72781889, 69284147, 66057314, 63120142, 60476963]
36095F0476963k370799k197619k138030k061243j857687j618933j512987j543421
36087D5176244j576021j546793j492205j421854j323290j264231j324910j432603
36079C3794337j417966j251767j088450j048326j077817j059178r52262p87668
36071B5110903o07754m56898l64261l03962k23234j24653o8193q4755j43357k08853
36061B2524983k72029l12423k93579k21627j63463j74297k25537k22299r2362
36052B0547367J29949K98552K62047P292l13288n16460n38434m52327l80463m07551
36042A8636684n29381o47617o48438n18936l58766k64926k54857l15334m47029
36033A4651400o13785p19279o97566n75757l99586j67018R9698K91023L12118
$$ y = [60476963, 58106164, 55908545, 53770515, 51709272, 49851585, 48232652, 46719665, 45176244, 43600223, 42053430, 40561225, 39139371, 37816081, 36551850, 35226940, 33794337, 32376371, 31124604, 30036154, 28987828, 27910011, 26850833, 25898571, 25110903, 24503149, 24046251, 23681990, 23378028, 23154794, 23030141, 22961948, 22877193, 22733836, 22524983, 22252954, 21940531, 21646952, 21425325, 21261862, 21087565, 20862028, 20639729, 20547367, 20677316, 20975868, 21237915, 21245207, 20931919, 20415459, 19877025, 19424698, 19044235, 18636684, 18107303, 17459686, 16811248, 16292312, 15933546, 15668620, 15413763, 15098429, 14651400, 14037615, 13318336, 12620770, 12045013, 11645427, 11478409, 11578107, 11869130, 12181248]
36024A2181248K02380P3255k4384q9023q4734K0254J63513K45107K56551K56627
36014A3200794K45895J81965J09954J46054K97542M03552L07267K4293k89703
36005A4627613m81342m93389l85027k90975l15116m41068n70535o30800n97213
35996A0422148m47721j89752P3695K05946J86464J16105N4872n4217k64174n11254
35986I592112o73117o80643n39254l06957q8927J5354P610j9994k1475n1481j45034
35975G088194k28990k19152j30219j3175J42101L41281M81995M43340K63565J09163
35965H278103N4615K36j57211l66070m87649m55131l01137p2693K06281M94113
35955G193457P14165Q06328P80288P01589O23795N40175M11479K39873R0337J7630
$$ y = [12181248, 12383628, 12456883, 12432499, 12343476, 12258742, 12278996, 12442509, 12687616, 12944167, 13200794, 13446689, 13628654, 13738608, 13884662, 14182204, 14585756, 14893023, 14917316, 14627613, 14146271, 13652882, 13267855, 12976880, 12661764, 12220696, 11650161, 11019361, 10422148, 9974427, 9784675, 9858370, 10064316, 10250780, 10366885, 10421757, 10367540, 10103366, 9592112, 8918995, 8238352, 7699098, 7392141, 7303214, 7318568, 7326178, 7306184, 7284709, 7233228, 7088194, 6859204, 6640052, 6509833, 6496658, 6638759, 6980040, 7462035, 7905375, 8168940, 8278103, 8332718, 8332954, 8175743, 7809673, 7322024, 6866893, 6565756, 6493063, 6699344, 7193457, 7907622, 8713950, 9494238, 10195827, 10819622, 11359797, 11771276, 12011149, 12101486, 12119116]
35945A2119116n441m5682r8724o5915J39631M91967Q73852J175748J359346J452528
35935A7396426J514955J606862J776527K074609K568006L311241M296800N446407
35927C9991833O619870P559618P842557P066120N270857L154833J648265J101747
35919H0255700R17598R4262j820628m313460o371257p287010p058145o179694
35911D8237366n193119m395570l811876l312816k761403k124689j496568j009027
35903B4132298p09765n33892l92913k60518j50647m1226J28966L74374O06482
35894B3153159P02266O43839N74856O79586R83273J309930J495695J618362J917332
35885C3078298K476338L117802L690623M339444N347391O790195Q510065J0384354
$$ y = [12119116, 12113675, 12067993, 11969269, 11903354, 12042985, 12534952, 13408804, 14584552, 15943898, 17396426, 18911381, 20518243, 22294770, 24369379, 26937385, 30248626, 34545426, 39991833, 46611703, 54171321, 62013878, 69079998, 74350855, 77505688, 79153953, 80255700, 81173298, 81267560, 79446932, 75133472, 68762215, 61475205, 54417060, 48237366, 43044247, 38648677, 34836801, 31523985, 28762582, 26637893, 25141325, 24132298, 23422533, 22888641, 22495728, 22235210, 22084563, 22043337, 22172303, 22546677, 23153159, 23855425, 24499264, 25074120, 25753706, 26736979, 28046909, 29542604, 31160966, 33078298, 35554636, 38672438, 42363061, 46702505, 52049896, 58840091, 67350156, 77734510]
35877G7734510J2438900J4713145J7168338J9599842K1254014K0529829J5716033
35870A99154611O674204m260660j3541122j8812167k0089868j8871639j6605428
35863A13647931j4074632j1654962r562995p836535o376718n117151m073625l254205
35855E1697108k629196k174640j854456j576351j247929q65878m86379j28152
35847D0734127K33715O01524R47940J265322J576946J917457K338876K902729
35839E2518636L618986M416877N210868N957039O599851O995803O928497O173511
35831I8420068M557965K082030r16023l789651n926453p105146p498190p389035
35823G2435565o971840o365677n665301m926245m175464l470817k897199k487749
$$ y = [77734510, 90173410, 104886555, 122054893, 141654735, 162908749, 183438578, 199154611, 205828815, 201568155, 188027033, 169214866, 149124998, 130253359, 113647931, 99573299, 87918337, 78355342, 70518807, 64142089, 59024938, 54951313, 51697108, 49067912, 46893272, 45038816, 43462465, 42214536, 41348658, 40862279, 40734127, 40967842, 41569366, 42517306, 43782628, 45359574, 47277031, 49615907, 52518636, 56137622, 60554499, 65765367, 71722406, 78322257, 85318060, 92246557, 98420068, 102978033, 105060063, 104144040, 100354389, 94427936, 87322790, 79824600, 72435565, 65463725, 59098048, 53432747, 48506502, 44331038, 40860221, 37963022, 35475273]
35815C5475273k203706k008563j908124j893400j889774j798465j576308j268493
35807B0928440r79565q04745p58212p62847p24047o02871m04744j33712J95251
35798A5952948N18431P56481Q96210J005461J157140J358891J565096J750764
35790B4961422J963588K262956K553220K509077J801810M82028r37159j878652
35782C3718290k160839k013902j728434j419341j097481p98737n71490m28714
35774B3499352l80135m57339o52336q66038r64527q79168o43006l56532j28782
35765A8171489k3008m1013j63694l87394o88830r71927j102468j010171p35087
35756A3047897l78629l3008K57797N06287P48169R76454J124783J145709J089523
$$ y = [35475273, 33271567, 31263004, 29354880, 27461480, 25571706, 23773241, 22196933, 20928440, 19948875, 19144130, 18385918, 17623071, 16899024, 16296153, 15891409, 15757697, 15952948, 16471379, 17227860, 18124070, 19129531, 20286671, 21645562, 23210658, 24961422, 26925010, 29187966, 31741186, 34250263, 36052073, 36534101, 35596942, 33718290, 31557451, 29543549, 27815115, 26395774, 25298293, 24499556, 23928066, 23499352, 23119217, 22661878, 22009542, 21143504, 20178977, 19299809, 18656803, 18300271, 18171489, 18148481, 18107468, 17943774, 17556380, 16867550, 15895623, 14793155, 13782984, 13047897, 12669268, 12636260, 12894057, 13400344, 14148513, 15124967, 16249750, 17395459, 18484982]
35747A8484982J080517J231428J575968K008849K258279K027473J286678L90994
35739C0345168j96623k96037q2490J38525J08143l38204j169049k063214k598768
35730B3847451k628325k367357k071842j764948j350924q54070m15537j32603
35722A2261845j3516l4103j35374k04221j49101K2043K49542M95379P05956P68321
35712A3966771O05766K93755o64j78631k47319k36237j62389o3563J7523Q8767
35702A4083779J89515L16512M19390M62977M49323L97891L59531M27542O60318
35693A7766778R89357J262195J381600J359852J255018J123485J030038J020937
35685B7189260J061047J063405J014208J014395J160707J432962J743156K058344
$$ y = [18484982, 19565499, 20796927, 22372895, 24381744, 26640023, 28667496, 29954174, 30345168, 30148545, 29852508, 29770018, 29908543, 30016686, 29678482, 28509433, 26446219, 23847451, 21219126, 18851769, 16779927, 15014979, 13664055, 12809985, 12394448, 12261845, 12248329, 12214226, 12078852, 11874631, 11725530, 11747573, 11997115, 12492494, 13198450, 13966771, 14572537, 14866292, 14865628, 14686997, 14439678, 14203441, 14041052, 13977489, 13995012, 14083779, 14273294, 14589806, 15009196, 15472173, 15921496, 16319387, 16678918, 17106460, 17766778, 18756135, 20018330, 21399930, 22759782, 24014800, 25138285, 26168323, 27189260, 28250307, 29313712, 30327920, 31342315, 32503022, 33935984, 35679140, 37737484]
35677C7737484K419846K855779L326345L761662M116592M372492M508904M497123
35669F7596227M318201L972477L470784K829264K077743J258940M06165m66837
35661H5462964j333173k113834k694677k990531k988223k742815k357679j954704
35653F6287328j620793j378162j239640j278988j569611k020925k349535k301966
35645E2527708j909855j483063j349373j617095k153608k722675l124046l255304
35637C4912689l108076k742900k268574j808139j431669j107900p57627l75276
35629B1312528o6126O1842J3890j11352k27803l14286l91444m94979o56681q61884
35619A8263705j026334j059851r64150q38037p75856p79940p74104o80526m81273
$$ y = [37737484, 40157330, 43013109, 46339454, 50101116, 54217708, 58590200, 63099104, 67596227, 71914428, 75886905, 79357689, 82186953, 84264696, 85523636, 85929801, 85462964, 84129791, 82015957, 79321280, 76330749, 73342526, 70599711, 68242032, 66287328, 64666535, 63288373, 62048733, 60769745, 59200134, 57179209, 54829674, 52527708, 50617853, 49134790, 47785417, 46168322, 44014714, 41292039, 38167993, 34912689, 31804613, 29061713, 26793139, 24985000, 23553331, 22445431, 21687804, 21312528, 21246402, 21308244, 21322134, 21210782, 20982979, 20668693, 20277249, 19782270, 19125589, 18263705, 17237371, 16177520, 15213370, 14375333, 13599477, 12819537, 12045433, 11364907, 10883634]
35610A0883634k28251n099J29085J64699J18236P334j36838k56578l00368k66008
35600A0109846j90797j06203k4596L7807N7037K9113j6774m2422l0873P943N1883
35589I881964Q1835Q3934M3870m2002j35444j59670p6623M2414P5679j652p6207
35578I718098l1399J18135K60290L07315K34935M4496k34268n09299o68451o79258
35568H560594o06821n21139m25785k91456j20305N0622J90033K92651L61451L77250
35558G867095K91639P0849k36496m98119o01412n52783m43878l30536j91084n175
35548E370100J82710L07403L51317L31947K51439J12648j6293j0814J92320M95130
35538G567907O91953O39567L66727J8644k74759m56737n14592m65394l82985l75741
$$ y = [10883634, 10655383, 10650284, 10779369, 10944068, 11062304, 11069638, 10932800, 10676222, 10375854, 10109846, 9919049, 9812846, 9788250, 9826057, 9883094, 9912207, 9895433, 9853011, 9822138, 9830081, 9881964, 9963799, 10047733, 10091603, 10049601, 9914157, 9754487, 9677864, 9720278, 9795957, 9794305, 9718098, 9686699, 9804834, 10065124, 10372439, 10607374, 10651870, 10417602, 9908303, 9239852, 8560594, 7953773, 7432634, 7006849, 6715393, 6595088, 6645710, 6835743, 7128394, 7489845, 7867095, 8158734, 8229583, 7993087, 7494968, 6893556, 6340773, 5896895, 5566359, 5375275, 5370100, 5552810, 5860213, 6211530, 6543477, 6794916, 6907564, 6891271, 6880457, 7072777, 7567907, 8259860, 8899427, 9266154, 9284798, 9010039, 8553302, 8038710, 7573316, 7190331, 6814590]
35528F814590m83779o13039o07956l91177k4192L45515N74237N86652M03004J22618
35518F726473j30720k64651k49862j34885l0195k9707j19363j91505j69867q5805
35508E319913j0219L8161P1542O9161P294o5763n7413N9660K14629L15235L11482
35497F273682J90839k5920k65765m27239m46648l19892p2268K36936M80281N17531
35487F141537L44193J45887J40674L63683O36485P48050O46059M55710L36139
35478I958417L31592L55487K98285J25744j27038m12397o77821q39607q13460
35469H199202n96358k87899r484J82046K94682L45408L30520K46328J23501L0185
35459H858131K4987R3866J47299J03364l0261j71737k45414k19795q6836J41806
$$ y = [6814590, 6330811, 5717772, 5109816, 4718639, 4694447, 5039962, 5614199, 6200851, 6603855, 6726473, 6595753, 6331102, 6081240, 5946355, 5916160, 5886453, 5767090, 5575585, 5405718, 5319913, 5309694, 5347855, 5419397, 5488558, 5495852, 5430089, 5372676, 5432336, 5646965, 5962200, 6273682, 6464521, 6438601, 6172836, 5745597, 5298949, 4979057, 4906789, 5143725, 5624006, 6141537, 6485730, 6631617, 6772291, 7135974, 7772459, 8520509, 9166568, 9622278, 9958417, 10290009, 10645496, 10943781, 11069525, 10942487, 10530090, 9852269, 9012662, 8199202, 7602844, 7314945, 7305461, 7487507, 7782189, 8127597, 8458117, 8704445, 8827946, 8858131, 8883118, 8976984, 9124283, 9227647, 9197386, 9025649, 8780235, 8560440, 8473604, 8615410]
35449H615410M06183O07322O73110O03622M48753K66517J11931L7793P6998K16821
35439A2064460L87725M81814M16211K15727K2413j6810J23385L57131O13698R12000
35429A5577754J309299J823215K423330L070521L752295M499021N342907O182583
35421D3980925O663444O299438M872322K775262Q80788q8353j78091k04127j045494
35412F3956114k843740m873554o194807o398641n744382m737743l742289k937067
35404B6483891k399272k084285j824316j487636j127326q97213q42281q46108
35396A4975454p79387o36595n16377n08642o10306p27776p61712p03592o36745
35387I094322o29767o53762o23308m86617k48688N2030L39782N05022M78653L03635
$$ y = [8615410, 9021593, 9628915, 10302025, 10905647, 11354400, 11620917, 11732848, 11770641, 11847639, 12064460, 12452185, 12933999, 13350210, 13565937, 13588350, 13571540, 13694925, 14052056, 14665754, 15577754, 16887053, 18710268, 21133598, 24204119, 27956414, 32455435, 37798342, 43980925, 50644369, 56943807, 61816129, 64591391, 65472179, 65383826, 65205735, 65001608, 63956114, 61112374, 56238820, 50044013, 43645372, 37900990, 33163247, 29420958, 26483891, 24084619, 22000334, 20176018, 18688382, 17561056, 16663843, 15821562, 14975454, 14196067, 13559472, 13043095, 12534453, 11924147, 11196371, 10434659, 9731067, 9094322, 8464555, 7810793, 7187485, 6700868, 6452180, 6504210, 6843992, 7349014, 7827667, 8131302]
35377H131302Q6559j19265l35965n67102p35538p40826n57951k75050n3828l4538
35367D797798k21443m45581m92150l05498m7600P2175L102j35157k12838k05386
35357B807422j51508o3040P4125K33883L43165L57338L06263K39885J55199J7644
35347D320376j51490k52321j92196J9843K72940M37210M47325L28458J57534k641
35337E385038j32932k26290k55845k06913j25761q9217j18953j66010j88681j98321
35327C676115k06668j78259q0193N0488J38034J54521J31988Q9857p627k00027
35317C568229m50664o37708o40066m43624j58834P7670K09012K52146K19815J09045
35307B105021l4411j12003o8135N4205J80266K79699L51173L92597M30890N19586
$$ y = [8131302, 8217861, 8098596, 7762631, 7195529, 6459991, 5719165, 5161214, 4886164, 4832336, 4797798, 4576355, 4130774, 3638624, 3333126, 3285526, 3357701, 3360803, 3225646, 3012808, 2807422, 2655914, 2592874, 2666999, 2900882, 3244047, 3601385, 3907648, 4147533, 4302732, 4320376, 4168886, 3916565, 3724369, 3744212, 4017152, 4454362, 4901687, 5230145, 5387679, 5385038, 5252106, 5025816, 4769971, 4563058, 4437297, 4348080, 4229127, 4063117, 3874436, 3676115, 3469447, 3291188, 3210995, 3261483, 3399517, 3554038, 3686026, 3775883, 3768256, 3568229, 3117565, 2479857, 1839791, 1396167, 1237333, 1315003, 1524015, 1776161, 1995976, 2105021, 2070610, 1958607, 1890472, 1944677, 2124943, 2404642, 2755815, 3148412, 3579302, 4098888]
35297D098888O43102O78519N36092L02003J50452J32866J47777J11444N2639J9272
35287F873054l690l0713j2987Q8016K12727K59881K08314J26441P3436M0905r270
35276G826114r2372j99036l19746m49751n70495o41582o35247n88277n89137o75838
35266C064633p63252p23690n41822l37274k19698j74051j16626j4496R6679J83988
35256D54391K57473L43573M42201N01313M27499J59126k41279n98456p67974p53793
35246B24074o59254n55628m42268l03081j33668Q1125L46691N98271P19411O55092
35236E30765M71735K77955J19450j6204j24998j71265j44835q8045m5186o975
35226H02397P0657J93713K92848K75571J24520o2421j48472q4495N1061J49486
$$ y = [4098888, 4741990, 5420509, 5956601, 6258604, 6409056, 6541922, 6689699, 6801143, 6853782, 6873054, 6869364, 6838651, 6825664, 6913680, 7126407, 7386288, 7594602, 7721043, 7794479, 7835384, 7826114, 7733742, 7534706, 7214960, 6765209, 6194714, 5553132, 4917885, 4329608, 3740471, 3064633, 2301381, 1577691, 1035869, 698595, 478897, 304846, 188220, 173724, 270403, 454391, 711864, 1055437, 1497638, 1998951, 2426450, 2585576, 2344297, 1745841, 977867, 224074, -435180, -990808, -1433076, -1736157, -1869825, -1788700, -1442009, -843738, -124327, 530765, 1002500, 1280455, 1399905, 1383701, 1258703, 1087438, 942603, 854558, 809372, 802397, 873054, 1066767, 1359615, 1635186, 1759706, 1697285, 1548813, 1464318, 1515379, 1664865]
35216A664865J95534K68463M19948N84671O40045N41266L62662K01831Q0563l2908
35206D926940j32412j57226p5856N5098J46534J71928J75102J88525J75730O6812
35196E541175j63009m55614o95961p73169o45243l77799j20792j7300j04313k92103
35186A895872m43923m82553m28599l49841k85067k14813r3577R5850L13934M85568
35176D92851N56244N33203M64903L77452K48381O0906j30544k25998j85567q8328
35166B103503o7366j95854m46138p36079r81322j108925j066543q52538n30492
35157c881754j94781Q1962K69279L67244L93787L74392L21415K24966Q6615l8649
35147a995524o9387J1693J18979J49301R6642M8459O7742J10864P2201j12304
$$ y = [1664865, 1860399, 2128862, 2548810, 3133481, 3773526, 4314792, 4677454, 4879285, 4959848, 4926940, 4794528, 4637302, 4561446, 4616544, 4763078, 4935006, 5110108, 5298633, 5474363, 5541175, 5378166, 4922552, 4226591, 3453422, 2808179, 2430380, 2309588, 2292288, 2187975, 1895872, 1451949, 969396, 540797, 190956, -94111, -308924, -402501, -306651, 7283, 492851, 1049095, 1582298, 2047201, 2424653, 2673034, 2733940, 2603396, 2377398, 2191831, 2103503, 2036137, 1840283, 1394145, 658066, -323256, -1432181, -2498724, -3351262, -3881754, -4076535, -3994573, -3725294, -3358050, -2964263, -2589871, -2268456, -2043490, -1956875, -1995524, -2064911, -2053218, -1934239, -1784938, -1688296, -1639837, -1572095, -1461231, -1389030, -1501334]
35137a501334m07959o93931q26215p38079n15795l41834l15521l47581k77040
35128e965289p0707J59156L28474M81229O73309Q34226Q35647O77404N15184M73843
35118a057524M88517L77806N8138l47729o15414o16766m19965k14319j45713k15029
35108b707998l12559l24850k04781K7017L03740N29835O15651N31596L33285J25089
35098a083975n786l3370O29J5726m4142j50769k10895j74910j16157j61823l37929
35087b303401n22349n74717m80366l29850j81833n019K37397N03876P16867Q60275
35077b079120R84411J114517J198247J165206J015104Q23138O66452N60829M58880
35068E907664K87873o846m21222q66037j187248j246786j017232o10413k06020
$$ y = [-1501334, -1909293, -2603224, -3429439, -4167518, -4683313, -5025147, -5340668, -5688249, -5965289, -6035996, -5876840, -5548366, -5067137, -4393828, -3559602, -2723955, -2046551, -1531367, -1057524, -569007, -191201, -133063, -480792, -1096206, -1712972, -2132937, -2347256, -2492969, -2707998, -3020557, -3345407, -3550188, -3523171, -3219431, -2689596, -2073945, -1542349, -1209064, -1083975, -1089761, -1123131, -1122502, -1106776, -1150918, -1301687, -1512582, -1687492, -1803649, -1965472, -2303401, -2825750, -3400467, -3880833, -4210683, -4392516, -4397535, -4160138, -3656262, -2939395, -2079120, -1094709, 19808, 1218055, 2383261, 3398365, 4221503, 4887955, 5448784, 5907664, 6195537, 6188691, 5767469, 4901432, 3714184, 2467398, 1450166, 839753, 633733]
35059F33733O3067J70600J62642Q8497k0893j25016j67305j22534l5946J3492
35049F60337p814o2174r2476p6327k1484O3878J67947K53736K74616K22535J44633
35038A527407J02394J23223J92412K71211L09138K58215J05729j02021k86028
35029B501680l94247m31780m35989m35161m30502l98041k98775j07829J42003
35020b88641L52341M21699L27784J40731m3793j70975k33475k47189k41210k46971
35010b29699k62964k37539j19850O9197K43803L33325L26684K39152Q6567q0101
35000C68575j61402q5212J17471L50079N41896O56165O38001M43525J41285r0608
34990B919775j20354J8467J91628L02219L27600K71665J46830j6771j98437m06311
$$ y = [633733, 696800, 867400, 1030042, 1118539, 1097646, 972630, 805325, 682791, 646845, 660337, 652523, 590349, 497873, 421546, 400062, 463940, 631887, 885623, 1160239, 1382774, 1527407, 1629801, 1753024, 1945436, 2216647, 2525785, 2784000, 2889729, 2787708, 2501680, 2107433, 1675653, 1239664, 804503, 374001, -24040, -322815, -430644, -288641, 63700, 485399, 813183, 953914, 910121, 739146, 505671, 258482, 17272, -229699, -492663, -730202, -850052, -780855, -537052, -203727, 122957, 362109, 448676, 368575, 207173, 121961, 239432, 589511, 1131407, 1787572, 2425573, 2869098, 3010383, 2919775, 2799421, 2817888, 3009516, 3311735, 3639335, 3911000, 4057830, 4041059, 3842622, 3436311]
34980C436311o19712p37388o56387m03085j20118Q4832K11885K78386K37830M5488
34970A758042k41959m92677o08449n70365m06843j75844K5522R5929J4450j20272
34960g22466j59760k8019K18886M51465N81923O14915N90409N12755L68416J87572
34950B616096L0549q8064k04223l18254l65720l14206k39788k50531l59191m84348
34940B2320n60532n90819n93481n55199m60530l33002k18380j38208p5704j910
34930c505445R6264K15264L50625M92927N99851O02331M80920L28663K85301L91051
34920C37752N42348O04392N26692L43513J29560j4080p569J09817J87705J43632
34910B903762Q2423J49527L09092L78109K64964N7754j32031k93692m46059n50643
$$ y = [3436311, 2816599, 2079211, 1422824, 1019739, 899621, 984453, 1196338, 1474724, 1712554, 1758042, 1516083, 1023406, 414957, -155408, -562251, -738095, -712573, -616644, -602194, -722466, -882226, -910245, -691359, -239894, 342029, 956944, 1547353, 2060108, 2428524, 2616096, 2646645, 2558581, 2354358, 2036104, 1670384, 1356178, 1116390, 865859, 506668, 22320, -538212, -1129031, -1722512, -2277711, -2738241, -3071243, -3289623, -3427831, -3503535, -3505445, -3409181, -3193917, -2843292, -2350365, -1750514, -1148183, -667263, -338600, -53299, 337752, 880100, 1484492, 2011184, 2354697, 2484257, 2470177, 2462608, 2572425, 2760130, 2903762, 2986185, 3135712, 3444804, 3822913, 4087877, 4145631, 4013600, 3719908, 3273849, 2723206]
34900B723206n66821n23167m66791l92496k80262j56348n7573K8899J34354K44397
34890F87398L11177L00425J90419k6697k84546m28974l47324r9905J42399K79739
34880G24111L39606L71580L76727L56269L43176L38127K74532J06484j01078k26353
34870B903181k23669j59032j18423j23591j47371j73935k14534k77736l51324
34861A113566m12950m37013l90305k53330o8011O2052O0704l3646j05027q5283
34851e49243n707P8033J58505K46432L16371L32936L08611K87898K82871K64067
34841A720774K08815J21033P752j22331k30642k56938j77555m2207N7782N6679
34831A343162l6741j38537j47621k9217J56804L15367L85824L46482J97877j2748
$$ y = [2723206, 2156385, 1633218, 1166427, 773931, 493669, 337321, 279748, 308647, 443001, 687398, 998575, 1299000, 1489419, 1462722, 1178176, 749202, 401878, 301973, 444372, 724111, 1063717, 1435297, 1812024, 2168293, 2511469, 2849596, 3124128, 3230612, 3129534, 2903181, 2679512, 2520480, 2402057, 2278466, 2131095, 1957160, 1742626, 1464890, 1113566, 700616, 263603, -126702, -380032, -448043, -385991, -325287, -358933, -463960, -549243, -554950, -476917, -318412, -71980, 244391, 577327, 885938, 1173836, 1456707, 1720774, 1929589, 2050622, 2058374, 1936043, 1705401, 1448463, 1270908, 1228701, 1286483, 1343162, 1306421, 1167884, 1020263, 991046, 1147850, 1463217, 1849041, 2195523, 2393400, 2380652]
34821B380652j86161k58506k82144l50507m46526m49381l12588j48566q3565r9011
34811b36303r1456m2152l5694j20380k32838k78057k20790p2291J56488M37521
34801g35952O85567P90261P09287N17553L49276K83438K81391K35951Q0316j52096
34791C044992l60713m45600l49882q8806K25061M21524M02815K39430R0567K2680
34781C202068m3295j88851l63090m40445l77202k50865j56416j22671j37280j97972
34771I23981l07284m43858n63010o11295n38527l35420q0105R7047J41808J46726
34761a569937K44580M41603O04019O05547M39702J90891l9296j61899j34166j9348
34751F01696L4831n8273k21889l07792k61165j34995K5143K14648L82739M13272
$$ y = [2380652, 2194491, 1935985, 1653841, 1303334, 856808, 407427, 94839, -53727, -137292, -236303, -327759, -369911, -405605, -525985, -758823, -1036880, -1257670, -1329961, -1173473, -735952, -50385, 739876, 1449163, 1966716, 2315992, 2599430, 2880821, 3116772, 3197088, 3044992, 2684279, 2238679, 1888797, 1799991, 2025052, 2446576, 2849391, 3088821, 3179388, 3202068, 3158773, 2969922, 2606832, 2166387, 1789185, 1538320, 1381904, 1259233, 1121953, 923981, 616697, 172839, -390171, -1001466, -1539993, -1875413, -1955518, -1858471, -1716663, -1569937, -1325357, -883754, -279735, 325812, 765514, 956405, 917109, 755210, 621044, 601696, 636527, 578254, 356365, 48573, -212592, -347587, -322444, -107796, 274943, 688215]
34741F88215K51159m576j85060j95979m7724K01743M68649O39181O21782M19697
34731B857087J20088j82514m22440n50189n47022m57087l53561k59537j42322
34722F2503N636J25230J46996N2727j28328l36916m78566m56513k55015L8857
34712a223389L25610N65017P24093P18744M98184J69753n9022r4103m6258p3522
34702A505107j87639k69510k42889j66351j46464k07904k82571l13681l31587
34693f43489l97957m87845m79532k94137q883K22811L44105M18893M87722M91391
34683c46921L80155K22392J33669J44685K12227L22756M95988P00677Q59643R45287
34673D070558R81873R37726P20224L33281n4676k92271m32178o24779q56687r30713
$$ y = [688215, 939374, 934798, 749738, 553759, 506035, 707778, 1176427, 1815608, 2437390, 2857087, 2977175, 2794661, 2372221, 1822032, 1275010, 817923, 464362, 204825, 62503, 68139, 193369, 340365, 393092, 264764, -72152, -550718, -1007231, -1262246, -1223389, -897779, -332762, 391331, 1110075, 1608259, 1778012, 1718990, 1624887, 1578629, 1505107, 1317468, 1047958, 805069, 638718, 492254, 284350, 1779, -311902, -643489, -1041446, -1529291, -2008823, -2302960, -2311843, -2089032, -1744927, -1326034, -838312, -346921, 33234, 255626, 389295, 533980, 746207, 1068963, 1564951, 2265628, 3125271, 4070558, 5052431, 5990157, 6710381, 7043662, 6988986, 6696715, 6264537, 5639758, 4783071, 3852358]
34663C852358p35222m13158j85107q5824J9608K00999L69683M34611M37352M63167
34653D358467M89969M16280K11535m4465k62253l99574m15242k68652j5915J75295
34643D245445J87798Q9279L1180M8999M6539m3952j84256l17431m35032n25982
34633C142587n43317m70944l57980k38086q0824J12843K29672J54573n9559k23992
34623A664973k27167j48419j39681k45483l66681l70117k10775L7515K56335L87072
34613F37572M53036M80284M43460L31388K24912K28732L23041L57342K23286j5318
34603C687735j94439k10297q1954R4113J97722J26933j33745m61234o53380n89039
34593A782415l42075j23061q9202k01252k70916j53112J15747L68207M65946L92799
$$ y = [3852358, 3117136, 2703978, 2518871, 2433047, 2452655, 2653654, 3023337, 3457948, 3895300, 4358467, 4848436, 5264716, 5476251, 5431786, 5169533, 4769959, 4354717, 4086065, 4070150, 4245445, 4433243, 4522522, 4553702, 4602701, 4649240, 4605288, 4421032, 4103601, 3668569, 3142587, 2599270, 2128326, 1770346, 1532260, 1451436, 1564279, 1793951, 1948524, 1888965, 1664973, 1437806, 1289387, 1149706, 904223, 537542, 167425, -43350, -5835, 250500, 637572, 1090608, 1570892, 2014352, 2345740, 2570652, 2799384, 3122425, 3479767, 3703053, 3687735, 3493296, 3282999, 3201045, 3295158, 3492880, 3619813, 3486068, 3024834, 2371454, 1782415, 1440340, 1317279, 1228077, 1026825, 755909, 602797, 718544, 1086751, 1552697, 1945496]
34583A945496K23494N0460o6554j33081k18789l84190n89525p10397o66191n04853
34573a054130l38842k25043j35519k4914J08214K25166K93358L26484L74716M58138
34563G628N17647M71780L31507K11591J98128K44813K43083J66271R3370J03144
34553B588962J95159L15753M15788M66752M50040L53699J79846l8750k24046k82162
34543D421041j87149l4123K6689p5342k73044m33879m70532l83639k27261n4855
34533B307906J02000K12176K24142J02650r9910k45985k29753q2848O7282J30054
34523B487714J05903K7157r0204k19728l04350l03167k36066j54687q6034k7359
34513A199179J9640L8589K3533q48Q275P3467J65029K18807K05314J72164J87431
$$ y = [1945496, 2168990, 2219450, 2152896, 2019815, 1801026, 1416836, 827311, 116914, -549277, -1054130, -1392972, -1618015, -1753534, -1778448, -1670234, -1445068, -1151710, -825226, -450510, 7628, 525275, 997055, 1328562, 1540153, 1738281, 1983094, 2226177, 2392448, 2485818, 2588962, 2784121, 3099874, 3515662, 3982414, 4432454, 4786153, 4965999, 4927249, 4703203, 4421041, 4233892, 4199769, 4226458, 4151116, 3878072, 3444193, 2973661, 2590022, 2362761, 2307906, 2409906, 2622082, 2846224, 2948874, 2848964, 2602979, 2373226, 2290378, 2357660, 2487714, 2593617, 2620774, 2530570, 2310842, 2006492, 1703325, 1467259, 1312572, 1226538, 1199179, 1218819, 1257408, 1280941, 1280093, 1288368, 1361835, 1526864, 1745671, 1950985, 2123149, 2310580]
34502B310580K42033K47010J44553o097p3593K9121K75579N40051O70916N95904
34492D976057L93495K33958K07008K17706Q7290k50055o78451j010703j125401
34483C050904j008468p30398m21608k29300k34658l91214n57951o02839m82329
34474a607861k45518J1837K03670L00681L43446L94134M56243M54592L20616R1521
34464G23361j08109j89849j75341j36980j07410q0527o4985q0907j16443j43220
34454d80410j73586k42579l18173k90602r4387J91181M02398M36650L17980J48406
34444a03122K7678k709J9342J0864p3530j91579k58341k30404j30494m882J17124
34433h20053K23471K97766L07134K25766Q8385J720N2570J98674L02784K87862
$$ y = [2310580, 2552613, 2799623, 2944176, 2938079, 2864486, 2893607, 3169186, 3709237, 4380153, 4976057, 5369552, 5603510, 5810518, 6028224, 6115514, 5865459, 5187008, 4176305, 3050904, 2042436, 1312038, 890430, 661130, 426472, 35258, -522693, -1125532, -1607861, -1853379, -1841542, -1637872, -1337191, -993745, -599611, -143368, 311224, 631840, 723361, 615252, 425403, 250062, 113082, 5672, -74855, -139840, -220747, -337190, -480410, -653996, -896575, -1214748, -1505350, -1599737, -1408556, -1006158, -569508, -251528, -103122, -75444, -78153, -58811, -47947, -121477, -313056, -571397, -801801, -932295, -937177, -820053, -596582, -298816, 8318, 234084, 322469, 324189, 376759, 575433, 878217, 1166079]
34423A166079J95743O9345j36153m55606p92536r84018r51909p19639l39217Q8771
34413b859140L71044L56682J40542K943J02817L35439N23987O15671O17632M81257
34403F88874J89581j20160k67045k29819j22729O63J84010M04563N08879L73294
34393A610111N5805k56101l98882l18607p8585J74385L04713K97285K46790K22035
34383A858949J89396R5656l4334j35407j93622k35626k48354j77492j5222J56479
34373A260423K28679J52424l5769k45336l83471m10396l71495l66263m61721o26573
34363a259498p53476p48209n95637l43447m1229K80980N76754P64786P83601O61194
34353f74181N00950L89156L30091K70753J66603J6917j40799k54701k89342k47045
$$ y = [1166079, 1361822, 1431167, 1295014, 839408, 46872, -937146, -1889055, -2608694, -2947911, -2859140, -2488096, -2131414, -1990872, -1987929, -1885112, -1549673, -1025686, -410015, 207617, 688874, 878455, 758295, 491250, 261431, 138702, 139365, 323375, 727938, 1236817, 1610111, 1665916, 1409815, 1010933, 692326, 613741, 788126, 1092839, 1390124, 1636914, 1858949, 2048345, 2144001, 2109667, 1974260, 1780638, 1545012, 1296658, 1119166, 1103944, 1260423, 1489102, 1641526, 1605757, 1360421, 976950, 566554, 195059, -171204, -632925, -1259498, -2012974, -2761183, -3356820, -3700267, -3741496, -3460516, -2883762, -2118976, -1335375, -674181, -173231, 215925, 546016, 816769, 983372, 1000289, 859490, 604789, 315447, 68402]
34343F8402j55529l3369J18221K85940M27909N02736N02681M41356L18742J23046
34333B600135j25543l48392m44800l66125j56339Q4523K79739M16262N09585N48447
34323B997492M95088L37208J19527q5580k33015l29562m11450m99236n71328n84776
34313A234368n25175m27133l37415k66878j89842q3753M0816J43850J88396J87800
34303c4966K21327L61221N58263O44552N07748K43156O9733R4042K12677K53708
34293C131461J56366o452j25922j43987q6315m6283j06525k44397l37460k85174
34283A905312j01724J22507L07473M05713L90357K76958J34893K6102o1017j81013
34273C225561l41486m72239m78692l13678k3843K51012L60531K71585R6943l7864
$$ y = [68402, -87127, -120496, -2275, 283665, 711574, 1214310, 1716991, 2158347, 2477089, 2600135, 2474592, 2126200, 1681400, 1315275, 1158936, 1243459, 1523198, 1939460, 2449045, 2997492, 3492580, 3829788, 3949315, 3863735, 3630720, 3301158, 2889708, 2390472, 1819144, 1234368, 709193, 282060, -55355, -322233, -512075, -595828, -555012, -411162, -222766, -34966, 186361, 547582, 1105845, 1750397, 2258145, 2501301, 2571034, 2665076, 2877753, 3131461, 3287827, 3281375, 3155453, 3011466, 2925151, 2878868, 2772343, 2527946, 2190486, 1905312, 1803588, 1926095, 2233568, 2639281, 3029638, 3306596, 3441489, 3467591, 3406574, 3225561, 2884075, 2411836, 1933144, 1619466, 1595623, 1846635, 2207166, 2478751, 2575694, 2537830]
34263B537830j26211k28448l19819k77834m3912K64651M49389M16252K40131O0296
34253B972325n7378j44357k32765k75850k06550o2435J8882l4724j25703j07790
34243A743655K5175J39003J25571j842j69518l23541m41318n31764o42273q07887
34233h84739r75715j033502r27572o95294l70385O1938N70306J008658J216068
34224b030237J157999R22238O14374L16572J11261N0351Q0286O2992q2472k79266
34214I24098l66233k70236q4498L2654K0228m8368q2858q0817q6212r3927o4384
34203b00553j1390Q587K551N3627J98179L62875M61387M80297M20659K38413o6294
34192A948338l51703m34213k85093n7119Q0609P4904k5832j36582j78531j28782
$$ y = [2537830, 2411619, 2183171, 1863352, 1585518, 1541606, 1806257, 2255646, 2671898, 2912029, 2972325, 2914947, 2770590, 2537825, 2261975, 2055425, 1992990, 2011872, 1977148, 1851445, 1743655, 1768830, 1907833, 2033404, 2031562, 1862044, 1538503, 1097185, 565421, -76852, -884739, -1860454, -2893956, -3821528, -4516822, -4887207, -4825269, -4254963, -3246305, -2030237, -872238, 50000, 664374, 980946, 1092207, 1142558, 1222844, 1285836, 1203364, 924098, 557865, 287629, 203131, 235785, 256013, 207645, 124787, 43970, -42242, -136169, -200553, -211943, -203356, -200805, -147178, 51001, 413876, 875263, 1355560, 1776219, 2014632, 1948338, 1596635, 1162422, 877329, 820210, 900819, 975723, 949891, 813309, 634778, 505996]
34182E05996n3226m7565j36706k70121m03034n16092n56565m47861j99036N4934
34172b069276J72905J39352N0350N357M1352J34028K20118K36036J68061O1361
34162h40356k4990n0849R979J53674L08553L73896L40616L26970M39273O28636
34152A665402P43879P05079N63506M02086K47239R3112m7453j50935k09248k19150
34142C793517j69601o9473K5427M4882k8484j38363k10506k23663k13742k08807
34132B601187j85750j17570m6643n9819j75625l01422l34945k71964j72441n5702
34122H79306J06629L05017M68121N38437N18177M21999K38958k2508k92976m92715
34112B668445o06429o69684o91428o25585m21926q5257L11148O50499Q17238P49963
$$ y = [505996, 452770, 405205, 268499, -1622, -404656, -920748, -1477313, -1925174, -2124210, -2069276, -1896371, -1757019, -1706669, -1701312, -1659960, -1525932, -1305814, -1069778, -901717, -840356, -865346, -916195, -906216, -752542, -443989, -70093, 270523, 597493, 1036766, 1665402, 2409281, 3114360, 3677866, 4079952, 4327191, 4420303, 4372850, 4221915, 4012667, 3793517, 3623916, 3554443, 3579870, 3624752, 3596268, 3457905, 3247399, 3023736, 2809994, 2601187, 2415437, 2297867, 2251224, 2191405, 2015780, 1714358, 1379413, 1107449, 935008, 879306, 985935, 1290952, 1759073, 2297510, 2815687, 3237686, 3476644, 3454136, 3161160, 2668445, 2062016, 1392332, 700904, 75319, -346607, -431864, -120716, 529783, 1347021, 2096984]
34102B096984M75232R5954k56644m77632n26935m32532k52758l8445J56062K47991
34092A087277J73503j5304j51280j00812J07839L37880M91244N50274N07000L42016
34082C329637R2453j29609k30191k15483j65201j63305k66968m83677p34815q81370
34072A51471q36954o43526m14833k38148j52620j63891k19934k16296j00249N5040
34062b779940J53087K22572L67175N76508P03148O58194N21246M00492K85351
34053A107833J23681l8785j11404j05794j13784j57709j76395j56097j51292j48339
34043G1915l5114K20361M55184M69129K40074j01893m56250p90319j019934r97968
34033a944815o87542k68377O221L6786p3074j57436j27901J737J61157K71204
$$ y = [2096984, 2572216, 2668170, 2411526, 1933894, 1406959, 974427, 721669, 683224, 839286, 1087277, 1260780, 1245476, 1094196, 993384, 1101223, 1439103, 1930347, 2480621, 2987621, 3329637, 3422090, 3292481, 3062290, 2846807, 2681606, 2518301, 2251333, 1767656, 1032841, 151471, -685483, -1329009, -1743842, -1981990, -2134610, -2298501, -2518435, -2734731, -2834980, -2779940, -2626853, -2404281, -2037106, -1460598, -757450, -99256, 421990, 822482, 1107833, 1231514, 1192729, 1081325, 975531, 861747, 704038, 527643, 371546, 220254, 71915, 36801, 257162, 712346, 1181475, 1421549, 1319656, 863406, 73087, -946847, -1944815, -2632357, -2900734, -2894513, -2857727, -2930801, -3088237, -3216138, -3214401, -3053244, -2782040]
34023b782040K82025J99360P7058k6881r5519j58197k44596l23327k95592q0364
34013c448073K79229O15950P70515P22348N82329M74872M47456M74034M99130
34004A417790M66022L38368J28165j01975k80936l70302l56962k25572K3380L16700
33994A354678N05455M70442K49519L3518K141J60616L51146M14213L13626J17620
33984C972974q6447k34983k94088k73174k18193j57805p7142J8965N0732n8685
33974B642154k56861l90441l80010l00652k58793k56617k30300j66660j10162
33965B91658q2724o6269n4357n9229o8775n0400MO0606J33179K35001L35990L65407
33953A040091L05097K24783J93411J98458J89148J60885J47647J49636J17395
$$ y = [-2782040, -2500015, -2300655, -2223597, -2250478, -2345997, -2504194, -2748790, -3072117, -3367709, -3448073, -3168844, -2552894, -1782379, -1060031, -477702, -2830, 444626, 918660, 1417790, 1883812, 2222180, 2350345, 2248370, 1967434, 1597132, 1240170, 1014598, 1037978, 1354678, 1860133, 2330575, 2580094, 2613612, 2615753, 2776369, 3127515, 3541728, 3855354, 3972974, 3886527, 3651544, 3357456, 3084282, 2866089, 2708284, 2631142, 2650107, 2700839, 2642154, 2385293, 1994852, 1614842, 1314190, 1055397, 798780, 568480, 401820, 291658, 208934, 142665, 88308, 29079, -39696, -90096, -90092, -29486, 103693, 338694, 674684, 1040091, 1345188, 1569971, 1763382, 1961840, 2150988, 2311873, 2459520, 2609156, 2726551]
33944B726551J1274j51370l09082l96631l79146k75565j57917j08201j54493k42319
33934E63101k73324j83889M116K09582L66727M60911M92711M45600L22350J84371
33924B592256R9893N7915j1586j25634k14212k21302j89458k06727l00272m09844
33914A071029m38032l09699k8272K92347M93792N15606M41707L71209K91108J33876
33904B834671q3921k63171l43141l36333k47474n5645J89360L35903K64515K1156
33894B315920k31338l72880l97904l54014k72091j75374j16511j55967k89133
33885d9292m20688m48640l78789l21644l57472m36738m43054l24011j22393Q7258
33875c215463K34422K51857J25751l6820o2254J22737M03317N68841M70895J14779
$$ y = [2726551, 2737825, 2586455, 2277373, 1880742, 1501596, 1226031, 1068114, 959913, 805420, 563101, 289777, 105888, 110004, 319586, 686313, 1147224, 1639935, 2085535, 2407885, 2592256, 2692149, 2750064, 2738478, 2612844, 2398632, 2177330, 1987872, 1781145, 1480873, 1071029, 632997, 323298, 295026, 587373, 1081165, 1596771, 2038478, 2409687, 2700795, 2834671, 2750750, 2487579, 2144438, 1808105, 1560631, 1504986, 1694346, 2030249, 2294764, 2315920, 2084582, 1711702, 1313798, 959784, 687693, 512319, 395808, 239841, -49292, -469980, -918620, -1297409, -1619053, -1976525, -2413263, -2856317, -3180328, -3302721, -3215463, -2981041, -2729184, -2603433, -2640253, -2702507, -2579770, -2176453, -1607612, -1136717, -1021938]
33865a021938l30110o05883n50099k62715k9857k6490j44935j63763j3377K06517
33855b942650M05768N73076O80150O46585M46895J74988m1630j40591j18772l032
33845c19213J27598J57773M5685j13695j91638j63306q7189J5592J71917L48260
33835h216M30454L62371K41337K06487K60292K69555J41492o3727k16274k63702
33825A360069k59065k72002l13639l40473k98533j66481J5623J63776K30216K66695
33815C86186L64575N17838N94366M82420K33400J3844o0964M211J53568L31775
33805C021219M53667M14611J97858p5872k73167l91593n08902o15462n97978m10877
33795A213504j73617m3154n2729j36397k50301l74508m24216k78596O2594M24960
$$ y = [-1021938, -1352048, -1957931, -2508030, -2770745, -2800602, -2827092, -2972027, -3135790, -3149167, -2942650, -2536882, -1963806, -1283656, -637071, -190176, -15188, -56818, -197409, -316181, -319213, -191615, -33842, 11843, -101852, -293490, -456796, -543985, -528393, -356476, -8216, 422238, 784609, 1025946, 1232433, 1492725, 1762280, 1903772, 1840045, 1623771, 1360069, 1101004, 829002, 515363, 174890, -123643, -290124, -274501, -110725, 119491, 386186, 750761, 1268599, 1862965, 2345385, 2578785, 2592629, 2531665, 2535876, 2689444, 3021219, 3474886, 3889497, 4087355, 4011483, 3738316, 3346723, 2837821, 2222359, 1624381, 1213504, 1039887, 996733, 944004, 807607, 557306, 182798, -241418, -520014, -457420, -32460]
33785c2460O12655N78769M15977K29119O5371o4551j56494k03678j86855q5013
33775A172840P4918J95122J73347m178k53765m67259n76808n71447m84431l54317
33765a095978j75526Q7705M04311O28469O15835L86170J13572n0339r2946q2242
33755G39031o5515n9617q5430j57316k54865l35583l63415l12945j74895J8838
33745a051712J97483L03956L37727L40180L54634L97934M38627M00613K30855
33736A950297k2509k37542l36068l32513k60435j20136O3006J94619J95213R7901
33726A191833M041l6745m9611n8494m6395J0313J10489K28993L19480L30785K51957
33715B256646J24630j1703j47839k42298j90708N8884L87855N96359O11307N25649
$$ y = [-32460, 580195, 1158964, 1574941, 1804060, 1869431, 1804880, 1648386, 1444708, 1257853, 1172840, 1247758, 1442880, 1616227, 1612049, 1358284, 891025, 314217, -257230, -741661, -1095978, -1271504, -1183799, -779488, -151019, 464816, 850986, 964558, 914219, 821273, 739031, 673516, 613899, 528469, 371153, 116288, -219295, -582710, -895655, -1070550, -1051712, -854229, -550273, -212546, 127634, 482268, 880202, 1318829, 1719442, 1950297, 1927788, 1690246, 1354178, 1021665, 761230, 641094, 704100, 898719, 1093932, 1191833, 1195874, 1159129, 1109518, 1051024, 1004629, 1014942, 1125431, 1354424, 1673904, 2004689, 2256646, 2381276, 2369573, 2221734, 1979436, 1788728, 1847612, 2235467, 2831826, 3443133, 3968782]
33705C968782M29829K99508Q3933j76478l80793m74437m83459m72101m91956n39199
33695A763629n42615m34739k54234j28739j28559j88326k07976j73524j22388
33686d17471m0109J26543L68776O04771P78940R11151J023922J068208R60471
33677E385202O76742K83400j15375m35603o24225o53903n48769m11486l72766
33668C183217m70841n96195n95845m31074k03060l5316K5142r09o6111j07705
33658G01303p2804K9369J30889J83149J98287J99854J86138J72248K09018L07249
33648B244700L91250L92207L52184L62252M16324M02098K39035l3900l06944m77738
33638C981468m87184l55024k02637j72965k83157l92353l46636j26806J63625
$$ y = [3968782, 4398611, 4698119, 4782052, 4605574, 4224781, 3750344, 3266885, 2794784, 2302828, 1763629, 1221014, 786275, 532041, 403302, 274743, 86417, -121559, -295083, -417471, -457580, -331037, 37739, 642510, 1421450, 2332601, 3356523, 4424731, 5385202, 6061944, 6345344, 6229969, 5794366, 5170141, 4516238, 3967469, 3555983, 3183217, 2712376, 2116181, 1520336, 1089262, 886202, 850886, 876028, 875119, 809008, 701303, 628499, 657868, 788757, 971906, 1170193, 1370047, 1556185, 1728433, 1937451, 2244700, 2635950, 3028157, 3380341, 3742593, 4158917, 4561015, 4800050, 4766150, 4459206, 3981468, 3494284, 3139260, 2936623, 2763658, 2480501, 2088148, 1741512, 1614706, 1778331]
33629A778331M08479N39556N31613M02099K14343L3856j34592l41958o10254q64987
33619A956486r75493q78645o58928m82029m32692m35832l60887j85534j7885L4203
33609b437236l3337j52415k59021l03223k28613n564L08773N77895O73829N65638
33599a293274L38407J33789N0604P8231J27488J32603J09905J08660J28364J11828
33589B6605J2815j52058l17607m21475m46272m27311m16559m22786l85976k26164
33579c176788P2676M27920P09302Q29700P96759O82870N46401L90271K06008M0393
33569A525512k2169M0883J38110J43006J9459j51004k61532k80342k59602k61611
33559F30710k87883k84664k15490j09705j9235N5633J54123K68918L30832L08241
$$ y = [1778331, 2186810, 2726366, 3257979, 3660078, 3874421, 3908277, 3773685, 3431727, 2821473, 1956486, 980993, 102348, -556580, -1038609, -1471301, -1907133, -2268020, -2453554, -2471439, -2437236, -2470573, -2622988, -2882009, -3185232, -3413845, -3419409, -3110636, -2532741, -1858912, -1293274, -954867, -821078, -770474, -692243, -564755, -432152, -322247, -213587, -85223, 26605, 39420, -112638, -430245, -851720, -1297992, -1725303, -2141862, -2564648, -2950624, -3176788, -3104112, -2676192, -1966890, -1137190, -340431, 342439, 888840, 1279111, 1485119, 1525512, 1503343, 1544226, 1682336, 1825342, 1844801, 1693797, 1432265, 1151923, 892321, 630710, 342827, 58163, -157327, -267032, -286267, -230634, -76511, 192407, 523239, 831480]
33549H31480K66095K70394K75364J83563N203j27936j28657o5379p0180j87501
33539A252446l55095m90464n44988n06015m09239l40816l67649m51860m73657
33530b687337l53652j25983J12637K86623L58779L11383J63450K028m9304P7735
33520a903641L36912O03671P66258P86224O92514N41901L91837K93387K79715
33511B788778L39989M06168L84784K22811m5395l14211m77961n02576m41014l81757
33501A979616l80109m36269n26819o32057p20495p32594o20829m13349k06886
33492b689791p6150p199O2082J55076K38917K83349L01130L22483L56129L88536
33482f65438M03401L91931L60801L35612L31988L14743K24056P2464j9340N9857
$$ y = [831480, 1097575, 1367969, 1643333, 1826896, 1832099, 1704163, 1575506, 1510127, 1439947, 1252446, 897351, 406887, -138101, -644116, -1053355, -1394171, -1761820, -2213680, -2687337, -3040989, -3166972, -3054335, -2767712, -2408933, -2097550, -1934100, -1932072, -1981376, -1903641, -1566729, -963058, -196800, 589424, 1281938, 1823839, 2215676, 2509063, 2788778, 3128767, 3534935, 3919719, 4142530, 4097135, 3782924, 3304963, 2802387, 2361373, 1979616, 1599507, 1163238, 636419, 4362, -716133, -1448727, -2069556, -2482905, -2689791, -2765941, -2773140, -2711058, -2555982, -2317065, -2033716, -1732586, -1410103, -1053974, -665438, -262037, 129894, 490695, 826307, 1158295, 1473038, 1697094, 1769558, 1750218, 1810075]
33472A810075K61981L96852L11202J8964l44278o43673q05606q18942p35830o51464
33462a200719o29872o43110o07393m76018k80551r7741Q26q680o8576o3261P2905
33451d002190K66157L59211K63171K9494k12815l44053k92744o7302K22262M31577
33441c347232N06475N01018M59373L56466K02164J18874K13700M08601N01282
33432g9279L94082J76999j6762j39653j87223j26428N7976K92561M60644N08603
33422A341520M74506M33522M42404N05391N55844M95311K89638J0198k47222m54564
33412C846548o26044p39216p48137o65895n68114m99152m20749k71961m8373J89554
33402e51539L58793M00951L23649K06148J33240J14759R8905O0164K0115k9443
$$ y = [1810075, 2072056, 2468908, 2780110, 2799074, 2454796, 1811123, 1005517, 186575, -549255, -1200719, -1830591, -2473701, -3081094, -3557112, -3837663, -3935404, -3934578, -3943258, -4011834, -4075095, -4002190, -3736033, -3376822, -3113651, -3084157, -3296972, -3641025, -3933769, -4001071, -3778809, -3347232, -2840757, -2339739, -1880366, -1523900, -1321736, -1202862, -989162, -580561, -79279, 314803, 491802, 475040, 335387, 148164, 21736, 79712, 372273, 832917, 1341520, 1816026, 2249548, 2691952, 3197343, 3753187, 4248498, 4538136, 4548334, 4301112, 3846548, 3220504, 2481288, 1733151, 1067256, 499142, -10, -420759, -692720, -741093, -551539, -192746, 208205, 531854, 738002, 871242, 986001, 1084906, 1145070, 1165185, 1135742]
33392A135742j50209l49106m97253m36741j58673J91384M83473P03774Q64381
33383A786772Q99612P38120M51798K37757K15132K91038K75038R9109j26176k59254
$$ y = [1135742, 985533, 636427, 139174, -297567, -456240, -264856, 218617, 922391, 1786772, 2686384, 3424504, 3876302, 4114059, 4329191, 4620229, 4895267, 4994376, 4868200, 4608946]
$$ [...]
##END NTUPLES=NMR SPECTRUM
##END=
