##TITLE=31Pdec_DE-22_10minrm
 
  24 sc
 31.10.2023
##JCAMPDX= 6.0         $$ Bruker NMR JCAMP-DX V2.0
##DATA TYPE= NMR SPECTRUM
##DATA CLASS= NTUPLES
##ORIGIN= UXNMR, Bruker Analytische Messtechnik GmbH
##OWNER= root
$$ XWIN-NMR		Version 3.5
$$ Tue Oct 31 14:44:41 2023 Russian Standard Time (UT+4h)  she@DPX200
##.OBSERVE FREQUENCY= 81.013821
##.OBSERVE NUCLEUS= ^31P
##.ACQUISITION MODE= SIMULTANEOUS
##.ACQUISITION SCHEME= undefined
##.AVERAGES= 24
##.DIGITISER RES= 16
##SPECTROMETER/DATA SYSTEM= spect
##.PULSE SEQUENCE= zgpg30
##.SOLVENT NAME= CDCl3
##.SHIFT REFERENCE= (INTERNAL, CDCl3, 0, 248.564)
##AUDIT TRAIL= $$ (NUMBER, WHEN, WHO, WHERE, WHAT)
$$ ##TITLE= Audit trail, XWIN-NMR		Version 3.5
$$ ##JCAMPDX= 5.01
$$ ##ORIGIN= Bruker BioSpin GmbH
$$ ##OWNER= she
$$ F:/spectra/data/she/nmr/P31/1/pdata/1/auditp.txt
$$ ##AUDIT TRAIL=  $$ (NUMBER, WHEN, WHO, WHERE, WHAT)
(   1,<2023-10-31 14:43:39.82 +0400>,<she>,<DPX200>,
      <created by zg, POWCHK disabled, PULCHK disabled
       configuration hash MD5:
       00 E9 B6 7A A2 85 ED C7 34 08 36 98 17 FE 4E 26
       data hash MD5: 32K
       57 C6 6F E9 E8 D6 C6 AE 1D A4 94 F2 65 2B 14 1A>)
(   2,<2023-10-31 14:43:43.10 +0400>,<she>,<DPX200>,
      <Start of raw data processing
       efp BC_mod = 2 LB = 5 FT_mod = 6 PKNL = 1 PHC0 = -10715.31 PHC1 = 206.89 SI = 64K 
       data hash MD5: 64K
       B0 6A B6 E9 30 BA B7 DD 00 12 B5 73 33 4F 2B 82>)
(   3,<2023-10-31 14:44:02.17 +0400>,<she>,<DPX200>,
      <pk PHC0 = 135.3754 PHC1 = -323.5999 
       data hash MD5: 64K
       99 21 6B 4B 41 EE 5D 9D 61 76 AB 7A DA 55 CB EA>)
(   4,<2023-10-31 14:44:05.76 +0400>,<she>,<DPX200>,
      <abs ABSG = 5 
       data hash MD5: 64K
       C4 DF 30 A1 55 32 7F F4 47 A5 21 FF 13 D9 21 9E>)
$$ ##END=
$$ 
$$ hash MD5
$$ 5F F2 C9 35 05 8D DC D4 E4 F6 05 D4 99 52 4D 64
##$RELAX= 
##$RELAX= 
##$RELAX= 
##$RELAX= 
##$RELAX= 
##$RELAX= 
##$RELAX= 
##$RELAX= 
##$RELAX= 
$$ Bruker specific parameters
$$ --------------------------
##$DU= <F:/spectra>
##$EXPNO= 1
##$NAME= <P31>
##$PROCNO= 1
##$TYPE= <nmr>
##$USER= <she>
##$AMP= (0..31)
100 100 100 100 100 100 100 100 100 100 100 100 100 100 100 100 100 100 
100 100 100 100 100 100 100 100 100 100 100 100 100 100 
##$AQSEQ= 0
##$AQ_mod= 1
##$AUNM= <au_zg>
##$AUTOPOS= <>
##$BF1= 81.014009
##$BF2= 200.13
##$BF3= 200.13
##$BF4= 200.13
##$BF5= 200.13
##$BF6= 200.13
##$BF7= 200.13
##$BF8= 200.13
##$BYTORDA= 1
##$CFDGTYP= 0
##$CFRGTYP= 5
##$CHEMSTR= <none>
##$CNST= (0..31)
1 1 145 1 1 1 1 1 1 1 1 1 1 1 1 1 1 1 1 1 1 1 1 1 1 1 1 1 1 1 1 1 
##$CPDPRG= <waltz16>
##$CPDPRG1= <>
##$CPDPRG2= <waltz16>
##$CPDPRG3= <>
##$CPDPRG4= <mlev>
##$CPDPRG5= <mlev>
##$CPDPRG6= <mlev>
##$CPDPRG7= <mlev>
##$CPDPRG8= <mlev>
##$CPDPRGB= <>
##$CPDPRGT= <>
##$D= (0..31)
0 1 0 0 0 0 0 0 0 0 0 0.03 2e-05 3e-06 0 0 0 0 0 0 0 0 0 0 0 0 0 0 0 0 
0 0 
##$DATE= 1698749019
##$DBL= (0..7)
120 120 120 11 120 120 24 19 
##$DBP= (0..7)
150 150 150 150 150 150 150 150 
##$DBP07= 0
##$DBPNAM0= <>
##$DBPNAM1= <>
$$ [...]
##$SUBNAM3= <"">
##$SUBNAM4= <"">
##$SUBNAM5= <"">
##$SUBNAM6= <"">
##$SUBNAM7= <"">
##$SUBNAM8= <"">
##$SUBNAM9= <"">
##$SW= 501.771253377433
##$SWIBOX= (0..15)
0 1 3 0 0 0 0 0 0 0 0 0 0 0 0 0 
##$SW_h= 40650.406504065
##$TD= 32768
##$TD0= 1
##$TE= 0
##$TE2= 300
##$TE3= 300
##$TEG= 300
##$TL= (0..7)
0 120 53 12 22 120 120 120 
##$TP= (0..7)
150 150 150 150 150 150 150 150 
##$TP07= 0
##$TPNAME0= <>
##$TPNAME1= <>
##$TPNAME2= <>
##$TPNAME3= <>
##$TPNAME4= <>
##$TPNAME5= <>
##$TPNAME6= <>
##$TPNAME7= <>
##$TPOAL= (0..7)
0.5 0.5 0.5 0.5 0.5 0.5 0.5 0.5 
##$TPOFFS= (0..7)
0 0 0 0 0 0 0 0 
##$TUNHIN= 0
##$TUNHOUT= 0
##$TUNXOUT= 0
##$USERA1= <user>
##$USERA2= <user>
##$USERA3= <user>
##$USERA4= <user>
##$USERA5= <user>
##$V9= 5
##$VALIST= <valist>
##$VCLIST= <CCCCCCCCCCCCCCC>
##$VD= 0
##$VDLIST= <DDDDDDDDDDDDDDD>
##$VPLIST= <PPPPPPPPPPPPPPP>
##$VTLIST= <TTTTTTTTTTTTTTT>
##$WBST= 1024
##$WBSW= 4
##$XGAIN= (0..3)
0 0 0 0 
##$XL= 0
##$YL= 0
##$YMAX_a= 9757
##$YMIN_a= -8013
##$ZGOPTNS= <>
##$ZL1= 120
##$ZL2= 120
##$ZL3= 120
##$ZL4= 120
##$ABSF1= 248.5645
##$ABSF2= -253.2056
##$ABSG= 5
##$ABSL= 3
##$ALPHA= 0
##$AQORDER= 0
##$ASSFAC= 0
##$ASSFACI= 0
##$ASSFACX= 0
##$ASSWID= 0
##$AUNMP= <proc_1d>
##$AZFE= 0.1
##$AZFW= 0.5
##$BCFW= 0
##$BC_mod= 2
##$BYTORDP= 0
##$COROFFS= 0
##$CY= -3
##$DATMOD= 1
##$DC= 0
##$DFILT= <>
##$DTYPP= 0
##$F1P= 0
##$F2P= 0
##$FCOR= 1
##$FTSIZE= 65536
##$FT_mod= 6
##$GAMMA= 0
##$GB= 0
##$INTBC= 1
##$INTSCL= 6.047779e-11
##$ISEN= 30
##$LB= 5
##$LEV0= 0
##$LPBIN= 0
##$MAXI= 10000
##$MC2= 0
##$MEAN= 0
##$ME_mod= 0
##$MI= 50
##$NCOEF= 0
##$NC_proc= -5
##$NLEV= 6
##$NOISF1= 182.463
##$NOISF2= 159.3651
##$NSP= 0
##$NTH_PI= 0
##$NZP= 0
##$OFFSET= 248.5645
##$PC= 4
##$PHC0= -10579.93
##$PHC1= -116.7099
##$PH_mod= 1
##$PKNL= yes
##$PPARMOD= 0
##$PSCAL= 0
##$PSIGN= 0
##$REVERSE= no
##$SF= 81.0140089999694
##$SI= 65536
##$SIGF1= 159.3651
##$SIGF2= -187.1042
##$SINO= 113.3802
##$SIOLD= 16384
##$SREGLST= <1H.CDCl3>
##$SSB= 0
##$STSI= 65536
##$STSR= 0
##$SW_p= 40650.406504065
##$SYMM= 0
##$S_DEV= 0
##$TDeff= 32768
##$TDoff= 0
##$TI= <>
##$TILT= no
##$TM1= 0
##$TM2= 0
##$TOPLEV= 0
##$USERP1= <user>
##$USERP2= <user>
##$USERP3= <user>
##$USERP4= <user>
##$USERP5= <user>
##$WDW= 1
##$XDIM= 65536
##$YMAX_p= 287649400
##$YMIN_p= -3960549
$$ End of Bruker specific parameters
$$ ---------------------------------
##NTUPLES= NMR SPECTRUM
##VAR_NAME=  FREQUENCY,     SPECTRUM/REAL,   SPECTRUM/IMAG
##SYMBOL=    X,             R,               I
##VAR_TYPE=  INDEPENDENT,   DEPENDENT,       DEPENDENT
##VAR_FORM=  AFFN,          ASDF,            ASDF
##VAR_DIM=   65536,         65536,           65536
##UNITS=     HZ,            ARBITRARY UNITS, ARBITRARY UNITS
##FACTOR=    0.620285442955139, 1,           1
##FIRST=     20137.2065510682, 0,            0
##LAST=      -20513.1999529968, 0,           0
##MIN=       -20513.1999529968, -3960549,    0
##MAX=       20137.2065510682, 287649400,    0
$$ Real data points
##PAGE= N=1
##DATA TABLE= (X++(R..R)), XYDATA
$$ [...]
39236H3467K4509K6679M4874P4393J00925J10502R9112P4344M8666K9259J2009
$$ 83467 107976 134655 179529 253922 354847 465349 564461 638805 687471 716730 728739
39225G28739j3858n1850q8454j01538q2392m7038k0712j1571n325J3412M1229
$$ 728739 714881 663031 574577 473039 390647 343609 322897 311326 306001 319413 360642
39214C60642O1239O2484M7616K5096J703j8047l2846m6353o1735p2997o8768m8036
$$ 360642 421881 484365 531981 557077 558780 540733 507887 461534 399799 326802 258034 209998
39202B09998k5746j7504k3333l1372l2860k6427j1192J4342M4496O4851O3709
$$ 209998 184252 166748 143415 112043 79183 52756 41564 55906 100402 165253 228962
39191B28962M3371J7719q1o662p335p837p414m65J4992L2874M5223N0664N3126
$$ 228962 272333 290052 289971 283309 275974 268137 260723 260258 275250 308124 353347 404011 457137
39178D57137N3294M5590K4228j0886n4442r8309j33107j50791j48143j27132r2835
$$ 457137 510431 556021 580249 569363 514921 416612 283505 132714 -15429 -142561 -235396
39167b35396n3269j9365N08P369R449J2714J7581K4386L4857M5417M6246L2775
$$ -235396 -288665 -308030 -307522 -300153 -290704 -277990 -260409 -236023 -201166 -155749 -109503 -76728
39155g6728J3528O29l965o991j1821j4719j0971K132K6702N9924Q8026R4285P7722
$$ -76728 -63200 -62571 -66536 -73527 -85348 -100067 -111038 -108906 -82204 -22280 65746 160031 237753
39142B37753N6791M8656M9886M4460K7357J1560J0620K1244K7065J6525o802l0247
$$ 237753 294544 343200 393086 437546 464903 476463 487083 508327 535392 551917 545115 514868
39130E14868m4859n1670n7525o6340p4322p3504o0457m1400k7052k1619j8366
$$ 514868 470009 418339 360814 294474 220152 146648 86191 44791 17739 -3880 -22246
39119b2246p861J0686K8405L5693K9038J0372j4782l7369m8849m9518m9383n6525
$$ -22246 -30107 -19421 8984 44677 73715 84087 69305 31936 -16913 -66431 -115814 -172339
39107a72339o6979p0351o3048n0631l8007k2693J071L4750P2413J02871J16239
$$ -172339 -239318 -309669 -372717 -423348 -461355 -484048 -482977 -448227 -375814 -272943 -156704
39096a56704J12330J01878R5727R3774Q9134Q1806Q1311R3912J12358J20831J07165
$$ -156704 -44374 57504 153231 247005 336139 417945 499256 593168 705526 826357 933522
39085I33522P0655K3469j4745l0793l0039k9694l7163m1361k9880q265N051q61
$$ 933522 1004177 1027646 1012901 982108 952069 922375 885212 843851 813971 805706 810757 809896
39073H09896k1268m4845o2194o5997n2423k7100m378M711K587m8J022k488k0145
$$ 809896 788628 743783 681589 615592 563169 536069 531691 536402 538989 538941 539963 537475 517330
39060E17330m6918o3566n6766l5833k2828k6184l1868k3299j943J7604K5568K1592
$$ 517330 470412 406846 350080 314247 291419 265235 233367 210068 208125 225729 251297 272889
39048B72889P017j5809l7606m6766m2297l3734k5837j2729Q088K4998K4818J1870
$$ 272889 279906 264097 226491 179725 137428 103694 77857 65128 73216 98214 123032 134902
39036A34902N073J5186L1351L2582R451k7230n6531o3700m7446j5109K4887O4210
$$ 134902 139975 155161 186512 219094 228545 201315 144784 81084 33638 18529 43416 107626
39024A07626R2119R8103P9994M8122J9984R818K0066L8618M5460K8084o689l8755
$$ 107626 199745 297848 377842 425964 445948 455766 475832 514450 559910 587994 581305 542550
39012E42550n3977n4543n0088m4347l4237j7828J918J9375K8740K7020J8590J3969
$$ 542550 488573 434030 383942 339595 305358 287530 289448 308823 337563 364583 383173 397142
39000C97142J8535K4142J8048j35j6510j8615p173R358K4928L5999L6369J8960
$$ 397142 415677 439819 457867 457732 441222 422607 415434 424792 449720 485719 522088 541048
38988E41048j7017o3557j07600j35635j38114j14499p3863k7375J8643N9061Q3258
$$ 541048 524031 460474 352874 217239 79125 -35374 -109237 -136612 -117969 -58908 24350
38977B4350Q1153N8165L6281L3747M6776N6028M7980K4620m331l0208m6191m8132
$$ 24350 105503 163668 199949 233696 280472 336500 384480 409100 404769 374561 328370 280238
38965B80238l9375l0637l1147m1879n8176p3442p7526n8778j6065L3284O5127
$$ 280238 240863 210226 179079 137200 79024 5582 -71944 -130722 -146787 -113503 -48376
38954d8376O8824N1718K5764k009k5191l4583k6443r493L947J2653K6212M9385
$$ -48376 20448 72166 97930 95921 70730 36147 9704 211 4158 16811 43023 92408
38942I2408P1824P5885N2771R978l4763o5088p3633o2168l7012m941K7503N3133
$$ 92408 164232 240117 292888 302866 268103 203015 129382 67214 30202 25261 52764 105897
38930A05897O5183O0308M0277J0312k3511n4397p3215p0109m1793J939M1894O2531
$$ 105897 171080 231388 271665 281977 258466 204069 130854 60745 18952 20891 62785 125316
38918A25316O1098M4035J8402r257k9305l2956k2679j3077j6920l3075n1412o5803
$$ 125316 186414 230449 248851 239594 210289 177333 154654 141577 124657 91582 40170 -25633
38906b5633p6990q4487q1879o2012k4733K0122N5954O9135O0999M8783M8402N6708
$$ -25633 -102623 -187110 -268989 -331001 -355734 -335612 -279658 -210523 -149524 -100741 -52339 4369
38894D369N7364M3797K6517J4766K740j6462l2089k5804O97K2041J7567n635k2703
$$ 4369 61733 105530 132047 146813 149553 133091 101002 75198 75895 97936 115503 109868 87165
38881H7165j6637J0252M2569O2533O0197M1533K4609K2276L0790L9692M7535N9339
$$ 87165 70528 80780 123349 185882 246079 287612 312221 334497 365287 404979 452514 511853
38869E11853P1587P0677M8447J1829k5159n2764o7501p0237o5956o0077n1838
$$ 511853 583440 654117 702564 714393 689234 636470 568969 498732 432776 372699 320861
38858C20861l6386j5664l93L361L363J1124K7561M4958N8233O6205O4891M9458
$$ 320861 284475 268811 268418 271779 275142 286266 313827 358785 417018 483223 548114 597572
38846E97572K3473j487j7672k7658l8394n4081p5032r6752j08227r8233o7785
$$ 597572 621045 619558 601886 574228 535834 481753 406721 309969 201742 103509 35724
38835C5724l1685l399J7709M0082O5160Q4457Q8697P3602L8697j0840n8723q1869
$$ 35724 4039 640 18349 58431 123591 208048 296745 370347 409044 398204 339481 257612
38823B57612o8053k8413J2198L7264M8200N4111N8830O0285N6238M4588K1369
$$ 257612 189559 161146 173344 210608 258808 312919 371749 432034 488272 532860 554229
38812E54229j4012n1446p5524q1379p9814q2526q6886q1346o3566m5774m0034
$$ 554229 540217 488771 413247 331868 252054 169528 82642 1296 -62270 -108044 -148078
38801a48078m2663l7077j1959K5107N3055N6857M0849K1519R253J862l979k523
$$ -148078 -190741 -227818 -239777 -214670 -161615 -104758 -63909 -42390 -33137 -31275 -35254 -37777
38789c7777J4172M2598O7048P2281N4657K3843k307q161P134K7115L2759K0182
$$ -37777 -23605 18993 86041 158322 212979 236822 234515 226354 233488 260603 293362 313544
38777C13544R97j1896j3571n521O177J1364L708r478j3550o032j531j1569k6780
$$ 313544 314541 302645 289074 283553 289730 301094 304802 295324 281774 275742 274211 262642 235862
38764B35862k7656r475J2004J9767J4480J2281K6119N0372O4208N2174K1465n300
$$ 235862 208206 198731 210735 230502 244982 257263 283382 333754 397962 450136 471601 466301
38752D66301j5564j9329l2741n5509p2208p2510o1156m7367l2890j4505O506K2340
$$ 466301 450737 431408 398667 343158 270950 198440 137284 89917 57027 42522 49028 71368
38740G1368K5189J3865m779j9807k3393j6126n178K848O242O004K401m326j1854
$$ 71368 96557 110422 105643 85836 62443 46317 41139 43987 50229 56233 58634 54308 42454
38727D2454j7925k4976l9148o1134p8879p4147l9974R555M9736O5179N7941L8551
$$ 42454 24529 -447 -39595 -100729 -179608 -253755 -293729 -284174 -234438 -169259 -111318 -72767
38715g2767J4954q356k5920l1847k4834j0034M570J2991J3347O886l802j4523
$$ -72767 -57813 -66169 -92089 -123936 -148770 -158804 -154234 -141243 -127896 -121010 -124812 -139335
38703a39335j7783n537K1575M8915N7406M0677J0090j6920k9301k4677q249O902
$$ -139335 -157118 -162655 -141080 -92165 -34759 5918 16008 -912 -30213 -54890 -63139 -56237
38691e6237O424j0874k9569l5166l1353l2540m2593m9986m3570k4765k941J3980
$$ -56237 -49813 -60687 -90256 -125422 -156775 -189315 -231908 -281894 -325464 -350229 -353170 -339190
38679c39190K2804K5946L1210M3865N6088N1062K2219j6619m4376n1294m1274
$$ -339190 -316386 -290440 -259230 -215365 -159277 -108215 -85996 -102615 -146991 -198285 -239559
38668b39559k3050o105L98n395j3814j4854j2323j7432k8128k6307p07L5997N9991
$$ -239559 -262609 -268714 -268316 -273711 -287525 -302379 -314702 -332134 -360262 -386569 -387276 -351279 -291288
38655b91288O0257M3201J9582l422k0186k7671k9935l3729l7771l3817k0288o656
$$ -291288 -231031 -187830 -168248 -171670 -191856 -219527 -249462 -283191 -320962 -354779 -375067 -381723
38643c81723j53M376J5128K9771L8200L4690K0379k044k6871m0788l1127j957
$$ -381723 -381876 -377500 -362372 -332601 -294401 -259711 -239332 -241376 -268247 -309035 -340162 -342119
38631c42119K5893L5091K7002J4031L561m582r079l775J4757L9905N7831N7985
$$ -342119 -316226 -281135 -254133 -240102 -236541 -241123 -250202 -253977 -239220 -199315 -141484 -83499
38619h3499M1079J6595p623l1644n8008q2498r4405q5673n6860j5566K6466N5548
$$ -83499 -42420 -25825 -33448 -65092 -123100 -205598 -300003 -385676 -442536 -458102 -431636 -376088
38607c76088O1920M5993J5924k0556n7061q2880q5928o5401l4888q507J0459K3815
$$ -376088 -314168 -268175 -252251 -272807 -329868 -412748 -498676 -564077 -598965 -607472 -597013 -573198
38595e73198K9686K6861K1589K0628K0940J5598P949R785K4465M1088M8429M7003
$$ -573198 -543512 -516651 -495062 -474434 -453494 -437896 -429947 -420162 -395697 -354609 -306180 -259177
38583b59177M2943L6627K4482Q976n11J843J1811K1915L1770M6712O5648P6089
$$ -259177 -216234 -179607 -155125 -146149 -146660 -144817 -133006 -111091 -79321 -32609 33039 109128
38571A09128O7026M4720K8485K8987L6662L4416J6034j1698l8536n5334n4126
$$ 109128 176154 220874 249359 278346 315008 349424 365458 353760 315224 259890 205764
38560B05764l3916p351N637n888l5678o6456q0232o6176k7629J6235M2468M2642
$$ 205764 171848 164497 170134 164246 128568 62112 -18120 -84296 -111925 -95690 -53222 -10580
38548a0580K7278J1529L68j1174k8021m8328o3963o5668m9964k2509O667L0691
$$ -10580 16698 28227 28595 17421 -10600 -58928 -122891 -188559 -238523 -261032 -254365 -223674
38536b23674M6375M9910L9254K1860J2383J7573K7987K9908K2357J6873K2657
$$ -223674 -177299 -127389 -88135 -66275 -53892 -36319 -8332 21576 43933 60806 83463
38525H3463L7920N5585P1172Q2497Q5650P5488M9763J1364l2659p3256j02261
$$ 83463 121383 176968 248140 330637 416287 491775 541538 552902 520243 446987 344726
38514C44726j15871j15469j03364p8851m2365m131J7425J2318p724j9017r658
$$ 344726 228855 113386 10022 -68829 -111194 -115325 -97900 -85582 -93306 -112323 -121981
38503a21981J1747L0702M1302M2366K8978j095l5362n1798l8895n430L0101N4090
$$ -121981 -110234 -79532 -38230 4136 33114 32019 -3343 -55141 -94036 -99466 -69365 -15275
38491a5275O1992N6180M4275L4919K9756K1011J36l1721o3178q1133p9156o0184
$$ -15275 46717 102897 147172 182091 211847 232858 232994 201273 138095 56962 -22194 -82378
38479h2378l3366p634J3101K8623L7696L7454K8311J7082J2787J8568K7375K6290
$$ -82378 -115744 -123378 -110277 -81654 -43958 -6504 21807 38889 51676 70244 97619 123909
38467A23909Q188j8357l2952k1463R545L8966N0911M5003K8711O440k0226m5749
$$ 123909 132097 113740 80788 59325 68870 107836 158747 203750 232461 238901 218675 172926
38455A72926o0282n8082m4781l3711l2745l5271k8019r347N197L05j9882l6529
$$ 172926 112644 54562 9781 -23930 -56675 -91946 -119965 -129312 -124115 -123810 -143692 -180221
38443a80221l8050k9751k2251j9438k0421k4931l1014l2919k7210j7380p398N596
$$ -180221 -218271 -248022 -270273 -289711 -310132 -335063 -366077 -398996 -426206 -443586 -450984 -445388
38431d45388K5704M7447N7839N0555L3019J7288P901J953j525K338J6951L6360
$$ -445388 -419684 -372237 -314398 -263843 -230824 -213536 -205635 -203682 -205207 -202869 -185918 -149558
38419a49558M8813M7749L5223J4346j4802m7061o6440n8780l0022k846P791Q561
$$ -149558 -100745 -52996 -17773 -3427 -18229 -65290 -131730 -190510 -220532 -223378 -215587 -207026
38407b07026J3819K5109L1419K5630J2789J955m625j1858k2777l0185j9122J8147
$$ -207026 -193207 -168098 -136679 -111049 -98260 -96305 -100930 -112788 -135565 -165750 -184872 -166725
38395a66725O7944J00489R4184N4119N190k9993m3982m1330l1080k2200j9068
$$ -166725 -98781 1708 95892 150011 155201 125208 81226 39896 8816 -13384 -32452
38384c2452j8071j2803n148o997k6239n3180o6629n5089k8310n537M736R733J9202
$$ -32452 -50523 -63326 -68474 -75471 -101710 -154890 -221519 -276608 -304918 -310455 -305719 -295986 -276784
38371b76784L2683M1064L6789K0934L756q4J7666M7914O7477N9352K9251r97j3444
$$ -276784 -244101 -203037 -166248 -145314 -141558 -141642 -123976 -76062 -8585 50767 80018 79021 65577
38358F5577l872K1505M8960O0279M7132K6078K7175O0136J00232J16205J05378
$$ 65577 61705 83210 132170 192449 239581 265659 292834 352970 453202 569407 674785
38347F74785R1156R0346R4758Q5271N3498N827m5973r2212j27064j48769j58232
$$ 674785 765941 856287 951045 1036316 1089814 1095641 1049668 957456 830392 681623 523391
38336E23391j55594j39411j11157p8468n0333k9050j0439P021J7780J7758J3652
$$ 523391 367797 228386 117229 38761 -11572 -40622 -51061 -44040 -26260 -8502 5150
38325E150J6455K5501K6922J1275j4343l6568n0385n5495m5784j6259K1162M3323
$$ 5150 21605 47106 74028 85303 70960 34392 -15993 -71488 -117272 -133531 -112369 -69046
38313f9046M1121K8272K0368J5933N085j2469k7431l3492l1279k3308j2613m419
$$ -69046 -27925 347 20715 36648 41733 29264 1833 -31659 -62938 -86246 -98859 -103278
38301a03278l357j0274k4112m1738n2187l9292N43M7552P4605P1696M7391J1723
$$ -103278 -106635 -116909 -141021 -182759 -234946 -274238 -273695 -226143 -151538 -79842 -32451 -20728
38289b0728k9680o6413q3556p6425n5287l0211k09L6538P0512Q8715R0127Q3184
$$ -20728 -50408 -116821 -200377 -276802 -332089 -362300 -362509 -325971 -255459 -166744 -76617 6567
38277F567O9256L9079j0617o3854r4906q9673n5054j0427K5185L9632L0686Q599
$$ 6567 75823 114902 104285 40431 -54475 -144148 -199202 -209629 -184444 -144812 -114126 -105527
38265a05527q170p324N641J3754P256p076j5166r747N584K1464K9658K9207K8601
$$ -105527 -113697 -121021 -115380 -101626 -94370 -101446 -116612 -126359 -120775 -99311 -69653 -40446 -11845
38252a1845L7804N4623O3117N0661K4402N667Q489K7137M3819M5005L0850J2842
$$ -11845 25959 80582 143699 194360 218762 224429 232918 260055 303874 348879 379729 392571
38240C92571L448N875J2519J3452N970l936p776k170P405J0536K677q005r257
$$ 392571 396019 401894 414413 427865 433835 429899 422123 419953 427358 437894 440571 432566 423309
38227D23309q41L991m343j9521k8999l0535l2931m3873o3016q4253r8520r6667
$$ 423309 422468 426459 422116 402595 373596 343061 310130 266257 203241 118988 20468 -76199
38215g6199p6601m7989k4780j2319m533P864K9786N8942Q4222Q8546O1438J2111
$$ -76199 -152800 -200789 -225569 -237888 -242421 -234557 -204771 -145829 -61607 26939 88377 100488
38203A00488l3614n2746m2198j8470k494l064j2056j5789j0833n615o515r192
$$ 100488 66874 14128 -28070 -46540 -49034 -52098 -64154 -79943 -90776 -96391 -102906 -112098
38191a12098p737o115j3193k9345m4556m8686l9066k0042M56J6176K8052M1083
$$ -112098 -119835 -125950 -139143 -168488 -213044 -261730 -300796 -320838 -320382 -304206 -276154 -235071
38179b35071N2721N1059L1026N833o246j362J2182K9080M7696O0108N6106L6785
$$ -235071 -182350 -131291 -100265 -94432 -100678 -102040 -89858 -60778 -13082 47026 103132 139917
38167A39917J1822j5685m7467p3373p3989m6262j2645L248m83j1723k2475l0101
$$ 139917 151739 136054 88587 15214 -58775 -105037 -117682 -114434 -114917 -126640 -149115 -179216
38155a79216l1104k5967k3874l1428m0224l4725j0194K3814N4082P1363P2513
$$ -179216 -210320 -236287 -260161 -291589 -331813 -366538 -376732 -352918 -298836 -227473 -154960
38144a54960O3908O0128P0164Q5037Q5791O4152L0367J308j4347j9742k3369k9607
$$ -154960 -91052 -30924 39240 124277 210068 274220 304587 305895 291548 271806 248437 218830
38132B18830l3597k6986j0391L289J505j4787l3571m3766m1426k9029j4659q402
$$ 218830 185233 158247 147856 151145 152650 137863 104292 60526 19100 -9929 -24588 -32990
38120c2990j2703j7775j2536J093J1018J1474J0356J8719L7561N6621O3295N2803
$$ -32990 -45693 -63468 -76004 -74911 -63893 -52419 -42063 -23344 14217 70838 134133 186936
38108A86936L3488K2859L4102O2823Q7461Q5017M9285l407m6234o2736n7856m7420
$$ 186936 220424 243283 277385 340208 427669 512686 561971 558564 512330 449594 391738 344318
38096C44318l8228k3788J58K4298L5432L1823K2429J5506J5811K9654O2362J09836
$$ 344318 306090 282302 282460 306758 342190 374013 396442 411948 427759 457413 519775 629611
38084F29611J61262K12405K67182L19360L38945K88804J61263l493j40488k05893
$$ 629611 790873 1003278 1270460 1589820 1928765 2217569 2378832 2375339 2234851 2028958
38074B028958k03235j67931j32029j07345r5429r8530j14199j28885j28441j13111
$$ 2028958 1825723 1657792 1525763 1418418 1322989 1224459 1110260 981375 852934 739823
38064G39823r4497p9165o2678l9262r747K1357N0365P3627Q6673Q6256P1209M2452
$$ 739823 645326 566161 503483 464221 454474 475831 526196 599823 686496 772752 843961 886413
38052H86413O345k3078l1811j8158N856K5438L2071K3544K525k2633m1487m9520
$$ 886413 892758 869680 837869 819711 825567 851005 883076 906620 909145 886512 845025 795505
38040G95505n0020m7478m3358l8719l5140l0976k2232j0071k541n648j7149l1749
$$ 795505 745485 698007 654649 615930 580790 549814 527582 517511 514970 509322 492173 460424
38028D60424m6920n9803o4183n6592m2163k9637k3935k7696m4687p3711j01779
$$ 460424 413504 353701 289518 232926 190763 161126 137191 109495 64808 -8903 -110682
38017a10682j11232r4004n4626k369N2533R7934J25300J37105J39985J29721R4008
$$ -110682 -221914 -315918 -370544 -372913 -320380 -222446 -97146 39959 179944 309665 403673
38006D03673L4905k1560m7363l9644j9374p767j1705k8217n1895p5064q7623q2160
$$ 403673 438578 417018 369655 330011 310637 302870 291165 262948 211053 135989 48366 -33794
37994c3794n9488k9798q641o960j9819k7682j5153J2230L4738L9732K9431J0406
$$ -33794 -93282 -123080 -131721 -138681 -158500 -186182 -201335 -189105 -154367 -114635 -85204 -74798
37982g4798j3483l5638m5641m0494k9909k4028k2029j9362j9171k6616l5955l4479
$$ -74798 -88281 -123919 -169560 -210054 -239963 -263991 -286020 -305382 -324553 -351169 -387124 -421603
37970d21603j9114K07J4581K4933L5042M4494N2711O3074P7910R4011J07243J16667
$$ -421603 -440717 -440510 -425929 -400996 -365954 -321460 -268749 -205675 -127765 -33754 73489 190156
37958A90156J19400J06977P4842L3718L615m812K153J2560K1135K7645K9316K1542
$$ 190156 309556 416533 491375 525093 528708 523896 526049 538609 559744 587389 616705 638247
37946F38247M359j7476m0467o2970p9448q1272o7686n0873m3622m4589m2513l3322
$$ 638247 642606 625130 584663 521693 442245 360973 293287 242414 198792 154203 111690 78368
37934G8368k4334k0702j6939o165J0417K9589N4332Q6171J12962J15181Q5936
$$ 78368 54034 33332 16393 10228 20645 50234 104566 190737 303699 418880 504816
37923E04816L7984j0182m8786p6154r0758q9033o9393l6467j843K1276K7784K4347
$$ 504816 542800 532618 483832 407678 316920 227887 158494 122027 120184 141460 169244 193591
37911A93591K0085J5542N681q544j9093k1095j6404o089J1076K8681L0816R158
$$ 193591 213676 229218 234899 226355 207262 186167 169763 163674 174750 203431 234247 243405
37899B43405k2453l9582l3180j7565j1452j6461j7979n317J3085J7246k265l3336
$$ 243405 220952 181370 148190 130625 119173 102712 84733 79416 92501 109747 107482 74146
37887G4146n5190n8453m8494l3435j7688o848q377k1992l5665l7106k5874j0125
$$ 74146 18956 -39497 -87991 -121426 -139114 -145962 -154339 -176331 -211996 -249102 -274976 -285101
37875b85101M295J6246K4220K5349J9416R846P48m667l899L359J3176J8714J4542
$$ -285101 -280806 -264560 -240340 -214991 -195575 -185729 -184981 -189648 -193547 -190188 -177012 -158298 -143756
37862a43756Q54j4935k1687j2939P748L1776N4004P2205Q0914P4311N6446M0623
$$ -143756 -142902 -157837 -179524 -192463 -184715 -152939 -98935 -26730 54184 128495 184941 225564
37850B25564L5318L7012L8813L7758L0473J2335j1919k6620k4809k2000l7881
$$ 225564 260882 297894 336707 374465 404938 417273 405354 378734 353925 331925 294044
37839B94044o8667r1129r2539q2719p3919o1397l0706K2627Q5534J34150J45591
$$ 294044 225377 134248 41709 -41010 -114929 -176326 -207032 -184405 -98871 35279 180870
37828A80870J11243M5839j9217n7014o0909m1201j2426J3122K5754K0930L253
$$ 180870 292113 337952 318735 261721 200812 159611 147185 160307 186061 206991 210244
37817B10244j5172k2916j7381o416j263n528j1191q054L266J1267O932o967k1126
$$ 210244 195072 172156 154775 148359 147096 141568 130377 122323 125589 136856 143788 136821 115695
37804A15695k9546l1039k4999j1260O381K0958K7918K7860K3602J7216J1031R035
$$ 115695 86149 55110 30111 18851 25232 46190 74108 101968 125570 142786 153817 162852
37792A62852J4102K3680L0421K8752K0815J4974J7938K8361L8431M1697L8386
$$ 162852 176954 200634 231055 259807 280622 295596 313534 341895 380326 422023 460409
37781D60409L1820K0582j366l3535o1409o7293m9808k6528j5023j7423k6574l7856
$$ 460409 492229 512811 511445 477910 416501 349208 299400 272872 257849 240426 213852 175996
37769A75996m6444m1528j8301N776K406l4352p6769r1091o8731k6233J5227M2511
$$ 175996 129552 88024 69723 75499 77905 43553 -33216 -124307 -193038 -219271 -204044 -161533
37757a61533N2034N0923N4681P5395J12187J56384K01393K42470K72840K88236
$$ -161533 -109499 -58576 -3895 71500 183687 340071 541464 783934 1056774 1345010
37747A345010K92204K89619K77906K51476K10880J58460Q8304p039j17201k11025
$$ 1345010 1637214 1926833 2204739 2456215 2667095 2825555 2913859 2906820 2789619 2578594
37737B578594k59459k59187k32398k06795j95966j93623j83030j52924j06230
$$ 2578594 2319135 2059948 1827550 1620755 1424789 1231166 1048136 895212 788982
37728G88982n5736j5186N534M033r881j8134j0257O806J9878K6179L1677L7139
$$ 788982 733246 718060 723594 727627 717746 699612 689355 696161 716039 742218 773895 811034
37716H11034L5806K3907M134k1380n2266q2639j01360j03068r3259q0548o9218
$$ 811034 846840 870747 874881 853501 801235 718596 617236 514168 420909 340361 271143
37705B71143o0112n2234m2148k8434j7944k0048l2014l7714k5397j155J9800L0450
$$ 271143 211031 158797 116649 88215 70271 50223 18209 -19505 -44902 -46057 -26257 4193
37693D193L5819M2679M9791M7385K5043j7418o5494r8361j02230p4970k2883L8979
$$ 4193 40012 82691 132482 179867 204910 187492 121998 23637 -78593 -153563 -176446 -137467
37681a37467Q5611R3830O2556J6883j2513j1639J4488N2865R0055J14727J21303
$$ -137467 -51856 41974 104530 121413 108900 97261 111749 164614 254669 369396 490699
37670D90699J12717R8343R0582J02265J40828K00597K63734L11008L28669L05283
$$ 490699 603416 701759 792341 894606 1035434 1236031 1499765 1810773 2139442 2444725
37660B444725K31197J09352l6037j68921k61585l05682l08316k83333k45472k06638
$$ 2444725 2675922 2785274 2749237 2580316 2318731 2013049 1704733 1421400 1175928 969290
37650I69290j72946j44322j17493r0331o3955m0184j7548O589K8212L5605K1142
$$ 969290 796344 652022 534529 444198 380243 340059 322511 329100 357312 392917 414059
37639D14059q432l8229n8397o5865n9134m3008l5731n5637r5396j21625j08117
$$ 414059 405627 367398 309001 243136 184002 140994 105263 49626 -45770 -167395 -275512
37628b75512o1614q838L2001N7519O6857N8647L9498K3015J6377J4612J0664N783
$$ -275512 -337126 -345964 -313963 -256444 -189587 -130940 -91442 -68427 -52050 -37438 -26774 -20991
37616b0991O882J6980L1621M4252N3215O1959P1750P6549O9198N2363L8108L4964
$$ -20991 -14109 2871 34492 78744 131959 193918 265668 342217 411415 463778 501886 536850
37604E36850L9824M4545M5403M2773L6708K8287K2679K5898L8881N6602P1400
$$ 536850 576674 621219 666622 709395 746103 774390 797069 822967 861848 918450 989850
37593I89850P6920P3647P3166R1391J31247J72578J82273J35945L4841r0133j91310
$$ 989850 1066770 1140417 1213583 1304974 1436221 1608799 1791072 1927017 1961858 1871725 1680415
37582A680415k33755k20937j86300j54764j20622o9817j2398K2777K1908p14k4062
$$ 1680415 1446660 1225723 1039423 884659 764037 694220 681822 704599 726507 725793 701731
37571G01731m0253m9091m7004l2125j3694n660j1814k3408l0648l1229k7391j9747
$$ 701731 661478 612387 565383 533258 519564 513904 502090 478682 448034 416805 389414 369667
37559C69667p140Q794K1546K3560J2115r315l5671o4182r1440j08050j01473o8747
$$ 369667 362527 371321 392867 416427 428542 419227 383556 319374 227934 119884 18411 -50336
37547e0336k5412L680O805k574m93K0470M3794N0083L8820K3909J4244Q445N494
$$ -50336 -75748 -72068 -65263 -67837 -68330 -47860 -4066 46017 84837 108746 122990 131435 136929
37534A36929P787J1767P432p106j9771k0002j2721r803j4349k1254k6891k8360
$$ 136929 144716 156483 163915 156809 137038 117036 104315 94512 80163 58909 32018 3658
37522C658j7467J2815N5837R3972J14221J14067R3239N0797n080n1880o5296l8068
$$ 3658 -13809 -994 54843 148815 263036 377103 470342 521139 516059 464179 398883 360815
37510C60815J3545O0424P9613O8301M1516J5197p095k9170m8752n6532m8338l1394
$$ 360815 374360 434784 514397 582698 624214 639411 632316 603146 554394 497862 449524 418130
37498D18130j6221o999k128j33j658p139j4985k2536k9409l9383n5565p2048p5034
$$ 418130 401909 394910 392782 392649 390991 383852 368867 346331 316922 277539 221974 149926 74892
37485G4892n7410k9064o779L878R940J6532K0086J7049J0536M493j850r134j2766
$$ 74892 17482 -11582 -18361 -14483 -4543 11989 32075 49124 59660 64153 62303 53169 40403
37472D0403p676N290K1487L7075M7519M5797K8573L268j5319j5510N296M0364
$$ 40403 32727 38017 59504 96579 144098 189895 218468 221736 206417 190907 196203 236567
37460B36567P3790Q4583O0407J0702l8665o6794p0857n8075l2792K409L8170O1176
$$ 236567 310357 394940 455347 466049 427384 360590 289733 231658 198866 201275 239445 300621
37448C00621O6842O2641N7210N2167M6757M3110M1401L5699K1995O813K63L167
$$ 300621 367463 430104 487314 539481 586238 629348 670749 706448 728443 735256 735519 738686
37436G38686R000J5943K6146L3071K2856n901l3963m1291k8548j1671j722J177
$$ 738686 747686 763629 789775 822846 845702 839801 805838 764547 735999 724328 722606 723783
37424G23783R2r53N965K5453M6921N0342K8730j421j6231o623J7928M1686N3259
$$ 723783 723875 722922 728887 754340 801261 851603 880333 878912 862681 856058 873986 915672 968931
37411I68931M7800K6439l992l3561n4489o4446o4360n3836l0955K005L4628N3893
$$ 968931 1016731 1043170 1039178 1005617 951128 886682 822322 768486 737531 739536 774164 828057
37399H28057N4201L9820J8467l422j9671k5360k1915j6173j1199k905J0270J9696
$$ 828057 882258 922078 940545 937123 917452 892092 870177 854004 842805 839900 850170 869866
37387H69866J4742l682k2547k7767j3478J5241M4779O3052P1918Q4310J03644
$$ 869866 884608 880926 858379 830612 817134 832375 877154 940206 1012124 1096434 1200078
37376A200078J13716R8300O4350L3047J1375j2489m4528p0588p2876n0053j4258
$$ 1200078 1313794 1412094 1476444 1509491 1520866 1508377 1463849 1393261 1320385 1270332 1256074
37365A256074K3103N4585P2596P2558N9685M6170L9948L8332L2816J9340L562
$$ 1256074 1279177 1333762 1406358 1478916 1538601 1584771 1624719 1663051 1695867 1715207 1718769
37354A718769n739r646k0901m7032p5080q1614n7668j5646K7635O4046Q9033R7178
$$ 1718769 1713030 1703384 1682483 1635451 1560371 1478757 1421089 1405443 1433078 1497124 1586157 1683335
37342A683335R0532Q1139P5338O2998L3285m380k7699k8456k0236j7782j9713
$$ 1683335 1773867 1855006 1930344 1993342 2026627 2022247 1994548 1966092 1945856 1928074 1908361
37331A908361j6704q674o726k1503n4529r7607j34914j48251j28995q8955n4828
$$ 1908361 1891657 1882983 1876257 1854754 1800225 1702618 1567704 1419453 1290458 1201503 1146675
37320A146675m6407o0706q0001r2413r8449r8800q6784n9594k9556j3310j1304
$$ 1146675 1100268 1039562 959561 867148 768699 669899 583115 523521 493965 480655 469351
37309D69351p895O960K5516L5230L5420L4372L5390L3548K4586J0912j011n118
$$ 469351 461456 468416 493932 529162 564582 598954 634344 667892 692478 703390 702379 697261
37297F97261J512J5406K5359J9014n554l5333n1894m7179l0115j6372j1395o178
$$ 697261 698773 714179 739538 758552 752998 717665 665771 618592 588477 572105 560710 554532
37285E54532P996K4584K8210J5907M366J1623L5924N7373N7675L4222j790l4808
$$ 554532 562528 587112 615322 631229 635595 647218 683142 740515 798190 832412 830622 795814
37273G95814n3083n4217m5884l8401l5006l1420k5381k2243k7345l5458l3807
$$ 795814 742731 688514 642630 604229 569223 537803 512422 490179 462834 427376 393569
37262C93569j7209M234J5984J4621Q027K730j559l908K531K0971M1695M9546L8925
$$ 393569 376360 380594 396578 411199 419226 421956 420397 416489 419020 439991 481686 531232 570157
37249E70157J6109j0480l5228n2574n8368n5361m9952m1606k3370M008K6771L3258
$$ 570157 586266 575786 540558 487984 429616 374255 324303 282697 259327 263335 290106 323364
37237C23364K8626K7290L3991L9486L3496J5376p632k6308l2190k0256O752L8225
$$ 323364 351990 379280 413271 452757 486253 501629 493997 467689 435499 415243 421995 460220
37225D60220O2868P6349Q1555Q2319P8261O6022M4702J8807m681k1236l0310l3769
$$ 460220 523088 599437 680992 763311 841572 907594 952296 971103 966422 945186 914876 881107
37213H81107l5015l8522m6727n6522o1018n5233l8190j0313K6214O1845P8799
$$ 881107 846092 807570 760843 704321 643303 588070 549880 539567 565781 627626 706425
37202G06425O2729J7821l2045o0627n9413m0585k0323j510K4187N8944R0156J02753
$$ 706425 769154 786975 754930 694303 634890 594305 573982 572472 596659 655603 745759 848512
37190H48512R5384P8557N9396L5716N828k2275l5265k5996j87K5390L1855J1301
$$ 848512 943896 1022453 1081849 1117565 1123393 1101118 1065853 1039857 1039670 1065060 1096915 1108216
37178A108216k4962n2926n3827k7778P374K8807K4392K012j6599j5869m40J4003
$$ 1108216 1083254 1030328 976501 948723 956097 984904 1009296 1011308 994709 978840 978400 992403
37166I92403K0421K3072K2236Q217k4104o3089q9895r5646q4122o2857l9038k0734
$$ 992403 1012824 1035896 1058132 1066349 1042245 979156 889261 793615 709493 646636 607598 586864
37154E86864j3435j4146j3531m774J2365L4873N9117P9420Q7955P9373N5857K6799
$$ 586864 573429 559283 545752 540978 553343 588216 647333 726753 814708 894081 949938 976737
37142I76737K541j2134j7724j4020J268K4993M4817N0502M7282M9412O0227O8103
$$ 976737 979278 967144 949420 935400 936668 961661 1006478 1056980 1104262 1153674 1213901 1282004
37130A282004O4803N8066N9856O9811P8099Q0007Q0993R0411J14976J54342J98947
$$ 1282004 1346807 1404873 1464729 1534540 1612639 1692646 1773639 1864050 1979026 2133368 2332315
37119B332315K38034K74932L27783M09293N13603O28417P42761Q22253P89951
$$ 2332315 2570349 2845281 3173064 3582357 4095960 4724377 5467138 6289391 7079342
37110G079342N72147J84378k45266n62017o96071o87543o19096n45459m81355
$$ 7079342 7651489 7835867 7590601 7028584 6332513 5644970 5025874 4480415 3999060
37101C999060m24874l71219l13480k49319j89363j48876j29421j17743j05756
$$ 3999060 3574186 3202967 2889487 2640168 2450805 2301929 2172508 2054765 1949009
37092A949009j01988j15660j36433j41443j21387q9276o1347l9133j5682R169
$$ 1949009 1847021 1731361 1594928 1453485 1332098 1242822 1181475 1142342 1126660 1135829
37082A135829K8880M1533N1253N8109N4898L7607J4407j25J306J3091K4204K9330
$$ 1135829 1164709 1206242 1257495 1315604 1370502 1408109 1422516 1422391 1423697 1436788 1460992 1490322
37070A490322L1259L2787K9626J5111q767l0719m2803m8645n4313n4599l5799
$$ 1490322 1521581 1554368 1583994 1599105 1590338 1559619 1516816 1468171 1413858 1359259 1323460
37059A323460O557N7431R2455R7749P9560N5954L9950L0794K1449J1711R498J9493
$$ 1323460 1330017 1387448 1479903 1577652 1657212 1713166 1753116 1783910 1805359 1817070 1826568 1846061
37047A846061L6533N2542O4079O8981O2564M5272L0018L1459M7385N9206N2770
$$ 1846061 1882594 1935136 1999215 2068196 2130760 2176032 2206050 2237509 2284894 2344100 2396870
37036B396870L1614P260j5615l8775o0214p0876o1077k7808K1619P0117R8324
$$ 2396870 2428484 2435744 2420129 2381354 2321140 2250264 2189187 2161379 2182998 2253115 2351439
37025B351439R7132P3949M5197K3490J2792J1986J8130K6744L3310L5529L2141
$$ 2351439 2448571 2522520 2567717 2591207 2603999 2615985 2634115 2660859 2694169 2729698 2761839
37014B761839K0967K786j2727j1283J1034M0265N7069N5595M5632L7700L3411
$$ 2761839 2782806 2785592 2772865 2761582 2772616 2812881 2869950 2925545 2971177 3008877 3042288
37003C042288L2252L9330N8291P9737Q6300P1951N0610M1708N0168O3975O9239
$$ 3042288 3074540 3113870 3172161 3251898 3338198 3410149 3460759 3502467 3552635 3616610 3685849
36992C685849O3336N3023M3203L1068J1922j1766l1090m1359m7837n7207o6691
$$ 3685849 3749185 3802208 3845411 3876479 3888401 3876635 3845545 3804186 3756349 3699142 3632451
36981C632451o7688n9144m9647m3810l3471q613K5102M5387L2287j1129n5937
$$ 3632451 3564763 3505619 3455972 3412162 3378691 3370078 3395180 3440567 3472854 3461725 3405788
36970C405788o7588l4977J8104N3519N1702K1440j9121n9202q9570r5130o9122
$$ 3405788 3338200 3303223 3321327 3374846 3426548 3447988 3428867 3369665 3280095 3184965 3115843
36959C115843l0407j0747k1628m4312n6026n5185n4651n9987o5664o8877p5504
$$ 3115843 3085436 3074689 3053061 3008749 2952723 2897538 2842887 2782900 2717236 2648359 2572855
36948B572855q9701j04331j05853q6714n2018j6207O770J3589J3348J6692K2407
$$ 2572855 2483154 2378823 2272970 2186256 2134238 2118031 2124801 2138390 2151738 2168430 2190837
36937B190837J8911J427j6954j7051N283L5845N9989P7639R7917J24618J52084
$$ 2190837 2209748 2211175 2194221 2177170 2182453 2218298 2278287 2355926 2453843 2578461 2730545
36926B730545J72525J81789J77709J56098J09788L2882o9819j76090k54960k88664
$$ 2730545 2903070 3084859 3262568 3418666 3528454 3561336 3491517 3315427 3060467 2771803
36916B771803k84422k60578k25386j76428j17422o4420l2689k4617l2474m6307
$$ 2771803 2487381 2226803 2001417 1824989 1707567 1643147 1610458 1585841 1553367 1507060
36906A507060n6863n8481n3991n2039n6199o1141o1411n7294m8977l3349j3040
$$ 1507060 1450197 1391716 1337725 1285686 1229487 1168346 1106935 1049641 1000664 967315 954275
36895I54275j464r108k7640l6181k2957N442L5083N7648P1290P4738O4526L8138
$$ 954275 952811 943703 916063 879882 856925 862367 897450 955098 1026388 1101126 1165652 1203790
36883A203790M43l2767m2164k0797J8295N3329P0940O9946N3563K5829m971k7378
$$ 1203790 1204233 1171466 1129302 1108505 1126800 1180129 1251069 1321015 1374578 1400407 1395436 1368058
36871A368058l5013l0873k2148j3604o695j589K328O657J3206K2868L4195M2129
$$ 1368058 1333045 1302172 1280024 1266420 1259725 1258136 1260464 1267121 1280327 1303195 1337390 1379519
36859A379519L9965K5635O048o836m840J0987L0789L9413K3069k0770p7641j23387
$$ 1379519 1419484 1445119 1451167 1444331 1439491 1450478 1481267 1520680 1543749 1522979 1445338 1321951
36847A321951j40903j30731j05715p7044m7384j6994P714J6637P563r048j9836
$$ 1321951 1181048 1050317 944602 867558 820174 803180 810894 827531 835094 826046 806210
36836H06210k0408j5519j2242j7587l7111o6410q6131p6391l8432O160L9242N9845
$$ 806210 785802 770283 758041 740454 703343 636933 550802 474411 435979 442139 481381 541226
36824E41226P2516P4141O0047L4526O607j9262m1374n4953n5306m2525j8384J4324
$$ 541226 613742 687883 747930 782456 789063 769801 728427 673474 618168 575643 557259 571583
36812E71583M3574M9946K9373P102J3456M7174P6584P7296N4624K6001l292l7107
$$ 571583 615157 665103 694476 701578 715034 762208 838792 916088 970712 996713 993421 956314
36800I56314p0853q9953q5559o4683m2962l0296k4808j9764j4434j5404k6760
$$ 956314 885461 795508 709949 645266 602304 572008 547200 527436 513002 497598 470838
36789D70838m3141n5635o1439o3813o5532o6974o7401o2233m1981k008M6538Q2317
$$ 470838 427697 372062 310623 246810 181278 114304 46903 -15330 -57311 -59319 -12781 69536
36777F9536R1561P5904M4665P833k2134l1409j5385J4595M0391N2973N7567O4188
$$ 69536 161097 237001 281666 289499 267365 235956 220571 235166 275557 328530 386097 450285
36765D50285P5393Q3755Q0700O6761N1557M4051M5280N0636N4931N3236M1604
$$ 450285 525678 609433 690133 756894 808451 852502 897782 948418 1003349 1056585 1098189
36754A098189K0951k861k5980m9785p3573q8937q7422p0873m8629k7437r507K882
$$ 1098189 1119140 1116279 1090299 1040514 966941 878004 790582 719709 671080 643643 634136 637018
36742F37018Q154R078Q738L918j0914l3134n1644n7956n3728m7469m6460m9933
$$ 637018 645172 654250 662988 666906 655992 622858 571214 513258 459530 412061 365601 315668
36730C15668m7036k5165J5075N6840Q3839R5852J01613J02002Q9799O3363L1053
$$ 315668 268632 243467 258542 315382 399221 495073 596686 698688 788487 851850 882903
36719H82903L109j2597q818J6998N5792R2225J18812J39824J62626J91178K25875
$$ 882903 886012 873415 864597 881595 937387 1029612 1148424 1288248 1450874 1642052 1867927
36708A867927K62603K93875L16721L33354L34526K90585J77963J5277j43643k57081
$$ 1867927 2130530 2424405 2741126 3074480 3409006 3699591 3877554 3892831 3749188 3492107
36698C492107l22658l55527l58856l27678k68678k00408j37708q6263m9186k9759
$$ 3492107 3169449 2813922 2455066 2127388 1858710 1658302 1520594 1434331 1385145 1355386
36688A355386k8172m1646o7270j01096j35796j62360j74218j69871j53608j32339
$$ 1355386 1327214 1285568 1218298 1117202 981406 819046 644828 474957 321349 189010
36678A89010j08115p5777l3000J0434M1504O0410P8403R9010J11745J07052Q8071
$$ 189010 80895 5118 -27882 -17448 24056 84466 162869 261879 373624 480676 568747
36667E68747O4337M2251K4949J3270L184j0057k2589k4506j3709J833J6927L2871
$$ 568747 633084 675335 700284 713554 716738 706681 684092 659586 645877 647710 664637 697508
36655F97508M5512M3340K4528L949n437p975j3583k1345k5314k6968k9431k6565
$$ 697508 743020 786360 810888 814837 809400 801425 787842 766497 741183 714215 684784 658219
36643F58219j1212J0774K8020M2297O6021J00198J25958J21943Q5140L4107m364
$$ 658219 647007 657781 685801 728098 794119 894317 1020275 1142218 1227358 1261465 1257101
36632A257101j4128j140J5169K5438M0660P3500J15565J42598J38549J05237N2292
$$ 1257101 1242973 1241833 1257002 1282440 1323100 1396600 1512165 1654763 1793312 1898549 1950841
36621A950841r172o2429q8460q0970n2586k2057Q10J7080L3435N9231J02818J65476
$$ 1950841 1941669 1879240 1790780 1709810 1657224 1635167 1635977 1653057 1686492 1745723 1848541 2014017
36609B014017K41533L25383M09956M70765M60032L36322J11490j38110l20404
$$ 2014017 2255550 2580933 2990889 3461654 3921686 4258008 4369498 4231388 3910984
36600C910984l93758l85237l48600l14106k79884k37517j90928j51475j26004
$$ 3910984 3517226 3131989 2783389 2469283 2189399 1951882 1760954 1609479 1483475
36591A483475j13527j08345j04291r9114r4494q8922p4156m5151j0535J5674L1646
$$ 1483475 1369948 1261603 1157312 1058198 963704 874782 800626 755475 744940 760614 792260
36580G92260M7363O6193P7562P1246M9807K2605m378k7751m2947m7266m2999l4734
$$ 792260 839623 905816 983378 1054624 1104431 1127036 1122658 1094907 1051960 1004694 961695 926961
36568I26961k7298k6143l2177l5721k4917k734J3622J2886m17j8208l7681n2391
$$ 926961 899663 873520 841343 805622 780705 777971 791593 804479 804062 785854 748173 695782
36556F95782m8856k3018R444K9373L2613K4287O249j7177l0933k3083k427J2020
$$ 695782 646926 623908 633352 662725 695338 719625 725874 708697 677764 654681 652254 664274
36544F64274J5910K0272L0497M0185M6208N4613O6854P2105N9796L2698K601k1403
$$ 664274 680184 700456 730953 771138 817346 871959 938813 1010918 1070714 1103412 1106013 1084610
36532A084610l6581m3622m4634m2705m1672m5997n7840p1615p4860n9450l0083
$$ 1084610 1048029 1004407 959773 917068 875396 829399 771559 699944 625084 565634 535551
36521E35551J953K9746N1091O3621O8466P6078R8124J31655J57565J56880J25514
$$ 535551 537504 567250 618341 681962 750428 826506 924630 1056285 1213850 1370730 1496244
36510A496244P5117K4918q875k3059k8508l7536n0975o1303o5422o7584p1170
$$ 1496244 1571361 1596279 1587404 1564345 1535837 1498301 1447326 1386023 1320601 1253017 1181847
36499A181847p4223p2172n8288k3683L2725R2271J24491J14095P6273M1232K6341
$$ 1181847 1107624 1035452 977164 953481 986206 1078477 1202968 1317063 1393336 1434568 1460909
36488A460909K6125K5101J4988K58q938p342Q68P127P391N929J0929K7053N2281
$$ 1460909 1487034 1512135 1527123 1527381 1518443 1511101 1511969 1519096 1526487 1532416 1543345 1570398 1622679
36475A622679Q1997J15590J56334K02888K44597K71423K87421L06945L35814L63652
$$ 1622679 1704676 1820266 1976600 2179488 2424085 2695508 2982929 3289874 3625688 3989340
36465C989340L78776L84509L96440M29204M90517N81011O91406Q03301R01054
$$ 3989340 4368116 4752625 5149065 5578269 6068786 6649797 7341203 8144504 9045558
36456I045558R81961J048975J096081J108349J075175R94500Q62256O66428L99660
$$ 9045558 10027519 11076494 12172575 13280924 14356099 15350599 16212855 16879283 17278943
36447A7278943P7571k59167n63097q02115r67082j063074j098175j081438j025419
$$ 17278943 17356514 17097347 16534250 15732135 14765053 13701979 12603804 11522366 10496947
36438A0496947r43973q48417p50316o64615o00899n51773m99974m40825l89068
$$ 10496947 9552974 8704557 7954241 7289626 6688727 6136954 5636980 5196155 4807087
36429D807087l58426l41975l19985k82740k38921k03587j82541j67666j45847
$$ 4807087 4448661 4106686 3786701 3503961 3265040 3061453 2878912 2711246 2565399
36420B565399j14915r0322r0591j15025j41917j49956j34905j05146p1203m3606
$$ 2565399 2450484 2360162 2269571 2154546 2012629 1862673 1727768 1622622 1551419 1507813
36410A507813l0586l0286l1164k5269j4807k140J7711M7917Q0164J00236R7797
$$ 1507813 1477227 1446941 1415777 1390508 1375701 1373561 1391272 1439189 1519353 1619589 1717386
36399A717386O8039J3368n1090j03526j33764j47400j48011j29529r5119o7993
$$ 1717386 1785425 1798793 1747703 1644177 1510413 1363013 1215002 1085473 990354 922361
36389I22361o6903p9399p5285m1697P846N2692P8878P9517N8751L4989K6013K9284
$$ 922361 855458 776059 700774 659077 666923 719615 798493 878010 936761 971750 997763 1027047
36377A027047K7410J2727m267j0991p245k716p926k7454n4448p2097o7135m1982
$$ 1027047 1054457 1067184 1062917 1051926 1044681 1041965 1034039 1006585 952137 880040 812905 770923
36365G70923j0511J4016K3368J5887K254J758K0952M1194L8546J1600k1223m6068
$$ 770923 760412 774428 797796 813683 815937 817695 838647 879841 918387 929987 908764 862696
36353H62696o1643o7154n8262l6444j0232J4554L6781N2428N4721M2738K3213
$$ 862696 801053 733899 675637 639193 628961 643515 680296 732724 787445 830183 853396
36342H53396M930l532L446J9045K3537M915k4300m2275m4359m1011l4948j8330
$$ 853396 858326 854794 858240 877285 900822 905737 881437 839162 794803 753792 718844 700514
36330G00514P530K6847K7572J2209j1910m0238o5420p6110o7368m5256j9191L368
$$ 700514 708044 734891 762463 774672 762762 722524 657104 580994 513626 468370 449179 452547
36318D52547J5585J5239J1268J6272L0026L8604L1741J3704l511r933l16K4006
$$ 452547 468132 483371 494639 510911 540937 579541 611282 624986 621475 611542 611226 635232
36306F35232N3499P5933Q3923P4038M3915k044m9081q3857j06139j19558j16976
$$ 635232 688731 764664 848587 922625 966540 964496 915415 831558 725419 605861 488885
36295D88885q8779m2601J89K8106M7159O4542P7622Q1227P5025O1434M5580L8249
$$ 488885 400106 357505 357694 385800 432959 497501 575123 656350 731375 792809 838389 876638
36283H76638M8611P1445Q9266Q9227P3545N5879N2854P3205J06274J27557J26997
$$ 876638 925249 996694 1085960 1175187 1248732 1304611 1357465 1430670 1536944 1664501 1791498
36272A791498J25807J51863K04129K57098K94620L18000L19625K71871J55551
$$ 1791498 1917305 2069168 2273297 2530395 2825015 3143015 3462640 3734511 3890062
36263C890062q994j67204k64668k80769k40169j92499j71327j71400j69692j60170
$$ 3890062 3881068 3713864 3449196 3168427 2928258 2735759 2564432 2393032 2223340 2063170
36253B063170j55031j58468j58218j44045j19396r2338o7309m7148l1885j5080
$$ 2063170 1908139 1749671 1591453 1447408 1328012 1235674 1168365 1121217 1089332 1074252
36243A074252P776K8527L5645L2007L0566L4933L8931M2901N2807O2224N3517
$$ 1074252 1082028 1110555 1146200 1178207 1208773 1243706 1282637 1325538 1378345 1440569 1494086
36232A494086K2549j1482k6187j4715J8144O4895J13329J45600J48728J25367
$$ 1494086 1516635 1505153 1478966 1464251 1482395 1547290 1660619 1806219 1954947 2080314
36222B080314R2814P1890P2335Q5454R6404J06611J34538J88956K54083L10707
$$ 2080314 2173128 2245018 2317353 2402807 2499211 2605822 2740360 2929316 3183399 3494106
36212C494106L59552M12411M73383N43261O31384P48222Q95424J074860J296529
$$ 3494106 3853658 4266069 4739452 5282713 5914097 6662319 7557743 8632603 9929132
36203I929132J566062J869232K155950K303121K105569J397480K57852r43445
$$ 9929132 11495194 13364426 15520376 17823497 19929066 21326546 21584398 20640953
36195B0640953j789024k118345k067398j852440j593848j331988j099086r15094
$$ 20640953 18851929 16733584 14666186 12813746 11219898 9887910 8788824 7873730
36187G873730p64697o28865n15379m33759l70758l14716k75030k54924k32396
$$ 7873730 7109033 6480168 5964789 5531030 5160272 4845556 4570526 4315602 4083206
36178D083206j90367j41363j02623p0067l4637p75K9281O7323J17969J65106J94481
$$ 4083206 3892839 3751476 3648853 3578786 3544149 3543374 3572655 3639978 3757947 3923053 4117534
36167D117534K12235K31349K59150L04626L73991M52017N13472N59951O17766
$$ 4117534 4329769 4561118 4820268 5124894 5498885 5950902 6464374 7024325 7642091
36158G642091O93105P59447P95967Q04763P81976P09953N91630M55615L10952
$$ 7642091 8335196 9094643 9890610 10695373 11477349 12187302 12778932 13234547 13545499
36149A3545499J33928q1361k95848m70712o05737p10829p74125p84826p57810
$$ 13545499 13679427 13598066 13302218 12831506 12225769 11514940 10740815 9955989 9198179
36140I198179p09688o36929n40671m45772l72297l14179k66894k47504k63754
$$ 9198179 8488491 7851562 7310891 6865119 6492822 6178643 5911749 5664245 5400491
36131E400491k89916k96528k81033k51182k05665j49561j00454o0901j4051L7217
$$ 5400491 5110575 4814047 4533014 4281832 4076167 3926606 3826152 3765251 3751200 3788417
36121C788417O0408M1666J0024o159j2632k0470k1977j6997k4934m6773n2773
$$ 3788417 3848825 3890491 3900515 3894356 3881724 3861254 3839277 3822280 3797346 3750573 3697800
36110C697800l1109r444m798N666L8199P0521Q4441R6352J15638J18518R6425
$$ 3697800 3666691 3657247 3652449 3658115 3696314 3766835 3851276 3947628 4063266 4181784 4278209
36099D278209Q5729J14137J59613J94465K24558K51726K47401K02810J59002J48790
$$ 4278209 4363938 4478075 4637688 4832153 5056711 5308437 5555838 5758648 5917650 6066440
36089F066440J54753J59026J81955K33054K78348K97087L16307L50567L68588
$$ 6066440 6221193 6380219 6562174 6795228 7073576 7370663 7686970 8037537 8406125
36080H406125L60642L72287M25714M77641N02940N43772O23605O96414P41845
$$ 8406125 8766767 9139054 9564768 10042409 10545349 11089121 11712726 12409140 13150985
36071A3150985Q22695R78389J151113J292740J451489J671831J908449K129432
$$ 13150985 13973680 14952069 16103182 17395922 18847411 20519242 22427691 24557123
36063B4557123K400676K771117L184623L608828M130329M812456N598442O481387
$$ 24557123 26957799 29728916 32913539 36522367 40652696 45465152 51063594 57544981
36055E7544981P612979R103611J0901081J3028223J5703289J9008378K2695806
$$ 57544981 65157960 74261571 85162652 98190875 113894164 132902542 155598348
36048A55598348K6486247K9942656L1404412K7704108J6513629m12545j7239010
$$ 155598348 182084595 212027251 243431663 271135771 287649400 287236855 269997845
36041B69997845k8208278l1717167l0175506k6723649k2958716j9281669j5961073
$$ 269997845 241789567 210072400 179896894 153173245 130214529 110932860 94971787
36034I4971787j3241218j1049194r189049p651102o478634n547641m707618l976761
$$ 94971787 81730569 70681375 61492326 53841224 47362590 41814949 37107331 33130570
36026C3130570l419314k973897k554544k191639j935564j732720j516985j322640
$$ 33130570 29711256 26737359 24182815 21991176 20055612 18322892 16805907 15483267
36018A5483267j198932j105219r88228q76898q10681p55004o71986n97873n69395
$$ 15483267 14284335 13179116 12190888 11313990 10503309 9748305 9076319 8478446 7909051
36009G909051n45124m77775l98217l54296l29105k90607k61471k68275k76295
$$ 7909051 7363927 6886152 6487935 6133639 5804534 5513927 5252456 4984181 4707886
36000D707886k45014k00253j85365j85712j65411j37433j34164j43184j31677
$$ 4707886 4462872 4262619 4077254 3891542 3726131 3588698 3454534 3311350 3179673
35991C179673j05368r0890q6963p9693p8032r0518r5643p7411o1512p5024r7582
$$ 3179673 3074305 2983415 2896452 2816759 2738727 2648209 2552566 2475155 2413643 2338619 2241037
35980B241037r2992o4269m0183l1599l5616n7268r2446j12684r9039o9069m4277
$$ 2241037 2148045 2083776 2043593 2011994 1976378 1919110 1826664 1713980 1614941 1545872 1501595
35969A501595j8558J3762L0166J2949j7505l4352m3087n8270o8663n8153l7304
$$ 1501595 1483037 1496799 1526965 1539914 1522409 1488057 1444970 1386700 1318037 1259884 1222580
35958A222580k3091j0550O833J4315L685j773J8399M6984N9310O2197O8942O1607
$$ 1222580 1199489 1188939 1195772 1210087 1213772 1211999 1230398 1277382 1336692 1398889 1467831 1529438
35946A529438J8356m0125p0679o1663l3826j038L6251P0281R1873J09231J32178
$$ 1529438 1547794 1507669 1436990 1375327 1341501 1340463 1376714 1446995 1538868 1648099 1780277
35935A780277J45635J24644O7671p469q8608j66282k19418k31694k14128j88814
$$ 1780277 1925912 2050556 2118227 2110758 2022150 1855868 1636450 1404756 1190628 1001814
35925A001814j60528j26213r8351r1282r2914p6546l6705P158L6490M5025L3568
$$ 1001814 841286 715073 616722 525440 432526 355980 319275 326433 362923 407948 441516
35914D41516J2013k418o292j8072m7731p1895o0243j4932L6826P7351J03518J09038
$$ 441516 453529 451111 444819 426747 379016 307121 246878 231946 268772 346123 449641 558679
35902E58679Q7014M5160j163m4872q0158r1231o8985l0154j29J5273K3308K1750
$$ 558679 645693 690853 689690 644818 564660 473429 404444 374290 374161 389434 412742 434492
35890D34492N043j6156k5180k3698k5415l0810k8172j4958N97J4674K6895K9517
$$ 434492 439535 423379 398199 374501 349086 318276 290104 275146 275743 290417 317312 346829
35878C46829J5463o693k1634k7021l1131l7840m6822n8637o5150m7212lN0754
$$ 346829 362292 355599 333965 306944 275813 237973 191151 132514 67364 20152 20149 70903
35866G0903P6931Q0491P7335O3301K4919k4218m9870m1203k2336j6651k2002k5221
$$ 70903 147834 228325 305660 368961 393880 369662 319792 278589 256253 239602 217600 192379
35854A92379k0568q573O732J5151R143l122p151l674m622q894j714J8100K9072
$$ 192379 171811 163238 169970 185121 194264 191142 183991 180317 175695 166801 165087 183187 212259
35841B12259J4014j6712l7333l4151j5367L30Q89r808j8549j9356j8497k0446
$$ 212259 226273 209561 172228 138077 122710 123040 123929 114121 95572 76216 57719 37273
35829C7273j9012j0469m538r057j2322L001L2914N5393N8550N0369M0873L0075
$$ 37273 18261 7792 3254 -5803 -18125 -15124 17790 73183 131733 182102 222975 253050
35817B53050J6435M549r87k075m062r677j6007j5516m254Q827Q817m468j2879
$$ 253050 269485 274034 273047 270972 266910 257233 241226 225710 221456 230283 239100 234632 221753
35804B21753m119J1357J6717J0716K472l617m538P516L1353M7500M1895L1334
$$ 221753 217634 228991 245708 256424 258896 255279 250741 258257 289610 337110 379005 410339
35792D10339M5212Q6723J31383J59839J71582J68112J44792J03641N7108J4567
$$ 410339 455551 542274 673657 833496 1005078 1173190 1317982 1421623 1478731 1493298
35782A493298k1984m7378n3121m0877k4051j2887p538n360m057J249J2244J9952
$$ 1493298 1471314 1423936 1370815 1329938 1305887 1293000 1285462 1280102 1276045 1277294 1289538 1309490
35770A309490J5677P945J4764L9319O7496R0179J13961J47691J91433K41034K91714
$$ 1309490 1325167 1333112 1347876 1387195 1454691 1544870 1658831 1806522 1997955 2238989 2530703
35759B530703L35604L67941L96534M30880M57871M41175L51470J91175r977k12016
$$ 2530703 2866307 3234248 3630782 4061662 4519533 4960708 5312178 5503353 5493376 5281360
35749E281360l76649m78057n12802m96360m49001l89570l37160l03755k82611
$$ 5281360 4904711 4426654 3913852 3417492 2968491 2578921 2241761 1938006 1655395
35740A655395k55933k17430j77721j46526j22256j02522r1987r2619r5892r1814
$$ 1655395 1399462 1182032 1004311 857785 735529 633007 541020 448401 352509 260695
35730B60695p9284o2349m2644k0188L536K6287M3437M4701K1420j8643n1282n6937
$$ 260695 181411 119062 76418 56230 59766 86053 129490 174191 195611 176968 125686 68749
35718F8749l7961j1561R420K3430L1597K9284R830k3594n2997n7846l4648p44
$$ 68749 30788 19227 28647 52077 83674 112958 122788 99194 46197 -11649 -46297 -47041
35706d7041K3459L1608K9504K4737K4026L2629M6899N2659M0210J7280j072j0398
$$ -47041 -23582 8026 37530 62267 86293 118922 165821 218480 258690 275970 274898 264500
35694B64500j5637j7595j2664l240L265N095O425R016J2864K1943L8530N4991
$$ 264500 248863 231268 218604 215364 218629 223724 230149 239165 252029 273972 312502 367493
35682C67493O3978P5452J09441J69267K33512K78339K99260L06952L06668K83775
$$ 367493 431471 506923 616364 785631 1019143 1297482 1596742 1903694 2210362 2494137
35672B494137K09547O9592j05754k49047l09315k96181k59991k35269k19786k01338
$$ 2494137 2703684 2773276 2667522 2418475 2109160 1812979 1552988 1317719 1097933 896595
35662H96595j78269j48922j05692n3309j6393j3114l0739m0591l1461j6887j3125
$$ 896595 718326 569404 463712 410403 394010 380896 350157 309566 278105 261218 248093
35651B48093k0314k5588j8136O29K0114L2428L8896M2906M1217K9386J2878L755
$$ 248093 227779 202191 184055 184684 204798 237226 276122 319028 360245 389631 402509 406264
35639D06264N902J0589O596j1301m1277p3117q9966q1842n7829l5940k1674o643
$$ 406264 412166 422755 429351 418050 376773 303656 213690 131848 74019 38079 16405 9762
35627I762J2928K9570L8763M7092O0997P6542Q5453Q4061P3097N5770L8638K6673
$$ 9762 22690 52260 91023 138115 199112 275654 361107 445168 518265 574035 612673 639346
35615F39346J4657r251m8132q9552j15201j12673q1208l5600k734j459k2699l8830
$$ 639346 654003 644752 596620 507068 391867 279194 197986 162386 159652 158193 135494 96664
35603I6664l4534j8889o193K646J4904L2000M6456M7010K5358j4898n5683p9599
$$ 96664 62130 43241 37048 39694 54598 86598 133054 180064 205422 190524 134841 55242
35591E5242q7588r1915r3408p9823m8078j2837J1732K5090L0311K5723J3857M921
$$ 55242 -32346 -124261 -217669 -297492 -345570 -358407 -346675 -321585 -291274 -265551 -251694 -246773
35579b46773J882n744k2865l4438k2243J1517M7808P1329P7947O9002N0327L3345
$$ -246773 -244891 -250635 -273500 -307938 -330181 -318664 -270856 -199527 -121580 -52578 -2251 31094
35567C1094K7028K9757L4936M0251M4774M2085K5534j825k9864n2404o9566q0483
$$ 31094 58122 87879 122815 163066 207840 249925 275459 273634 243770 191366 121800 41317
35555D1317p9814o2098k7350J6277N4006P1740O4643L7542j515m3407p5781q8208
$$ 41317 -38497 -100595 -127945 -111668 -57662 14078 78721 116263 114748 71341 -4440 -92648
35543i2648q2219o9220n6152m0853k3554j2961j4866k2022k1212n440K3739N8195
$$ -92648 -174867 -244087 -300239 -341092 -364646 -377607 -392473 -414495 -435707 -441147 -417408 -359213
35531c59213Q3402Q5674O6055M1006K4313J5650J1048J3397K2811K6113R927j9133
$$ -359213 -275811 -190137 -124082 -83076 -58763 -43113 -32065 -18668 4143 30256 40183 21050
35519B1050l9425l8965k5567j3246q733j3197k6914m5065n3640l8383j032L6669
$$ 21050 -18375 -57340 -82907 -96153 -104886 -118083 -144997 -190062 -243702 -282085 -283117 -246448
35507b46448M9810L2687K356j9679k4544j4244O791K9664L8008K1008j0997l5513
$$ -246448 -196638 -163951 -161595 -181274 -205818 -220062 -213271 -183607 -145599 -124591 -135588 -171101
35495a71101m2807m1484m0010l6467k8786k0784j2620J639K0089K9234K2996J4706
$$ -171101 -213908 -255392 -295402 -331869 -360655 -381439 -394059 -392420 -372331 -343097 -320101 -305395
35483c05395J9997L6269M8718M9243M0020K5756J2454P196Q219L05k8331o6849
$$ -305395 -285398 -249129 -200411 -151168 -111148 -85392 -72938 -65742 -57523 -57218 -85549 -152398
35471a52398q9355q1028m9700j3629J4456L1962M2020M6649M3414L1121J8132
$$ -152398 -241753 -322781 -372481 -386110 -371654 -339692 -297672 -251023 -207609 -176488 -158356
35460a58356J7110K8097L5140K5546M859j3747k6530l6251l9371k8339m661K0002
$$ -158356 -141246 -113149 -78009 -52463 -47604 -61351 -87881 -124132 -163503 -191842 -196503 -176501
35448a76501L5156L7638K9166J5015L095k405m996q870j1946j2059j5158k8041
$$ -176501 -141345 -103707 -74541 -59526 -56431 -58836 -63832 -72702 -84648 -96707 -111865 -139906
35436a39906m5023n0681l6493q485K1007M3030N4074N5503N3128N3337N7238N9210
$$ -139906 -184929 -235610 -272103 -280588 -259581 -216551 -162477 -106974 -53846 -509 56729 115939
35424A15939N1419L0685L409j7846k7969l8452o4314j00387j21119j09060p4025
$$ 115939 167358 198043 201452 183606 155637 117185 52871 -47516 -168635 -277695 -351720
35413c51720l7245o389K3415N1317O6520O1150L9241J4725N517K3509O1685R5619
$$ -351720 -388965 -395354 -371939 -320622 -254102 -192952 -153711 -138986 -133469 -109960 -48275 47344
35401D7344J07202J03636J04316J12717J12397Q9295M7517K461l2225m9491n0028
$$ 47344 154546 258182 362498 475215 587612 676907 724424 726885 694660 645169 595141
35390E95141m3076m1457n1871p0455q6472q8553p0741l7313m79K9829N2325O9807
$$ 595141 552065 510608 458737 388282 301810 213257 142516 105203 104724 134553 186878 256685
35378B56685Q3293R2938R7842R0797O1342J1385l8628o7456p2632o6070n6861
$$ 256685 339978 432916 530758 621555 682897 694282 655654 588198 515566 449496 392635
35367C92635m7052l7882k9306j7437k825K403j3220m3109o7243p2450o0033l7520
$$ 392635 345583 307701 278395 260958 258133 260536 247316 204207 136964 64514 4481 -33039
35355c3039j4098j036l747j2995j4213n137N338J3290K2059K8742K2254j199l0453
$$ -33039 -47137 -48173 -51920 -64915 -79128 -84265 -78927 -65637 -43578 -14836 7418 6219 -24234
35342b4234m9930n0122k8677O964L6797M1515K4023Q078J1435K9356M7424N8739
$$ -24234 -74164 -124286 -152963 -145999 -109202 -67687 -43664 -35586 -24151 5205 52629 111368
35330A11368O2345N5995M0388K4371J7322J9655K5700L1518L5465L5922L2963
$$ 111368 173713 229708 270096 294467 311789 331444 357144 388662 424127 460049 493012
35319D93012K7884J7693m289l8377p4116r9557j09293j00841p2093k9878O106
$$ 493012 520896 538589 534300 495923 421807 322250 212957 112116 40023 10145 16251
35308A6251J8379Q997n406j3911j9050k5236k8469k1591n516R544J4095Q846L348
$$ 16251 34630 43627 38221 24310 5260 -19976 -48445 -70036 -75552 -66008 -51913 -43067 -39719
35295c9719N448J3683K1330K5834L0423L6951M1918M1357L6162L0272K5876K2109
$$ -39719 -34271 -20588 742 26576 56999 93950 135868 177225 213387 243659 269535 291644
35283B91644J6592P217n545j7258k2899k2285j9714j7868j5763j3960j7296k8487
$$ 291644 308236 315453 309908 292650 269751 247466 227752 209884 194121 180161 162865 134378
35271A34378m1218m4352l4070j9278j2772j7575k4651k5569k4546l2908n1944
$$ 134378 93160 48808 14738 -4540 -17312 -34887 -59538 -85107 -109653 -142561 -194505
35260a94505o8091o8900n8643n2471n8659p2493q4789q8957q0466n7102k2232
$$ -194505 -262596 -331496 -390139 -442610 -501269 -573762 -658551 -747508 -827974 -885076 -907308
35249i07308J6240N1105P7222Q9873Q8265Q0707P9590Q8334R7445R5163P8736
$$ -907308 -891068 -839963 -762741 -672868 -584603 -503896 -424306 -335972 -238527 -143364 -64628
35238f4628N5029L4382K4338K4042K3583J3972r6k325J6931M7601O7914O3677
$$ -64628 -9599 24783 49121 73163 96746 110718 110622 108297 125228 172829 240743 304420
35226C04420L8467P685j5355k9145m1216n5310o3490n4903l1285p800K940K601
$$ 304420 342887 350572 335217 306072 264856 209546 146056 91153 59868 52068 55008 57609
35214E7609O09J458L329N839J2351K3158L0934K7138J2664j383n975n158j0797
$$ 57609 58218 59676 63005 68844 81195 104353 135287 162425 175089 173706 167731 162573 151776
35201A51776k6646m2288m4410k9973o777J4537K6966L1133L5520M6738N6798M8479
$$ 151776 125130 82842 38432 8459 1682 16219 43185 74318 109838 156576 213374 261853
35189B61853J9072j0642k0425j5126j3144j8066j8712j3938j7522l4347m8832
$$ 261853 280925 270283 249858 234732 221588 203522 184810 170872 153350 119003 70171
35178G0171m5433k8029j0523P51N698R90j5858l7360n0794n0612m0773k8825k3220
$$ 70171 24738 -3291 -13814 -13063 -7365 -6375 -22233 -59593 -110387 -160999 -201772 -230597 -253817
35165b53817l0711m7945n8723m8010j8114J4434L5661M1912L4390J5222j0252
$$ -253817 -284528 -332473 -391196 -439206 -457320 -442886 -407225 -365313 -330923 -315701 -325953
35154c25953l4549n3944o8913p7738p4227n3741j8598K3036O0227Q1278P8466
$$ -325953 -360502 -414446 -483359 -561097 -635324 -689065 -707663 -684627 -624400 -543122 -464656
35143d64656N5362K8165J6482L0794O6548J07195J33273J33732J12501Q2590N1170
$$ -464656 -409294 -381129 -364647 -333853 -267305 -160110 -26837 106895 219396 301986 353156
35132C53156J3024l6723q5635j08395r2753n5648k6902j9046j9497j0763R668
$$ 353156 366180 329457 243822 135427 42674 -12974 -39876 -58922 -78419 -89182 -79514
35121g9514L0945M2306M0738L0561K0010J5133J3779Q361m098j9042l2109m2738
$$ -79514 -48569 -6263 34475 65036 85046 100179 113958 122319 118221 99179 67070 24332
35109B4332m7967m2179k8366j9651k0591j6212P634L9425N2749L9856J9074P463
$$ 24332 -23635 -65814 -94180 -113831 -134422 -150634 -143000 -103575 -50826 -10970 8104 15567
35097A5567J274j0539k6031l3228k7348j6975j4555k3831l4816l1386q287J9849
$$ 15567 16841 6302 -19729 -52957 -80305 -97280 -111835 -135666 -170482 -201868 -210155 -190306
35085a90306L2322K4561R209m359k1156m7502p6135r1311q4391o0224l1846j1525
$$ -190306 -157984 -133423 -124214 -128573 -149729 -197231 -273366 -364677 -449068 -509292 -541138 -552663
35073e52663k602K378J1973K4568L2321L4726L8185M0681K9182j351l6427n7861
$$ -552663 -555265 -552887 -540914 -516346 -484025 -449299 -411114 -370433 -341251 -342602 -379029 -436890
35061d36890o3539o2146n4840l3933J852M0984P0010Q4957R0438R1097Q5327O6840
$$ -436890 -500429 -562575 -617415 -651348 -649496 -608512 -538502 -453545 -363107 -272010 -186683 -119843
35049a19843L4071j463k0595j3967Q185K5937K6815J2197p544k0153j8474o409
$$ -119843 -85772 -87235 -107830 -121797 -113612 -87675 -60860 -48663 -56207 -76360 -94834 -101243
35037a01243L643L317k963m136N227K1448L7162M6326M6211L8622K8327J7866
$$ -101243 -97600 -94283 -97246 -101382 -96155 -74707 -37545 8781 54992 93614 121941 139807
35025A39807N230j1814l1048m6644n2058m1893j6191J3952K9302J6439k0865o4660
$$ 139807 145037 133223 102175 55531 3473 -38420 -54611 -40659 -11357 5082 -15783 -80443
35013h0443r4761r8578p5791l8303l339J7120K0697J0586p737k5376l1865k2309
$$ -80443 -175204 -273782 -349573 -387876 -391215 -374095 -353398 -342812 -350549 -375925 -407790 -430099
35001d30099p32K4645M6669O0924O7847P3582Q3206R2847R4397Q7207P6969O3903
$$ -430099 -430831 -406186 -359517 -298593 -230746 -157164 -73958 18889 113286 200493 277462 341365
34989C41365M3086J7631j708j4419l3336o1276p7769o2266k2621J1704J8654m403
$$ 341365 384451 402082 400374 385955 352619 291343 213574 151308 128687 140391 159045 154642
34977A54642m8634r7750j27889j20550p9362k5669K1749N4523O7480N8915L9502
$$ 154642 106008 8258 -119631 -240181 -319543 -345212 -323463 -268940 -201460 -142545 -103043
34966a03043K7335K9029L4558L3418K5908J4794k720k6947m7717n4049m8974m7128
$$ -103043 -75708 -46679 -12121 21297 47205 61999 59279 32332 -15385 -69434 -118408 -165536
34954a65536n7928p5870q7309q3484o6520m5082k5946j0473J659Q952J1273J4175
$$ -165536 -223464 -299334 -386643 -470127 -536647 -581729 -607675 -618148 -616489 -607537 -596264 -582089
34942e82089K5462M6948P2114R1611R8892R2236P5147N4715L6989K4436J9595
$$ -582089 -556627 -509679 -437565 -345954 -247062 -154826 -79679 -24964 12025 36461 56056
34931E6056K7865N0995P8514R1444P7503M1436K75l0660m9052o5369q9968j18525
$$ 56056 83921 134916 213430 304874 382377 423813 424088 393428 344376 279007 189039 70514
34919G0514j33140j20538q5612m3389k867L4367O3507P5063O6228M7187L2942
$$ 70514 -62626 -183164 -268776 -312165 -315032 -280665 -217158 -142095 -75867 -28680 4262
34908D262L1416L8990M3500L2269K540l5216o7832r2169j12549j27427j26039
$$ 4262 35678 74668 118168 150437 152977 117761 49929 -42240 -154789 -282216 -408255
34897d08255r9865n2299L377N0246P3039O6174M0193J4226j287r658j5202j4245
$$ -408255 -508120 -560419 -557042 -506796 -433757 -367583 -327390 -313164 -314451 -324109 -339311 -353556
34885c53556l551J0520J9518K4636L1937L8460L3042J2656r374j5252R07L0154
$$ -353556 -357107 -346587 -327069 -302433 -270496 -232036 -198994 -186338 -195712 -210964 -210057 -179903
34873a79903N7606P1460O7672N1386L3597K2712J8520J5705J2014R688R198O028
$$ -179903 -122297 -50837 16835 68221 101818 124530 143050 158755 170769 180457 189655 195683
34861A95683m116k0129l8127n6201p2504q0807p3687n1146k2377K249J8384K6995
$$ 195683 191567 171438 133311 77110 4606 -76201 -149888 -201034 -223411 -221162 -202778 -175783
34849a75783L0360L0019K5676J5189j457j7861k4778j9577r147k300k178n744
$$ -175783 -145423 -115404 -89728 -74539 -75996 -93857 -118635 -138212 -147359 -149659 -151837 -157581
34837a57581o028N053K9019N3086N6971L2847n049l4015m1320k6458O273M7953
$$ -157581 -163609 -158556 -129537 -76451 -19480 13367 8318 -25697 -67017 -93475 -87202 -39249
34825c9249Q2151R3723Q3311O6508N5452M5312K2171j8107o2349r2042j00622
$$ -39249 42902 136625 219936 286444 341896 387208 409379 391272 328923 236881 136259
34814A36259r5734q4727o4869l3681k887J0395O580M871J6882L0557K8147J0537
$$ 136259 40525 -44202 -109071 -142752 -145639 -135244 -128664 -123793 -106911 -76354 -48207 -37670
34802c7670o370j2005o763P346K9027N1804O6026O7854O0208M6368K9174J4097
$$ -37670 -44040 -56045 -62808 -55462 -26435 25369 91395 159249 219457 265825 294999 309096
34790C09096N689J952k299r279k0783m1326o9926r3228r6986q2042n9745l5588
$$ 309096 314785 316737 314438 305159 284376 243050 173124 79896 -17090 -99132 -158877 -194465
34778a94465r308J1886J5440J412j3958j6882r479k344k897j3583l2377n1797
$$ -194465 -203773 -191887 -176447 -175035 -188993 -205875 -215354 -217698 -220595 -234178 -266555 -318352
34766c18352o4459p0572p1984o0231k3771K9728P1632Q0008O0322L3758J5248
$$ -318352 -382811 -453383 -525367 -585598 -609369 -579641 -508009 -428001 -367679 -333921 -318673
34755c18673R512J7713L6288N3753N8254M8156L2370K3135K8937M7145O1324N4713
$$ -318673 -309161 -291448 -255160 -201407 -143153 -94997 -62627 -39492 -10555 36590 97914 152627
34743A52627L0323Q466j54p825k8408n3508o2650n0965l3804k5863k6447k5135
$$ 152627 182950 191416 191262 183437 155029 101521 38871 -12094 -45898 -71761 -98208 -123343
34731a23343j3621Q596L3990N2301N9878O1715O0761N0311K3509j3597m6287o6116
$$ -123343 -136964 -128368 -94378 -42077 17801 79516 140277 190588 214097 200500 154213 88097
34719H8097p4525p4062o4327m6460k4583j920J9472L5239L9881L1389J1987j2998
$$ 88097 13572 -60490 -124817 -171277 -195860 -197780 -178308 -143069 -103188 -71799 -59812 -72810
34707g2810l3310l6173j8863L071Q639o974k9211m0881l5128j4090J4778L8631
$$ -72810 -106120 -142293 -161156 -158085 -149446 -156420 -185631 -226512 -261640 -275730 -260952 -222321
34695b22321M4367K9331L339k1255l6883l9038k6182n207J0148J1979N567R88
$$ -222321 -177954 -148623 -145284 -166539 -203422 -242460 -268642 -273849 -263701 -251722 -246155 -245167
34683b45167K549J0019K3371L9016M5547L2170J738l0441n0922n6651n0297l4526
$$ -245167 -242618 -232599 -209228 -170212 -124665 -92495 -90757 -121198 -172120 -228771 -279068 -313594
34671c13594j3622M783J4582J5904J1924L301j0791k7872m2690n2008n4352m5086
$$ -313594 -327216 -322433 -307851 -291947 -280023 -276722 -287513 -315385 -358075 -410083 -464435 -509521
34659e09521j8286K2589O0823Q0090Q1340Q0465Q8767J01378J06566R9980Q4602
$$ -509521 -527807 -505218 -444395 -364305 -282965 -202500 -113733 -12355 94211 194191 278793
34648B78793O1042K6313j6491n3528o9978o3820m7565l6236l4783l7240l6191
$$ 278793 339835 366148 349657 296129 226151 162331 114766 78530 43747 6507 -29684
34637b9684l0577k3643j5519j438K1376M6527O0115N1012K1141j2976l0236k0136
$$ -29684 -60261 -83904 -99423 -100861 -79485 -32958 27157 78169 99310 86334 56098 35962
34625C5962R453L9664N5961N6196M6152L1740J6710L556p842k1367m0125n9414
$$ 35962 45415 85079 141040 197236 243388 275128 291838 295394 287552 266185 226060 166646
34613A66646o6898n2610j9356J7688M2309M8404M0790K7717J5419R180J4398L1893
$$ 166646 99748 47138 27782 45470 87779 136183 176973 204690 220109 229289 243687 275580
34601B75580N3334O5333N9261L6218M259k5814m3083m0899k2372K0J2409P447
$$ 275580 328914 394247 453508 489726 493985 468171 425088 384189 361817 361837 374246 381693
34589C81693j3626m2438o5268o7699m3270L49M4783P2735P8666O9476N4583L5593
$$ 381693 368067 325629 260361 192662 149392 149741 194524 267259 345925 415401 469984 505577
34577E05577P775k7817n8308o9925o3323n2369m6977m2181k6542J671K9828M1897
$$ 505577 513352 485535 427227 357302 293979 241610 194633 152452 125910 127581 157409 199306
34565A99306L3701J7844J2235K1780L3356L2009J9394J0200J1104J0958m846l5403
$$ 199306 233007 250851 263086 284866 318222 350231 369625 379825 390929 401887 397041 361638
34553C61638o3700p2314n7456l0201o757M033N396N041M831J189n735q929j581
$$ 361638 297938 225624 168168 137967 131210 135243 140639 145680 150511 151700 145965 137036 135455
34540A35455J6851M1598O4239P3059N8476K1279k8315p9695j23600j45548j29949
$$ 135455 152306 193904 258143 331202 389678 410957 382642 302947 179347 33799 -96150
34529i6150p8577j7661K2327L1270J9938L253q852j0279j312P132J413j9274m0224
$$ -96150 -174727 -192388 -170061 -138791 -118853 -115600 -124452 -134731 -136043 -128911 -127498 -146772 -186996
34516a86996m5423l0641l566K2992L7251L4081J8203n54j6453l0237m2463m8387
$$ -186996 -232419 -263060 -266626 -243634 -206383 -172302 -154099 -154653 -171106 -201343 -243806 -292193
34504b92193m1988k4145n529P4j1831k9328l2943j5198J0746K5904K7033K8495
$$ -292193 -334181 -358326 -363855 -363781 -375612 -404940 -437883 -453081 -442335 -416431 -389398 -360903
34492c60903M2951O5118P6888O6531M1103J9192J0563M530j6665n1729p4459n9583
$$ -360903 -317952 -252834 -175946 -109415 -68312 -49120 -38557 -34027 -50692 -102421 -176880 -236463
34480b36463j0065M7561R0724J15083J24533J19764J01279P4876M6967J8146j3000
$$ -236463 -246528 -198967 -108243 6840 131373 251137 352416 427292 474259 492405 479405
34469D79405m1659n7182n2640l2855j2799o499j4421k1837j3607Q254K5085K0914
$$ 479405 437746 380564 327924 295069 282270 275771 261350 239513 225906 234160 259245 280159
34457B80159j874k6932l9333l4238j5749O620K1496K1458P241j5189m0917o6649
$$ 280159 278285 251353 212020 177782 162033 168653 190149 211607 218848 203659 162742 96093
34445I6093q5637q6522o1140j4238L5267O4518O1935L6219J0502M105J7235L3470
$$ 96093 10456 -76066 -137206 -151444 -116177 -51659 10276 46495 56997 61102 78337 111807
34433A11807L6881K4923N161j4949l0258l3629j8474J1298L9423N0605M3830K9537
$$ 111807 148688 173611 178772 163823 133565 99936 81462 92760 132183 182788 226618 256155
34421B56155J6893Q182K493k584j3381l7053p1901j03994j17423j07654q3706
$$ 256155 273048 281230 283723 281139 267758 230705 158804 54810 -62613 -170267 -253973
34410b53973n8237l6316j3651J4642M4783O7184P8797Q6462R3766R1581P1065
$$ -253973 -312210 -348526 -362177 -347535 -302752 -235568 -156771 -70309 23457 115038 186103
34399A86103M2021K5953K9786L7975L3958J8508J655j2939k7269m1016n3628o8238
$$ 186103 228124 254077 283863 321838 355796 374304 375959 363020 335751 294735 241107 172869
34387A72869q4109r0032p5688m7711k5632k2302l4500n0493n9666n7014m6245
$$ 172869 88760 -1272 -76960 -124671 -150303 -172605 -207105 -257598 -317264 -374278 -420523
34376d20523l7464l4820k8302n527L0308O3270Q4060R6033J01618R4956P2746
$$ -420523 -457987 -492807 -521109 -526636 -496328 -433058 -348998 -252965 -151347 -56391 16355
34365A6355M2532J3730j2159l5825n1154n0410l5353j5684K908K3004M6913O8553
$$ 16355 58887 72617 60458 24633 -26521 -76931 -112284 -127968 -125060 -102056 -55143 13410
34353A3410P6700O5964M3582K4345J7439J8877J8720J4280J1889J5363J8066J0001
$$ 13410 90110 156074 199656 224001 241440 260317 279037 293317 305206 320569 338635 348636
34341C48636r740l1038m2412m0738l2320k6138k5913k7877k6142j9458j1428m900
$$ 348636 338896 307858 265446 224708 192388 166250 140337 112460 86318 66860 55432 50532
34329E0532J465J0749K3345L4742L6476K0913j1469m9239p7435q8989q7527p9749
$$ 50532 51997 62746 86091 120833 157309 178222 166753 117514 40079 -48910 -136437 -216186
34317b16186o8309n2700l3590j3661M601K0212L2664M0035L8553K5611M417j5320
$$ -216186 -284495 -337195 -370785 -384446 -379845 -359633 -326969 -286934 -248381 -222770 -218353 -233673
34305b33673k2965j3559R508L5001M7490L7482J2723n509m252N598K476j8936
$$ -233673 -256638 -270197 -260689 -225688 -178198 -140716 -127993 -133502 -137754 -132156 -129680 -148616
34293a48616m2649n3808n6733o5343q1815r2038q1139m8525p194K7939M8636N2197
$$ -148616 -191265 -245073 -301806 -367149 -448964 -541002 -622141 -670666 -677860 -649921 -601285 -549088
34281e49088L7590Q418k1120l1759j6849R521K8481L7483M8250O5920Q0182P9283
$$ -549088 -511498 -503080 -524200 -555959 -572808 -563287 -534806 -497323 -449073 -383153 -302971 -223688
34269b23688O4786M8423M0040M2484N3158O5711P3424P5089P5528P7188P3866
$$ -223688 -158902 -110479 -70439 -27955 25203 90914 164338 239427 314955 392143 466009
34258D66009N6963K7896J513m879J2504L7992M8829L6457J4009k56l934r316k3742
$$ 466009 522972 550868 552381 547502 560006 597998 646827 683284 697293 697037 693103 683787 660045
34245F60045l9593m5226l8421k6181j7437j8882l1629m7654n4661m9117m0657
$$ 660045 620452 575226 536805 510624 493187 474305 442676 395022 340361 291244 250587
34234B50587l9567m3499m0620k3360L605K5494K5808j222m1569o9390o9824n1426
$$ 250587 211020 167521 126901 103541 107146 132640 158448 157226 115657 46267 -23557 -74983
34222g4983l2676k1226j2031n95J1242K1701L3271M8973O8945R0678J08018J11032
$$ -74983 -107659 -128885 -140916 -141511 -130269 -108568 -75297 -26324 42621 133299 241317 352349
34210C52349R3190O0399K8153P658k462j0637k2449l6957m8465n0280m0380k5532
$$ 352349 445539 505938 534091 541749 539287 528650 506201 469244 420779 370499 330119 304587
34198C04587j6845j8719k4319k4175j7232j0746j1008j7672k6867l5421l9779
$$ 304587 287742 269023 244704 220529 203297 192551 181543 163871 137004 101583 61804
34187F1804l4616j8416j084n8k3606n9333q3939q4609o7464m5377k3269J678K9387
$$ 61804 27188 8772 7688 7630 -15976 -75309 -159248 -243857 -311321 -356698 -379967 -378289 -348902
34174c48902N1456N6403L8674L844l3358n7495o1202m6607j9971J1756L9774N5446
$$ -348902 -297446 -241043 -202369 -198525 -231883 -289378 -350580 -397187 -417158 -405402 -365628 -310182
34162c10182N8159N8218O6781Q3146R4986R0548O8512L7556R844o098j0322j0488
$$ -310182 -252023 -193805 -127024 -43878 51108 141656 210168 247724 257568 251470 241148 230660
34150B30660j3604j8096j6009k993J5982L1140L5916L0228J8448O100k623o490
$$ 230660 217056 198960 182951 179958 195940 227080 262996 293224 311672 317772 315149 308659
34138C08659p354q011q383l580J1938L5315N1309M2676Q505k9741m4907k8448
$$ 308659 301305 293294 284911 281331 293269 328584 379893 422569 431074 401333 356426 327978
34126C27978K813K3502K1280K324k0234l8868n2294n8019n0099k6541M076K7144
$$ 327978 330791 354293 375573 377897 357663 318795 266501 208482 158383 131842 135918 163062
34114A63062L2873K0718m343l4349n6943n8654l5380J920L5851N6452O4421O2676
$$ 163062 195935 216653 212310 177961 121018 62364 26984 28904 64755 121207 185628 248304
34102B48304M9456K1435j8675n9873q8723r7850q9563p2070n2693l4914k0198
$$ 248304 297760 319195 300520 240647 151924 54074 -35489 -107559 -160252 -195166 -215364
34091b15364j0146o182q657j6637k7211l4993l4772k6288j4945o500j948J040
$$ -215364 -225510 -231692 -240349 -256986 -284197 -319190 -353962 -380250 -395195 -401695 -403643 -402603
34079d02603K616j014j2535k7010l2608k0474N609L1572M5882M7805M2569L3156
$$ -402603 -399987 -401001 -413536 -440546 -473154 -493628 -488019 -456447 -410565 -362760 -320191 -287035
34067b87035K0157N327j0294k9036n1472p0879p9716p9809p7446o8627m0034J0617
$$ -287035 -266878 -261551 -271845 -300881 -352353 -423232 -502948 -582757 -660203 -728830 -768864 -758247
34055g58247O3630R3518R1814O9285M1101J6472p10q843p415M041K5077N0666
$$ -758247 -694617 -601099 -509285 -440000 -398899 -382427 -383137 -391980 -399395 -395354 -370277 -319611
34043c19611P1068P8166P0688N2551K9903J0888K498L843P246R958J9534M2261
$$ -319611 -248543 -170377 -99689 -47138 -17235 -6347 -3849 -6 7240 17198 36732 78993
34031G8993P0900R0468R2773P8313M7334j016n8483j03537j12741p7698j3401
$$ 78993 149893 240361 333134 411447 458781 457765 399282 295745 183004 105306 91905
34020I1905M8165P7227O6025L1498k397k2688k8233k1601q376O36k773j4084k1736
$$ 91905 140070 217297 283322 314820 312423 289735 261502 239901 231525 232161 229388 215304 193568
34007A93568k2986k6396l7616n0716n6173n0958l7840k0768m572N295O381o8j2912
$$ 193568 170582 144186 106570 55854 -319 -51277 -89117 -109885 -114457 -109162 -102781 -102849 -115761
33994a15761l0760m5898m4881k1075J5438M4751N3905M5418L1015J9094Q183p785
$$ -115761 -146521 -192419 -237300 -258375 -242937 -198186 -144281 -98863 -67848 -48754 -40571 -48356
33982d8356k7813m0000l2727q229J9202L7368M3000L5658J4139j6289l9431l8303
$$ -48356 -76169 -116169 -148896 -157125 -137923 -100555 -57555 -21897 -7758 -24047 -63478 -101781
33970a01781r612L3499P0285Q3265O7383L4799P558n83N240J0799Q867O06j3729
$$ -101781 -111393 -77894 -7609 75656 143039 177838 185396 184813 190053 200852 209719 210325 196596
33957A96596l4629n3372n3026k6293J2182L7296L5559J2712j6258l7591m0788
$$ 196596 161967 108595 55569 29276 41458 78754 114313 127025 110767 73176 32388
33946C2388k0303J7700N3522O6724N3923L1118J6266J1802P258l274j2355j0054
$$ 32388 12085 29785 83307 150031 203954 235072 251338 263140 270398 267124 254769 244715
33934B44715J346R064N192n141j2293j3575j2185q640l52R422Q585j2615m8484
$$ 244715 246061 255125 260317 255176 242883 229308 217123 208483 208131 217553 226138 213523 165039
33921A65039p9438q7680p1120m3007j9501p299k109K050M306L16p077n982J2099
$$ 165039 85601 -2079 -73199 -116206 -135707 -143006 -145115 -143065 -138759 -138443 -145520 -151502 -139403
33908a39403M0264N9921N6111K9082n506k5887j9319O104K7255K8649J7006Q577
$$ -139403 -99139 -39218 16893 45975 40469 14582 -4737 1367 28622 57271 74277 82854
33896H2854P604O802N540J3097L0912M4207L8475J5090j6763n4293r6058j29079
$$ 82854 90458 97260 102800 115897 146809 191016 229491 244581 227818 173525 77467 -51612
33884e1612j35228j12128p7902n1808l6355k1348M14K6448N1016P2647R2999J10085
$$ -51612 -186840 -298968 -376870 -428678 -465033 -486381 -485967 -459519 -408503 -335856 -242857 -132772
33872a32772J16734J08331Q9843P0882N4732L7343J6851k622j7923l0097l7767
$$ -132772 -16038 92293 182136 253018 307750 345093 361944 359322 341399 311302 273535
33861B73535l5624k4924j7437k0753k5889j9517m561K303p143k3377l3554l6302
$$ 273535 237911 212987 195550 174797 148908 129391 124830 127133 119990 96613 63059 26757
33849B6757l8569m3965m8290m3500k4163O803L7059N1926M4585K0127q201k6050
$$ 26757 -11812 -55777 -104067 -147567 -171730 -164927 -127868 -75942 -31357 -11230 -19431 -45481
33837d5481k6278j5058o973r638j5940j5885j1923j5050k7966m0169m0399k8123
$$ -45481 -71759 -86817 -93790 -103428 -119368 -135253 -147176 -162226 -190192 -230361 -270760 -298883
33825b98883j2391m011q122j9743k7658k6804k4057k6928l1267k8086j8620j2130
$$ -298883 -311274 -315285 -323407 -343150 -370808 -397612 -421669 -448597 -479864 -507950 -526570 -538700
33813e38700j0366m714J1174L5426O3956R1450J06643R9844P8186O0658N3160
$$ -538700 -549066 -553780 -542606 -507180 -443224 -351774 -245131 -145287 -67101 -6443 46717
33802D6717M1075J3123k0181m2187n3965o9483r2197j08588j03375p2102k0295
$$ 46717 87792 100915 80734 38547 -15418 -84901 -177098 -285686 -389061 -461163 -481458
33791d81458M0343R3717J24673J26844J05027P0917L7037J1117o869k0181k7496
$$ -481458 -441115 -347398 -222725 -95881 9146 80063 117100 128217 121348 101167 73671
33780G3671k4300j2970m010l098l799J494J0031J4955J6718J9324J9997J3269
$$ 73671 49371 36401 32391 29293 25494 26988 37019 51974 68692 88016 108013 121282
33768A21282L803M592K0476M0799N0324M1890J8139j2057l6856m8233m9791n3479
$$ 121282 125085 129677 150153 190952 241276 283166 301305 289248 252392 204159 154368 100889
33756A00889o4724p4313o9552n1054l3377k8712l3982l6006k6815j1090N84K692
$$ 100889 36165 -38148 -107700 -158754 -192131 -220843 -254825 -290831 -317646 -328736 -328152 -325460
33744c25460p93J74J4480M1784O9462Q1387P2753N2602K9615K613k8869n3485
$$ -325460 -326253 -326079 -311599 -269815 -200353 -118966 -46213 6389 36004 38617 9748 -43737
33732d3737o0363n8198o6539q7080r8787q6242n8898l5309k1490j4458j4647k1160
$$ -43737 -104100 -162298 -228837 -315917 -414704 -500946 -559844 -595153 -616643 -631101 -645748 -666908
33720f66908k2649p385K1094M9626P2394R0761J00718R5343P9436O7574O3998
$$ -666908 -689557 -696942 -675848 -626222 -553828 -463067 -362349 -267006 -187570 -119996 -55998
33709e5998N5451K8951j1027m6957o3726n7337l5179j1453K724Q153J3623K2395
$$ -55998 -547 28404 17377 -29580 -93306 -150643 -185822 -197275 -194551 -186398 -172775 -150380
33697a50380K7106J9395K06k0732l1925k6468o599J6656L2332L9058M2810M6631
$$ -150380 -123274 -103879 -103673 -124405 -156330 -182798 -189397 -172741 -140409 -101351 -58541 -11910
33685a1910M8382M8395N1859O0713O8449O6468N2526L1126R124p339j5305j6965
$$ -11910 36472 84867 136726 197439 265888 332356 384882 416008 425132 417793 402488 385523
33673C85523j7401j9701k4110l0725l8849m4299m2659l6324l3638l9481n0385
$$ 385523 368122 348421 324311 293586 254737 210438 167779 131455 97817 58336 7951
33662G951n9636o2900n7828m2951j9603P456L2202M8325N0175L7852K0474Q384
$$ 7951 -51685 -114585 -172413 -215364 -234967 -227511 -195309 -146984 -96809 -58957 -38483 -30099
33650c0099K657r52J491K0968N6626Q7169Q9112O0110J9362j0918k0090j1478
$$ -30099 -27442 -28394 -26903 -5935 50691 137860 226972 287082 306444 295526 275436 263958
33638B63958J625M157r312l0133m5110m9040m5708m0626l7938m1314n0673n8011
$$ 263958 265583 269740 260428 230295 185185 136145 90437 49811 11873 -29441 -80114 -138125
33626a38125n2903l4561j4636n786r371j5373j2303L788K7506M8399N7260N0920
$$ -138125 -191028 -225589 -240225 -246011 -255382 -270755 -283058 -279270 -251764 -203365 -146105 -95185
33614i5185L3773J5315L920O44l61l921q150r254r400j4447k4338l2031l3255
$$ -95185 -61412 -46097 -42177 -41533 -41894 -45815 -53965 -63219 -72619 -87066 -111404 -143435 -176690
33601a76690l1226k9160k4448j4665l986K409O693J4893K6809L4760L1428J4859
$$ -176690 -207916 -237076 -261524 -276189 -280175 -277766 -271073 -256180 -229371 -194611 -163183 -148324
33589a48324j1885m0630n9396o0435m7861l2558j9893p598M713J1521R546L501
$$ -148324 -160209 -200839 -260235 -320670 -368531 -401089 -420982 -428580 -423867 -412346 -402800 -399299
33577c99299r30n197j3094k0103j4061J1451M6993P2252P1450M5410J0722j3185
$$ -399299 -400229 -405426 -418520 -438623 -452684 -441233 -394240 -321988 -250538 -205128 -194406 -207591
33565b07591j8977j5747j8877l4612n3586n8962m1368p210K6506M5348M6617L7831
$$ -207591 -226568 -242315 -261192 -295804 -349390 -408352 -449720 -456930 -430424 -385076 -338459 -300628
33553c00628K8655K4826K7534L5607M6920N7767O1688N1274K4907p266k8056k8252
$$ -300628 -271973 -247147 -219613 -184006 -137086 -79319 -17631 33643 58550 51284 23228 -5024
33541e024j5687n580k801J637J6322L7299N2464N2963L6835O438l0804o1201p2455
$$ -5024 -20711 -26291 -29092 -27455 -11133 26166 78630 131593 168428 174866 144062 82861 10406
33528A0406o5283n3277m8850n1902n2839m2810j9590J1421L8248M8372L8960J9509
$$ 10406 -54877 -108154 -157004 -208906 -261745 -304555 -324145 -312724 -274476 -226104 -187144 -167635
33516a67635M91j7818l9427n7816n6259k6750J6916M9867N7605M4006K1584j95
$$ -167635 -167144 -184962 -224389 -282205 -338464 -365214 -348298 -298431 -240826 -196820 -175236 -175431
33504a75431j6303k0912o793K6045O1346P2129M2336j6365p3580j06042j10406
$$ -175431 -191734 -212646 -219439 -193394 -132048 -59919 -17583 -33948 -107528 -213570 -323976
33493c23976r3375o0815k1151J1648K9855M2394O2845Q8590J01321Q8529N6305
$$ -323976 -417351 -478166 -499317 -487669 -457814 -415420 -352575 -263985 -162664 -74135 -17830
33482a7830K0859m022j0678K04J5962J9175N582r521p958J1999L6033M7516L6255
$$ -17830 3029 -993 -11671 -11467 4495 23670 29252 19731 11773 23772 59805 107321 143576
33469A43576J369m4648p7789p9248n2868k0918k001J970k014j0489k4172m1157
$$ 143576 144945 100297 22508 -56740 -109608 -130526 -132527 -130557 -132571 -143060 -167232 -208389
33457b08389n4496n5828m0144r468K5929N1731N7646M2185J1292k4181m9283m9298
$$ -208389 -262885 -318713 -358857 -368325 -342396 -290665 -233019 -190834 -179542 -203723 -253006 -302304
33445c02304k0128K4788O1915P5196O6999N2573M5432M7977N3298N3059M3852
$$ -302304 -322432 -297644 -235729 -160533 -93534 -40961 4471 52448 105746 158805 202657
33434B02657K8645J3788M247P28J099L724Q310J3856J7667J6778R073o540k7737
$$ 202657 231302 245090 249337 250065 251164 254888 263198 277054 294721 311499 320572 314032 286295
33421B86295m6343n3455n0623n1493o6252q6206r0012o5184j8816L1493P0049
$$ 286295 239952 186497 135874 84381 18129 -68077 -158089 -223273 -242089 -210596 -140547
33410a40547Q6811P9112N5633L2825K1265J7871J4362Q204J061p784j9502l0622
$$ -140547 -53736 25376 81009 113834 135099 152970 167332 175536 176597 168813 149311 118689
33398A18689l6275l5792k9439j3827J0875L2020L3622J6289k90K626K6044N6317
$$ 118689 82414 46622 17183 3356 14231 46251 79873 96162 95872 98498 124542 180859
33386A80859P5987O9857L1869k5208p2562q6825o8999l9857k0228j7797k5899
$$ 180859 256846 326703 358572 333364 260802 173977 104978 65121 44893 27096 1197
33375A197k8274r835K8791O8638R0104R0831Q0401O2320L2290o569l9056n3077
$$ 1197 -27077 -36912 -8121 60517 150621 241452 321853 384173 416463 409894 370838 317761
33363C17761n1209m2455l0206j4621q60L461k878j4096k3779k6893j8109M779
$$ 317761 266552 224097 193891 179270 178410 181871 178993 164897 141118 114225 96116 100895
33351A00895L4819N8207O4303N2067K8471M296j1019j6482k1315l3680m7321m6498
$$ 100895 135714 193921 258224 310291 338762 343058 332039 315557 294242 260562 213241 166743
33339A66743k6276m57J5292K1128K6080K8479J4860j9613n8483p7594o8419m4334
$$ 166743 140467 140010 155302 176430 202510 230989 245849 226236 167753 90159 21740 -22594
33327b2594k6325k5482l6856m5612l9088j6611J0818L1635M4446N5807O7527P0265
$$ -22594 -48919 -74401 -111257 -156869 -195957 -212568 -201750 -170115 -125669 -69862 -2335 67930
33315F7930N3376J9747j3230k8947k5660j4463o290m015n651j0404j9052l0310
$$ 67930 121306 141053 127823 98876 73216 58753 52463 48448 42797 32393 13341 -16969
33303a6969l9218l9218k5628J439L5729O6547Q3686Q2673O6875M5098K5860J2103
$$ -16969 -56187 -95405 -121033 -119594 -83865 -17318 66368 149041 215916 261014 286874 298977
33291B98977J299q483j3881j0209M20Q718P295k898j6498k9982m1057m5979m3143
$$ 298977 300276 291793 277912 267703 268123 276841 284136 281238 264740 234758 193701 147722 104579
33278A04579l7862l7952m4452n1636n6498o2062o8734o8345n2629k4950K579K3177
$$ 104579 66717 28765 -15687 -67323 -123821 -185883 -254617 -322962 -375591 -400541 -397962 -374785
33266c74785M0492N7341O4966N0199J3719k3891l8068k1383J2773M5248O5892
$$ -374785 -334293 -276952 -211986 -161787 -148068 -171959 -210027 -231410 -218637 -173389 -107497
33255a07497P4335P3192O5547N6279M9984M6382M0533K7648N721k4601n7759q1347
$$ -107497 -33162 40030 105577 161856 211840 258222 298755 326403 332124 307523 249764 168417
33243A68417q3628o6699m7238l8648l5225k0059J2303M7690O8685P3662P4847
$$ 168417 84789 18090 -29148 -67796 -103021 -123080 -110777 -63087 5598 79260 154107
33232A54107Q0016Q1693O6017K9241j6926n5335p6502q1982p7794o7604n3063
$$ 154107 234123 315816 381833 411074 394148 338813 262311 180329 102535 34931 -18132
33221a8132l8270l0326l3791m5960n9719p0573p8182q0822p2904n1971k5777o602
$$ -18132 -56402 -86728 -120519 -166479 -226198 -296771 -374953 -455775 -528679 -580650 -606427 -613029
33209f13029K037Q139J9023L1153L5275K7712J2808k310j0572n610J3744L9516
$$ -613029 -610992 -602853 -583830 -552677 -517402 -489690 -476882 -479192 -489764 -495374 -481630 -442114
33197d42114O0066O9914P1093O6973O0550N7060N9608O0587M5870J2123k6371
$$ -442114 -382048 -312134 -241041 -174068 -113518 -56458 3150 63737 109607 121730 95359
33186I5359n2820o3664o3692n2575k6745P548L3731M0549L2058K0209J3446J4997
$$ 95359 42539 -21125 -84817 -137392 -164137 -156589 -122858 -82309 -50251 -30042 -16596 -1599
33174a599K5439M0555M9546M1968J7509j4161m3164o5642q0144q2893p1403n1370
$$ -1599 23840 64395 113941 155909 173418 159257 116093 50451 -29693 -112586 -183989 -235359
33162b35359l4575k7604k5634j9694o752J1617L7506P5109J18181J45800J37368
$$ -235359 -269934 -297538 -323172 -342866 -349618 -338001 -300495 -225386 -107205 38595 175963
33151A75963R1045K4231m1814r3583j24278j29382j08150o7651k1552J7655M6442
$$ 175963 267008 291239 249425 155842 31564 -97818 -205968 -273619 -295171 -277516 -231074
33140b31074P0041R2725J08298J03381P1879K3457k3957n6563o7968n7624l4123
$$ -231074 -161033 -68308 39990 143371 215250 238707 214750 158187 90219 32595 -1528
33129a528j5822j6580k9057l1748j6753j978r227l6790o2275o8615n7744l9683
$$ -1528 -17350 -33930 -62987 -94735 -111488 -113466 -122693 -159483 -221758 -290373 -348117 -387800
33117c87800j8851M805K8792M9111O5417P9317Q8481Q7578P5803N9216M3694K9637
$$ -387800 -406651 -401846 -373054 -323943 -258526 -179209 -90728 -3150 72653 131869 175563 205200
33105B05200J7086J2183K1186L7797M4989L4953K0889K0259K9444K6785K787k4190
$$ 205200 222286 234469 255655 293452 338441 373394 394283 414542 443986 470771 473558 449368
33093D49368k9831j3370M441P964P5r786j9122l0060m1981n2029n8625o0925n8880
$$ 449368 419537 406167 410608 418572 418647 408861 389739 359679 317698 265669 207044 146119 87239
33080H7239n6161n7403n9224n0181k5239N215K7188L8544M4074M0097J7322j9910
$$ 87239 31078 -26325 -85549 -135730 -160969 -155754 -128566 -90022 -45948 -5851 11471 -8439
33068h439n0347n8601n2559n0280n5970n8447m9637l3541j5824N659L4407O4535
$$ -8439 -58786 -117387 -169946 -220226 -276196 -334643 -384280 -417821 -433645 -427986 -393579 -329044
33056c29044Q2704Q0143N9714L1740N284j6880l6733n5042o6946o5311n0100l2243
$$ -329044 -246340 -166197 -106483 -74743 -69459 -86339 -123072 -178114 -245060 -310371 -360471 -392714
33044c92714k3993k5069k2227m565K3926M9968O5914P4072P7817P5618O6398N5164
$$ -392714 -416707 -441776 -464003 -468568 -444642 -394674 -328760 -254688 -176871 -101253 -34855 20309
33032B0309M8415M6499M4841M1286L8950M2954N6654P8335R8042J01094Q0590
$$ 20309 68724 115223 160064 201350 240300 283254 339908 418243 516285 617379 697969
33021F97969M4918P564k8279o7756j08564j36768j41174j24394r6786o6711m0292
$$ 697969 742887 750451 722172 654416 545852 409084 267910 143516 46730 -19981 -60273
33010f0273k2382j1116K630K3239M1861M6458L6888K3813J5723J3163J2894J1087
$$ -60273 -82655 -93771 -91141 -67902 -26041 20417 57305 81118 96841 110004 122898 133985
32998A33985M269o547j3725r828N131K6788N1571P2464P5878N3937J8246q982
$$ 133985 138254 131707 117982 108154 113285 140073 191644 264108 339986 393923 412169 403187
32986D03187j7513j4106o703M184J6941K4329K3019J8304J3979N934q918k5876
$$ 403187 385674 371568 364865 369049 385990 410319 433338 451642 465621 471555 462637 436761
32974D36761m1020n8474q0571r7033r3813p0418m0857j8778p442j913N510K0885
$$ 436761 395741 337267 256696 159663 65850 -4568 -45425 -64203 -71645 -73558 -68048 -47163
32962d7163M3072O1641O4420M8058J9847q656k7393l0882k1410q948l670o957
$$ -47163 -4091 57550 121970 170028 189875 181219 153826 122944 101534 92586 88916 81959
32950H1959j0151j420K5094O2281R0627R1541O4968L1045J0577O524P086K033
$$ 81959 71808 70388 95482 157763 248390 339931 404899 435944 446521 453045 460131 462164
32938D62164r099k0563k4988j6182N515K9306L9643K8039n95l1668n0671n3254
$$ 462164 453065 432502 407514 391332 396847 426153 465796 493835 493240 461572 410901 357647
32926C57647m7615m3669l9790k6994p319L245k647q685N498L6149O0402O5364
$$ 357647 310032 266363 226573 199579 192260 195505 192858 184173 189671 225820 286222 351586
32914C51586N7157M2009J5807k1521n5275o9929o6708n9362n7639o0910o2658
$$ 351586 408743 450752 466559 445038 389763 319834 253126 193764 136125 75215 12557
32903A2557n4556l0458O237M1082N9972O1054N2748M3852L9737M3234N1543N4455
$$ 12557 -41999 -72457 -66220 -25138 34834 95888 148636 192488 232225 275459 327002 381457
32891C81457M3867K5500J3891J3991J4775M771j2728k6549l5374m9062p1427r0374
$$ 381457 425324 450824 464715 478706 493481 498252 485524 458975 423601 374539 303112 212738
32879B12738r0630p1182m3751j7194Q372L2034M5288L9540J6535j1880l1279l0567
$$ 212738 122108 50926 7175 -10019 -1647 30387 75675 115215 131750 119870 88591 58024
32867E8024o356L3133P1121R3677R6917Q1687M6793o690o7543j17428j42264j38671
$$ 58024 51668 84801 155922 249599 346516 428203 474996 468306 400763 283335 141071 2400
32855B400j13085p9053n1324l5537k4738j0744M337J4319K2598L9363O4849Q4712
$$ 2400 -110685 -189738 -241062 -276599 -301337 -312081 -307744 -293425 -270827 -231464 -166615 -81903
32843h1903Q5181O6533L9617J5459N46m095l436m619r975j5994j9076j8099j1719
$$ -81903 3278 69811 109428 124887 125433 121338 117902 113283 103308 87314 68238 50139 38420
32830C8420J418J9014L6430N1270O0956N7047L1487q920m2668n3176m2931k5349
$$ 38420 39838 58852 95282 146552 207508 264555 296042 287122 244454 191278 148347 122998
32818A22998r576J862O871K624j1047l0535m8576n4474l9684o933K9859N6919
$$ 122998 113422 115284 122155 124779 113732 83197 34621 -19853 -59537 -66470 -36611 20308
32806B0308O8134O1508L7352M895j7530j7703j988J3076J8040J3689J520j9373
$$ 20308 88442 149950 187302 192197 174667 156964 154976 168052 186092 199781 201301 181928
32794A81928m4835o1707n5941k5098J7475N2229O9500P5431P9691Q1379P4333
$$ 181928 137093 75386 19445 -5653 11822 64051 133551 208982 288673 370052 444385
32783D44385O3469O3283P7012Q8652Q2150O0200L8266K8578L5233N3601O5316
$$ 444385 507854 571137 648149 736801 818951 879151 917417 945995 981228 1034829 1100145
32772A100145M5768p721n9554o1656L573J11835K22534L07882L65444M15960M85681
$$ 1100145 1145913 1138192 1078638 1016982 1020555 1132390 1354924 1662806 2028250 2444210 2929891
32761B929891N80285O79241P59313Q04258P73699N89689K06208k98026p38174
$$ 2929891 3510176 4189417 4948730 5752988 6526687 7116376 7322584 7024558 6286384
32752F286384r65143r75687q71809p42418o13855m89256l82246l00568k31246
$$ 6286384 5321241 4345554 3473745 2731327 2117472 1628216 1245970 945402 714156
32743G14156j62825j05816p5853o8940o8103o6048o6007o3990m5650m690M4850
$$ 714156 551331 445515 369662 300722 232619 166571 100564 36574 -9076 -13766 31084
$$ [...]
##END NTUPLES=NMR SPECTRUM
##END=
