##TITLE=31Pdec_DE-21_oil_d6_TFA
 DMSO-d6
 64 sc
 6.6.2024
##JCAMPDX= 6.0         $$ Bruker NMR JCAMP-DX V2.0
##DATA TYPE= NMR SPECTRUM
##DATA CLASS= NTUPLES
##ORIGIN= UXNMR, Bruker Analytische Messtechnik GmbH
##OWNER= root
$$ XWIN-NMR		Version 3.5
$$ Thu Jun  6 16:21:17 2024 Russian Standard Time (UT+4h)  she@DPX200
##.OBSERVE FREQUENCY= 81.013821
##.OBSERVE NUCLEUS= ^31P
##.ACQUISITION MODE= SIMULTANEOUS
##.ACQUISITION SCHEME= undefined
##.AVERAGES= 40
##.DIGITISER RES= 16
##SPECTROMETER/DATA SYSTEM= spect
##.PULSE SEQUENCE= zgpg30
##.SOLVENT NAME= CDCl3
##.SHIFT REFERENCE= (INTERNAL, CDCl3, 0, 248.564)
##AUDIT TRAIL= $$ (NUMBER, WHEN, WHO, WHERE, WHAT)
$$ ##TITLE= Audit trail, XWIN-NMR		Version 3.5
$$ ##JCAMPDX= 5.01
$$ ##ORIGIN= Bruker BioSpin GmbH
$$ ##OWNER= she
$$ F:/spectra/data/she/nmr/P31/1/pdata/1/auditp.txt
$$ ##AUDIT TRAIL=  $$ (NUMBER, WHEN, WHO, WHERE, WHAT)
(   1,<2024-06-06 16:20:21.78 +0400>,<she>,<DPX200>,
      <created by zg, POWCHK disabled, PULCHK disabled
       configuration hash MD5:
       00 E9 B6 7A A2 85 ED C7 34 08 36 98 17 FE 4E 26
       data hash MD5: 32K
       31 33 06 25 6F 49 C0 7E 97 A1 68 F2 92 BB 9F 07>)
(   2,<2024-06-06 16:20:24.09 +0400>,<she>,<DPX200>,
      <Start of raw data processing
       efp BC_mod = 2 LB = 10 FT_mod = 6 PKNL = 1 PHC0 = -256.1141 PHC1 = 124.8 SI = 64K 
       data hash MD5: 64K
       CE 84 AC 98 52 34 76 26 15 F9 ED 1B AD 91 91 15>)
(   3,<2024-06-06 16:20:43.40 +0400>,<she>,<DPX200>,
      <pk PHC0 = 8.953549 PHC1 = 0 
       data hash MD5: 64K
       05 50 93 68 92 AF 12 7C 1E E9 F1 8A A7 F6 92 B1>)
$$ ##END=
$$ 
$$ hash MD5
$$ 47 16 B7 D3 6C 6E 12 EE A9 8D B8 CD AA 1F 6E 71
##$RELAX= 
##$RELAX= 
##$RELAX= 
##$RELAX= 
##$RELAX= 
##$RELAX= 
##$RELAX= 
##$RELAX= 
##$RELAX= 
$$ Bruker specific parameters
$$ --------------------------
##$DU= <F:/spectra>
##$EXPNO= 1
##$NAME= <P31>
##$PROCNO= 1
##$TYPE= <nmr>
##$USER= <she>
##$AMP= (0..31)
100 100 100 100 100 100 100 100 100 100 100 100 100 100 100 100 100 100 
100 100 100 100 100 100 100 100 100 100 100 100 100 100 
##$AQSEQ= 0
##$AQ_mod= 1
##$AUNM= <au_zg>
##$AUTOPOS= <>
##$BF1= 81.014009
##$BF2= 200.13
##$BF3= 200.13
##$BF4= 200.13
##$BF5= 200.13
##$BF6= 200.13
##$BF7= 200.13
##$BF8= 200.13
##$BYTORDA= 1
##$CFDGTYP= 0
##$CFRGTYP= 5
##$CHEMSTR= <none>
##$CNST= (0..31)
1 1 145 1 1 1 1 1 1 1 1 1 1 1 1 1 1 1 1 1 1 1 1 1 1 1 1 1 1 1 1 1 
##$CPDPRG= <waltz16>
##$CPDPRG1= <>
##$CPDPRG2= <waltz16>
##$CPDPRG3= <>
##$CPDPRG4= <mlev>
##$CPDPRG5= <mlev>
##$CPDPRG6= <mlev>
##$CPDPRG7= <mlev>
##$CPDPRG8= <mlev>
##$CPDPRGB= <>
##$CPDPRGT= <>
##$D= (0..31)
0 1 0 0 0 0 0 0 0 0 0 0.03 2e-05 3e-06 0 0 0 0 0 0 0 0 0 0 0 0 0 0 0 0 
0 0 
##$DATE= 1717676421
##$DBL= (0..7)
120 120 120 11 120 120 24 19 
##$DBP= (0..7)
150 150 150 150 150 150 150 150 
##$DBP07= 0
##$DBPNAM0= <>
##$DBPNAM1= <>
##$DBPNAM2= <>
##$DBPNAM3= <>
##$DBPNAM4= <>
##$DBPNAM5= <>
##$DBPNAM6= <>
##$DBPNAM7= <>
##$DBPOAL= (0..7)
0.5 0.5 0.5 0.5 0.5 0.5 0.5 0.5 
##$DBPOFFS= (0..7)
$$ [...]
##$SUBNAM2= <"">
##$SUBNAM3= <"">
##$SUBNAM4= <"">
##$SUBNAM5= <"">
##$SUBNAM6= <"">
##$SUBNAM7= <"">
##$SUBNAM8= <"">
##$SUBNAM9= <"">
##$SW= 501.771253377433
##$SWIBOX= (0..15)
0 1 3 0 0 0 0 0 0 0 0 0 0 0 0 0 
##$SW_h= 40650.406504065
##$TD= 32768
##$TD0= 1
##$TE= 0
##$TE2= 300
##$TE3= 300
##$TEG= 300
##$TL= (0..7)
0 120 53 12 22 120 120 120 
##$TP= (0..7)
150 150 150 150 150 150 150 150 
##$TP07= 0
##$TPNAME0= <>
##$TPNAME1= <>
##$TPNAME2= <>
##$TPNAME3= <>
##$TPNAME4= <>
##$TPNAME5= <>
##$TPNAME6= <>
##$TPNAME7= <>
##$TPOAL= (0..7)
0.5 0.5 0.5 0.5 0.5 0.5 0.5 0.5 
##$TPOFFS= (0..7)
0 0 0 0 0 0 0 0 
##$TUNHIN= 0
##$TUNHOUT= 0
##$TUNXOUT= 0
##$USERA1= <user>
##$USERA2= <user>
##$USERA3= <user>
##$USERA4= <user>
##$USERA5= <user>
##$V9= 5
##$VALIST= <valist>
##$VCLIST= <CCCCCCCCCCCCCCC>
##$VD= 0
##$VDLIST= <DDDDDDDDDDDDDDD>
##$VPLIST= <PPPPPPPPPPPPPPP>
##$VTLIST= <TTTTTTTTTTTTTTT>
##$WBST= 1024
##$WBSW= 4
##$XGAIN= (0..3)
0 0 0 0 
##$XL= 0
##$YL= 0
##$YMAX_a= 3807
##$YMIN_a= -5823
##$ZGOPTNS= <>
##$ZL1= 120
##$ZL2= 120
##$ZL3= 120
##$ZL4= 120
##$ABSF1= 0
##$ABSF2= 0
##$ABSG= 0
##$ABSL= 0
##$ALPHA= 0
##$AQORDER= 0
##$ASSFAC= 0
##$ASSFACI= 0
##$ASSFACX= 0
##$ASSWID= 0
##$AUNMP= <proc_1d>
##$AZFE= 0.1
##$AZFW= 0.5
##$BCFW= 0
##$BC_mod= 2
##$BYTORDP= 0
##$COROFFS= 0
##$CY= -3
##$DATMOD= 1
##$DC= 0
##$DFILT= <>
##$DTYPP= 0
##$F1P= 0
##$F2P= 0
##$FCOR= 1
##$FTSIZE= 65536
##$FT_mod= 6
##$GAMMA= 0
##$GB= 0
##$INTBC= 1
##$INTSCL= 6.047779e-11
##$ISEN= 30
##$LB= 10
##$LEV0= 0
##$LPBIN= 0
##$MAXI= 10000
##$MC2= 0
##$MEAN= 0
##$ME_mod= 0
##$MI= 50
##$NCOEF= 0
##$NC_proc= -11
##$NLEV= 6
##$NOISF1= 182.463
##$NOISF2= 159.3651
##$NSP= 0
##$NTH_PI= 0
##$NZP= 0
##$OFFSET= 248.5645
##$PC= 4
##$PHC0= -247.1606
##$PHC1= 124.8
##$PH_mod= 1
##$PKNL= yes
##$PPARMOD= 0
##$PSCAL= 0
##$PSIGN= 0
##$REVERSE= no
##$SF= 81.0140089999694
##$SI= 65536
##$SIGF1= 159.3651
##$SIGF2= -187.1042
##$SINO= 113.3802
##$SIOLD= 16384
##$SREGLST= <1H.CDCl3>
##$SSB= 0
##$STSI= 65536
##$STSR= 0
##$SW_p= 40650.406504065
##$SYMM= 0
##$S_DEV= 0
##$TDeff= 32768
##$TDoff= 0
##$TI= <>
##$TILT= no
##$TM1= 0
##$TM2= 0
##$TOPLEV= 0
##$USERP1= <user>
##$USERP2= <user>
##$USERP3= <user>
##$USERP4= <user>
##$USERP5= <user>
##$WDW= 1
##$XDIM= 65536
##$YMAX_p= 325961180
##$YMIN_p= -150021840
$$ End of Bruker specific parameters
$$ ---------------------------------
##NTUPLES= NMR SPECTRUM
##VAR_NAME=  FREQUENCY,     SPECTRUM/REAL,   SPECTRUM/IMAG
##SYMBOL=    X,             R,               I
##VAR_TYPE=  INDEPENDENT,   DEPENDENT,       DEPENDENT
##VAR_FORM=  AFFN,          ASDF,            ASDF
##VAR_DIM=   65536,         65536,           65536
##UNITS=     HZ,            ARBITRARY UNITS, ARBITRARY UNITS
##FACTOR=    0.620285442955139, 1,           1
##FIRST=     20137.2065510682, 0,            0
##LAST=      -20513.1999529968, 0,           0
##MIN=       -20513.1999529968, -150021840,  0
##MAX=       20137.2065510682, 325961180,    0
$$ Real data points
##PAGE= N=1
##DATA TABLE= (X++(R..R)), XYDATA
$$ [...]
41479B2896152Q12113R7469n34176r83494j196416j178149r78800o64256k93483
41470A7976960Q8052M44885P48298R77062J120538J182281J182094J152080J124008
41461B5996258J113204J109846J084115J001180Q36276N83627K59438r8961m38679
41452C1446304p03777q52499q70615p72650n91075l62019j16029J24346L44106
41443B7646092N36701P06450Q68178J039447J227366J420351J593441J721955
41435C6759981J788027J773544J652204J397557J005101N06866l9383n79957j088378
41426D3175562j561529j993799k355589k598844k685533k611671k404951k102328
41418B4861318j733027j321934r03082n22376k21609j4675J25871K60318M52028
$$ y = [22896152, 23708265, 23805734, 23271558, 22288064, 21091648, 19913499, 18934699, 18270443, 17976960, 18065012, 18509897, 19258195, 20235257, 21355795, 22538076, 23720170, 24872250, 25996258, 27109462, 28219308, 29303423, 30304603, 31140879, 31724506, 31983944, 31884983, 31446304, 30742527, 29890028, 29019413, 28246763, 27655688, 27293669, 27177640, 27301986, 27646092, 28182793, 28889243, 29757421, 30796868, 32024234, 33444585, 35038026, 36759981, 38548008, 40321552, 41973756, 43371313, 44376414, 44883280, 44843897, 44263940, 43175562, 41614033, 39620234, 37264645, 34665801, 31980268, 29368597, 26963646, 24861318, 23128291, 21806357, 20903275, 20380899, 20159290, 20144615, 20270486, 20530804, 20982832]
41409B0982832P29327J059784J354214J501422J415364J070268N10677j61472
41401B8462416q15082j327472j621820j688073j575460j363420j131557r42938
41393A7996594q39252q41171r51526j159361j440022j752023k040415k251196
41385F721628k344976k296778k088478j712594j189227n75257N0685O17358J080823
41376a736816J425079J652136J773906J809921J787036J734617J672102J594509
41368A1712490J467775J240591Q66679L25606l64623j144530j921308k588697
41360I593983l052305l249727l160015k804644k242392j556365q32085j32975
41352g436525N14106J112530J669883K168540K555112K758835K726620K451094
$$ y = [20982832, 21712159, 22771943, 24126157, 25627579, 27042943, 28113211, 28623888, 28462416, 27647334, 26319862, 24698042, 23009969, 21434509, 20071089, 18939532, 17996594, 17157342, 16316171, 15364645, 14205284, 12765262, 11013239, 8972824, 6721628, 4376652, 2079874, -8604, -1721198, -2910425, -3485682, -3434997, -2817639, -1736816, -311737, 1340399, 3114305, 4924226, 6711262, 8445879, 10117981, 11712490, 13180265, 14420856, 15287535, 15613141, 15248518, 14103988, 12182680, 9593983, 6541678, 3291951, 131936, -2672708, -4915100, -6471465, -7303550, -7436525, -6922419, -5809889, -4140006, -1971466, 583646, 3342481, 6069101, 8520195]
41344H520195J977304J390812P96911K96937l5502j72804j39037J02J59537K61379
41334A3055834K57206J39662n8913k79055m54078n32139m94025l59514j78426
41325A1096552r478J02357J36704R0674l8537k64853o07975j076368j651598k281812
41315E495666k884960l361892l619776l599017l290046k731422j993911j161393
41307a7146751l15703M71673J139611J632753J903198J925228J712991J321518
41299g355482Q25090K90356k32852o98684j048271j210336j125823p82417k34442
41290a1572861M08667J020662J499561J787671J866191J740300J433191R92209
41282h24409M93473K8835l26510n46720o61341p23825p62991p56624o51244m13078
$$ y = [8520195, 10497499, 11888311, 12685222, 12982159, 12946657, 12773853, 12634816, 12634918, 12794455, 13055834, 13313040, 13452702, 13393789, 13114734, 12660656, 12128517, 11634492, 11274978, 11096552, 11087074, 11189431, 11326135, 11416809, 11378272, 11113419, 10505444, 9429076, 7777478, 5495666, 2610706, -751186, -4370962, -7969979, -11260025, -13991447, -15985358, -17146751, -17462454, -16990781, -15851170, -14218417, -12315219, -10389991, -8677000, -7355482, -6530392, -6240036, -6472888, -7171572, -8219843, -9430179, -10556002, -11338419, -11572861, -11164194, -10143532, -8643971, -6856300, -4990109, -3249809, -1816618, -824409, -330936, -302101, -628611, -1175331, -1836672, -2560497, -3323488, -4080112, -4731356, -5144434]
41272e144434o7529L06084O19783Q24993R26509R56038R32577Q44487O64934L81957
41262A245399J6281l82550p51792j031707j180965j190058j083847r06446o97951
41253e963636m81723k68236o3157J32178L23530N18975P18151R09169J080148
41244c094601J235036J397064J594347J838199K110789K370750K571735K681043
41236A2704362K689451K612194K484167K349296K244789K187771K173214K181448
41228C1626692K184555K147133K029802J802181J456894J010460M91509o8284
41220D2680942o31300j148778j568503j855501k009297k062507k060946k038815
41212B9305295k003190j934011j797321j565815j239440q56719m87162k03429
$$ y = [-5144434, -5211963, -4905879, -4286096, -3461103, -2534594, -1578556, -645979, 198508, 863442, 1245399, 1261680, 879130, 127338, -904369, -2085334, -3275392, -4359239, -5265685, -5963636, -6445359, -6713595, -6776752, -6644574, -6321044, -5802069, -5083918, -4174749, -3094601, -1859565, -462501, 1131846, 2970045, 5080834, 7451584, 10023319, 12704362, 15393813, 18006007, 20490174, 22839470, 25084259, 27272030, 29445244, 31626692, 33811247, 35958380, 37988182, 39790363, 41247257, 42257717, 42749226, 42680942, 42049642, 40900864, 39332361, 37476860, 35467563, 33405056, 31344110, 29305295, 27302105, 25368094, 23570773, 22004958, 20765518, 19908799, 19421637, 19218208]
41204A9218208m7737j5219o5481j50074k32723k91413l11404k83637k11156j14547
41194A7494817k9004N282m6679k06760m77605q39686j255454j681929k085890
41185A0877092k452217k780090l070495l313625l484011l546404l470521l247949
41177a4488220k901986k483571k054783j669898j365522j163499j079627j126804
41169b8333910j306847j596087j936680k243030k423354k407310k167469j725914
41161d4140601j144654n05610J11006O42867J053324J331150J484429J532215
41153c9635874J498190J408391J291166J175206J083660J026843R98996R83111
41145c0170311R61931R27115Q79008Q18535P41718O44849N35207M33656L63002
$$ y = [19218208, 19170471, 19155252, 19089771, 18939697, 18706974, 18415561, 18104157, 17820520, 17609364, 17494817, 17465813, 17471095, 17424416, 17217656, 16740051, 15900365, 14644911, 12962982, 10877092, 8424875, 5644785, 2574290, -739335, -4223346, -7769750, -11240271, -14488220, -17390206, -19873777, -21928560, -23598458, -24963980, -26127479, -27207106, -28333910, -29640757, -31236844, -33173524, -35416554, -37839908, -40247218, -42414687, -44140601, -45285255, -45790865, -45679859, -45036992, -43983668, -42652518, -41168089, -39635874, -38137684, -36729293, -35438127, -34262921, -33179261, -32152418, -31153422, -30170311, -29208380, -28281265, -27402257, -26583722, -25842004, -25197155, -24661948, -24228292, -23865290]
41136b3865290L31091L23468L11328K68416J86445Q2278n329k8571N1253K47996
41126b2096915N44988R01564J266534J589818J827700J945062J920604J754597
41118a0346048J470811J106843O99733K80733j16910m50259o74387p63302p24322
41109i517108n90247l95510j57504J23150M48739Q11506J189017J545356J835039
41100d707562K011585K042442J924573J690298J397560J108693Q67728O84879
41092G020196N33359L61091J16545k20521o20878j014133j319395j477107j463585
41083A915572j288956r90820o27905k66721L9777K67436M16604M94270N01717
41074D60974M37157L05974J28178n9812k09241k70963k12697l0750K51273N90846
$$ y = [-23865290, -23534199, -23210731, -22899403, -22630987, -22444542, -22362264, -22367593, -22396164, -22344911, -22096915, -21551927, -20650363, -19383829, -17794011, -15966311, -14021249, -12100645, -10346048, -8875237, -7768394, -7068661, -6787928, -6904838, -7355097, -8029484, -8792786, -9517108, -10107355, -10502865, -10660369, -10537219, -10088480, -9276974, -8087957, -6542601, -4707562, -2695977, -653535, 1271038, 2961336, 4358896, 5467589, 6335317, 7020196, 7553555, 7914646, 8031191, 7810670, 7189792, 6175659, 4856264, 3379157, 1915572, 626616, -364204, -992109, -1258830, -1219053, -951617, -535013, -40743, 460974, 898131, 1204105, 1332283, 1272471, 1063230, 792267, 579570, 548820, 800093, 1390939]
41064A390939R31949J208952J358794J341673J155690Q32777M19492m2498n25260
41055H072508j011495j484870j921679k290719k561740k715210k745481k656016
41047i314702k450390k123980j663070j058854l33689M41137J159669J725455
41039a3618424K092123K267298K281663K156578J898786J519820J055871N69879
41031B23594J36794j75637l21215k83063p6940K49585O24780R69409J219890J349534
41021C916731J377204J357058J352246J405430J522686J680111J846260K000828
41013A6458554K133664K227249K242573K126210J836979J373323P82408J46188
41005B9327148m46862r31286j284235j526595j702855j848534j965400k023189
$$ y = [1390939, 2322888, 3531840, 4890634, 6232307, 7387997, 8220774, 8640266, 8597768, 8072508, 7061013, 5576143, 3654464, 1363745, -1197995, -3913205, -6658686, -9314702, -11765092, -13889072, -15552142, -16610996, -16944685, -16503548, -15343879, -13618424, -11526301, -9259003, -6977340, -4820762, -2921976, -1402156, -346285, 223594, 360388, 184751, -136464, -419527, -496467, -246882, 377898, 1347307, 2567197, 3916731, 5293935, 6650993, 8003239, 9408669, 10931355, 12611466, 14457726, 16458554, 18592218, 20819467, 23062040, 25188250, 27025229, 28398552, 29180960, 29327148, 28880286, 27949000, 26664765, 25138170, 23435315, 21586781, 19621381, 17598192]
40997A7598192j988204j857873j674969j511053j432021j469856j616538j837446
40989D210232k088565k324267k495739k550705k442505k145288j664988j039965
40981a2541790l33946L72528R89645J427085J608018J490033J088471M89370j62669
40972e573255p04343j004658j002240p14930k25106L48124Q81365J277148J483801
40963e234094J499694J364758J145887R18332P42338O40779N91678N44953M55955
40954B670280L14844J53693K9848j00J01087L45084P16658J169778J625317J981130
40944I107619K137458K027916J642756J036765L19306l72844r12181j211712j239190
40935A2535893j016232o11189j27053L22340O46730Q07641Q21415P36201O02240
$$ y = [17598192, 15609988, 13752115, 12077146, 10566093, 9134072, 7664216, 6047678, 4210232, 2121667, -202600, -2698339, -5249044, -7691549, -9836837, -11501825, -12541790, -12875736, -12503208, -11513563, -10086478, -8478460, -6988427, -5899956, -5410586, -5573255, -6277598, -7282256, -8284496, -8999426, -9224532, -8876408, -7995043, -6717895, -5234094, -3734400, -2369642, -1223755, -305423, 436915, 1077694, 1669372, 2214325, 2670280, 2985124, 3138817, 3168665, 3168565, 3269652, 3614736, 4331394, 5501172, 7126489, 9107619, 11245077, 13272993, 14915749, 15952514, 16271820, 15898976, 14986795, 13775083, 12535893, 11519661, 10908472, 10781419, 11103759, 11750489, 12558130, 13379545, 14115746, 14717986]
40926A4717986M57111L31174K59386K81527M26512O94394J053618J456283J857212
40917B1535203K221434K518989K718237K787522K705331K471720K113098J676398
40909D0747932J215045P74465L85030O4312j76306l27835l86468l60437k73310
40900D1662428j58201m7066L3576N7056o378j75867m37140p36930j008603j209819
40890C7973056j339485j424492j496580j580571j692135j831196j970331k053811
40882B4584455k017910j822900j475816j030708n68202j65440J30207L11616M00600
40873A8345902M21610L78922K53664K0741l29482p79092j282447j773236k177668
40864A3078914k434250k512942k420243k186334j847415j438692r97595n63219
$$ y = [14717986, 15175097, 15506271, 15765657, 16047184, 16473696, 17168090, 18221708, 19677991, 21535203, 23756637, 26275626, 28993863, 31781385, 34486716, 36958436, 39071534, 40747932, 41962977, 42737442, 43122472, 43186784, 43010478, 42682643, 42296175, 41935738, 41662428, 41504227, 41457161, 41490737, 41547793, 41541415, 41365548, 40928408, 40191478, 39182875, 37973056, 36633571, 35209079, 33712499, 32131928, 30439793, 28608597, 26638266, 24584455, 22566545, 20743645, 19267829, 18237121, 17668919, 17503479, 17633686, 17945302, 18345902, 18767512, 19146434, 19400098, 19420839, 19091357, 18312265, 17029818, 15256582, 13078914, 10644664, 8131722, 5711479, 3525145, 1677730, 239038, -758557, -1321776]
40856a321776j65017J88760N06963P92892J018101J115036J001918O31730L6023
40847C804630o68753j321503j780047j970832j901645j639320j270959q69751
40839g618180m79814j21870J91733M47601O32298P36216P52646O74714M98385
40830d286271K32700r1743m25678p15415r18977j015092j004466r09251p73241
40821i907434o56798o18925o89180q44548j007836j072514r43622n75559J0482
40812a6305934P35557J490752K169216K691208L017995L153079L131080L000679
40804C083632K813756K625892K497527K480211K588954K782419K972113L059050
40796B4903554K974861K703376K274787J741447J152641N43264n9091o17895j079383
$$ y = [-1321776, -1486793, -1298033, -791070, 1822, 1019923, 2134959, 3136877, 3768607, 3804630, 3135877, 1814374, 34327, -1936505, -3838150, -5477470, -6748429, -7618180, -8097994, -8219864, -8028131, -7580530, -6948232, -6212016, -5459370, -4784656, -4286271, -4053571, -4145314, -4570992, -5286407, -6205384, -7220476, -8224942, -9134193, -9907434, -10564232, -11183157, -11872337, -12716885, -13724721, -14797235, -15740857, -16316416, -16305934, -15570377, -14079625, -11910409, -9219201, -6201206, -3048127, 82953, 3083632, 5897388, 8523280, 11020807, 13501018, 16089972, 18872391, 21844504, 24903554, 27878415, 30581791, 32856578, 34598025, 35750666, 36293930, 36234839, 35616944, 34537561]
40787C4537561j383650j490825j404522j175198q80533n96877l80082k61908k52067
40778B6711899l34603m62687n67717n88410n01978l31829j26239P1927K41410
40769B4111773L79897M92461N79065O23299N87460M23053R6917l82970r61735
40760B5949220j556724k087387k496923k756219k854381k787958k559085k183112
40752F667431j696404j155207o26843j82087J08424J82320N485m04900r74777
40743A923442j595216k159432k591110k850865k925864k815757k524195k058266
40735a7597263j433865o82607J44450R78925J743390K365107K792849L010009
40727h679005L035886K913662K693032K416562K112807J794985J465223J123202
$$ y = [34537561, 33153911, 31663086, 30258564, 29083366, 28202833, 27605956, 27225874, 26963966, 26711899, 26377296, 25914609, 25346892, 24758482, 24256504, 23924675, 23798436, 23870363, 24111773, 24491670, 24984131, 25563196, 26186495, 26773955, 27197008, 27293925, 26910955, 25949220, 24392496, 22305109, 19808186, 17051967, 14197586, 11409628, 8850543, 6667431, 4971027, 3815820, 3188977, 3006890, 3115314, 3297634, 3303119, 2898219, 1923442, 328226, -1831206, -4422316, -7273181, -10199045, -13014802, -15538997, -17597263, -19031128, -19713735, -19569285, -18590360, -16846970, -14481863, -11689014, -8679005, -5643119, -2729457, -36425, 2380137, 4492944, 6287929, 7753152, 8876354]
40719H876354P72969M22716Q1438k39312n20131p36394q73528r43065r83833j046408
40709D810806j171598j372464j623332j859623j994164j947893j680587j204904
40701h043759n78529J17401Q01621J409740J902075K262734K493661K609337K634851
40692E609132K603492K547650K484466K407946K298073K142614J954356J770474
40684B3818203J636061J583244J614492J694252J754442J718483J537472J217881
40676C6574530Q20534M29651J12675j03367k29236k95654l38449l93849m96353
40667C6080482o69859r13802j197011j469810j691029j852418j980870k113551
40659B4192132k263044k399946k466850k411996k216832j900696j504896j070279
$$ y = [8876354, 9649323, 10072039, 10153477, 9914165, 9394034, 8657640, 7784112, 6841047, 5857214, 4810806, 3639208, 2266744, 643412, -1216211, -3210375, -5158268, -6838855, -8043759, -8622288, -8504887, -7703266, -6293526, -4391451, -2128717, 364944, 2974281, 5609132, 8212624, 10760274, 13244740, 15652686, 17950759, 20093373, 22047729, 23818203, 25454264, 27037508, 28652000, 30346252, 32100694, 33819177, 35356649, 36574530, 37395064, 37824715, 37937390, 37834023, 37604787, 37309133, 36970684, 36576835, 36080482, 35410623, 34496821, 33299810, 31830000, 30138971, 28286553, 26305683, 24192132, 21929088, 19529142, 17062292, 14650296, 12433464, 10532768, 9027872, 7957593]
40651G957593o22312j70790K78512P11558J104751J435994J698147J903885K078962
40642A6376300K247991K419131K574774K675241K677411K559853K339447K069161
40634C5939309J819829J658822J636233J777415K073361K468332K859378L123119
40626E3355798L163960K955256K546923K038216J535782J118521Q19779O29031
40618F8163266N09184M18971L28267K23106J07084K632n4487l2593P6476K52648
40608F9994554M60214O62361Q24550R11706Q92043P48186M83349J15118l36095
40599G4755986q52256j413873j993238k551294l040343l412295l630463l681681
40591E4180543l584923l392282l176990l006194k907932k853687k773650k599507
$$ y = [7957593, 7335281, 7164491, 7443003, 8154561, 9259312, 10695306, 12393453, 14297338, 16376300, 18624291, 21043422, 23618196, 26293437, 28970848, 31530701, 33870148, 35939309, 37759138, 39417960, 41054193, 42831608, 44904969, 47373301, 50232679, 53355798, 56519758, 59475014, 62021937, 64060153, 65595935, 66714456, 67534235, 68163266, 68672450, 69091421, 69419688, 69642794, 69749878, 69752510, 69698023, 69665430, 69741906, 69994554, 70454768, 71117129, 71941679, 72853385, 73745428, 74493614, 74976963, 75092081, 74755986, 73903730, 72489857, 70496619, 67945325, 64904982, 61492687, 57862224, 54180543, 50595620, 47203338, 44026348, 41020154, 38112222, 35258535, 32484885, 29885378]
40583B9885378k308468j941584j586250j333012j230087j261919j365253j470544
40575A7388261j537715j562596j557505j528077j463981j345419j158035r07119
40567F327814o21687l42534j00334R8527K65826M12093N33870O19054O62354O75216
40557H530199O83196P15321P92343R17684J073893J227615J341649J386284J342142
40548A8010326J195144R32627N49799O6818m55128r16616j211502j275131j119262
40539A5777075q29128n25829l20610k85650m46227p85607j254771j784661k299117
40530G245475k725752l004320l094752k985216k695909k273106j772856j241893
40522a2548329p07385j81577L24853P93488J199625J519622J736006J838969J828464
$$ y = [29885378, 27576910, 25635326, 24049076, 22716064, 21485977, 20224058, 18858805, 17388261, 15850546, 14287950, 12730445, 11202368, 9738387, 8392968, 7234933, 6327814, 5706127, 5363593, 5263259, 5361786, 5627612, 6039705, 6573575, 7192629, 7854983, 8530199, 9213395, 9928716, 10721059, 11638743, 12712636, 13940251, 15281900, 16668184, 18010326, 19205470, 20138097, 20687896, 20754714, 20299586, 19382970, 18171468, 16896337, 15777075, 14947947, 14422118, 14101508, 13815858, 13369631, 12584024, 11329253, 9544592, 7245475, 4519723, 1515403, -1579349, -4564565, -7260474, -9533580, -11306436, -12548329, -13255714, -13437291, -13112438, -12318950, -11119325, -9599703, -7863697, -6024728, -4196264]
40513d196264J718291J538552J332598J147967J023157R74297R88377J029031
40505E556006J053017J027093R35961P81190N77293L47714J17985r4172k84453
40496A0017634m55526o02203p02460p24668o46282m69496k23813M4343K89231
40487F526760M83383O26387P38727Q44923R59320J082849J205802J308650J363796
40478A5140597J346643J252817J105658R44527Q03769O99495O29409N77911N19825
40469B3020651M24866K67350M0696k29328m81689o35969o25909m32550r1917L29634
40459B1585835P70359J188846J554330J831114J975905J947974J722292J300947
40451C3877602P21740N8034n95417j144298j511388j645278j530155j200017p45125
$$ y = [-4196264, -2477973, -939421, 393177, 1541144, 2564301, 3538598, 4526975, 5556006, 6609023, 7636116, 8572077, 9353267, 9930560, 10278274, 10396259, 10302087, 10017634, 9562108, 8959905, 8257445, 7532777, 6886495, 6416999, 6193186, 6237529, 6526760, 7010143, 7636530, 8375257, 9220180, 10179500, 11262349, 12468151, 13776801, 15140597, 16487240, 17740057, 18845715, 19790242, 20594011, 21293506, 21922915, 22500826, 23020651, 23445517, 23712867, 23753563, 23524235, 23042546, 22406577, 21780668, 21348118, 21256201, 21585835, 22356194, 23545040, 25099370, 26930484, 28906389, 30854363, 32576655, 33877602, 34599342, 34657376, 34061959, 32917661, 31406273, 29760995, 28230840, 27030823, 26285698]
40442B6285698k96239J1897Q0676j26721n82033j207862j902089k559026l082626
40433A6621675l396447l455715l257978k843304k280675j647380j011483m22333
40425a693640R1733N21230Q70557J150368J368352J522167J599349J585048J472669
40416H487833J271378J007708P21347M55763K46718J14882O6956J01818K13585
40407A2687988L87865N95976P95207R39305R95845R60120Q54510P11686N54012
40398A9482514L85129J97747j3079k43417m82431p17035r35183j128100j291676
40389A5254469j425648j531291j611030j670421j716570j747430j737397j634555
40381B180127j379516r38083l28604L69970J031392J513218J699296J539886J069994
$$ y = [26285698, 25989459, 26001356, 26082032, 25955311, 25373278, 24165416, 22263327, 19704301, 16621675, 13225228, 9769513, 6511535, 3668231, 1387556, -259824, -1271307, -1693640, -1601907, -1080677, -210120, 940248, 2308600, 3830767, 5430116, 7015164, 8487833, 9759211, 10766919, 11488266, 11944029, 12190747, 12305629, 12372585, 12474403, 12687988, 13075853, 13671829, 14467036, 15406341, 16402186, 17362306, 18216816, 18928502, 19482514, 19867643, 20065390, 20052311, 19808894, 19326463, 18609428, 17674245, 16546145, 15254469, 13828821, 12297530, 10686500, 9016079, 7299509, 5552079, 3814682, 2180127, 800611, -137472, -466076, -96106, 935286, 2448504, 4147800, 5687686, 6757680]
40372F757680L95362l45933j027113j564272j925144k113207k140468k013308
40364c976403j743083j364701r36419n17930j49524J49985L72911N15425N77814
40355g071925N67668N02772M10540L18575K38279J56908N0781q9410k45227l80659
40345e541698m63334m76246m13282k69134l7800K77478O54913J059359J460335
40336c749409J844848K210994K549909K835890L033214L109509L042590K819005
40328A7696550K431774J883875J197975M26097l51531j045101j584225j938924
40320A8716490k119647k160310k099304j969055j794600j596332j393414j206858
40312D376970j062287r91271j028358j201510j518047j953707k452086k935978
$$ y = [6757680, 7153042, 6807109, 5779996, 4215724, 2290580, 177373, -1963095, -3976403, -5719486, -7084187, -8020606, -8538536, -8688060, -8538075, -8165164, -7649739, -7071925, -6504257, -6001485, -5590945, -5272370, -5034091, -4877183, -4826402, -4915812, -5161039, -5541698, -6005032, -6481278, -6894560, -7163694, -7201494, -6924016, -6269103, -5209744, -3749409, -1904561, 306433, 2856342, 5692232, 8725446, 11834955, 14877545, 17696550, 20128324, 22012199, 23210174, 23636271, 23284740, 22239639, 20655414, 18716490, 16596843, 14436533, 12337229, 10368174, 8573574, 6977242, 5583828, 4376970, 3314683, 2323412, 1295054, 93544, -1424503, -3378210, -5830296, -8766274]
40304h766274l325806l559130l606913l482643l238772k946483k663632k406625
40296c3996278k143453j812313j353589p38012J8352Q53178J670310K364447K851275
40287c2286083L091248L098151K932076K681555K440180K283261K250623K339481
40279a1169508K508096K690654K822956K871068K845400K786226K727525K666898
40271A0749315K566300K381499K093498J717556J290590Q56719M64136J66140
40263B2285753J1820K5742J92123M57480P50401J005237J177763J248715J217492
40254B8372526J091061Q74208N66498J68437l05963q19115j312747j726677k022985
40245B4885243k198419k276014k283054k231093k109642j894861j566882j126621
$$ y = [-8766274, -12092080, -15651210, -19258123, -22740766, -25979538, -28926021, -31589653, -33996278, -36139731, -37952044, -39305633, -40043645, -40025293, -39172115, -37501805, -35137358, -32286083, -29194835, -26096684, -23164608, -20483053, -18042873, -15759612, -13508989, -11169508, -8661412, -5970758, -3147802, -276734, 2568666, 5354892, 8082417, 10749315, 13315615, 15697114, 17790612, 19508168, 20798758, 21655477, 22119613, 22285753, 22297573, 22323315, 22515438, 22972918, 23723319, 24728556, 25906319, 27155034, 28372526, 29463587, 30337795, 30904293, 31072730, 30766767, 29947652, 28634905, 26908228, 24885243, 22686824, 20410810, 18127756, 15896663, 13787021, 11892160, 10325278, 9198657]
40237I198657o04412n7288M43309Q29224J053552J102523R94739P66534M51222
40228A4178060O5711l85678q91639j412587j876351k199831k325443k247166k007576
40219H97500j669777j285543q80095m59462l1065L79099P26565R66883J079128
40210b76767J077809J007676R28392Q97222R50846J086957J254008J361027J309399
40201I596569J032516N22990j64208r29156j652479k218484k532881k537100k220093
40192a102326j624516q41859O864Q02359J459215J942953K261611K438263K485440
40183G828004K398891K169045J794173J284676O63024l2612p44316j400799j936305
40174A2023781k310361k515822k573067k515528k371061k144833j813909j341278
$$ y = [9198657, 8594245, 8536957, 8980266, 9809490, 10863042, 11965565, 12960304, 13726838, 14178060, 14243771, 13858093, 12966454, 11553867, 9677516, 7477685, 5152242, 2905076, 897500, -772277, -2057820, -2937915, -3397377, -3428442, -3049343, -2322778, -1355895, -276767, 801042, 1808718, 2737110, 3634332, 4585178, 5672135, 6926143, 8287170, 9596569, 10629085, 11152075, 10987867, 10058711, 8406232, 6187748, 3654867, 1117767, -1102326, -2726842, -3568701, -3561837, -2759478, -1300263, 642690, 2904301, 5342564, 7828004, 10226895, 12395940, 14190113, 15474789, 16137813, 16105201, 15360885, 13960086, 12023781, 9713420, 7197598, 4624531, 2109003, -262058, -2406891, -4220800, -5562078]
40166e562078p02455R2922R96239J928425K792645L487997L925998M048929L844284
40157A4852906L349333K642723J824307R90176K13815m58852j001869j397468
40149B1015071j629192j685831j575014j335519j033804p42601n17799l91447
40141A2103864l79661m89296p14837j032750j401322j763434k048925k183709
40133B089930k113713j834920j407019r36062n34119k78375j88680k28788l24555
40124e756301l88322l42433j39331K24926P10511J250795J778983K248227K633554
40115B220609K918208L078774L084242K913550K579787K138847J668294J226847
40107B1829158Q25118M32511J6108m18938q18711j107021j229092j182538j017799
$$ y = [-5562078, -6264533, -6171611, -5175372, -3246947, -454302, 3033695, 6959693, 11008622, 14852906, 18202239, 20844962, 22669269, 23659445, 23873260, 23414408, 22412539, 21015071, 19385879, 17700048, 16125034, 14789515, 13755711, 13013110, 12495311, 12103864, 11724203, 11234907, 10520070, 9487320, 8085998, 6322564, 4273639, 2089930, -23783, -1858703, -3265722, -4201784, -4735903, -5014278, -5202958, -5431746, -5756301, -6144623, -6487056, -6626387, -6401461, -5690950, -4440155, -2661172, -412945, 2220609, 5138817, 8217591, 11301833, 14215383, 16795170, 18934017, 20602311, 21829158, 22654276, 23086787, 23102895, 22683957, 21865246, 20758225, 19529133, 18346595, 17328796]
40098A7328796q12753o40923n51069n63708o78815q84836j161991j479808j795752
40089H759141k062593k244124k329180k332728k282475k200560k092237j945880
40081h730636j740122j452361j068084n93004o4202M50594Q71856J136127J214612
40072i975220J113015Q59812M96677P7083l31068o47683p95141p25142m44421
40063a0372088j8960M51411Q72768J185388J367707J422383J358180J178671Q84724
40054a669816M90212L6663m12046p96059j084302j275671j380593j405211j350195
40045h847018j216632j008713p34544m10190o4038K65501N39184P26819Q14524
40036i935107Q10337P46720O74207O45097O95896Q39900J072392J380202J745423
$$ y = [17328796, 16516043, 15875120, 15324051, 14760343, 14081528, 13196692, 12034701, 10554893, 8759141, 6696548, 4452424, 2123244, -209484, -2491959, -4692519, -6784756, -8730636, -10470758, -11923119, -12991203, -13584207, -13648409, -13197815, -12325959, -11189832, -9975220, -8862205, -8002393, -7505716, -7428633, -7759701, -8407384, -9202525, -9927667, -10372088, -10391048, -9939637, -9066869, -7881481, -6513774, -5091391, -3733211, -2554540, -1669816, -1179604, -1142941, -1554987, -2351046, -3435348, -4711019, -6091612, -7496823, -8847018, -10063650, -11072363, -11806907, -12217097, -12281135, -12015634, -11476450, -10749631, -9935107, -9124770, -8378050, -7703843, -7058746, -6362850, -5522950, -4450558, -3070356, -1324933]
40027a324933K139613K513446K791678K882815K705028K217531J439760M48114
40019A5813052o43657j705852k609323l242270l531888l463265l081866k475152
40011d940221j743145r73101k28256M47467J015189J431023J653528J667897J507632
40002a61987J251739R94456Q06931P14930P02177P31878P71657Q08639Q47652
39993G468072Q95110R41530R58132R12726P94009O25584M57846L41376K97965
39984A3692350L07196L16929K71394J40370o5737k99297m91677n73948m96724
39975A2800856k45009J57085O55628J186801J696559K149202K522947K801097
39967B3725166K969472L022759K972070K843338K664747K452613K207968J926723
$$ y = [-1324933, 814680, 3328126, 6119804, 9002619, 11707647, 13925178, 15364938, 15813052, 15169395, 13463543, 10854220, 7611950, 4080062, 616797, -2465069, -4940221, -6683366, -7656467, -7884723, -7437256, -6422067, -4991044, -3337516, -1669619, -161987, 1089752, 2084208, 2891139, 3606069, 4308246, 5040124, 5811781, 6620420, 7468072, 8363182, 9304712, 10262844, 11175570, 11969579, 12595163, 13053009, 13394385, 13692350, 13999546, 14316475, 14587869, 14728239, 14662502, 14363205, 13871528, 13297580, 12800856, 12555847, 12712932, 13368560, 14555361, 16251920, 18401122, 20924069, 23725166, 26694638, 29717397, 32689467, 35532805, 38197552, 40650165, 42858133, 44784856]
39959D4784856J613606J286752R69872O81450M31653K26517O9174m8040j53687
39950D9862153k96433n28370q79939j339193j845380k301940k608001k697984
39942C7364913k571227k295872j983915j748023j657753j713898j854318j990304
39934B1549603k053289k023824j927901j810051j705822j629514j576940j533847
39926G288415j482004j401401j271209j072670p95321m44963m9014L45710O83914
39917A801457R15730J005753R35449P05771L45210q3261m89461p81469q96717
39908C458462q21012n87184k57431J00769M35186P18243R44378J121919J266807
39899F380137J398800J536295J689396J855369K019214K157560K243619K252019
$$ y = [44784856, 46398462, 47685214, 48655086, 49336536, 49768189, 49994706, 50063880, 50015840, 49862153, 49565720, 49037350, 48157411, 46818218, 44972838, 42670898, 40062897, 37364913, 34793686, 32497814, 30513899, 28765876, 27108123, 25394225, 23539907, 21549603, 19496314, 17472490, 15544589, 13734538, 12028716, 10399202, 8822262, 7288415, 5806411, 4405010, 3133801, 2061131, 1265810, 820847, 771833, 1117543, 1801457, 2717187, 3722940, 4658389, 5364160, 5709370, 5626109, 5136648, 4355179, 3458462, 2637450, 2050266, 1792835, 1893604, 2328790, 3047033, 3991411, 5113330, 6380137, 7778937, 9315232, 11004628, 12859997, 14879211, 17036771, 19280390, 21532409]
39891B1532409K161893J957499J630087J184710O46652N7231n39678j103717j586674
39882B5940412j919335k022522j844471j396447p59079o0021N57039R59827J054743
39873B0510146Q15781L02204l52635r82743j439919j626112j498641j062716l70046
39864A4295319M76216J327551K019583K416266K447143K121663J517368P48042
39856B7369151p4426q65320j567344k134179k519979k687699k625947k355166
39848A2539091j918033j366601p59244j65295L36710O77128Q22698P93431O53426
39839A1613311M79869L30631K28702J66514J21371P2086R426o5169j52679k71181
39829A2532881m56388p41271j125648j557409j941023k171313k174338j934025
$$ y = [21532409, 23694302, 25651801, 27281888, 28466598, 29113250, 29170481, 28630803, 27527086, 25940412, 24021077, 21998555, 20154084, 18757637, 17998558, 17938537, 18495576, 19455403, 20510146, 21325927, 21628131, 21275496, 20292753, 18852834, 17226722, 15728081, 14665365, 14295319, 14771535, 16099086, 18118669, 20534935, 22982078, 25103741, 26621109, 27369151, 27294725, 26429405, 24862061, 22727882, 20207903, 17520204, 14894257, 12539091, 10621058, 9254457, 8495213, 8329918, 8666628, 9343756, 10166454, 10959885, 11613311, 12093180, 12423811, 12652513, 12819027, 12940398, 13012484, 13021910, 12956741, 12804062, 12532881, 12076493, 11335222, 10209574, 8652165, 6711142, 4539829, 2365491, 431466]
39821D31466j494170r40240l72464J21044M86238P14669Q38496R08818R67052
39812A660909J024491J061061J043362R50561P91843O04958M38485L29984K91523
39803H197177L06992L40239L50780L10877K15675Q1546o3516j89207k68029k79080
39793I003454k13877q1659R1957K75170M43952N90974P24577Q59979J009141J174133
39783A3877801J344402J496408J595670J603114J486222J232034Q57121M09981
39775B3902753l7214m07954o46362p35795o99099n79708m17185k34645m4788J33556
39765B0233559K63354K93366J80546p9057m31287p75393j004766j052157r11359
39756A6716806o28849k81406M3346K61469L08609J56492j78889o42766j156198
$$ y = [431466, -1062704, -2002944, -2375408, -2254364, -1768126, -1053457, -214961, 693857, 1660909, 2685400, 3746461, 4789823, 5740384, 6532227, 7137185, 7575670, 7905654, 8197177, 8504169, 8844408, 9195188, 9506065, 9721740, 9803286, 9739770, 9550563, 9282534, 9003454, 8789577, 8707918, 8799875, 9075045, 9518997, 10109971, 10834548, 11694527, 12703668, 13877801, 15222203, 16718611, 18314281, 19917395, 21403617, 22635651, 23492772, 23902753, 23865539, 23457585, 22811223, 22075428, 21376329, 20796621, 20379436, 20144791, 20100003, 20233559, 20496913, 20790279, 20970825, 20891768, 20460481, 19685088, 18680322, 17628165, 16716806, 16087957, 15806551, 15849897, 16111366, 16419975, 16576467, 16397578, 15754812, 14598614]
39747A4598614j631736j987638k162955k133048j918286j577703j187215q12781
39739A187252m92425k34183k6467J47904L00766M32911N33465N84224N68346M80705
39729C482498L34570J60007n490j27392j78527j37842R312K64671O09234J003596
39719E414637J398860J749793K020589K183074K216254K114021J897165J618037
39711B0612430J349461J160433J090834J138348J263855J411375J531391J595901
39703C1154028J599456J549144J452282J310888J126068R06823O72699M44266
39695D0215654K27243L584k62691o09165j057514j599389k187488k738657l158114
39686B8833463l381309l410603l320024l221796l216091l355048l636317m017023
$$ y = [14598614, 12966878, 10979240, 8816285, 6683237, 4764951, 3187248, 2000033, 1187252, 694827, 460644, 434177, 582081, 882847, 1315758, 1849223, 2433447, 3001793, 3482498, 3817068, 3977075, 3971585, 3844193, 3665666, 3527824, 3537136, 3801807, 4411041, 5414637, 6813497, 8563290, 10583879, 12766953, 14983207, 17097228, 18994393, 20612430, 21961891, 23122324, 24213158, 25351506, 26615361, 28026736, 29558127, 31154028, 32753484, 34302628, 35754910, 37065798, 38191866, 39098689, 39771388, 40215654, 40442897, 40446481, 40183790, 39574625, 38517111, 36917722, 34730234, 31991577, 28833463, 25452154, 22041551, 18721527, 15499731, 12283640, 8928592, 5292275, 1275252]
39678A275252m428870m785971m993214m964929m650048m048348l207851k209050
39670c2013029j148882j29820P51684J423648J859939K091082K193101K257002
39662b2715275K355547K524867K765133L051040L342714L596503L778046L873078
39654B571653L886857L831099L709690L515845L241869K891541K485006K054253
39646B8187813J633541J249857R17031O35794L98502J92466l528k25007n16459
39637C2470010r07327j381447j864458k244148k415474k325827j997268j515472
39629A7818589r92121n21541j54758R9444K55694L32292L40996K87982J83190
39620A7649767N0770p0155j38781j29013l3341J45865M01003P09722J023816J276702
$$ y = [1275252, -3153618, -7939589, -12932803, -17897732, -22547780, -26596128, -29803979, -32013029, -33161911, -33291731, -32540047, -31116399, -29256460, -27165378, -24972277, -22715275, -20359728, -17834861, -15069728, -12018688, -8675974, -5079471, -1301425, 2571653, 6458510, 10289609, 13999299, 17515144, 20757013, 23648554, 26133560, 28187813, 29821354, 31071211, 31988242, 32624036, 33022538, 33215004, 33211476, 32986469, 32470010, 31562683, 30181236, 28316778, 26072630, 23657156, 21331329, 19334061, 17818589, 16826468, 16304927, 16150169, 16249613, 16505307, 16837599, 17178595, 17466577, 17649767, 17700537, 17630382, 17491601, 17362588, 17329247, 17475112, 17876115, 18585837, 19609653, 20886355]
39610B0886355J410605J402275J267007J041796P65579M71792J92692l7308j89302
39601B7211491k54220k48573k02456j39145o6026J4358Q5030J06731K9442j84695
39591B6351937n40071r97507j481398j905386k206591k367256k407931k359022
39583A2086775k236172k038924j768697j446296j114644q27543o33303n60085
39575A461111o05941p36272q92206j010374j047811j000028r02090q12419p88170
39566f334200q62051j026238j228421j386079j417691j275133r58119n07693O658
39557a4988967M95989Q64998J040871J009491Q32540O27709N21007N97544Q74228
39548h124590J303925J806258K307093K762562L153812L462432L651982L672795
$$ y = [20886355, 22296960, 23699235, 24966242, 26008038, 26773617, 27245409, 27438101, 27400793, 27211491, 26957271, 26708698, 26506242, 26367097, 26301071, 26315429, 26400459, 26507190, 26536632, 26351937, 25811866, 24814359, 23332961, 21427575, 19220984, 16853728, 14445797, 12086775, 9850603, 7811679, 6042982, 4596686, 3482042, 2654499, 2021196, 1461111, 855170, 118898, -773308, -1783682, -2831493, -3831521, -4733611, -5546030, -6334200, -7196251, -8222489, -9450910, -10836989, -12254680, -13529813, -14487932, -14995625, -14988967, -14492978, -13627980, -12587109, -11577618, -10745078, -10117369, -9596362, -8998818, -8124590, -6820665, -5014407, -2707314, 55248, 3209060, 6671492, 10323474, 13996269]
39540A3996269L484773L080021K491751J787358J050435L59245k29463o85196
39532B5335193r98500j173134j221135j161172j018581q25537o17737m24407k56363
39523A7638627j05069M1091J76129K73079L03682K62401J71386O3392l8993j30020
39513A8655705k13141k91839l67832m44139n25455o13029o97806p58010p65223
39504A3979231o97967n55448l62006j60020O22O8954J71k26640n86328j004700
39494A0455869j388577j670398j832222j894465j886775j826554j713578j534835
39486c291535j274327r26067n05113m9098L90508P59955J010946J105794J025221
39477a753716P79610M16476J3825l44342n99787p39043p86490p77821p34965o59570
$$ y = [13996269, 17481042, 20561063, 23052814, 24840172, 25890607, 26249852, 26020389, 25335193, 24336693, 23163559, 21942424, 20781252, 19762671, 18937134, 18319397, 17894990, 17638627, 17533558, 17574649, 17750778, 18023857, 18327539, 18589940, 18761326, 18824718, 18785725, 18655705, 18442564, 18150725, 17782893, 17338754, 16813299, 16200270, 15502464, 14744454, 13979231, 13281264, 12725816, 12363810, 12203790, 12204412, 12273366, 12273537, 12046897, 11460569, 10455869, 9067292, 7396894, 5564672, 3670207, 1783432, -43122, -1756700, -3291535, -4565862, -5491929, -5997042, -6046140, -5655632, -4895677, -3884731, -2778937, -1753716, -974106, -557630, -543805, -888147, -1487934, -2226977, -3013467, -3791288, -4526253, -5185823]
39467e185823n45613l97507k38722j05141l0140l4415j27123l11090n79667r03788
39457h459029j223207j456363j528074j400466j093047o85214k98251n6460l7632
39448a6237743k36445n62854q77428j044081r76519o64356j73479L79877Q72691
39439a9520337J215642J370242J340208J153237Q49267M77161R1776k53738n18759
39430a3795301o85194p62786p85344p94717q16835q43098q31237p28391n02150
39421b0545053j57946K68049P30322J189059J609075J952750K183332K281717
39413a0488695K262881K175412K080316K021690K008795K020767K027033K004613
39405F112812J940128J823160J646164J413960J149808Q86774O50962M53059K93514
$$ y = [-5185823, -5731436, -6128943, -6367665, -6472806, -6502946, -6537361, -6664484, -6975574, -7555241, -8459029, -9682236, -11138599, -12666673, -14067139, -15160186, -15845400, -16143651, -16200111, -16237743, -16474188, -17037042, -17914470, -18958551, -19935070, -20599426, -20772905, -20393028, -19520337, -18304695, -16934453, -15594245, -14441008, -13591741, -13114580, -13022804, -13276542, -13795301, -14480495, -15243281, -16028625, -16823342, -17640177, -18483275, -19314512, -20042903, -20545053, -20702999, -20434950, -19704628, -18515569, -16906494, -14953744, -12770412, -10488695, -8225814, -6050402, -3970086, -1948396, 60399, 2081166, 4108199, 6112812, 8052940, 9876100, 11522264, 12936224, 14086032, 14972806, 15623768, 16076827, 16370341]
39396A6370341J70534P9983J0702n3912j26840k11061l01956l91923m69006n13430
39386A4563432n02565m24769k88884j18344O5685K56896M60402O74204Q69784
39377A5555841R92222R90373Q61470O73358N38361N51999P40050J048542J374816
39368B3327032J611610J679648J543489J216104P53425K35351k63300o95543j043027
39359B8364789j298670j452368j494395j428255j275434j068727q45663o48485
39351A8852792n23207n10095o30431q79967j231862j644099k067040k449925k745662
39342F170504k914432k929688k788248k518314k175571j825002j516905j269786
39334a1767442j068068q74866o52273l76938m2551L47091P82758J246764J710318
$$ y = [16370341, 16540875, 16620858, 16631560, 16577648, 16450808, 16239747, 15937791, 15545868, 15076862, 14563432, 14060867, 13636098, 13347214, 13228870, 13294555, 13551451, 14011853, 14686057, 15555841, 16548063, 17538436, 18399906, 19073264, 19611625, 20163624, 20903674, 21952216, 23327032, 24938642, 26618290, 28161779, 29377883, 30131308, 30366659, 30103359, 29407816, 28364789, 27066119, 25613751, 24119356, 22691101, 21415667, 20346940, 19501277, 18852792, 18329585, 17819490, 17189059, 16309092, 15077230, 13433131, 11366091, 8916166, 6170504, 3256072, 326384, -2461864, -4980178, -7155749, -8980751, -10497656, -11767442, -12835510, -13710376, -14362649, -14739587, -14782138, -14435047, -13652289, -12405525, -10695207]
39325a0695207K141184K517819K833512L081129L231007L227706L018135K594426
39317A1949711K016680J393671Q34066M05906J33500K5213R7183L65079Q11138
39308A8032147J360908J896746K302574K508930K509368K342796K060189J701534
39300C4715192J295418Q71094M62637R7886k14353m82692p18339r20931j071937
39291C4033975j132370j046620p62674k68810L75528J041237J567034J812106
39283C5619406J700073J242265N36277k61299r82000j495760j743682j740781
39275C2874499j551046j250805r00933n39390j89506J28934L92866N72553O32955
39266C0170127N46224L14539j2652l45525n85792o64409n63793l17620N022L21126
$$ y = [-10695207, -8554023, -6036204, -3202692, -121563, 3109444, 6337150, 9355285, 11949711, 13966391, 15360062, 16194128, 16600034, 16733534, 16758747, 16855930, 17221009, 18032147, 19393055, 21289801, 23592375, 26101305, 28610673, 30953469, 33013658, 34715192, 36010610, 36881704, 37344341, 37442227, 37227874, 36745182, 36026843, 35105912, 34033975, 32901605, 31854985, 31092311, 30823501, 31199029, 32240266, 33807300, 35619406, 37319479, 38561744, 39098021, 38836722, 37854722, 36358962, 34615280, 32874499, 31323453, 30072648, 29171715, 28632325, 28442819, 28571753, 28964619, 29537172, 30170127, 30716351, 31030890, 31018238, 30672713, 30086921, 29422512, 28858719, 28541099, 28546121, 28867247]
39256B8867247N54304O50503N86507L70762L8107l59875p67563j138268j442176
39247B7359548j665798j806341j869171j871009j841294j813143j807321j823645
39239A2861826j848972j874645j906873j960487k041124k129399k178867k130952
39231c209493j940124j596410j132538o11177r8709L59034P43594J049493J262480
39222e173850J352097J287587J063653P13212K97915j13200m61057p03801q17209
39213b554653p92489o33273l53652K1217M54027Q98805J310818J658099J927688
39204A936587K124207K263782K366418K446980K505042K518441K447306K249162
39196B0857925J896569J387886P50630M3467o43661j202103j537118j608366j451642
$$ y = [28867247, 29421551, 30072054, 30658561, 31029323, 31067430, 30707555, 29939992, 28801724, 27359548, 25693750, 23887409, 22018238, 20147229, 18305935, 16492792, 14685471, 12861826, 11012854, 9138209, 7231336, 5270849, 3229725, 1100326, -1078541, -3209493, -5149617, -6746027, -7878565, -8489742, -8588451, -8229417, -7485823, -6436330, -5173850, -3821753, -2534166, -1470513, -757301, -459386, -572586, -1033643, -1737444, -2554653, -3347142, -3980415, -4334067, -4312850, -3858823, -2960018, -1649200, 8899, 1936587, 4060794, 6324576, 8690994, 11137974, 13643016, 16161457, 18608763, 20857925, 22754494, 24142380, 24893010, 24936477, 24292816, 23090713, 21553595, 19945229, 18493587]
39187A8493587j164655q65295o47698n56491n83340o79335p75244q03454p16041
39178A1702034m95183j55588K59439O87165J059440J319648J438155J420710J305283
39169A8541103J146348R91661Q62365P47900O20116M60061K82583J43148J19374
39160B3914659K74158O20375J107946J640222K108150K422926K534237K432553
39152C7055226K140804J702653J173741O17621J00622l22116o27485q37199j007679
39143C9996188j198576j439141j713004j968031k142722k194985k121115j957241
39135B5261373j760991j579947j423114j254267j015455o68687k28457K38177
39127A7568632O43993R22661J051295J046660R49115Q11576O95169O59880P44008
$$ y = [18493587, 17328932, 16463637, 15815939, 15259448, 14676108, 13996773, 13221529, 12418075, 11702034, 11206851, 11051263, 11310702, 11997867, 13057307, 14376955, 15815110, 17235820, 18541103, 19687451, 20679112, 21541477, 22289377, 22909493, 23369554, 23652137, 23795285, 23914659, 24188817, 24809192, 25917138, 27557360, 29665510, 32088436, 34622673, 37055226, 39196030, 40898683, 42072424, 42690045, 42790667, 42468551, 41841066, 41003867, 39996188, 38797612, 37358471, 35645467, 33677436, 31534714, 29339729, 27218614, 25261373, 23500382, 21920435, 20497321, 19243054, 18227599, 17558912, 17330455, 17568632, 18212625, 19135286, 20186581, 21233241, 22182356, 22993932, 23689101, 24348981, 25092989]
39118B5092989R43419J208609J465078J644355J708078J657243J528342J379758
39110C6627871J270382J236014J273818J343746J387374J354838J225153J007934
39102D6727130P26707L98504K7628l82403q12330j222779j566145j806019j932167
39093D0158126j962696j930815j862606j760739j606843j380113j076513p15445
39085B7862356l34307K0487L00512M61944M75546L39605Q8581k12267m88814o85933
39075B7827710p85178q04826p87029p79812q18607r13176j047584j192834j319113
39066A9379551j396568j390819j268756j016580o53557k26505K11432O21657R88805
39057A5248660J315934J611383J875949K099739K271593K392099K476867K546850
$$ y = [25092989, 26036408, 27245017, 28710095, 30354450, 32062528, 33719771, 35248113, 36627871, 37898253, 39134267, 40408085, 41751831, 43139205, 44494043, 45719196, 46727130, 47453837, 47852341, 47879969, 47497566, 46685236, 45462457, 43896312, 42090293, 40158126, 38195430, 36264615, 34402009, 32641270, 31034427, 29654314, 28577801, 27862356, 27528049, 27548536, 27849048, 28310992, 28786538, 29126143, 29214724, 29002457, 28513643, 27827710, 27042532, 26237706, 25450677, 24670865, 23852258, 22939082, 21891498, 20698664, 19379551, 17982983, 16592164, 15323408, 14306828, 13653271, 13426766, 13638198, 14259855, 15248660, 16564594, 18175977, 20051926, 22151665, 24423258, 26815357, 29292224, 31839074]
39049C1839074K616641K693718K789581K930755L157042L506068L995872M618672
39041E8147423N348032O149613O985001P807988Q561003R177894R592872R751592
39033A21521418R619418R180687Q425413P331418N861909L993106J760445p11348
39025A66982466l222238n549563p506365q975315r912645j0335000j0301931r898444
39017A01280965r218636q352839p380277o365785n357663m385775l462432k589529
39009E4168029j771466j026035l81727J42054N59516R27046J324772J820211K435658
39000E8198058L137558L852215M497861N015862N387195N631749N797217N943837
38992I7461552O125645O369827O663149O956589P189229P318682P340764P288710
$$ y = [31839074, 34455715, 37149433, 39939014, 42869769, 46026811, 49532879, 53528751, 58147423, 63495455, 69645068, 76630069, 84438057, 92999060, 102176954, 111769826, 121521418, 131140836, 140321523, 148746936, 156078354, 161940263, 165933369, 167693814, 166982466, 163760228, 158210665, 150704300, 141728985, 131816340, 121481340, 111179409, 101280965, 92062329, 83709490, 76329213, 69963428, 64605765, 60219990, 56757558, 54168029, 52396563, 51370528, 50988801, 51130855, 51690371, 52617417, 53942189, 55762400, 58198058, 61335616, 65187831, 69685692, 74701554, 80088749, 85720498, 91517715, 97461552, 103587197, 109957024, 116620173, 123576762, 130765991, 138084673, 145425437, 152714147]
38984A52714147P215040P169179P184551P279322P463304P741835Q116216Q586001
38976B13469595R151855R809682J0532415J1251159J1851676J2187948J2100085
38969B90354415J1428755J0036027P846573M901901J393509k359360n988797r176128
38961C08436895j1719159j3543770j4671874j5178010j5160599j4732990j4021754
38954B09408739j3156150j2244390j1349300j0482989r627607q766900p903798
38947A35877605p053977o229890n436742m683445l990078l375818k836369k337185
38939I9934101j835466j313438p91836l10829J04592M65843Q13215J187184J599834
38930I9853200K024830K409957K701856K868404K911420K870089K815289K830630
$$ y = [152714147, 159929187, 167098366, 174282917, 181562239, 189025543, 196767378, 204883594, 213469595, 222621450, 232431132, 242963547, 254214706, 266066382, 278254330, 290354415, 301783170, 311819197, 319665770, 324567671, 325961180, 323601820, 317613023, 308436895, 296717736, 283173966, 268502092, 253324082, 238163483, 223430493, 209408739, 196252589, 184008199, 172658899, 162175910, 152548303, 143781403, 135877605, 128823628, 122593738, 117156996, 112473551, 108483473, 105107655, 102271286, 99934101, 98098635, 96785197, 95993361, 95682532, 95787124, 96252967, 97066182, 98253366, 99853200, 101878030, 104287987, 106989843, 109858247, 112769667, 115639756, 118455045, 121285675]
38922A21285675K979888L272896L649575L993311M165543M041237L531020K592870
38914A49512015J244957m19674k233574l987150n484978o594791p262664p496282
38906A17277859p339158o854114o117110n214116m236909l277938k424277j748844
38898H0065393j297070j070779j019205j051388j073169j028557r15572p67783
38890G1841870o24302n15429m64582m86130n70229o71378p21386o64159m87353
38881F6636922k28162M8485K81666M35670N02512M93309M31139L48798K84029
38872F9234368K66169L00363L61997M06667L88533K74619M7295l03289p86322
38863G0190400j405534k142501k943836l728823m414563m937475n256986n350412
$$ y = [121285675, 124265563, 127538459, 131188034, 135181345, 139346888, 143388125, 146919145, 149512015, 150756972, 150337298, 148103724, 144116574, 138631596, 132036805, 124774141, 117277859, 109938701, 103084587, 96967477, 91753361, 87516452, 84238514, 81814237, 80065393, 78768323, 77697544, 76678339, 75626951, 74553782, 73525225, 72609653, 71841870, 71217568, 70702139, 70237557, 69751427, 69181198, 68509820, 67788434, 67124275, 66636922, 66408760, 66457245, 66738911, 67174581, 67677093, 68170402, 68601541, 68950339, 69234368, 69500537, 69800900, 70162897, 70569564, 70958097, 71232716, 71280011, 70976722, 70190400, 68784866, 66642365, 63698529, 59969706, 55555143, 50617668, 45360682, 40010270]
38855D0010270n216532m887493m430320l926060l438235k993113k581681k175149
38847A0361687j741280j256882p18140j48156M04455Q81110J238073J464699J580269
38838A2065835J610577J562782J418687J150762P48484K38802l08184p89871j096243
38829A6601631j143987r08678m40589J45703P06227J112717J288642J222913R61063
38820A9545642N83843J83754j56251l81704m79987m80081m33432l83094l39368
38811A7659322k77114j53628O7568L99871Q25462J292834J722141K023380K124206
38802B5684042J992965J642550J114022M53913k96538j091782j861945k505601
38794B5131626k913007l012922k812459k400289j909563j464643j142034r60870
$$ y = [40010270, 34793738, 29906245, 25475925, 21549865, 18111630, 15118517, 12536836, 10361687, 8620407, 7363525, 6645385, 6497229, 6901684, 7782794, 9020867, 10485566, 12065835, 13676412, 15239194, 16657881, 17808643, 18557127, 18795929, 18487745, 17697874, 16601631, 15457644, 14548966, 14108377, 14254080, 14960307, 16073024, 17361666, 18584579, 19545642, 20129485, 20313239, 20156988, 19775284, 19295297, 18815216, 18381784, 17998690, 17659322, 17382208, 17228580, 17296148, 17696019, 18521481, 19814315, 21536456, 23559836, 25684042, 27677007, 29319557, 30433579, 30887492, 30590954, 29499172, 27637227, 25131626, 22218619, 19205697, 16393238, 13992949, 12083386, 10618743, 9476709, 8515839]
38786H515839q98837r18524r87613j082451j177305j235260j217040j105654r23834
38777a030679p22811n47445m06392k70891r9212J34667M25795P40750J034209
38768g42009J272051J448568J585371J711290J837206J943001J984128J913654
38760A2953260J708987J390335J021146O89906M81745M49922N94999Q61067J157243
38751B1308610J398207J538610J577865J538492J443166J308188J148098R77900
38743C2239136Q10298O53382N09265L70282K16017J9835k34891n41526q71729
38734C3170069j189361j464106j675991j811903j859806j805383j634138j339888
38726B0389493r35450m56782M5082N19606R28295J244999J449083J522026J454062
$$ y = [8515839, 7617002, 6698478, 5710865, 4628414, 3451109, 2215849, 998809, -106845, -1030679, -1753490, -2300935, -2707327, -2978218, -3077430, -2942763, -2516968, -1776218, -742009, 530042, 1978610, 3563981, 5275271, 7112477, 9055478, 11039606, 12953260, 14662247, 16052582, 17073728, 17763634, 18245379, 18695301, 19290300, 20151367, 21308610, 22706817, 24245427, 25823292, 27361784, 28804950, 30113138, 31261236, 32239136, 33049434, 33702816, 34212081, 34582363, 34798380, 34818215, 34583324, 34041798, 33170069, 31980708, 30516602, 28840611, 27028708, 25168902, 23363519, 21729381, 20389493, 19454043, 18997261, 19042343, 19561949, 20490244, 21735243, 23184326, 24706352, 26160414]
38717B6160414J257857R78376O88045M65154L65894M05779N58275P65340R51394
38708C2596528J040112R77675P56802M24414O1315k56535m90416o47137p65352
38699C3697406q94052j073309j318810j610762j892923k087152k119758j947173
38691B0753467j570025j033715m19417J71479O37713Q98284R05332O47723J51217
38682B1142058n18891j256516j926744k397129k578262k452019k071888j537752
38674F402857r61039m35533k0411K63461M24740M85302M66712L88056K73904J63257
38664G451306J10371J72466L84993P34787J151141J528515J769589J818637J666621
38655A6788426J338547Q83837L72773j14037n07176p66885q85844q82142p95876
$$ y = [26160414, 27418271, 28396647, 29084692, 29549846, 29915740, 30321519, 30879794, 31645134, 32596528, 33636640, 34614315, 35371117, 35795531, 35856846, 35600311, 35109895, 34462758, 33697406, 32803354, 31730045, 30411235, 28800473, 26907550, 24820398, 22700640, 20753467, 19183442, 18149727, 17730310, 17901789, 18539502, 19437786, 20343118, 20990841, 21142058, 20623167, 19366651, 17439907, 15042778, 12464516, 10012497, 7940609, 6402857, 5441818, 5006285, 4985874, 5249335, 5674075, 6159377, 6626089, 7014145, 7288049, 7451306, 7561677, 7734143, 8119136, 8853923, 10005064, 11533579, 13303168, 15121805, 16788426, 18126973, 19010810, 19383583, 19269546, 18762370, 17995485, 17109641, 16227499, 15431623]
38646A5431623o89028o34581o88431q58293j092766j300799j390931j309386j060839
38637F406569p05921l37950m7686J08949J24412K9379j28983l01236m35768m77058
38627D234707l78025j25311K42203O40947R76226J182331J245800J200028J096357
38618A0315263R69100Q14520N94591K61234k14162q20397j501018k162443k692637
38609E564051k986839k973901k635322k011994j198209l23677M75363J090480
38601e000048J468271J617376J592562J466703J305874J155507J035523R40050
38593E581818Q42090P06196N07142K45540m8878l28059n44909o72570p14872p00759
38583D872739o63449o17522n51106m37918k56271k4L19888O74450J013964J273822
$$ y = [15431623, 14742595, 14108014, 13419583, 12561290, 11468524, 10167725, 8776794, 7467408, 6406569, 5700648, 5362698, 5315012, 5423961, 5548373, 5577752, 5448769, 5147533, 4711765, 4234707, 3856682, 3731371, 3973574, 4614521, 5590747, 6773078, 8018878, 9218906, 10315263, 11284363, 12098883, 12693474, 12954708, 12740546, 11920149, 10419131, 8256688, 5564051, 2577212, -396689, -3032011, -5044005, -6242214, -6565891, -6090528, -5000048, -3531777, -1914401, -321839, 1144864, 2450738, 3606245, 4641768, 5581818, 6423908, 7130104, 7637246, 7882786, 7833908, 7505849, 6960940, 6288370, 5573498, 4872739, 4209290, 3591768, 3040662, 2602744, 2346473, 2346449, 2666337, 3340787, 4354751, 5628573]
38573E628573J396277J359601J194129R71789P74198O58240O37204O84414P53556
38564A4057981Q02637Q09160P70967O96550N94207M68153L22360J66281J5612
38555A8703908j13454k12179k83556l40280l97956m66981n46321o22534o76560
38546A5044087o95819o83291o55895o35038o39757o86779p89404r47797j137870
38537H172437j313548j424829j437441j340390j142072q63223n31175j75681J72525
38528A16603M81059P18334Q61908R05974Q59565P38232N59851L47424J30289o2298
38518E656941k10253l06691l57367l80442m06849m76471o27169q78513j215680
38509G97506j582683j895247k075010k089635j973170j810563j693301j670610
$$ y = [5628573, 7024850, 8384451, 9578580, 10550369, 11324567, 11982807, 12620011, 13304425, 14057981, 14860618, 15669778, 16440745, 17137295, 17731502, 18199655, 18522015, 18688296, 18703908, 18590454, 18378275, 18094719, 17754439, 17356483, 16889502, 16343181, 15720647, 15044087, 14348268, 13664977, 13009082, 12374044, 11734287, 11047508, 10258104, 9310307, 8172437, 6858889, 5434060, 3996619, 2656229, 1514157, 650934, 119759, -55922, 116603, 597662, 1315996, 2177904, 3083878, 3943443, 4681675, 5241526, 5588950, 5719239, 5656941, 5446688, 5139997, 4782630, 4402188, 3995339, 3518868, 2891699, 2013186, 797506, -785177, -2680424, -4755434, -6845069, -8818239, -10628802, -12322103, -13992713]
38501a3992713j722084j765155j694025j431743r69942l76377K32582P38675J064404
38492a9916378J194783J173755J080611R96460R73139J015778J085241J119734
38484a1276877J068985R27665P48461O20338O20476P72688J042437J367015J691461
38475b417351J984589K233593K430298K559094K592195K497546K258112J887557
38467A6025633J425089R11161L66130k08512q09126j409217j956691k391662k673093
38458I279712k796745k791271k693480k519779k255674j873415j367694p85293
38450g803639k25923J93177L94152L85585K68906J95540K97161O28459J151212
38441d515370J760284K330609K761824L006190L072738L006640K853969K633639
$$ y = [-13992713, -15714797, -17479952, -19173977, -20605720, -21575662, -21952039, -21719457, -20980782, -19916378, -18721595, -17547840, -16467229, -15470769, -14497630, -13481852, -12396611, -11276877, -10207892, -9280227, -8531766, -7911428, -7290952, -6518264, -5475827, -4108812, -2417351, -432762, 1800831, 4231129, 6790223, 9382418, 11879964, 14138076, 16025633, 17450722, 18361883, 18728013, 18519501, 17710375, 16301158, 14344467, 11952805, 9279712, 6482967, 3691696, 998216, -1521563, -3777237, -5650652, -7018346, -7803639, -8029562, -7836385, -7442233, -7056648, -6787742, -6592202, -6295041, -5666582, -4515370, -2755086, -424477, 2337347, 5343537, 8416275, 11422915, 14276884, 16910523]
38433A6910523K335470J943317J462638R31056M06645n5801m26498p11295r47491
38424B1848564j185417j461445j773876k075126k287672k338324k193551j876602
38416F656551j457579j022285o35369l14958l1312K68206O20304J015869J396645
38407F496072J677757J780869J663767J340025Q83387M09241L4378j65820j78005
38398A3941671m1642J76031M03322N79456O63337O36031M98190K67853j9059l12442
38388A6792748n61918p32422q06237p71717o17539l45520J0394L83378O99658
38379A4050825R13999J029162J086143J132445J190402J248170J279188J272409
38371B3202743J246337J235667J264966J333232J418785J493925J534304J520192
$$ y = [16910523, 19245993, 21189310, 22651948, 23583004, 23989649, 23933848, 23507350, 22796055, 21848564, 20663147, 19201702, 17427826, 15352700, 13065028, 10726704, 8533153, 6656551, 5198972, 4176687, 3541318, 3226360, 3195048, 3463254, 4083558, 5099427, 6496072, 8173829, 9954698, 11618465, 12958490, 13841877, 14251118, 14285496, 14119676, 13941671, 13900029, 14076060, 14479382, 15058838, 15722175, 16358206, 16856396, 17124249, 17105190, 16792748, 16230830, 15498408, 14692171, 13920454, 13302915, 12957395, 12967789, 13351167, 14050825, 14964824, 15993986, 17080129, 18212574, 19402976, 20651146, 21930334, 23202743, 24449080, 25684747, 26949713, 28282945, 29701730, 31195655, 32729959, 34250151]
38363C4250151J438119J288538J093003Q90034P18383N99370N31818N02503N03377
38354D1815296N42154O37268P98597J006808J208764J336912J342591J221244
38346D9909634J012437P75092N55185L67390K00901M1319j10555k37391l20916
38337E2193096l62296l93075m68048o41304r38226j341620j800898k255674k655560
38328D1336395k965660l161868l226816l152873k949403k645288k279392j882381
38320A9072714j464475j022014n59273j06997K78262N33607O14415N10553K49506
38311A8106298j09879m87205p92135r40304q73772n78499q8714N23956J168840
38302A5928586J753666K199117K451445K491079K333522K021756J612534J160033
$$ y = [34250151, 35688270, 36976808, 38069811, 38959845, 39678228, 40277598, 40809416, 41311919, 41815296, 42357450, 42994718, 43793315, 44800123, 46008887, 47345799, 48688390, 49909634, 50922071, 51697163, 52252348, 52619738, 52820639, 52861958, 52751403, 52514012, 52193096, 51830800, 51437725, 50969677, 50328373, 49390147, 48048527, 46247629, 43991955, 41336395, 38370735, 35208867, 31982051, 28829178, 25879775, 23234487, 20955095, 19072714, 17608239, 16586225, 16026952, 15919955, 16198217, 16731824, 17346239, 17856792, 18106298, 17996419, 17509214, 16717079, 15776775, 14903003, 14324504, 14235790, 14759746, 15928586, 17682252, 19881369, 22332814, 24823893, 27157415, 29179171, 30791705, 31951738]
38294C1951738P02301K57701j65394n52635q74689j093263j178089j123155r51884
38285B6972631p08254m38933j77251O0519K64835M19656N02483N02302M39771
38276B7837759L66565L38038L80188M78815N97947P08687Q04850Q97630R97492
38267C3407971J096093J158414J130885R63839O37233J75015l60059q88433j341685
38258C5979273j683020j910858k045977k112168k121405k067942j931117j687468
38250B0419318j330352q86299m13614J8989L57749N74621O61200O19951M65262
38241B0486825K31828k2580k28822l29115k98399j52513O0498K80345M55464N56900
38231B1040431N82839N55672N13328M95623N28583O13812P29506Q42230R21164
$$ y = [31951738, 32654039, 32911740, 32746346, 32193711, 31319022, 30225759, 29047670, 27924515, 26972631, 26264377, 25825444, 25648193, 25708712, 25973547, 26393203, 26895686, 27397988, 27837759, 28204324, 28542362, 28922550, 29401365, 29999312, 30707999, 31512849, 32410479, 33407971, 34504064, 35662478, 36793363, 37757202, 38394435, 38569450, 38209391, 37320958, 35979273, 34296253, 32385395, 30339418, 28227250, 26105845, 24037903, 22106786, 20419318, 19088966, 18202667, 17789053, 17808042, 18165791, 18740412, 19401612, 20021563, 20486825, 20718653, 20696073, 20467251, 20138136, 19839737, 19687224, 19747722, 20028067, 20483531, 21040431, 21623270, 22178942, 22692270, 23187893, 23716476, 24330288, 25059794, 25902024, 26823188]
38222B6823188R47108R15529Q37015P35790O43785N90518N94507O61834P90697
38213C3539971R75264J204116J455285J693534J873254J946331J873065J634344
38205D6195164J241561P37957J87296l46800q20756j220520j557129j851123k113175
38196D0452475k330831k469317k486454k352625k064798j648832j150363o18389
38188B5330866q9351M18154Q93281J315365J644417J828364J821582J602460J182506
38179C5947644O06224n7369p31008j348669j868254k269537k540521k665571k626047
38170B2446892k411672k031469j516348r13959k79894L32308Q79277J328904J653400
38161A9487439J823403J814416J625065J291910Q84846M82174J41174j15675k90958
$$ y = [26823188, 27770296, 28685825, 29522840, 30258630, 30902415, 31492933, 32087440, 32749274, 33539971, 34515235, 35719351, 37174636, 38868170, 40741424, 42687755, 44560820, 46195164, 47436725, 48174682, 48361978, 48015178, 47194422, 45973902, 44416773, 42565650, 40452475, 38121644, 35652327, 33165873, 30813248, 28748450, 27099618, 25949255, 25330866, 25241515, 25659669, 26552950, 27868315, 29512732, 31341096, 33162678, 34765138, 35947644, 36553868, 36496499, 35765491, 34416822, 32548568, 30279031, 27738510, 25072939, 22446892, 20035220, 18003751, 16487403, 15573444, 15293550, 15625858, 16505135, 17834039, 19487439, 21310842, 23125258, 24750323, 26042233, 26927079, 27409253, 27550427, 27434752, 27143794]
38152B7143794l90723m12279l51101k15456l0836J67911L43860M58394M75279
38143B7188843L77928J88927l0989k12768l20427l75863m49006o16010r08873
38134B4841762j289635j669660j961518k124532k171847k141806k064705j951816
38126I466243j806837j639851j467390j300721j137227r64887p74510n65966l42120
38117e33266r8233J80736N11555R00091J333123J777022K181962K491572K657548
38108A1402110K653423K478122K146113J673099J071177L58439m26124j217073
38100B0139286j934351k508536k906180l139243l250294l281763l251311l150986
38092c283378k966144k693236k341184j921389j442013r13358l56304J96876P10532
$$ y = [27143794, 26753071, 26340792, 25989691, 25774235, 25743399, 25911310, 26255170, 26713564, 27188843, 27566771, 27755698, 27724709, 27511941, 27191514, 26815651, 26366645, 25750635, 24841762, 23552127, 21882467, 19920949, 17796417, 15624570, 13482764, 11418059, 9466243, 7659406, 6019555, 4552165, 3251444, 2114217, 1149330, 374820, -191146, -533266, -631499, -450763, 60792, 960883, 2294006, 4071028, 6252990, 8744562, 11402110, 14055533, 16533655, 18679768, 20352867, 21424044, 21782483, 21356359, 20139286, 18204935, 15696399, 12790219, 9650976, 6400682, 3118919, -132392, -3283378, -6249522, -8942758, -11283942, -13205331, -14647344, -15560702, -15917006, -15720130, -15009598]
38083a5009598J155149J512169J774341J944672K034940K063077K049710K014691
38075d60849J972281J924005J853684J732456J534768J255052R13855N52334K20567
38066A1498153l8375k07627l08591l90459m97717o38884p81182q72005q67579
38057F895734p51551n40527k80205l3768J35755J83771R6898j03336l67585o36587
38047D598599q64316j034801j161887j270909j373245j450802j462361j368952
38039e388674j160724q67076n45078k55294l7592J03457J96275K81831L86950
38030g285925N11782O40765P64095Q87887J024959J177063J324117J427755J446139
38021A918637J350677J135185Q14771M20705k642m02109p28324r53239j078507
$$ y = [-15009598, -13854449, -12342280, -10567939, -8623267, -6588327, -4525250, -2475540, -460849, 1511432, 3435437, 5289121, 7021577, 8556345, 9811397, 10725252, 11277586, 11498153, 11459778, 11252151, 10943560, 10553101, 10055384, 9416500, 8635318, 7763313, 6895734, 6144183, 5603656, 5323451, 5289683, 5425438, 5609209, 5706107, 5602771, 5235186, 4598599, 3734283, 2699482, 1537595, 266686, -1106559, -2557361, -4019722, -5388674, -6549398, -7416474, -7961552, -8216846, -8254438, -8150981, -7954706, -7672875, -7285925, -6774143, -6133378, -5369283, -4481396, -3456437, -2279374, -955257, 472498, 1918637, 3269314, 4404499, 5219270, 5639975, 5637333, 5235224, 4506900, 3553661, 2475154]
38012B475154j127304j129500j114067j108666j134489j192600j253617j263934
38004f849023j166253r20925n19550O926N84677J107280J468842J610271J550055
37995c127700J376261J203781J124243J174839J334080J537817J705899J771567
37987H100787J704961J521710J271923J013755P83975N80827L68424R9372k58292
37978A5187442p03636j199937j684154k085548k349609k458430k435240k328437
37970e7549k185537k035315j887926j746441j615344j498451j391519j279697
37962a3697779j143589r67827p44295m69077j39717K41652O61460J091724J496337
37953a3671111J845185K129070K366426K595246K851173L142834L439755L680885
$$ y = [2475154, 1347850, 218350, -895717, -2004383, -3138872, -4331472, -5585089, -6849023, -8015276, -8936201, -9455751, -9448825, -8864148, -7756868, -6288026, -4677755, -3127700, -1751439, -547658, 576585, 1751424, 3085504, 4623321, 6329220, 8100787, 9805748, 11327458, 12599381, 13613136, 14397111, 14977938, 15346362, 15445734, 15187442, 14483806, 13283869, 11599715, 9514167, 7164558, 4706128, 2270888, -57549, -2243086, -4278401, -6166327, -7912768, -9528112, -11026563, -12418082, -13697779, -14841368, -15809195, -16553490, -17022567, -17162284, -16920632, -16259172, -15167448, -13671111, -11825926, -9696856, -7330430, -4735184, -1884011, 1258823, 4698578, 8379463]
37945H379463L798876L748348L527746L186725K811816K490061K266031K118181
37937C2327247J970881J733667J342291P81479Q7271o62028j361326j903858k216980
37928C2098644k295442k208430k067765j973300j971179k049667k165837k276028
37920A5090996k350128k370184k324713k206407k012938j747253j415148j021342
37912c57117n68860o5270M67503R89950J455950J833123K116943K324902K472801
37903A0669925K551973K527650K361126K037538J578634J037151M85312O258l15981
37894B2939586m14652k61937J17769O49368J222118J715828K034186K132836K026418
37885C2161520J771548J440479J101023Q03424N67873L76625J82997o2270l85073
$$ y = [8379463, 12178339, 15926687, 19454433, 22641158, 25452974, 27943035, 30209066, 32327247, 34298128, 36031795, 37374086, 38155565, 38242836, 37580808, 36219482, 34315624, 32098644, 29803202, 27594772, 25527007, 23553707, 21582528, 19532861, 17367024, 15090996, 12740868, 10370684, 8045971, 5839564, 3826626, 2079373, 664225, -357117, -925977, -991247, -523744, 466206, 1922156, 3755279, 5872222, 8197124, 10669925, 13221898, 15749548, 18110674, 20148212, 21726846, 22763997, 23249309, 23255567, 22939586, 22524934, 22262997, 22380766, 23030134, 24252252, 25968080, 28002266, 30135102, 32161520, 33933068, 35373547, 36474570, 37277994, 37845867, 38222492, 38405489, 38343219, 37958146]
37876C7958146p79887j218010j658151k051721k346631k493816k454845k209003
37868B2746082j761361j150403m46805K63065R02569J422937J802973K034568
37860B5813625K109118K017550J763258J375029R06288M19459l2338m12692o96004
37851C3263293q57874q72943p23866m15182J9010N21568J031160J502250J914398
37842C5381814K267004K564958K804042K962855L004031K884327K570614K055824
37834E6495469J366861N59361k95629j120022j826349k318809k518017k406407
37826D7936458k060270j634281j300554j179392j300629j608979k001259k372284
37818C4478810k647348k790067k790745k651154k378449j989049j514470r99646
$$ y = [37958146, 37178259, 35960249, 34302098, 32250377, 29903746, 27409930, 24955085, 22746082, 20984721, 19834318, 19387513, 19650578, 20553147, 21976084, 23779057, 25813625, 27922743, 29940293, 31703551, 33078580, 33984868, 34404327, 34371989, 33959297, 33263293, 32405419, 31532476, 30808610, 30393428, 30412438, 30934006, 31965166, 33467416, 35381814, 37648818, 40213776, 43017818, 45980673, 48984704, 51869031, 54439645, 56495469, 57862330, 58421691, 58126062, 57006040, 55179691, 52860882, 50342865, 47936458, 45876188, 44241907, 42941353, 41761961, 40461332, 38852353, 36851094, 34478810, 31831462, 29041395, 26250650, 23599496, 21221047, 19231998, 17717528, 16717882]
37810A6717882m89997j4803M17268Q02622J120714J328939J381465J255305R64087
37801B3483482N56447J06830k97583n75432o73479n84780l53036n6489K25730
37792B1831690M47191O04410P17560Q01506Q52695Q57059Q03940O91947N25578
37783B8133576L09707M8582k48821n62509q62904j119892j308370j404895j388084
37774B1596390j255378j043756q26562o79980o45054p12781q34037r40085r65474
37765A3693283q70655o55530l53988j3403L25497O38171R16556J164198J387558
37756A6231687J586062J746091J842330J846425J741681J538810J280971J027849
37748B8841906Q24731O77932N53695L97968J61632j80123o16367j097795j547309
$$ y = [16717882, 16227885, 16213082, 16630350, 17432972, 18553686, 19882625, 21264090, 22519395, 23483482, 24039929, 24146759, 23849176, 23273744, 22600265, 22015485, 21662449, 21605960, 21831690, 22278881, 22883291, 23600851, 24402357, 25255052, 26112111, 26916051, 27607998, 28133576, 28443283, 28491865, 28243044, 27680535, 26817631, 25697739, 24389369, 22984474, 21596390, 20341012, 19297256, 18470694, 17790714, 17145660, 16432879, 15598842, 14658757, 13693283, 12822628, 12167098, 11813110, 11799707, 12125204, 12763375, 13679931, 14844129, 16231687, 17817749, 19563840, 21406170, 23252595, 24994276, 26533086, 27814057, 28841906, 29666637, 30344569, 30898264, 31296232, 31457864, 31277741, 30661374, 29563579, 28016270]
37739B8016270j885470k061434k071422j952351j756333j526834j293077j079304
37731A4390045r10854q05579p58278p35798o91652n92527m39744k71552j43024
37722I041037r3980j24807j97518k63313k98661l24719l96644n70402q69384j270217
37712D631392j711502k114442k401832k509978k396448k047681j486025p71838
37704a0808354M298P40621J349664J779245K019006K091964K040739J917942J780473
37695B915598J680941J654822J711441J837027K007260K197362K380622K518650
37687A8903723K556788K436409K122091J626375J012410L70264k16145o88960
37679B8122955j016015j182162j186480j045521p92462m67621j07293K61189O19604
$$ y = [28016270, 26130800, 24069366, 21997944, 20045593, 18289260, 16762426, 15469349, 14390045, 13479191, 12673612, 11915334, 11179536, 10487884, 9895357, 9455613, 9184061, 9041037, 8947057, 8822250, 8624732, 8361419, 8062758, 7738039, 7341395, 6770993, 5901609, 4631392, 2919890, 805448, -1596384, -4106362, -6502810, -8550491, -10036516, -10808354, -10804056, -10063435, -8713771, -6934526, -4915520, -2823556, -782817, 1135125, 2915598, 4596539, 6251361, 7962802, 9799829, 11807089, 14004451, 16385073, 18903723, 21460511, 23896920, 26019011, 27645386, 28657796, 29028060, 28811915, 28122955, 27106940, 25924778, 24738298, 23692777, 22900315, 22432694, 22325401, 22586590, 23206194]
37670B3206194R59651J282138J585887J847328K009135J997518J764902J328718
37662C5981471P75614K25693k19823n15108o72158p35337p50965p52699p65237
37653C2571451q12388r16269j088851j326211j610171j912588k198012k428295
37645B0278666k573834k626585k601469k519015k380455k158490j816542j342760
37637B259516p68753j56014M37107R79634J467707J907514K298832K629444K879378
37628A3934365L028224L059267K958991K716832K331490J822860J239097O47759
37620C1738885J11146l40462p19306j065296j414103j768937k093105k324488
37612B2124334k400595k282513j971257j511863r82039m68833m3312K57626M38565
$$ y = [23206194, 24165845, 25447983, 27033870, 28881198, 30890333, 32887851, 34652753, 35981471, 36757085, 36982778, 36762955, 36247847, 35575689, 34840352, 34089387, 33336688, 32571451, 31759063, 30842794, 29753943, 28427732, 26817561, 24904973, 22706961, 20278666, 17704832, 15078247, 12476778, 9957763, 7577308, 5418818, 3602276, 2259516, 1490763, 1334749, 1771856, 2751490, 4219197, 6126711, 8425543, 11054987, 13934365, 16962589, 20021856, 22980847, 25697679, 28029169, 29852029, 31091126, 31738885, 31850031, 31509569, 30790263, 29724967, 28310864, 26541927, 24448822, 22124334, 19723739, 17441226, 15469969, 13958106, 12976067, 12507234, 12463922, 12721548, 13160113]
37603A3160113N39730O16517P10663Q29113R44657J017117J019903R55138Q49258
37594B0642209P32778O18617M95223L38871J32960j21043m04061o83521r17279
37585B0834754j061998j089625j005890q58297p23824o76316p47425r05253j069272
37576A2696854j155682j123035r87771q04317o30569n04511m41752m45183n12650
37567F091384o37050q03053r85703j151391j261081j279676j193212j024559q31922
37558c076263o84932o31908o78993p91512r12654r87022r78059q73851o82815
37549a0298009m25449j27415J85207M89749P69276J011822J207485J346454J419271
37540d421609J417987J337307J176793R44909O62918L65254R5120j03004j92092
$$ y = [13160113, 13699843, 14316360, 15027023, 15856136, 16800793, 17817910, 18837813, 19792951, 20642209, 21374987, 21993604, 22488827, 22827698, 22960658, 22839615, 22435554, 21752033, 20834754, 19772756, 18683131, 17677241, 16818944, 16095120, 15418804, 14671379, 13766126, 12696854, 11541172, 10418137, 9430366, 8626049, 7995480, 7490969, 7049217, 6604034, 6091384, 5454334, 4651281, 3665578, 2514187, 1253106, -26570, -1219782, -2244341, -3076263, -3761195, -4393103, -5072096, -5863608, -6776262, -7763284, -8741343, -9615194, -10298009, -10723458, -10850873, -10665666, -10175917, -9406641, -8394819, -7187334, -5840880, -4421609, -3003622, -1666315, -489522, 455387, 1118305, 1483559, 1578679, 1475675, 1283583]
37531A283583j52856M673K34710M65542O28948O94225O81288O40515O13916O06775
37521E701319N87837N13247L55843J23439j40818l73979n16750n35165m33128
37512E281845k52045n5781R7200J84370K34467L14455M92872Q02463J225787J709727
37502A0035360K193853K630819K988709L242291L366884L341170L154460K811372
37494C3764918K332059J749986J108528M56427j56022o78318j061889j269724
37486C6245965j293934j169846r72302p91596p01518p35464q77727j069042j225419
37477B7409117j270215j170869r59695p20053n41985m76525n19115o27039p49787
37468B0373834q49173r03923r07183q63154p80990o64830n06749k92182j9320
$$ y = [1283583, 1130727, 1135400, 1370110, 1835652, 2464600, 3158825, 3840113, 4480628, 5094544, 5701319, 6289156, 6802403, 7158246, 7281685, 7140867, 6766888, 6250138, 5714973, 5281845, 5029800, 4974019, 5071219, 5255589, 5490056, 5804511, 6297383, 7099846, 8325633, 10035360, 12229213, 14860032, 17848741, 21091032, 24457916, 27799086, 30953546, 33764918, 36096977, 37846963, 38955491, 39411918, 39255896, 38577578, 37515689, 36245965, 34952031, 33782185, 32809883, 32018287, 31316769, 30581305, 29703578, 28634536, 27409117, 26138902, 24968033, 24008338, 23288285, 22746300, 22269775, 21750660, 21123621, 20373834, 19524661, 18620738, 17713555, 16850401, 16069411, 15404581, 14897832, 14605650, 14586330]
37459A4586330K79589N33910O58107N93903L45468j6300l84464o64342q12989
37450A5119212q48776q26282p93974p66610p32985o85933o39639o16442o22057
37441H586514o39397o45149o27077n85325n23788m44470l45630k18053m2736K00037
37431D714926N10232Q51665J156707J354753J409877J344928J234839J170085
37423A3748012J211869J366623J590626J812062J951441J935309J711024J265434
37415B6592400O37691q4735p86284j350766j688615j759540j583963j236023q18989
37406A7921176m33738j52958p757J2365n1383j43353k08363k01607r4336J23458
37396A6763504M43369Q40436J273587J685489K007354K171568K128065J859616
$$ y = [14586330, 14865919, 15399829, 16057936, 16651839, 16997307, 16981007, 16596543, 15932201, 15119212, 14270436, 13444154, 12650180, 11883570, 11150585, 10464652, 9825013, 9208571, 8586514, 7947117, 7301968, 6674891, 6089566, 5565778, 5121308, 4775678, 4557625, 4514889, 4714926, 5225158, 6076823, 7233530, 8588283, 9998160, 11343088, 12577927, 13748012, 14959881, 16326504, 17917130, 19729192, 21680633, 23615942, 25326966, 26592400, 27230091, 27145356, 26359072, 25008306, 23319691, 21560151, 19976188, 18740165, 17921176, 17487438, 17334480, 17326723, 17339088, 17287705, 17144352, 16935989, 16734382, 16640046, 16763504, 17206873, 18047309, 19320896, 21006385, 23013739, 25185307, 27313372, 29172988]
37388B9172988J395332Q19116K61420j34951k65425j04549K84642P74935J219620
37379C3423128J499912J558731J409501J119144P76197M58357K09530L1455j08342
37370D0377613k56146m49122p00131r94654j298564j572974j789757j939710k028891
37361B9347664k066583k053257j976186j817348j573024j275378r99046q41785
37353A6745057q86196j162921j632806k194160k712722l065532l181585l059143
37345a150008k751759k334765j872529j399565r18593m15412J13314O32879J063257
37336i033181J300902J259407R08082K91644m76599j247966j888072k321014k544696
37327a3751493k611263k590471k540914k499545k481761k481272k470590k411929
$$ y = [29172988, 30568320, 31387436, 31648856, 31513905, 31248480, 31143931, 31428573, 32203508, 33423128, 34923040, 36481771, 37891272, 39010416, 39786613, 40244970, 40454500, 40485955, 40377613, 40121467, 39672345, 38972214, 37977560, 36678996, 35106022, 33316265, 31376555, 29347664, 27281081, 25227824, 23251638, 21434290, 19861266, 18585888, 17586842, 16745057, 15858861, 14695940, 13063134, 10868974, 8156252, 5090720, 1909135, -1150008, -3901767, -6236532, -8109061, -9508626, -10427219, -10842631, -10729317, -10096438, -9033181, -7732279, -6472872, -5564790, -5273146, -5749745, -6997711, -8885783, -11206797, -13751493, -16362756, -18953227, -21494141, -23993686, -26475447, -28956719, -31427309, -33839238]
37319c3839238k282235k098480j919928j817359j827830j928834k049392k104122
37311d9867418k023839j771953j354469q28548k99162J08703K97470K40815j400
37302e5499801l07616n47820o38584n71759m04813k23187r6586m8560n0260m0185
37292e8429171M0394K17990M81693P99996J139106J466897J747519J943039K028006
37283d8564531K005664J911777J803647J742142J773984J916693K149288K415168
37275c2846168K640816K763613K754946K628715K434587K240709K110692K081235
37267a3190855K150285K283523K436287K577076K698306K810121K923153L029930
37259G717826L094135L055375K851849K450901J866699J149556L54773m81430
$$ y = [-33839238, -36121473, -38219953, -40139881, -41957240, -43785070, -45713904, -47763296, -49867418, -51891257, -53663210, -55017679, -55846227, -56145389, -56036686, -55739216, -55498401, -55499801, -55807417, -56355237, -56993821, -57565580, -57970393, -58193580, -58290166, -58338726, -58388986, -58429171, -58388777, -58170787, -57689094, -56889098, -55749992, -54283095, -52535576, -50592537, -48564531, -46558867, -44647090, -42843443, -41101301, -39327317, -37410624, -35261336, -32846168, -30205352, -27441739, -24686793, -22058078, -19623491, -17382782, -15272090, -13190855, -11040570, -8757047, -6320760, -3743684, -1045378, 1764743, 4687896, 7717826, 10811961, 13867336, 16719185, 19170086, 21036785, 22186341, 22541114, 22059684]
37251B2059684j337508k180633k947493l553735l928369m048940l952355l713179
37243c602528l403908l064547k699436k294620j834587j308393p14511p3141N63976
37234a8431695J123658J540852J786382J873494J843860J747180J625610J505216
37226e385443J393102J279911J148384R86879Q02663O26443N02413M67325N30355
37217B352032O65324Q19890R38846R91906R90456R79285J004346J077122J161734
37208A0980941J195041J125878R46589O96443M37013K19903P1299J030K0769J49961
37198A5844867M03544P73522J218556J667048K033704K247764K282859K168433
37190B8640297J969116J744005J516856J276832R99688O64814K57203k36375q24778
$$ y = [22059684, 20722176, 18541543, 15594050, 12040315, 8111946, 4063006, 110651, -3602528, -7006436, -10070983, -12770419, -15065039, -16899626, -18208019, -18922530, -18995671, -18431695, -17308037, -15767185, -13980803, -12107309, -10263449, -8516269, -6890659, -5385443, -3992341, -2712430, -1564046, -577167, 225496, 851939, 1354352, 1821677, 2352032, 3017356, 3837246, 4776092, 5767998, 6758454, 7737739, 8742085, 9819207, 10980941, 12175982, 13301860, 14248449, 14944892, 15381905, 15601808, 15673107, 15674137, 15694906, 15844867, 16248411, 17021933, 18240489, 19907537, 21941241, 24189005, 26471864, 28640297, 30609413, 32353418, 33870274, 35147106, 36146794, 36811608, 37068811, 36832436, 36007658]
37181C6007658j502920k242158k985599l650789m143216m381288m324183l988612
37173H788893l446138k803120k170139j628860j207724q79191n81212k48951J61301
37164d015141O60971J223558J783315K248918K536859K607319K477040K203140
37156A1725979J856706J505144J203367R84525Q51027P75358P13101O19608M63431
37147B0698246K37628l1279k85212m54269m87770l80254j79888K3108J23663L6255
37137A9300228k75530p85637j412461k042351k562245k891696l001856k912644
37129C415808k672268k334697j948109j554265j190730q90044o75577n56220n22736
37120h928838n48565n95153o18786n78213m46790k28624L3708K74254M37245N04278
$$ y = [36007658, 34504738, 32262580, 29276981, 25626192, 21482976, 17101688, 12777505, 8788893, 5342755, 2539635, 369496, -1259364, -2467088, -3346279, -3927491, -4176442, -4015141, -3354170, -2130612, -347297, 1901621, 4438480, 7045799, 9522839, 11725979, 13582685, 15087829, 16291196, 17275721, 18126748, 18902106, 19615207, 20234815, 20698246, 20935874, 20904595, 20619383, 20165114, 19677344, 19297090, 19117202, 19140310, 19263973, 19300228, 19024698, 18239061, 16826600, 14784249, 12222004, 9330308, 6328452, 3415808, 743540, -1591157, -3539266, -5093531, -6284261, -7174305, -7849882, -8406102, -8928838, -9477403, -10072556, -10691342, -11269555, -11716345, -11944969, -11911261, -11637007, -11199762, -10695484]
37110a0695484M94471M43934L88290L60551L93665N12673P18163R77159J232614
37101e173964J426824J524458J523893J454812J366992J315337J341690J452882
37093F232924J603561J701796J648173J393025R74644N08750J32022o6175q3056
37084A4045664Q717J11855J59352J38169P2564j1623j12459k53338m65192p61830
37074A2931879j121442j486203j782755j950072j954358j784439j440653r32586
37066D79371k86456M48197J200813J892620K456996K859451L104387L220941L237057
37057A8613377L162657K994398K734228K403197K039945J688441J386184J159194
37049C6181621J021338R72128R91625J037738J052463R77325P71606M26052l1972
$$ y = [-10695484, -10201013, -9757079, -9368789, -9008238, -8614573, -8101900, -7383737, -6406578, -5173964, -3747140, -2222682, -698789, 756023, 2123015, 3438352, 4780042, 6232924, 7836485, 9538281, 11186454, 12579479, 13554123, 14062873, 14194895, 14128720, 14045664, 14054381, 14166236, 14325588, 14463757, 14536321, 14524698, 14412239, 14158901, 13693709, 12931879, 11810437, 10324234, 8541479, 6591407, 4637049, 2852610, 1411957, 479371, 192915, 641112, 1841925, 3734545, 6191541, 9050992, 12155379, 15376320, 18613377, 21776034, 24770432, 27504660, 29907857, 31947802, 33636243, 35022427, 36181621, 37202959, 38175087, 39166712, 40204450, 41256913, 42234238, 43005844, 43431896, 43399924]
37040D3399924n43494j033032j429295j682726j773629j713197j543092j332390
37032C2349069j163672j105755j185322j377005j621488j861648k073076k267890
37024A9693213k469164k676573k852347k939516k895550k713471k419542k058970
37016a331920j681992j328531j006843o76941k58852L29253J123063K081637L087370
37007C36244L972524M563622M734539M452174L791438K905324J962919J090967
36999B7809751L49670k55379p47620j161353j533634j897464k271793k652784
36991A7639394l012503l307186l493018l543850l462246l276592l024814k734313
36983h215128k410604k042146j618714j151139o77942k53323P4973K82907L73841
$$ y = [43399924, 42856430, 41823398, 40394103, 38711377, 36937748, 35224551, 33681459, 32349069, 31185397, 30079642, 28894320, 27517315, 25895827, 24034179, 21961103, 19693213, 17224049, 14547476, 11695129, 8755613, 5860063, 3146592, 727050, -1331920, -3013912, -4342443, -5349286, -6026227, -6285079, -5955826, -4832763, -2751126, 336244, 4308768, 8872390, 13606929, 18059103, 21850541, 24755865, 26718784, 27809751, 28159421, 27904042, 27156422, 25995069, 24461435, 22563971, 20292178, 17639394, 14626891, 11319705, 7826687, 4282837, 820591, -2456001, -5480815, -8215128, -10625732, -12667878, -14286592, -15437731, -16115673, -16368996, -16294023, -16011116, -15637275]
36974a5637275L71221L08409K21569J46179J13549J44810K45429M06465O12225
36965a3067419Q44303J074743J257155J333486J261062J042333P33669M25065
36957e095603K02690J14729J56687K81076M23849N32377N82058N78172N47795
36948a676170N28150N54850O50041Q10495R99522J150176J183426J035005O78733
36939E914228J38117n15197j175822j730921k091587k216311k116855j846334
36931e640682j475412j063826o38154j89183L06091Q50830J406791J900983K257477
36922b285085K435147K448345K358414K243288K165791K157405K218913K328663
36914A6070881K450467K539779K550865K447620K215715J867249J430762R33823
$$ y = [-15637275, -15266054, -14957645, -14736076, -14589897, -14476348, -14331538, -14086109, -13679644, -13067419, -12223116, -11148373, -9891218, -8557732, -7296670, -6254337, -5520668, -5095603, -4892913, -4778184, -4621497, -4340421, -3916572, -3384195, -2802137, -2223965, -1676170, -1148020, -593170, 56871, 867366, 1866888, 3017064, 4200490, 5235495, 5914228, 6052345, 5537148, 4361326, 2630405, 538818, -1677493, -3794348, -5640682, -7116094, -8179920, -8818074, -9007257, -8701166, -7850336, -6443545, -4542562, -2285085, 150062, 2598407, 4956821, 7200109, 9365900, 11523305, 13742218, 16070881, 18521348, 21061127, 23611992, 26059612, 28275327, 30142576, 31573338, 32507161]
36906C2507161L96119j59801o95242j158520j503352j704781j762007j693470
36898B4226107j532205j322266j114981r65792r29819j051573j350342j810328
36890A4148801k380676k980790l507272l847728l905713l627884l018103k133922
36882a1253287j074106L4898J055210J860683K362946K528722K379745J977857
36874a27332J406239P55398J13245m45918q72735j146265j264888j232198j051723
36865c866177p35882l19608J37227N65581R12380J158342J318820J431230J537453
36856B139366J664997J808902J923582J936709J784742J451215R84731M86681
36848A4180925P5612j54967j66375K0881L46133P35276J120113J447446J682261
$$ y = [32507161, 32903280, 32743479, 32048237, 30889717, 29386365, 27681584, 25919577, 24226107, 22693902, 21371636, 20256655, 19290863, 18361044, 17309471, 15959129, 14148801, 11768125, 8787335, 5280063, 1432335, -2473378, -6101262, -9119365, -11253287, -12327393, -12292495, -11237285, -9376602, -7013656, -4484934, -2105189, -127332, 1278907, 2034305, 2147550, 1701632, 828897, -317368, -1582256, -2814454, -3866177, -4602059, -4921667, -4784440, -4218859, -3306479, -2148137, -829317, 601913, 2139366, 3804363, 5613265, 7536847, 9473556, 11258298, 12709513, 13694244, 14180925, 14256537, 14101570, 13935195, 13956076, 14302209, 15037485, 16157598, 17605044, 19287305]
36839A9287305J806412J812954J701584J481009J173625Q11587M23761K6979l68270
36830B8156946p44865j073731j320425j454975j457029j317915j044622o65220
36822A9078164k29688J98106N55438P97256R09303R14708Q70898Q54046R32921
36813B4881152J142154J468462J856459K227998K502753K613479K518529K214483
36805D1425469J743615J186476O37905J76964j55219l62503m85207n78628o86300
36796D2902572q22740r77551j135290j290699j446130j599722j742306j867659
36788C2020475j983295k108088k257285k427590k595052k728102k805345k822493
36780A2293225k781961k675482k477928k159490j706090j132282m80276J89969
$$ y = [19287305, 21093717, 22906671, 24608255, 26089264, 27262889, 28074476, 28498237, 28525216, 28156946, 27412081, 26338350, 25017925, 23562950, 22105921, 20788006, 19743384, 19078164, 18848476, 19046582, 19602020, 20399276, 21308579, 22223287, 23094185, 23948231, 24881152, 26023306, 27491768, 29348227, 31576225, 34078978, 36692457, 39210986, 41425469, 43169084, 44355560, 44993465, 45170429, 45015210, 44652707, 44167500, 43588872, 42902572, 42079832, 41102281, 39966991, 38676292, 37230162, 35630440, 33888134, 32020475, 30037180, 27929092, 25671807, 23244217, 20649165, 17921063, 15115718, 12293225, 9511264, 6835782, 4357854, 2198364, 492274, -640008, -1120284, -930315]
36772i30315Q12035J322783J672232J835159J821218J675603J464923J253228
36764A0926866J081669R61790Q81399Q15177P35201O21290M69930K96728J28490
36755A6918540j1504j15024j88612k41732k72923k65861k00168p0626R8156K51732
36745A5901978L20625K41395k5672m86131j106959j817639k519829l107800l494796
36736C905172l634038l524610l201295k715702k117814j443444p10175P5316Q98083
36727a2468507J713854K445764L010401L358302L495374L466054L314077L055848
36719A1391167K685895K204931J646647J084688O14134L15171K17629K86694M37405
36710B0884361N68359N97980M90321K62721k7900l14409n48318p11656q07967
$$ y = [-930315, -118280, 1204503, 2876735, 4711894, 6533112, 8208715, 9673638, 10926866, 12008535, 12970325, 13851724, 14666901, 15402102, 16023392, 16493322, 16790050, 16918540, 16907036, 16792012, 16603400, 16361668, 16088745, 15822884, 15622716, 15552090, 15650246, 15901978, 16222603, 16463998, 16438326, 15952195, 14845236, 13027597, 10507768, 7399968, 3905172, 271134, -3253476, -6454771, -9170473, -11288287, -12731731, -13441906, -13366590, -12468507, -10754653, -8308889, -5298488, -1940186, 1555188, 5021242, 8335319, 11391167, 14077062, 16281993, 17928640, 19013328, 19627462, 19942633, 20160262, 20446956, 20884361, 21452720, 22050700, 22541021, 22803742, 22775842, 22461433, 21913115, 21201459, 20393492]
36701B0393492q44198q20356p35426o02129m52944l27062k48765k18994k28606
36692A5915012k78029l82624n60093q12562j115184j414724j638747j715324j597110
36683F400615j278298p97017k24882L50511Q44939J193293J356803J322676J102636
36674A0271276P33240K72242k15135o75445j078912j415508j679464j855221j916231
36665B440842j838083j616237j274229q55045m02288N3046M89408Q81221J194092
36656i27273J401491J512493J583397J696215J915534K252671K656370L029574
36648A5120472L263063L277392L059714K674942K238688J863871J611856J474509
36640C4584507J392697J297309J149342R56614P57703N85779M40687K91388J05585
$$ y = [20393492, 19549294, 18728938, 17993512, 17391383, 16938439, 16611377, 16362612, 16143618, 15915012, 15636983, 15254359, 14694266, 13881704, 12766520, 11351796, 9713049, 7997725, 6400615, 5122317, 4325300, 4100418, 4450929, 5295868, 6489161, 7845964, 9168640, 10271276, 11004516, 11276758, 11061623, 10386178, 9307266, 7891758, 6212294, 4357073, 2440842, 602759, -1013478, -2287707, -3142752, -3545040, -3491994, -3002586, -2121365, -927273, 474218, 1986711, 3570108, 5266323, 7181857, 9434528, 12090898, 15120472, 18383535, 21660927, 24720641, 27395583, 29634271, 31498142, 33109998, 34584507, 35977204, 37274513, 38423855, 39380469, 40138172, 40723951, 41164638, 41456026, 41561611]
36631D1561611j19291l50165n42526o74619p63247q48370r59491j090661j202024
36622C5011217j244519j189179j043209q46283o52607n10119m46435m64889n48708
36613B8065269o69303p94653q94708r43878r24489q34462o94472n43550m18415
36604B1347339l28417k47486j34108L2414K25695L75776M01462K52825n8685m56898
36594B1409917q26293j056800j089753r43224p02929m82940l77453m26787o08713
36585A4895025q53374j075227j212496j257331j257412j285111j395165j599985
36577D958924j872580k162656k408735k545345k514149k280575j847010j254166
36569a1926292n69936J29293P76922J325326J743498K011980K125620K100782
$$ y = [41561611, 41442320, 41092155, 40549629, 39875010, 39111763, 38263393, 37303902, 36213241, 35011217, 33766698, 32577519, 31534310, 30688027, 30035420, 29525301, 29078866, 28613977, 28065269, 27395966, 26601313, 25706605, 24762727, 23838238, 23003776, 22309304, 21765754, 21347339, 21018922, 20771436, 20637328, 20669742, 20895437, 21271213, 21672675, 21925500, 21866815, 21409917, 20583624, 19526824, 18437071, 17493847, 16790918, 16307978, 15930525, 15503738, 14895025, 14041651, 12966424, 11753928, 10496597, 9239185, 7954074, 6558909, 4958924, 3086344, 923688, -1485047, -4030392, -6544541, -8825116, -10672126, -11926292, -12496228, -12366935, -11590013, -10264687, -8521189, -6509209, -4383589, -2282807]
36561b282807J972134J773847J520951J209348Q32470L95152q7346n96846j111030
36552C625873j591572j976280k191178k182788j951857j564750j131973p63962
36544i728487n25878m11945l51679k47300k3515L40542Q15079J346670J879328
36535f907185K355884K712596K884983K825780K522699K006538J346915O35478
36527A0383688l8290o04383j011157j214121j177332q95935m19447J52031P01440
36518E876494J132847J389118J448395J315510J018708O08438J52517k71589n86007
36509A2084431p27374o69059m38641j12883K11594M51272N50543M78541K25550
36500A2053974j90371p15712j268724j764834k146503k398488k539444k597256
$$ y = [-2282807, -310673, 1463174, 2984125, 4193473, 5025943, 5421095, 5333749, 4736903, 3625873, 2034301, 58021, -2133157, -4315945, -6267802, -7832552, -8964525, -9728487, -10254365, -10666310, -11017989, -11265289, -11288804, -10948262, -10133183, -8786513, -6907185, -4551301, -1838705, 1046278, 3872058, 6394757, 8401295, 9748210, 10383688, 10345398, 9741015, 8729858, 7515737, 6338405, 5442470, 5023023, 5175054, 5876494, 7009341, 8398459, 9846854, 11162364, 12181072, 12789510, 12942027, 12670438, 12084431, 11357057, 10687998, 10249357, 10136474, 10348068, 10799340, 11349883, 11828424, 12053974, 11863603, 11147891, 9879167, 8114333, 5967830, 3569342, 1029898, -1567358]
36492a567358k586464k501931k327906k050385j663961j174907o05237L819N94586
36483a3879744J103242J473132J666657J673752J514234J230645Q73611M89551
36475c854920J19544j93393m01321m61941l57714j08322K35102O10836R67405
36466c444724J270548J496496J624737J642440J557853J407884J248780J135139
36458G939153J102404J161578J301078J487271J665396J771313J756911J613990
36450A9799094J375801J093627Q10506N56061L60304K60273K81112M05040N60729
36441B5502547O50075N96897L84924O2827k82867n68452p44984q07802p84217
$$ y = [-1567358, -4153822, -6655753, -8983659, -11034044, -12698005, -13872912, -14478149, -14474330, -13879744, -12776502, -11303370, -9636713, -7962961, -6448727, -5218082, -4344471, -3854920, -3735376, -3928769, -4330090, -4792031, -5149745, -5258067, -5022965, -4412129, -3444724, -2174176, -677680, 947057, 2589497, 4147350, 5555234, 6804014, 7939153, 9041557, 10203135, 11504213, 12991484, 14656880, 16428193, 18185104, 19799094, 21174895, 22268522, 23079028, 23635089, 23995393, 24255666, 24536778, 24941818, 25502547, 26152622, 26749519, 27134443, 27197270, 26914403, 26345951, 25600967, 24793165, 24008948]
$$ [...]
##END NTUPLES=NMR SPECTRUM
##END=
