##TITLE=31Pdec_DE-21_oil_d6
 DMSO-d6
 84 sc
 6.6.2024
##JCAMPDX= 6.0         $$ Bruker NMR JCAMP-DX V2.0
##DATA TYPE= NMR SPECTRUM
##DATA CLASS= NTUPLES
##ORIGIN= UXNMR, Bruker Analytische Messtechnik GmbH
##OWNER= root
$$ XWIN-NMR		Version 3.5
$$ Thu Jun  6 15:29:47 2024 Russian Standard Time (UT+4h)  she@DPX200
##.OBSERVE FREQUENCY= 81.013821
##.OBSERVE NUCLEUS= ^31P
##.ACQUISITION MODE= SIMULTANEOUS
##.ACQUISITION SCHEME= undefined
##.AVERAGES= 64
##.DIGITISER RES= 16
##SPECTROMETER/DATA SYSTEM= spect
##.PULSE SEQUENCE= zgpg30
##.SOLVENT NAME= CDCl3
##.SHIFT REFERENCE= (INTERNAL, CDCl3, 0, 248.564)
##AUDIT TRAIL= $$ (NUMBER, WHEN, WHO, WHERE, WHAT)
$$ ##TITLE= Audit trail, XWIN-NMR		Version 3.5
$$ ##JCAMPDX= 5.01
$$ ##ORIGIN= Bruker BioSpin GmbH
$$ ##OWNER= she
$$ F:/spectra/data/she/nmr/P31/1/pdata/1/auditp.txt
$$ ##AUDIT TRAIL=  $$ (NUMBER, WHEN, WHO, WHERE, WHAT)
(   1,<2024-06-06 15:28:43.98 +0400>,<she>,<DPX200>,
      <continue with go, POWCHK disabled, PULCHK disabled
       configuration hash MD5:
       00 E9 B6 7A A2 85 ED C7 34 08 36 98 17 FE 4E 26
       data hash MD5: 32K
       DB B7 83 D3 F6 D7 2E B9 1C 38 E9 D6 2E D8 83 16>)
(   2,<2024-06-06 15:28:46.62 +0400>,<she>,<DPX200>,
      <Start of raw data processing
       efp BC_mod = 2 LB = 10 FT_mod = 6 PKNL = 1 PHC0 = -168.9472 PHC1 = -29.40008 SI = 64K 
       data hash MD5: 64K
       F7 0C 91 AD 7A 8D 05 40 E5 7C 64 39 1A EB 34 92>)
(   3,<2024-06-06 15:29:14.48 +0400>,<she>,<DPX200>,
      <pk PHC0 = 42.88485 PHC1 = -172.5999 
       data hash MD5: 64K
       1E F6 76 A0 B7 76 2E 5A 23 C5 9C 7B 72 38 F6 CC>)
$$ ##END=
$$ 
$$ hash MD5
$$ 65 FF 0E 85 C2 60 9E B6 29 78 34 C4 2C 81 A2 31
##$RELAX= 
##$RELAX= 
##$RELAX= 
##$RELAX= 
##$RELAX= 
##$RELAX= 
##$RELAX= 
##$RELAX= 
##$RELAX= 
$$ Bruker specific parameters
$$ --------------------------
##$DU= <F:/spectra>
##$EXPNO= 1
##$NAME= <P31>
##$PROCNO= 1
##$TYPE= <nmr>
##$USER= <she>
##$AMP= (0..31)
100 100 100 100 100 100 100 100 100 100 100 100 100 100 100 100 100 100 
100 100 100 100 100 100 100 100 100 100 100 100 100 100 
##$AQSEQ= 0
##$AQ_mod= 1
##$AUNM= <au_zg>
##$AUTOPOS= <>
##$BF1= 81.014009
##$BF2= 200.13
##$BF3= 200.13
##$BF4= 200.13
##$BF5= 200.13
##$BF6= 200.13
##$BF7= 200.13
##$BF8= 200.13
##$BYTORDA= 1
##$CFDGTYP= 0
##$CFRGTYP= 5
##$CHEMSTR= <none>
##$CNST= (0..31)
1 1 145 1 1 1 1 1 1 1 1 1 1 1 1 1 1 1 1 1 1 1 1 1 1 1 1 1 1 1 1 1 
##$CPDPRG= <waltz16>
##$CPDPRG1= <>
##$CPDPRG2= <waltz16>
##$CPDPRG3= <>
##$CPDPRG4= <mlev>
##$CPDPRG5= <mlev>
##$CPDPRG6= <mlev>
##$CPDPRG7= <mlev>
##$CPDPRG8= <mlev>
##$CPDPRGB= <>
##$CPDPRGT= <>
##$D= (0..31)
0 1 0 0 0 0 0 0 0 0 0 0.03 2e-05 3e-06 0 0 0 0 0 0 0 0 0 0 0 0 0 0 0 0 
0 0 
##$DATE= 1717673249
##$DBL= (0..7)
120 120 120 11 120 120 24 19 
##$DBP= (0..7)
150 150 150 150 150 150 150 150 
##$DBP07= 0
##$DBPNAM0= <>
##$DBPNAM1= <>
##$DBPNAM2= <>
##$DBPNAM3= <>
##$DBPNAM4= <>
##$DBPNAM5= <>
##$DBPNAM6= <>
##$DBPNAM7= <>
##$DBPOAL= (0..7)
0.5 0.5 0.5 0.5 0.5 0.5 0.5 0.5 
$$ [...]
##$SUBNAM2= <"">
##$SUBNAM3= <"">
##$SUBNAM4= <"">
##$SUBNAM5= <"">
##$SUBNAM6= <"">
##$SUBNAM7= <"">
##$SUBNAM8= <"">
##$SUBNAM9= <"">
##$SW= 501.771253377433
##$SWIBOX= (0..15)
0 1 3 0 0 0 0 0 0 0 0 0 0 0 0 0 
##$SW_h= 40650.406504065
##$TD= 32768
##$TD0= 1
##$TE= 0
##$TE2= 300
##$TE3= 300
##$TEG= 300
##$TL= (0..7)
0 120 53 12 22 120 120 120 
##$TP= (0..7)
150 150 150 150 150 150 150 150 
##$TP07= 0
##$TPNAME0= <>
##$TPNAME1= <>
##$TPNAME2= <>
##$TPNAME3= <>
##$TPNAME4= <>
##$TPNAME5= <>
##$TPNAME6= <>
##$TPNAME7= <>
##$TPOAL= (0..7)
0.5 0.5 0.5 0.5 0.5 0.5 0.5 0.5 
##$TPOFFS= (0..7)
0 0 0 0 0 0 0 0 
##$TUNHIN= 0
##$TUNHOUT= 0
##$TUNXOUT= 0
##$USERA1= <user>
##$USERA2= <user>
##$USERA3= <user>
##$USERA4= <user>
##$USERA5= <user>
##$V9= 5
##$VALIST= <valist>
##$VCLIST= <CCCCCCCCCCCCCCC>
##$VD= 0
##$VDLIST= <DDDDDDDDDDDDDDD>
##$VPLIST= <PPPPPPPPPPPPPPP>
##$VTLIST= <TTTTTTTTTTTTTTT>
##$WBST= 1024
##$WBSW= 4
##$XGAIN= (0..3)
0 0 0 0 
##$XL= 0
##$YL= 0
##$YMAX_a= 3604
##$YMIN_a= -1971
##$ZGOPTNS= <>
##$ZL1= 120
##$ZL2= 120
##$ZL3= 120
##$ZL4= 120
##$ABSF1= 0
##$ABSF2= 0
##$ABSG= 0
##$ABSL= 0
##$ALPHA= 0
##$AQORDER= 0
##$ASSFAC= 0
##$ASSFACI= 0
##$ASSFACX= 0
##$ASSWID= 0
##$AUNMP= <proc_1d>
##$AZFE= 0.1
##$AZFW= 0.5
##$BCFW= 0
##$BC_mod= 2
##$BYTORDP= 0
##$COROFFS= 0
##$CY= -3
##$DATMOD= 1
##$DC= 0
##$DFILT= <>
##$DTYPP= 0
##$F1P= 0
##$F2P= 0
##$FCOR= 1
##$FTSIZE= 65536
##$FT_mod= 6
##$GAMMA= 0
##$GB= 0
##$INTBC= 1
##$INTSCL= 6.047779e-11
##$ISEN= 30
##$LB= 10
##$LEV0= 0
##$LPBIN= 0
##$MAXI= 10000
##$MC2= 0
##$MEAN= 0
##$ME_mod= 0
##$MI= 50
##$NCOEF= 0
##$NC_proc= -10
##$NLEV= 6
##$NOISF1= 182.463
##$NOISF2= 159.3651
##$NSP= 0
##$NTH_PI= 0
##$NZP= 0
##$OFFSET= 248.5645
##$PC= 4
##$PHC0= -126.0624
##$PHC1= -202
##$PH_mod= 1
##$PKNL= yes
##$PPARMOD= 0
##$PSCAL= 0
##$PSIGN= 0
##$REVERSE= no
##$SF= 81.0140089999694
##$SI= 65536
##$SIGF1= 159.3651
##$SIGF2= -187.1042
##$SINO= 113.3802
##$SIOLD= 16384
##$SREGLST= <1H.CDCl3>
##$SSB= 0
##$STSI= 65536
##$STSR= 0
##$SW_p= 40650.406504065
##$SYMM= 0
##$S_DEV= 0
##$TDeff= 32768
##$TDoff= 0
##$TI= <>
##$TILT= no
##$TM1= 0
##$TM2= 0
##$TOPLEV= 0
##$USERP1= <user>
##$USERP2= <user>
##$USERP3= <user>
##$USERP4= <user>
##$USERP5= <user>
##$WDW= 1
##$XDIM= 65536
##$YMAX_p= 292185970
##$YMIN_p= -79993882
$$ End of Bruker specific parameters
$$ ---------------------------------
##NTUPLES= NMR SPECTRUM
##VAR_NAME=  FREQUENCY,     SPECTRUM/REAL,   SPECTRUM/IMAG
##SYMBOL=    X,             R,               I
##VAR_TYPE=  INDEPENDENT,   DEPENDENT,       DEPENDENT
##VAR_FORM=  AFFN,          ASDF,            ASDF
##VAR_DIM=   65536,         65536,           65536
##UNITS=     HZ,            ARBITRARY UNITS, ARBITRARY UNITS
##FACTOR=    0.620285442955139, 1,           1
##FIRST=     20137.2065510682, 0,            0
##LAST=      -20513.1999529968, 0,           0
##MIN=       -20513.1999529968, -79993882,   0
##MAX=       20137.2065510682, 292185970,    0
$$ Real data points
##PAGE= N=1
##DATA TABLE= (X++(R..R)), XYDATA
$$ [...]
13081A480304n45780r10913j130153j201647j160440j052775r10466p39856n28759
13072f700485k64333M9863L87316P05495R61634J128003J198806J186858J114490
13063b32353J005125Q79098P52944O39519N47565M81344M41158M24535M27220
13054E366155M43690M67411M91666N11529N26105N38578N52349N65506N68519
13045A0031508N47452M90147L91717K57932J06059l8603j50694k12612k16604
13036A1206302j61186m7861J17652L21491N39051P35670Q70934R07154Q21290
13027A5310497O16185L25168N417k80426m88169o08661o65314o93765p19260p47799
13017A2053873p72471p83831p74725p39846o74949n77478m46533k80921p6871
$$ y = [1480304, 934524, 23611, -1106542, -2308189, -3468629, -4521404, -5431870, -6171726, -6700485, -6964818, -6914955, -6527639, -5822144, -4860510, -3732507, -2533701, -1346843, -232353, 772772, 1651870, 2404814, 3044333, 3591898, 4073242, 4514400, 4938935, 5366155, 5809845, 6277256, 6768922, 7280451, 7806556, 8345134, 8897483, 9462989, 10031508, 10578960, 11069107, 11460824, 11718756, 11824815, 11786212, 11635518, 11422906, 11206302, 11045116, 10997255, 11114907, 11436398, 11975449, 12711119, 13582053, 14489207, 15310497, 15926682, 16251850, 16257267, 15976841, 15488672, 14880011, 14214697, 13520932, 12801672, 12053873, 11281402, 10497571, 9722846, 8983000, 8308051, 7730573, 7284040, 7003119, 6926248]
13008F926248J70946M62804P84135J100089J361324J519805J545093J431913J197786
12999A6500143Q75574N05228J25705k32030n48485q14432j027708j192073j318577
12990A2873345j425109j530029j641562j750441j832791j863298j830214j741197
12982g41296j615187j466894j297393j099465q73063o36977m26021k74777j98115
12973h629188j80076j78166j42550m0419J29432L40902N58220P51356Q98535R79560
12963e512394R72090Q57682O33235L18026m8807m17579p38506r70461j087706
12954e994420j082787r63044p42647m37586o8591L32519P22256J053478J285684
12945e895138J390970J355981J183798Q96460N34591J51461j97788m68650o37191
$$ y = [6926248, 7097194, 7559998, 8344133, 9444222, 10805546, 12325351, 13870444, 15302357, 16500143, 17375717, 17880945, 18006650, 17774620, 17226135, 16411703, 15383995, 14191922, 12873345, 11448236, 9918207, 8276645, 6526204, 4693413, 2830115, 999901, -741296, -2356483, -3823377, -5120770, -6220235, -7093298, -7730275, -8156296, -8431073, -8629188, -8809264, -8987430, -9129980, -9170399, -9040967, -8700065, -8141845, -7390489, -6491954, -5512394, -4540304, -3682622, -3049387, -2731361, -2780168, -3197747, -3936253, -4906714, -5994420, -7077207, -8040251, -8782898, -9220484, -9289075, -8956556, -8234300, -7180822, -5895138, -4504168, -3148187, -1964389, -1067929, -533338, -381877, -579665, -1048315, -1685506]
12936a685506p03016o83432o02587m82599l40480j88868l6998J08029K38027L40374
12926d037056L99470M03674L51266K48877J04721p4816k81237m98195p01257q64191
12916d948744r67415j004722r85548r29683q54585p63045o41756m72605k46677
12907a1814780L0162L41785O69582R96305J303564J565348J744137J797130J693522
12898a673245J432842J050466O06144J64541k19824n09090o83393p40154o91134
12889a262847n58198l71412j70413k693Q8866Q6488J1343q2754j33848r8595L3801
12878b460262K42986M86772P11439Q61658Q91712P77447N24720J69428k32142
12869A973758o18161r34354j141808j221393j177899j042688q69169p16898o27309
$$ y = [-1685506, -2388522, -3071954, -3674541, -4157140, -4497620, -4686488, -4723486, -4615457, -4377430, -4037056, -3637586, -3233912, -2882646, -2633769, -2529048, -2603864, -2885101, -3383296, -4084553, -4948744, -5916159, -6920881, -7906429, -8836112, -9690697, -10453742, -11095498, -11568103, -11814780, -11784618, -11442833, -10773251, -9776946, -8473382, -6908034, -5163897, -3366767, -1673245, -240403, 810063, 1416207, 1580748, 1360924, 851834, 168441, -571713, -1262847, -1821045, -2192457, -2362870, -2365563, -2276697, -2190209, -2178866, -2261620, -2395468, -2494063, -2460262, -2217276, -1730504, -1019065, -157407, 734305, 1511752, 2036472, 2205900, 1973758, 1355597, 421243, -720565, -1941958, -3119857, -4162545, -5031714, -5748612, -6375921]
12860f375921o02012n97567n44334l82893r7588K74241O63149J002641J253560
12851e406724J404766J458160J416662J285551J081575Q37285N94870L93964K61267
12842C327376K05978K20617K85256L72704M52884M96717M81257L95216K40197
12833F478202K5535k37446n33230q33193j092543j262942j314638j251041j105075
12824a126371r21691p39144n79127m49144l53391l01598l04952l60250m38214
12815e573882m91048m75592l73170j92757L8948K89698N30890P43394R18315J051806
12805c533398J139417J177283J169253J130388J080065J028587R68196Q76727
12797E036518P33042N33587K96306M7599j95827m32689o65978q88130j077503
$$ y = [-6375921, -6977933, -7575500, -8119834, -8502727, -8600315, -8326074, -7662925, -6660284, -5406724, -4001958, -2543798, -1127136, 158415, 1239990, 2077275, 2672145, 3066109, 3327376, 3533354, 3753971, 4039227, 4411931, 4864815, 5361532, 5842789, 6238005, 6478202, 6503737, 6266291, 5733061, 4899868, 3807325, 2544383, 1229745, -21296, -1126371, -2048062, -2787206, -3366333, -3815477, -4168868, -4470466, -4775418, -5135668, -5573882, -6064930, -6540522, -6913692, -7106449, -7067501, -6777803, -6246913, -5503519, -4585204, -3533398, -2393981, -1216698, -47445, 1082943, 2163008, 3191595, 4159791, 5036518, 5769560, 6303147, 6599453, 6647052, 6451225, 6018536, 5352558, 4464428, 3386925]
12788C386925j207444j258164j223507j111796r42333p38608n20680l01107q6864
12779d003578J14502K88405M10227M48855L77833J90227r1836m21556p46214j030087
12769d463222j266545j470272j654104j806737j887568j843338j636263j266611
12761a7294660p77342k40035K69033O91270R98514J193101J296303J330737J306658
12752a1226421J221678J075212Q86896P02877N81905N68805O73350Q67861J101882
12743c545955J320923J478385J539583J482684J299744R98664O06287J70785k42644
12734E108456n67196p55563p94382p04198n27614l12611r6833J01233K78214M30463
12724B159969N39400N70104M84241K58394j01359n54083j031310j456022j763616
$$ y = [3386925, 2179481, 921317, -302190, -1413986, -2356319, -3094927, -3615607, -3916714, -4003578, -3889076, -3600671, -3190444, -2741589, -2363756, -2173529, -2265365, -2686921, -3433135, -4463222, -5729767, -7200039, -8854143, -10660880, -12548448, -14391786, -16028049, -17294660, -18072002, -18312037, -18043004, -17351734, -16353220, -15160119, -13863816, -12533079, -11226421, -10004743, -8929531, -8042635, -7339758, -6757853, -6189048, -5515698, -4647837, -3545955, -2225032, -746647, 792936, 2275620, 3575364, 4574028, 5180315, 5351100, 5108456, 4541260, 3785697, 2991315, 2287117, 1759503, 1446892, 1350059, 1451292, 1729506, 2159969, 2699369, 3269473, 3753714, 4012108, 3910749, 3356666, 2325356, 869334, -894282]
12715h94282j912686j883512j673959j301297q06939k54826K80661P32457J055858
12706f658525J234891J279023J213676J069768Q75803O53906M20526J91017j6699
12697B63386j84945l04382l78311m16899m26885m07955l58693k83487j91970r2637
12687b782778J1305J20194K34059L51220M69275N85328O94254P86485Q47470Q59972
12677B176784Q09880O94300N27622L39744J65345L0611n3276q6055o8427M815
12667D541343J42708L48283O08593Q93059J162317J380604J521648J565272J492268
12658A3656095J287269R50056N05281P59n04695r53866j296904j493476j519237
12649A0631282j376766j100833p48537l77529k6701K88121N63688P95714R74250
$$ y = [-894282, -2806968, -4690480, -6364439, -7665736, -8472675, -8727501, -8446840, -7714383, -6658525, -5423634, -4144611, -2930935, -1861167, -985364, -331458, 89068, 280085, 263386, 78441, -225941, -604252, -1021151, -1448036, -1855991, -2214684, -2498171, -2690141, -2782778, -2771473, -2651279, -2417220, -2066000, -1596725, -1011397, -317143, 469342, 1316812, 2176784, 2986664, 3680964, 4208586, 4548330, 4713675, 4744286, 4691010, 4604955, 4536528, 4541343, 4684051, 5032334, 5640927, 6533986, 7696303, 9076907, 10598555, 12163827, 13656095, 14943364, 15893420, 16398701, 16399460, 15894765, 14940899, 13643995, 12150519, 10631282, 9254516, 8153683, 7405146, 7027617, 7000916, 7289037, 7852725, 8648439, 9622689]
12640I622689J090323J145438J153405J131651J088467J015097Q87510O77563
12632A7812143L69214k8693m82516r47828j385618j766283k060946k235354k259753
12623G014366k129188j874363j549778j207022q74538n58188k57453K0154K58266
12614a157744M40918N60204O15911O10607N47018M30293K72014R0521r5228k74295
12604B040219m45460o06787p41579q17982q09120p18319n84751m61451l84010
12595c529240l56225l61127l82722m18798m78500n71603o97828q39521r60177
12586h595741j012735r57303p79600m99486j66189J55358M01790N28320N20159
12577a0405427L92808J81954o8580l13284n06784o07224n84014m26506j48374
$$ y = [9622689, 10713012, 11858450, 13011855, 14143506, 15231973, 16247070, 17134580, 17812143, 18181357, 18152664, 17670148, 16722320, 15336702, 13570419, 11509473, 9274119, 7014366, 4885178, 3010815, 1461037, 254015, -620523, -1178711, -1436164, -1416010, -1157744, -716826, -156622, 459289, 1069896, 1616914, 2047207, 2319221, 2409742, 2314514, 2040219, 1594759, 987972, 246393, -571589, -1380709, -2099028, -2683779, -3145230, -3529240, -3885465, -4246592, -4629314, -5048112, -5526612, -6098215, -6796043, -7635564, -8595741, -9608476, -10565779, -11345379, -11844865, -12011054, -11855696, -11453906, -10925586, -10405427, -10012619, -9830665, -9899245, -10212529, -10719313, -11326537, -11910551, -12337057, -12485431]
12568a2485431K14718O13194R94546J313705J540062J660354J678165J610663
12560b860024J482615J318268J134427R39663P41497N55542M06102L14757K86468
12551D319315L06994L54062M10738M68946N23227N64198N78981N57535M98916
12542H582912M12183L11213K07824J09277K1749m5020p7401o1479J3607J53870
12532I628735L56927O05413Q62593J077551J200743J201616J077632Q51175N59430
12523A7421815K44036n7395l18603n28682o88622q01377q63294q63936p93439
12514A2750503o51333m51898k23683k035J83252L17459M00266M36159M25425L63121
12504A3547236K44883P3957j34181l51139n40996o72564p33661p37784p16585
$$ y = [-12485431, -12270713, -11657519, -10662973, -9349268, -7809206, -6148852, -4470687, -2860024, -1377409, -59141, 1075286, 2014949, 2756446, 3311988, 3718090, 4032847, 4319315, 4626309, 4980371, 5391109, 5860055, 6383282, 6947480, 7526461, 8083996, 8582912, 8995095, 9306308, 9514132, 9623409, 9645158, 9600138, 9522737, 9461258, 9474865, 9628735, 9985662, 10591075, 11453668, 12531219, 13731962, 14933578, 16011210, 16862385, 17421815, 17665851, 17608456, 17289853, 16761171, 16072549, 15271172, 14407878, 13543942, 12750503, 12099170, 11647272, 11423589, 11421554, 11604806, 11922265, 12322531, 12758690, 13184115, 13547236, 13792119, 13866076, 13731895, 13380756, 12839760, 12167196, 11433535, 10695751, 9979166]
12495I979166p01408p05614p19240p18440o81690o00901m81496l35245j74847
12486D860285j5164J23012K14884K41758K02343J15674J3298p3997j28729j54738
12476E398626j76250k23886l11656m20025m99096m90820l55261q6424K86306P07953
12466C829467J114373J449953J679929J792730J793784J696555J516256J268204
12458A6141251R69264O39092K99027l0368l31027n88777p96273r56427j081670
12449A4264092j186954j281169j364165j431574j483089j527225j577769j642088
12441B770059j707807j738790j687332j517611j225348q40774m14750L09L62634
12432e999410O43777Q27633R11768R10093Q51486P72023P04707O72451O86322
$$ y = [9979166, 9277758, 8572144, 7852904, 7134464, 6452774, 5851873, 5370377, 5035132, 4860285, 4845121, 4968133, 5183017, 5424775, 5627118, 5742792, 5756090, 5682093, 5553364, 5398626, 5222376, 4998490, 4686834, 4266809, 3767713, 3276893, 2921632, 2835208, 3121514, 3829467, 4943840, 6393793, 8073722, 9866452, 11660236, 13356791, 14873047, 16141251, 17110515, 17749607, 18048634, 18018266, 17687239, 17098462, 16302189, 15345762, 14264092, 13077138, 11795969, 10431804, 9000230, 7517141, 5989916, 4412147, 2770059, 1062252, -676538, -2363870, -3881481, -5106829, -5947603, -6362353, -6362044, -5999410, -5355633, -4528000, -3616232, -2706139, -1854653, -1082630, -377923, 294528, 980850]
12423I80850P46592Q43917R59857J068010J137733J141839J067066R22119P36621
12414I604604N48621L86295K54969J37883R933j45087l24351n07099o63713p66687
12404H535368p98939p57482o52731n05859l46313k08453j23785j08715j54620
12395D878471k28202k83068k75890j80236M646K51518N12076P33348Q76552R28124
12385G217339Q97970Q09021O85783N46836M01932K52536R4748p5738k56914m34083
12375A0139430n78927o57990o47745n46528l75740j71574K5983J82993K79727
12366G649629L14720L00138K49468J66795M6731j15979l16414n36752p51965r40306
12356F066065j093419j219656j336516j455569j571234j663434j712498j713147
$$ y = [980850, 1727442, 2571359, 3531216, 4599226, 5736959, 6878798, 7945864, 8867983, 9604604, 10153225, 10539520, 10794489, 10932372, 10942305, 10797218, 10472867, 9965768, 9302055, 8535368, 7736429, 6978947, 6326216, 5820357, 5474044, 5265591, 5141806, 5033091, 4878471, 4650269, 4367201, 4091311, 3911075, 3915721, 4167239, 4679315, 5412663, 6289215, 7217339, 8115309, 8924330, 9610113, 10156949, 10558881, 10811417, 10906165, 10830427, 10573513, 10139430, 9560503, 8902513, 8254768, 7708240, 7332500, 7160926, 7186909, 7369902, 7649629, 7964349, 8264487, 8513955, 8680750, 8727481, 8611502, 8295088, 7758336, 7006371, 6066065, 4972646, 3752990, 2416474, 960905, -610329, -2273763, -3986261, -5699408]
12348e699408j674596j606671j504590j346122j103431p60667l26737J61172O43197
12339a3217853J050632J325247J437004J391551J224036R83128P12990M40776
12331d652489J74953q5328l36591n63125p40141q44971q68750q21936p30165o21586
12321a0090129n12721m02777k80874j39878J4970J69287L11321M42698N79823
12312i908280P43981R45956J175532J403693J596990J734789J817959J862624
12304A373244J882528J871747J800700J629776J332995R16978M23602q5328n52545
12295A0593697r44948j257986j504982j701485j855803j969416k043159k082670
12287b766752k098383k098800k080834k025456j904935j697929j400562j025374
$$ y = [-5699408, -7374004, -8980675, -10485265, -11831387, -12934818, -13695485, -14022222, -13861050, -13217853, -12167221, -10841974, -9404970, -8013419, -6789383, -5806255, -5093265, -4652489, -4477536, -4562864, -4899455, -5462580, -6202721, -7047692, -7916442, -8738378, -9468543, -10090129, -10602850, -11005627, -11286501, -11426379, -11411409, -11242122, -10930801, -10488103, -9908280, -9164299, -8218343, -7042811, -5639118, -4042128, -2307339, -489380, 1373244, 3255772, 5127519, 6928219, 8557995, 9890990, 10807968, 11231570, 11146242, 10593697, 9648749, 8390763, 6885781, 5184296, 3328493, 1359077, -684082, -2766752, -4865135, -6963935, -9044769, -11070225, -12975160, -14673089, -16073651, -17099025]
12279a7099025n92177j21529L63652Q32197J241995J544686J697235J676332J489361
12270h967273J175766P96745M17154Q6879j71701l66043n24392o78547q45860
12261i077272j018854j166400j245031j215656j059965p89646m42804o7966K95500
12252a5788094O28591R29341J199035J428855J596954J678079J658689J546358
12244e122192J367485J156592R45259P55590N97832M70255L60878K51089J21484
12235I04272l9500k25406m06401n36774n74829n02563l31284r1939J78647M45694
12225a180083O79102Q56687R69166J021977J029780J005792R52688Q60928P15424
12216F911461N06563K39772o0584l54747n98508p58815q26294q14722p45074o26088
$$ y = [-17099025, -17691202, -17812731, -17449079, -16616882, -15374887, -13830201, -12132966, -10456634, -8967273, -7791507, -6994762, -6577608, -6490729, -6662430, -7028473, -7552865, -8231412, -9077272, -10096126, -11262526, -12507557, -13723213, -14783178, -15572824, -16015628, -16083594, -15788094, -15159503, -14230162, -13031127, -11602272, -10005318, -8327239, -6668550, -5122192, -3754707, -2598115, -1652856, -897266, -299434, 170821, 531699, 782788, 904272, 864772, 639366, 232965, -303809, -878638, -1381201, -1712485, -1804424, -1625777, -1180083, -500981, 355706, 1324872, 2346849, 3376629, 4382421, 5335109, 6196037, 6911461, 7418024, 7657796, 7597212, 7242465, 6643957, 5885142, 5058848, 4244126, 3499052, 2872964]
12206B872964m49846k09303P5851L47678N24171N31463L36322l6050n05968r63605
12196B523677j303700j455009j392458j132242p19487k16929L04247P73676J131184
12187a487041J333955J359879J207425Q93378M50596p2812o14689j105509j483304
12178D81878j711515j788595j741563j606762j410412j161414q59639n11629j41266
12169a0450917K11576N02292O95714P76934P54822O55808N10104L38942J52589
12160e852136m0349k23227l72822m71829n20916n39404n54012n83748o30192o77778
12150a0466413p03378o89634o34145n49236m53651l62297k78866j92701q1736
12141a4412057P5626K82403N11145P10608Q28650Q34930P30549N46634L39355
$$ y = [2872964, 2423118, 2213815, 2289666, 2637344, 3161515, 3692978, 4029300, 3993250, 3487282, 2523677, 1219977, -235032, -1627490, -2759732, -3479219, -3696148, -3391901, -2618225, -1487041, -153086, 1206793, 2414218, 3307596, 3758192, 3685380, 3070691, 1965182, 481878, -1229637, -3018232, -4759795, -6366557, -7776969, -8938383, -9798022, -10309651, -10450917, -10239341, -9737049, -9041335, -8264401, -7509579, -6853771, -6343667, -6004725, -5852136, -5892485, -6115712, -6488534, -6960363, -7481279, -8020683, -8574695, -9158443, -9788635, -10466413, -11169791, -11859425, -12493570, -13042806, -13496457, -13858754, -14137620, -14330321, -14412057, -14336431, -14054028, -13542883, -12832275, -12003625, -11168695, -10438146, -9891512, -9552157]
12132i552157J79873J32411K24799M30049O74221Q66877R35916Q50908O29094
12123d628009L25205R537k57246m41506n39137n64891n37386m69227l66582k35031
12113g704273q3878P6201K39471M08201N89488P89679J010756J248238J488592
12104a937525J708178J877479J969242J964074J850060J620410J274765Q24275
12096A1150958K95793k67838q11542j276204j612375j796192j838425j778623
12088B065552j666763j544555j437453j357707j309773j291269j291149j290954
12080i124071j270249j211567j101389r29400o89768l84159k3741L70242P66282
12071a3597820J124798J405891J579979J632997J562030J368000J055018O37623
$$ y = [-9552157, -9372284, -9239873, -9015074, -8585025, -7910804, -7043927, -6108011, -5257103, -4628009, -4302804, -4293267, -4550513, -4992019, -5531156, -6096047, -6633433, -7102660, -7469242, -7704273, -7788151, -7711950, -7472479, -7064278, -6474790, -5685111, -4674355, -3426117, -1937525, -229347, 1648132, 3617374, 5581448, 7431508, 9051918, 10326683, 11150958, 11446751, 11178913, 10367371, 9091167, 7478792, 5682600, 3844175, 2065552, 398789, -1145766, -2583219, -3940926, -5250699, -6541968, -7833117, -9124071, -10394320, -11605887, -12707276, -13636676, -14326444, -14710603, -14734344, -14364102, -13597820, -12473022, -11067131, -9487152, -7854155, -6292125, -4924125, -3869107, -3231484]
12063c231484J48280l61638q27949j184412j376105j372502j175317q17347l52900
12054a0551374J56403O55265J102419J469495J734605J879318J893659J783747
12046A23537J572896J294660R85061O79734M13078K13548R5198N2318O2375R5688
12036E588093J25925J36779J23892R3560N9692L9331M6330Q4062J40574J90287
12026F628525K03585J60807O3614o2877j79578k50289k57008k06063j23758m5488
12016E931470k827j1766o6652j44924k22193k87573l46827m10802m79809n37701
12006C420396n59378n23086m16718k36788J1488L07593O10287Q66893J037166
11997D517853J112862J114731J071021R98423Q98613P64477N85794L54212P1313
$$ y = [-3231484, -3083204, -3444842, -4272791, -5457203, -6833308, -8205810, -9381127, -10198474, -10551374, -10394971, -9739706, -8637287, -7167792, -5433187, -3553869, -1660210, 123537, 1696433, 2991093, 3976154, 4655888, 5068966, 5282514, 5377712, 5430030, 5492405, 5588093, 5714018, 5850797, 5974689, 6068249, 6127941, 6167272, 6213602, 6297664, 6438238, 6628525, 6832110, 6992917, 7056531, 6993654, 6814076, 6563787, 6306779, 6100716, 5976958, 5931470, 5928643, 5916877, 5850225, 5705301, 5483108, 5195535, 4848708, 4437906, 3958097, 3420396, 2861018, 2337932, 1921214, 1684426, 1695914, 2003507, 2613794, 3480687, 4517853, 5630715, 6745446, 7816467, 8814890, 9713503, 10477980, 11063774, 11417986, 11489299]
11988A1489299k44608n61915q48460j082758j255117j360921j393509j342062
11980C399949j196888r61356o63736l58507j12137K0403J5763j10660l12826n32883
11970h12878p21573q51284r18331r37548r33720r32496r52866j003250j080292
11961i144238j167503j235494j250324j190138j057573q75277o69409m59143k60731
11952a7309830r4469K0258P9000R8124J03162J09814J15546J08293Q2627M8919
11942a6638556K9826M9093J21062K44672M01345N56108O63575O80009N78996L64310
11932a2949560P2958k35196m97508o67739p24132o65020n00519k48898O2526L98522
11922a5954566P21858R99147J201140J299474J267695J090707P77394L66322q0899
$$ y = [11489299, 11244691, 10682776, 9834316, 8751558, 7496441, 6135520, 4742011, 3399949, 2203061, 1241705, 577969, 219462, 107325, 127728, 143491, 32831, -279995, -812878, -1534451, -2385735, -3304066, -4241614, -5175334, -6107830, -7060696, -8063946, -9144238, -10311741, -11547235, -12797559, -13987697, -15045270, -15920547, -16589956, -17049099, -17309830, -17404299, -17384041, -17305041, -17206917, -17103755, -16993941, -16878395, -16770102, -16687475, -16638556, -16608730, -16559637, -16438575, -16193903, -15792558, -15236450, -14572875, -13892866, -13313870, -12949560, -12876602, -13111798, -13609306, -14277045, -15001177, -15666197, -16166716, -16415614, -16353088, -15954566, -15232708, -14233561, -13032421, -11732947, -10465252, -9374545, -8597151, -8230829, -8311728]
11913h311728m94865q14139r96800j028084r24623p32156n13181l26530k07531
11904a4349637j58072j50524j42942r9326p061J16193K30482K93228K79845J93684
11894a3794130O1119q2631k07235k94297l37355l37632k98763k23270j12000L4538
11884a5591656K14808M24568O53228Q79892J074944J210423J273745J274614J240139
11875g345295J201494J179080J172397J160096J112413J009119Q48574O39251
11867I77129L81543N8156l56148q71404j461951k061985k580373k927701l042303
11858a1885037k903935k532408j977273j305940n93396Q6619O68885J102469J356130
11849a7983886J424068J328862J117065Q47088N74951L43776J77931P9737K9728
$$ y = [-8311728, -8806593, -9620732, -10617532, -11645616, -12570239, -13302395, -13815576, -14142106, -14349637, -14507709, -14658233, -14801175, -14900501, -14907562, -14791369, -14560887, -14267659, -13987814, -13794130, -13733011, -13815642, -14022877, -14317174, -14654529, -14992161, -15290924, -15514194, -15626194, -15591656, -15376848, -14952280, -14299052, -13419160, -12344216, -11133793, -9860048, -8585434, -7345295, -6143801, -4964721, -3792324, -2632228, -1519815, -510696, 337878, 977129, 1358672, 1416828, 1060680, 189276, -1272675, -3334660, -5915033, -8842734, -11885037, -14788972, -17321380, -19298653, -20604593, -21197989, -21111370, -20442485, -19340016, -17983886, -16559818, -15230956, -14113891, -13266803, -12691852, -12348076, -12170145, -12090408, -12060680]
11840a2060680m981n3584j24682k02226k57724k68893k31940j63235r4317o3361
11830a3525623j02774k24994m13709o26235q05421q94823q52735o62916l39362
11821a8448592P6464N23455R29628J221821J339406J250713R64279N27829J5727
11812a1599270m88282r07580j186651j301396j262753j110130q94623o58284m20723
11803a9829692j81988O0697K96676N00335O45179P20971P40611P33561P31846
11794a5581804P56418Q09332Q74541R26742R43053R10799Q28462P02872N46573
11785h283012L75450K03852L7507j30327l13458n18961p34464r27226j056854
11776a1347493j091714j016502q27967n27360j19904L77817R30588J485661J983306
$$ y = [-12060680, -12065661, -12119245, -12243927, -12446153, -12703877, -12972770, -13204710, -13367945, -13462262, -13525623, -13628397, -13853391, -14267100, -14893335, -15698756, -16593579, -17446314, -18109230, -18448592, -18372128, -17848673, -16919045, -15697224, -14357818, -13107105, -12142826, -11614997, -11599270, -12087552, -12995132, -14181783, -15483179, -16745932, -17856062, -18750685, -19408969, -19829692, -20011680, -19950983, -19654307, -19153972, -18508793, -17787822, -17047211, -16313650, -15581804, -14825386, -14016054, -13141513, -12214771, -11271718, -10360919, -9532457, -8829585, -8283012, -7907562, -7703710, -7666203, -7796530, -8109988, -8628949, -9363413, -10290639, -11347493, -12439207, -13455709, -14283676, -14811036, -14930940, -14553123, -13622535, -12136874, -10153568]
11767a0153568K371255K615827K705158K644686K449418K138869J738071J282864
11759G792580Q23163M16838J11664p6953j77038k48532l53584n26975p63705j026697
11749E970761j265437j434687j507466j480206j369633j203494j010267q13060
11741d113489o28618m67952l34669k21284j08665K5943J92905L75194N26429N87307
11731d166899N13118K96501k7071l91556p20861r48549j033605r70894p91486
11722h241302n48599k94423o1884J38112L06827M47418N62744O59779P52494Q57241
11712e421593R82010J117627J239295J319335J343270J318723J271682J232446
11704D402795J218779J225800J228849J197387J110297R63380P68109N46832L28325
$$ y = [-10153568, -7782313, -5166486, -2461328, 183358, 2632776, 4771645, 6509716, 7792580, 8615743, 9032581, 9144245, 9067292, 8890254, 8641722, 8288138, 7761163, 6997458, 5970761, 4705324, 3270637, 1763171, 282965, -1086668, -2290162, -3300429, -4113489, -4742107, -5210059, -5544728, -5766012, -5874677, -5848734, -5655829, -5280635, -4754206, -4166899, -3653781, -3357280, -3384351, -3775907, -4496768, -5445317, -6478922, -7449816, -8241302, -8789901, -9084324, -9146208, -9008096, -8701269, -8253851, -7691107, -7031328, -6278834, -5421593, -4439583, -3321956, -2082661, -763326, 579944, 1898667, 3170349, 4402795, 5621574, 6847374, 8076223, 9273610, 10383907, 11347287, 12115396, 12662228, 12990553]
11695A2990553J43036J6935l4385r081Q0335K07869L36474M23491M30000L32272
11685A4917499J30962j46349m50921p25548r20811j009580r93014q94269p44857
11676I163112n74524m09648k73447j78593j14355m1633R3484L31201O70827J062613
11666I729037J425638J681348J781219J713597J494133J155305P42196L07889
11658B0030362r8137m43985p22059r45190j135915j313663j484277j637238j752438
11649A0497460j810060j794453j690852j483728j164564p46051k70937J95000
11641A731815N85959Q63560J032215J132218J214305J311114J422244J519901
11633A0813331J568583J544084J440245J263656J025744P40490M27947J17984
$$ y = [12990553, 13133589, 13150524, 13116139, 13107058, 13187393, 13395262, 13731736, 14155227, 14585227, 14917499, 15048461, 14902112, 14451191, 13725643, 12804832, 11795252, 10802238, 9907969, 9163112, 8588588, 8178940, 7905493, 7726900, 7612545, 7570912, 7664396, 7995597, 8666424, 9729037, 11154675, 12836023, 14617242, 16330839, 17824972, 18980277, 19722473, 20030362, 19932225, 19488240, 18766181, 17820991, 16685076, 15371413, 13887136, 12249898, 10497460, 8687400, 6892947, 5202095, 3718367, 2553803, 1807752, 1536815, 1731815, 2317774, 3181334, 4213549, 5345767, 6560072, 7871186, 9293430, 10813331, 12381914, 13925998, 15366243, 16629899, 17655643, 18396133, 18824080, 18942064]
11625A8942064j51445l44952m47732m80608m96923n56575o93234q99862j141719
11616A3729014j380769j588143j738247j799112j736651j534371j212521q28300
11608A910900m53893j47097O6227J90481K47144K61963K57805K51567K52887K64377
11598C102361K83474L04803L22469L32573L35341L34304L31365L21390K92117
11589E960197K30428J29262j0581j82662l75336n68349p29943q20343q03387o62961
11579B166325m16540j15504J73181L95525N30001N84985N80113N29289M36583
11570D863958L02817J34865m8035k14248l27956l63624l19585k22937j22427p1506
11560C611322j07283k33460m15050n88851o87056o65115n21305k97246n8360J34143
$$ y = [18942064, 18790619, 18445667, 17997935, 17517327, 17020404, 16463829, 15770595, 14870733, 13729014, 12348245, 10760102, 9021855, 7222743, 5486092, 3951721, 2739200, 1910900, 1457007, 1309910, 1376137, 1566618, 1813762, 2075725, 2333530, 2585097, 2837984, 3102361, 3385835, 3690638, 4013107, 4345680, 4681021, 5015325, 5346690, 5668080, 5960197, 6190625, 6319887, 6309306, 6126644, 5751308, 5182959, 4453016, 3632673, 2829286, 2166325, 1749785, 1634281, 1807462, 2202987, 2732988, 3317973, 3898086, 4427375, 4863958, 5166775, 5301640, 5253605, 5039357, 4711401, 4347777, 4028192, 3805255, 3682828, 3611322, 3504039, 3270579, 2855529, 2266678, 1579622, 914507, 393202, 95956, 37596, 171739]
11550A71739K43011K57957J85971L8911j74437m48825p75751j133627j482620
11541c117671j769793j942523j962996j817748j521295j115290o63289k38929
11533a4149534R3398K99752L87658L97158L75872L55245L43600L35904L26978
11524a1233969L16426L05173K90977K67909K28116J62228N8556r4344k99017n38926
11514a0536871p76601r65574j070029j078735j003874q67690o88225m73550k25538
11505a7686687N2147L46975O33918Q77301J040161J099223J056716R38830P80089
11496a0861327O05501M24997K43268P3499n9449j29453j22815m4323Q4815K30807
11486i554480L51732M08455L82307K87645J66832P0304L6467Q1724J99138L61401
$$ y = [171739, 414750, 672707, 858678, 897589, 723152, 274327, -501424, -1635051, -3117671, -4887464, -6829987, -8792983, -10610731, -12132026, -13247316, -13910605, -14149534, -14056136, -13756384, -13368726, -12971568, -12595696, -12240451, -11896851, -11560947, -11233969, -10917543, -10612370, -10321393, -10053484, -9825368, -9663140, -9604584, -9698928, -9997945, -10536871, -11313472, -12279046, -13349075, -14427810, -15431684, -16299374, -16987599, -17461149, -17686687, -17634540, -17287565, -16653647, -15776346, -14736185, -13636962, -12580246, -11641416, -10861327, -10255826, -9830829, -9587561, -9514062, -9573511, -9702964, -9825779, -9870102, -9785287, -9554480, -9202748, -8794293, -8411986, -8124341, -7957509, -7887205, -7850738, -7769014, -7569876, -7208475]
11476g208475N28301O59679P29912P37680P06532O73603O68268O92248P18034
11467a094218P10054O51317N52828M41441L42139K70241K33626K35532K72424
11458B615384L29814L82831M05385L84332L28131K61214K06969J72518J46706
11449E233284J11225N5641j4292q0652j27167j52318j70503k00001k48525l08873
11439D097819l66761m12207m44025m64395m69761m48280l88638k93710j86385
11430F23657j01086o6363q9631j52281k17883k50444k32838j72635r1218o916
11420g57638P2980J48449K20980K93887L75588M78198O09649P64808R22173J049059
11410D178133J113665J098144J005763Q58970O90773N33780M09576L20724K48831
$$ y = [-7208475, -6680174, -6020495, -5290583, -4552903, -3846371, -3172768, -2504500, -1812252, -1094218, -384164, 267153, 819981, 1261422, 1603561, 1873802, 2107428, 2342960, 2615384, 2945198, 3328029, 3733414, 4117746, 4445877, 4707091, 4914060, 5086578, 5233284, 5344509, 5400150, 5385858, 5305206, 5178039, 5025721, 4855218, 4655217, 4406692, 4097819, 3731058, 3318851, 2874826, 2410431, 1940670, 1492390, 1103752, 810042, 623657, 522571, 456208, 366577, 214296, -3587, -254031, -486869, -659504, -750722, -757638, -684658, -536209, -315229, -21342, 354246, 832444, 1442093, 2206901, 3129074, 4178133, 5291798, 6389942, 7395705, 8254675, 8945448, 9479228, 9888804, 10209528, 10458359]
11401A0458359J60892K1253j95984m97062q61522j240624j566262j770921j809926
11392B698203j673705j385336r89339n40268r3665L03408O22403Q58232J023749
11383H23682J135977J202827J217253J158763R98999P10855K82200k69375q90509
11374F370672j502271k023193k392124k578775k579590k405828k074067j606120
11366a0791296j037768m26990J50357O20490R36175J089192J104599J025101Q97507
11357f432633P65379O64836O20955O45633P37731Q84431J062804J241862J385456
11348A576454J456527J424039J272819J012505O79223L27113J3040k20014l55844
11339G185862m08905m14130m05182l94533l69887l08373j95358l3579J60743L68438
$$ y = [10458359, 10619251, 10640504, 10444520, 9947458, 9085936, 7845312, 6279050, 4508129, 2698203, 1024498, -360838, -1350177, -1890445, -1984110, -1680702, -1058299, -200067, 823682, 1959659, 3162486, 4379739, 5538502, 6537501, 7248356, 7530556, 7261181, 6370672, 4868401, 2845208, 453084, -2125691, -4705281, -7111109, -9185176, -10791296, -11829064, -12256054, -12105697, -11485207, -10549032, -9459840, -8355241, -7330140, -6432633, -5667254, -5002418, -4381463, -3735830, -2998099, -2113668, -1050864, 190998, 1576454, 3032981, 4457020, 5729839, 6742344, 7421567, 7748680, 7761720, 7541706, 7185862, 6776957, 6362827, 5957645, 5563112, 5193225, 4884852, 4689494, 4655915, 4816658, 5185096]
11329E185096N76630P81932R86747J191915J391163J569907J706011J770754J733920
11320A6894075J576859J307651R64819O03545K74265R433j76224k79838l08232
11311B0866353k80422k29407j98420k30947l57227n82542q83193j213423j520976
11302A5369796j764256j923034j998180k002145j947400j840213j682232j477368
11294G34968j239897r99168p95259o63309o14707o30977o77292p22993p49246
11285f357880p40053o73433n28773l05365l2577K39675M62072O02428O49740O10024
11275f074142N01447L51601J94772O7368K566K5877J50843L72986O63872R71992
11265b770818J236017J407195J468767J439686J359224J261371J154466J017846
$$ y = [5185096, 5761726, 6543658, 7530405, 8722320, 10113483, 11683390, 13389401, 15160155, 16894075, 18470934, 19778585, 20743404, 21346949, 21621214, 21630647, 21454423, 21174585, 20866353, 20585931, 20356524, 20158104, 19927157, 19569930, 18987388, 18104195, 16890772, 15369796, 13605540, 11682506, 9684326, 7682181, 5734781, 3894568, 2212336, 734968, -504929, -1504097, -2299356, -2962665, -3577372, -4208349, -4885641, -5608634, -6357880, -7097933, -7771366, -8300139, -8605504, -8638081, -8398406, -7936334, -7333906, -6684166, -6074142, -5572695, -5221094, -5026322, -4958954, -4956388, -4930511, -4779668, -4406682, -3742810, -2770818, -1534801, -127606, 1341161, 2780847, 4140071, 5401442, 6555908, 7573754]
11257G573754Q16638N25879J51089k65391o57138r60458j139547j192454j134171
11248C718201r73418p05683l28825J34893O32132J094391J464587J715768J851363
11239H603409J889903J846174J720616J502036J180778P64535K87565j93680o18367
11230A6982969r43608j158734j284516j359335j419541j482216j537989j558583
11222F238447j515236j395272j205017r59572o71727l51556j6020L02453N58374
11213I84874P06067P14429N76511L13075k9602l90663p14808r71297j156909j280342
11203a248665j343399j335977j246476j075850q44510n89079l50701j60656l3050
11194h228363K9600K5573m7074j78483l36151m70150n32541m96235l61899j51978
$$ y = [7573754, 8390392, 8916271, 9067360, 8801969, 8144831, 7184373, 6044826, 4852372, 3718201, 2744783, 2039100, 1710275, 1845168, 2477300, 3571691, 5036278, 6752046, 8603409, 10493312, 12339486, 14060102, 15562138, 16742916, 17507451, 17795016, 17601336, 16982969, 16039361, 14880627, 13596111, 12236776, 10817235, 9335019, 7797030, 6238447, 4723211, 3327939, 2122922, 1163350, 491623, 140067, 124047, 426500, 984874, 1690941, 2405370, 2981881, 3294956, 3265354, 2874691, 2159883, 1188586, 31677, -1248665, -2592064, -3928041, -5174517, -6250367, -7094877, -7683956, -8034657, -8195313, -8228363, -8198763, -8173190, -8220264, -8398747, -8734898, -9205048, -9737589, -10233824, -10595723, -10747701]
11184a0747701J02426L73736O41162Q83704J072800J176868J177241J080976R18738
11175c320050P31591N59190M34444L79483L98683M73060N62931O19157N97144
11166A435633M68841K31601q8175m41393p74030j048172j253502j403447j522366
11157d395010j633941j754371j886712k014433k099623k093202j956469j682568
11149a9516329j304060q82068m84706j67249L8434J25026J04281k497j74145l93191
11139b2656504o39234q77345j054534j113622j018733p74089m21533j9422L80836
11130b8194180P46124J058211J302031J454692J484124J362832J090972P11370
11122a8983824L01460n4860k97211m04414l92351k98629j60964P90J88646M15281
$$ y = [-10747701, -10645275, -10271539, -9630377, -8746673, -7673873, -6497005, -5319764, -4238788, -3320050, -2588459, -2029269, -1594825, -1215342, -816659, -343599, 219332, 838489, 1435633, 1904474, 2136075, 2047900, 1606507, 832477, -215695, -1469197, -2872644, -4395010, -6028951, -7783322, -9670034, -11684467, -13784090, -15877292, -17833761, -19516329, -20820389, -21702457, -22187163, -22354412, -22315978, -22190952, -22086671, -22089168, -22263313, -22656504, -23295738, -24173083, -25227617, -26341239, -27359972, -28134061, -28555594, -28575016, -28194180, -27448056, -26389845, -25087814, -23633122, -22148998, -20786166, -19695194, -18983824, -18682364, -18737224, -19034435, -19438849, -19831200, -20129829, -20290793, -20290003, -20101357, -19686076]
11112a9686076O88348J001125J330219J636617J872072J994616J987400J866985
11104g308694J674003J453043J234706J028650Q29640O32074M42446K79716J64271
11095D29855J06300J02287J37908J91883K40031K61093K41907J78366P4172n7754
11085A906048j91988k92075l20184k50997q3264J55438M14236O35989P79853Q35925
11075C588981Q21982P65634O85559N83600M50666K81242Q6999j00828k44427l19919
11065F599489l30162l00469k62020k35478k23599k13834j87859j33313n1569M2874
11055D704060J29144J86205J95827J46421M0726r8336k32726l26226l63244l56873
11045D024978l40590l48192l93653m63488n26004n49591n16730m27395k95735
$$ y = [-19686076, -18997728, -17996603, -16666384, -15029767, -13157695, -11163079, -9175679, -7308694, -5634691, -4181648, -2946942, -1918292, -1088652, -456578, -14132, 265584, 429855, 536155, 638442, 776350, 968233, 1208264, 1469357, 1711264, 1889630, 1963802, 1906048, 1714060, 1421985, 1101801, 850804, 767540, 922978, 1337214, 1973203, 2753056, 3588981, 4410963, 5176597, 5862156, 6445756, 6896422, 7177664, 7264663, 7163835, 6919408, 6599489, 6269327, 5968858, 5706838, 5471360, 5247761, 5033927, 4846068, 4712755, 4661186, 4704060, 4833204, 5019409, 5215236, 5361657, 5402383, 5304047, 5071321, 4745095, 4381851, 4024978, 3684388, 3336196, 2942543, 2479055, 1953051, 1403460, 886730, 459335, 163600]
11036A63600j45999q481Q6173J13234N9016p4035k61744m57467o03699o54643
11026a784045n97174m56883k86410j43886p2252q7097j75871l06412m39484n39906
11016d889420n83375n58163m61950k96709o6974K15547N25466Q23407J064207
11007d227964J207153J221844J092024Q23706M55397N7615k86817n12533n90654
10998g60229n25973l41985p1393K42884N47824P93156R52445J035469J080048
10989B952246J128464J204983J307871J416994J508224J565008J583117J569945
10981A4236852J540246J508138J476118J426659J324254J130221Q22959M12316
10973B3877763n8208n20261q96523j120679j157735j017916p56824m59402k13196
$$ y = [163600, 17601, 9120, 95293, 208527, 267543, 193508, -68236, -525703, -1129402, -1784045, -2381219, -2838102, -3124512, -3268398, -3340650, -3427747, -3603618, -3910030, -4349514, -4889420, -5472795, -6030958, -6492908, -6789617, -6856591, -6641044, -6115578, -5292171, -4227964, -3020811, -1798967, -706943, 116763, 572160, 629775, 342958, -169575, -760229, -1286202, -1628187, -1699580, -1456696, -908872, -115716, 836729, 1872198, 2952246, 4080710, 5285693, 6593564, 8010558, 9518782, 11083790, 12666907, 14236852, 15777098, 17285236, 18761354, 20188013, 21512267, 22642488, 23465447, 23877763, 23819555, 23299294, 22402771, 21282092, 20124357, 19106441, 18349617, 17890215, 17677019]
10964A7677019q2070r1467k29902m62478p46572j041793j312698j528230j662691
10955A0519118j700316j641426j505393j326835j146788j004382r31716r48986
10947C13276j057081j231931j428624j596539j696213j707486j627580j466276
10939a1498454j243954r91100p44355n37876l93617l14822k84155k67309k23879
10930a6499521j24587L3888K28132M23219N91274P19045Q03748Q48112Q60908
10921a2115782Q57866Q56914Q71154R07814R74280J083834J253483J492777J790052
10912b027608K106754K387395K580282K652597K588346K377219K012642J504013
10904A6181640Q88376K26692m12334r67108j390681j655944j762131j738006j635595
$$ y = [17677019, 17594949, 17503482, 17273580, 16811102, 16064530, 15022737, 13710039, 12181809, 10519118, 8818802, 7177376, 5671983, 4345148, 3198360, 2193978, 1262262, 313276, -743805, -1975736, -3404360, -5000899, -6697112, -8404598, -10032178, -11498454, -12742408, -13733508, -14477863, -15015739, -15409356, -15724178, -16008333, -16275642, -16499521, -16624108, -16590220, -16362088, -15938869, -15347595, -14628550, -13824802, -12976690, -12115782, -11257916, -10401002, -9529848, -8622034, -7647754, -6563920, -5310437, -3817660, -2027608, 79146, 2466541, 5046823, 7699420, 10287766, 12664985, 14677627, 16181640, 17070016, 17296708, 16884374, 15917266, 14526585, 12870641, 11108510, 9370504, 7734909]
10895G734909j514812j424900j389751j402801j433929j444865j404541j297067
10887c577757j121333q86682o10171l17905m7264J57291K58978K47111J44862
10878e752870j505j44331k52018l13862l34807l26613k99626k57830j99250j20770
10868h003482k2880Q9512K09240L28277M36992N23882N79216O02263O06334O14495
10858d036151O44929O95564P41253P47511O90700N70379M08489K39869R9585R610
10848H11738l0756m3042n3908p5717r8546r8281n1363N4803K17091M13775O05687
10837A651481P47350Q05583P71565O55912M74085K39456k8964k95354n07886o14565
10827C898663n84305m21813j70172J00503L15943M23602M08737K92776J17761
$$ y = [7734909, 6220097, 4795197, 3405446, 2002645, 568716, -876149, -2280690, -3577757, -4699090, -5585772, -6195943, -6513848, -6561112, -6403821, -6144843, -5897732, -5752870, -5754375, -5898706, -6150724, -6464586, -6799393, -7126006, -7425632, -7683462, -7882712, -8003482, -8026362, -7936850, -7727610, -7399333, -6962341, -6438459, -5859243, -5256980, -4650646, -4036151, -3391222, -2695658, -1954405, -1206894, -516194, 54185, 462674, 702543, 802128, 811738, 780982, 737940, 684032, 608315, 509769, 411488, 360125, 414928, 632019, 1045794, 1651481, 2398831, 3204414, 3975979, 4631891, 5105976, 5345432, 5316468, 5021114, 4513228, 3898663, 3314358, 2892545, 2722373, 2822876, 3138819, 3562421, 3971158, 4263934, 4381695]
10818D381695p1351k37267l52643l98391l61329k32073m539L19645P20729J150813
10808D915289J535870J795374J870897J746332J449450J039149N89298J74415
10800A5116074j43843l28270l70357k85280j03914J31247L68292N53588O46410
10791A5583947O32412N27617L71696K14119R6893L9165L1652M4801M4130J561
10781A7587993j01092k70627m97989p53646r89238j148205j183515j077136q52009
10772A0714536n66786k92952q7486K2565L9122j5652j06325j88789k18133j63084
10762I137016k2662J65559L35373M19421L80177K26216N197k20511m02015n22931
10752I500840o01140o72976p69593q99871j047954j182392j269624j286938j231381
$$ y = [4381695, 4310344, 4073077, 3720434, 3322043, 2960714, 2728641, 2724102, 3043747, 3764476, 4915289, 6451159, 8246533, 10117430, 11863762, 13313212, 14352361, 14941659, 15116074, 14972231, 14643961, 14273604, 13988324, 13884410, 14015657, 14383949, 14937537, 15583947, 16216359, 16743976, 17115672, 17329791, 17426684, 17465849, 17497501, 17542302, 17586432, 17587993, 17486901, 17216274, 16718285, 15964639, 14975401, 13827196, 12643681, 11566545, 10714536, 10147750, 9854798, 9767312, 9789877, 9828999, 9813347, 9707022, 9518233, 9300100, 9137016, 9114354, 9279913, 9615286, 10034707, 10414884, 10641100, 10646297, 10425786, 10023771, 9500840, 8899700, 8226724, 7457131, 6557260, 5509306, 4326914, 3057290, 1770352, 538971]
10743E38971j119510r76485q22100o65757n13829l80095k86164k48075k59403
10734d732447k87283k89193k39872j46816m2265L8733P4932O2181J0587n7824
10724e609267j15035j41489j41760j46596j95851l13457m92005o96392q81894
10715h733746j013035j071299j050546r49957p73773n37032k68903r532J95985
10706a4211838L02872K73420Q8155k42251o72369j129033j528089j795986j889922
10697b0805041j808581j587237j279300r34385n83155k32567J29740N23916R61886
10688b5614724J432903J898947K304873K599989K760034K796611K747772K655324
10680f418271K542652K405054K215472J940597J559472J077140N27316l7262n62099
$$ y = [538971, -580539, -1557024, -2379124, -3044881, -3558710, -3938805, -4224969, -4473044, -4732447, -5019730, -5308923, -5548795, -5695611, -5737876, -5699143, -5624211, -5562030, -5551443, -5609267, -5724302, -5865791, -6007551, -6154147, -6349998, -6663455, -7155460, -7851852, -8733746, -9746781, -10818080, -11868626, -12818583, -13592356, -14129388, -14398291, -14407823, -14211838, -13908966, -13635546, -13547391, -13789642, -14462011, -15591044, -17119133, -18915119, -20805041, -22613622, -24200859, -25480159, -26414544, -26997699, -27230266, -27100526, -26576610, -25614724, -24181821, -22282874, -19978001, -17378012, -14617978, -11821367, -9073595, -6418271, -3875619, -1470565, 744907, 2685504, 4244976, 5322116, 5849432, 5812170, 5250071]
10671E250071j007485j357357j617223j802074j921016j969944j939693j833602
10663h198323j678558j518833j397554j339650j345433j394781j457373j504249
10655a9834754j515344j479032j385920j224312r82008o51310k32362K64595Q15264
10646b6225183J378963J905328K349297K681847K886453K947525K847036K575767
10638f652967K148687J610180J025852M67698k65l32651n07863n27060m09471
10629c177860j88142R3280L85859O44091Q34712R41270R63495R13561Q11850O84696
10619B906812N64986M92628N08397O38098Q74122J168364J445665J632856J687350
10610A1919278J609575J433975J205530R56380O96269M21669J35314j40241l66782
$$ y = [5250071, 4242586, 2885229, 1268006, -534068, -2455084, -4425028, -6364721, -8198323, -9876881, -11395714, -12793268, -14132918, -15478351, -16873132, -18330505, -19834754, -21350098, -22829130, -24215050, -25439362, -26421370, -27072680, -27305042, -27040447, -26225183, -24846220, -22940892, -20591595, -17909748, -15023295, -12075770, -9228734, -6652967, -4504280, -2894100, -1868248, -1400550, -1400815, -1733466, -2241329, -2768389, -3177860, -3366002, -3272722, -2886863, -2242772, -1408060, -466790, 496705, 1410266, 2222116, 2906812, 3471798, 3964426, 4472823, 5110921, 5985043, 7153407, 8599072, 10231928, 11919278, 13528853, 14962828, 16168358, 17124738, 17821007, 18242676, 18377990, 18237749, 17870967]
10601A7870967n09676n57782n30758m70931m25938m30311m92521n92436o91214
10592A3169400p49791p46162o81844n75192m48564l18980j96380q5882J0740R4059
10582I471404J63573K13030K30174K03861J33738L4518o8627j50049j91863j85043
10572I854716j24747p864J60581L56371N33454O37513O29001N01071K82514K5327
10562A2847937k17095m11137n53419o67023p89015r55954j188733j478407j782187
10553D804967k038741k197373k242802k201775k132107k101326k160312k318956
10545a2588425k536625k736787k839334k790295k571986k194010j680108j063763
10537c1001333l91020K81127Q96436J413611J811958K086673K239993K273812
$$ y = [17870967, 17361291, 16803509, 16272751, 15801820, 15375882, 14945571, 14453050, 13860614, 13169400, 12419609, 11673447, 10991603, 10416411, 9967847, 9648867, 9452487, 9366605, 9377345, 9471404, 9634977, 9848007, 10078181, 10282042, 10415780, 10450298, 10381671, 10231622, 10039759, 9854716, 9729969, 9722105, 9882686, 10239057, 10772511, 11410024, 12039025, 12540096, 12822610, 12847937, 12630842, 12219705, 11666286, 10999263, 10210248, 9254294, 8065561, 6587154, 4804967, 2766226, 568853, -1673949, -3875724, -6007831, -8109157, -10269469, -12588425, -15125050, -17861837, -20701171, -23491466, -26063452, -28257462, -29937570, -31001333, -31392353, -31111226, -30214790, -28801179, -26989221, -24902548, -22662555, -20388743]
10529b0388743K186972J981094J675107J317746R82607P42253O36134O53202P40087
10520i473541Q29234Q69505Q41785P56054O41602N41020N03705N70417P55401
10511c164818J043162J404590J818344K283273K820031L463939M248311N182639
10503A9099471O239034P357677Q470114R531406J0548702J1590033J2763227J4174736
10495I9774400J5889772J7902678K0110163K2283024K4040610K4837192K3997049
10488B48834888K0875448J5178192P297442j620415j0037527j6636597k0778648
10481B43112783k2548807k2477518k1208632j9294214j7124405j4935641j2859044
10474A12664522j0978494r363262q064683p100345o448250o050116n817800n647483
$$ y = [-20388743, -18201771, -16220677, -14545570, -13227824, -12245217, -11502964, -10866830, -10213628, -9473541, -8644307, -7774802, -6933017, -6176963, -5535361, -4994341, -4490636, -3920219, -3164818, -2121656, -717066, 1101278, 3384551, 6204582, 9668521, 13916832, 19099471, 25338505, 32696182, 41166296, 50697702, 61246404, 72836437, 85599664, 99774400, 115664172, 133566850, 153677013, 175960037, 200000647, 224837839, 248834888, 269710336, 284888528, 292185970, 290565555, 280528028, 263891431, 243112783, 220563976, 198086458, 176877826, 157583612, 140459207, 125523566, 112664522, 101686028, 92322766, 84258083, 77157738, 70709488, 64659372, 58841572, 53194089]
10466E3194089n443721n143110m727513m226049l705110l242702k893922k668126
10458B1143836k531993k431714k317306k158352j948031j695369j411698j103202
10450E546171p75936m46106j43655R4569K36974K68768J98729N7863j10709k66026
10440D660642l80396m42679m54323m23269l61453k86269k19566j78824j65748
10431A748115j64015j49985j06915l1061P2131J94763L29604M68172N96416O92613
10421C649838P31372O93542N76952M01561K05362L2169q3143j25252j01632m0065
10411E940704J7874K8702l6411j78234l68326n59911p02795p56814p03417n52406
10401B128966l37197r8998J28655L24946M79039N88389O59167P02417P24341P19039
$$ y = [53194089, 47750368, 42607258, 37879745, 33653696, 29948586, 26705884, 23811962, 21143836, 18611843, 16180129, 13862823, 11704471, 9756440, 8061071, 6649373, 5546171, 4770235, 4324129, 4180474, 4275043, 4512017, 4780785, 4979514, 5037377, 4926668, 4660642, 4280246, 3837567, 3383244, 2959975, 2598522, 2312253, 2092687, 1913863, 1748115, 1584100, 1434115, 1327200, 1296139, 1368270, 1563033, 1892637, 2360809, 2957225, 3649838, 4381210, 5074752, 5651704, 6053265, 6258627, 6290796, 6207653, 6082401, 5980769, 5940704, 5958578, 5987280, 5950869, 5772635, 5404309, 4844398, 4141603, 3384789, 2681372, 2128966, 1791769, 1692771, 1821426, 2146372, 2625411, 3213800, 3872967, 4575384, 5299725, 6018764]
10391F018764O72439N76065M39434K89877J57721N6323k8466j30796k83814m99641
10381G267906p63725j045562j315438j553673j747341j881685j937265j896871
10373d873654j756633j532559j256989r65533o81773m10179j42529J28440L99833
10364a1091576O58549Q85148J056478J148681J143317J034008Q28956N49137K24580
10355c562722j11308m29773p12773r50830j134181j247125j272923j204700j051068
10346a1677403q31479n67555k79411J2128K84515N18515P05088Q46429R49780
10337a0039393J019671J054233J046588R90207Q86497P50427O08848M91266M19698
10328b771958M04144M43840N30862O54170Q02832R65403J124613J253508J321050
$$ y = [6018764, 6691203, 7267268, 7706702, 7996579, 8154300, 8210623, 8182157, 8051361, 7767547, 7267906, 6504181, 5458619, 4143181, 2589508, 842167, -1039518, -2976783, -4873654, -6630287, -8162846, -9419835, -10385368, -11067141, -11477320, -11619849, -11491409, -11091576, -10433027, -9547879, -8491401, -7342720, -6199403, -5165395, -4336439, -3787302, -3562722, -3674030, -4103803, -4816576, -5767406, -6901587, -8148712, -9421635, -10626335, -11677403, -12508882, -13076437, -13355848, -13343720, -13059205, -12540690, -11835602, -10989173, -10039393, -9019722, -7965489, -6918901, -5928694, -5042197, -4291770, -3682922, -3191656, -2771958, -2367814, -1923974, -1393112, -738942, 63890, 1029293, 2153906, 3407414, 4728464]
10319D728464J306605J212528J064198Q96831P38021N96549M62157L13078J24694
10310A1443125j23604m40794q14927j208742j567952j839722j988906k003241
10302A455237j890628j676429j401913j118749q76758p08702o19127n83250n58450
10293g978769n04019l97801k39398m1279J80947M10772O28432Q11555R40635J005002
10283e183923J005309R51297Q55449P26070N66931L86534K07774O3404k4280o1830
10273e07265q1583j16651j72833k17889j95001n2550K25834O07029J017272J368183
10263A874546J585227J626364J487224J196289Q05349L78687j8829l36359n52667
10254H045831o85106p83588r08853j104070j373144j676549j947780k122853k167003
$$ y = [4728464, 6035069, 7247597, 8311795, 9208626, 9946647, 10543196, 11005353, 11318431, 11443125, 11319521, 10878727, 10063800, 8855058, 7287106, 5447384, 3458478, 1455237, -435391, -2111820, -3513733, -4632482, -5509240, -6217942, -6837069, -7420319, -7978769, -8482788, -8880589, -9119987, -9161266, -8980319, -8569547, -7941115, -7129560, -6188925, -5183923, -4178614, -3227317, -2371868, -1645798, -1078867, -692333, -484559, -421155, -445435, -507265, -588848, -705499, -878332, -1096221, -1291222, -1343772, -1117938, -510909, 506363, 1874546, 3459773, 5086137, 6573361, 7769650, 8574999, 8953686, 8934857, 8598498, 8045831, 7360725, 6577137, 5668284, 4564214, 3191070, 1514521, -433259, -2556112, -4723115]
10245d723115k085308j916128j715716j540913j432189j400647j425852j466905
10237a7706773j479706j430339j300666j088847q08317m85720j55765J48748M09133
10228b3898252O27273Q19732J003492J185220J360491J517787J640242J706838
10220a4037177J698737J609219J448761J240552J010509P79151N59414L60234
10212e330600J92695P3457K0709M2840J26339K32477L08819L11569K24924O3975
10202c732796j38702l48957n37712o80545p59710p70706p26333o52580n78518
10193h926559n25728n01207m96384m93476m76078m36716l76071k95432j89377
10184a2717028m5131J49829L96548O76630R51539J168746J273540J225766J016390
$$ y = [-4723115, -6808423, -8724551, -10440267, -11981180, -13413369, -14814016, -16239868, -17706773, -19186479, -20616818, -21917484, -23006331, -23814648, -24300368, -24456133, -24307385, -23898252, -23270979, -22451247, -21447755, -20262535, -18902044, -17384257, -15744015, -14037177, -12338440, -10729221, -9280460, -8039908, -7029399, -6250248, -5690834, -5330600, -5137905, -5064448, -5043739, -5000899, -4874560, -4642083, -4333264, -4021695, -3796771, -3732796, -3871498, -4220455, -4758167, -5438712, -6198422, -6969128, -7695461, -8348041, -8926559, -9452287, -9953494, -10449878, -10943354, -11419432, -11856148, -12232219, -12527651, -12717028, -12762159, -12612330, -12215782, -11539152, -10587613, -9418867, -8145327, -6919561, -5903171]
10175e903171O74018K56246j66841n26041p62266q38367p52806n43908k77825
10166h840961k7619J44475J98266J22794o2112l14595n87827q45006j063748j231202
10156a2507535j338158j378773j355428j282468j183123j080364r88697r12565
10148b2027111q50335p98602p54122p14960o82801o65005o72378p10385p67441
10139b8643140q09667p90053o69922m40292j30848J96589M65081O03985N69981
10130b9648286L62041K3750l69599p34228j000720j126407j094413r05993n76173
10121c5070028j36041L65034Q65027J302113J627193J811140J847717J753833
10113b5634012J565388J327346J080894Q53153O52943M73255K99340J19439o7042
$$ y = [-5903171, -5229153, -4972907, -5139748, -5665789, -6428055, -7266422, -8019228, -8563136, -8840961, -8868580, -8724105, -8525839, -8403045, -8465157, -8779752, -9367579, -10212585, -11276333, -12507535, -13845693, -15224466, -16579894, -17862362, -19045485, -20125849, -21114546, -22027111, -22877446, -23676048, -24430170, -25145130, -25827931, -26492936, -27165314, -27875699, -28643140, -29452807, -30242860, -30912782, -31353074, -31483922, -31287333, -30822252, -30218267, -29648286, -29286245, -29262495, -29632094, -30366322, -31367042, -32493449, -33587862, -34493855, -35070028, -35206069, -34841035, -33976008, -32673895, -31046702, -29235562, -27387845, -25634012, -24068624, -22741278, -21660384, -20807231, -20154288, -19681033, -19381693, -19262254, -19329296]
10104a9329296k48049m03520n11883n55770n28102m39522l23170k29280k06804
10095b2775396k79670m31907o11499p50595p90382o98941m77024j52679K31552
10086b6736541O33431J021018J373037J671417J894369K018412K030066J939015
10078a4155776J782024J612436J479246J406760J386070J382682J354498J268889
10070b483171J111219Q85874O15576L41084J17205K41K8225K02827M83601P99620
10060B102301J073638J246425J289488J202547J001538P06783L37849q4589n34038
10051H341942r75666j368981j675955j871788j952191j930413j823306j636888
10043d893246j366364j014048o09800k13297J06701L00617L54118K84938J27427
$$ y = [-19329296, -19577345, -19980865, -20492748, -21048518, -21576620, -22016142, -22339312, -22568592, -22775396, -23055066, -23486973, -24098472, -24849067, -25639449, -26338390, -26815414, -26968093, -26736541, -26103110, -25082092, -23709055, -22037638, -20143269, -18124857, -16094791, -14155776, -12373752, -10761316, -9282070, -7875310, -6489240, -5106558, -3752060, -2483171, -1371952, -486078, 129498, 470582, 587787, 588028, 616253, 819080, 1302681, 2102301, 3175939, 4422364, 5711852, 6914399, 7915937, 8622720, 8960569, 8875980, 8341942, 7366276, 5997295, 4321340, 2449552, 497361, -1433052, -3256358, -4893246, -6259610, -7273658, -7883458, -8096755, -7990054, -7689437, -7335319, -7050381, -6922954]
10034f922954q3616l21185n64276p91349r78152j103950j160599j155581j106952
10025a4188614j035646r60024q92289q35213p80892p14709o23747n04453l64864
10016b0900451k21583r5438q258K0315k2735j40481l27194n71878q57526j154212
10006b4279441j414196j579486j602055j465333j194455q50207n08852k34559
9998c3128584n5375M4767J12387J97064L26883M99431O89123Q62855R94533J072644
9988b8384272J099191J082466J029547R44600Q33853P11198N97007N09301M54771
9979b1122338M27963M19347M24707M47976M96358N73400O75815P94401R14864
9970a5947507J015910J068650J044301R30666P46189N37004L53871K23210J32917
$$ y = [-6922954, -7006570, -7327755, -7892031, -8683380, -9661532, -10765482, -11926081, -13081662, -14188614, -15224260, -16184284, -17076573, -17911786, -18692678, -19407387, -20031134, -20535587, -20900451, -21122034, -21217472, -21225730, -21205415, -21228150, -21368631, -21695825, -22267703, -23125229, -24279441, -25693637, -27273123, -28875178, -30340511, -31534966, -32385173, -32894025, -33128584, -33183959, -33139192, -33026805, -32829741, -32502858, -32003427, -31314304, -30451449, -29456916, -28384272, -27285081, -26202615, -25173068, -24228468, -23394615, -22683417, -22086410, -21577109, -21122338, -20694375, -20275028, -19850321, -19402345, -18905987, -18332587, -17656772, -16862371, -15947507, -14931597, -13862947, -12818646, -11887980, -11141791, -10604787, -10250916, -10027706, -9894789]
9961i894789M2392r1838k92277n50864q35247j105148j329937j498256j614803
9952a7170767j688553j723250j717021j666998j570562j422325j214109r42745
9944b9116330o20585k79359L6433K82456M26928M58144L86095K38609N2907j34581
9934b8269283k94462m02175m31331l54538j58065J40360M89733Q25538J095523
9925b7358700J271921J346013J316449J183587R53198O44646K94931m7623l37647
9916b0733225n44496o53774o62280n75832m12910k08076q196J39899K06317J92274
9906b3260299J33580Q9805J23786K82326N89560J059082J718977K630052L876615
9897a2756516N527244P580531R909452J2216427J4036081J4841873J4258967J2272664
$$ y = [-9894789, -9852397, -9944235, -10236512, -10787376, -11622623, -12727771, -14057708, -15555964, -17170767, -18859320, -20582570, -22299591, -23966589, -25537151, -26959476, -28173585, -29116330, -29736915, -30016274, -29979841, -29697385, -29270457, -28812313, -28426218, -28187609, -28134702, -28269283, -28563745, -28965920, -29397251, -29751789, -29909854, -29769494, -29279761, -28454223, -27358700, -26086779, -24740766, -23424317, -22240730, -21287532, -20642886, -20347955, -20395578, -20733225, -21277721, -21931495, -22593775, -23169607, -23582517, -23790593, -23798789, -23658890, -23452573, -23260299, -23126719, -23036914, -22913128, -22630802, -22041242, -20982160, -19263183, -16633131, -12756516, -7229272, 351259, 10260711, 22477138, 36513219, 51355092, 65614059, 77886723]
9889G7886723R273819N888179K708147J06040j792015l027008l715769l991057
9881H3337059l970304l744703l384478k950038k497217k075365j723584j466759
9873F1524611j311484j246688j252655j312882j419144j567438j749891j947880
9865D9716549k129867k257173k297221k236409k083902j865858j616755j372606
9857C3856758j166156j023125r59497r79129j071523j211835j364689j489903
9849B4590901j548098j508325j358976j115630q16417n05765k19103K0920J99263
9840A7738770L04113L27875K70267J39423m9109k73075n03272p04821q43748q98982
9830A5507441q73124p92513o94511o11250n62145n57734o05517p07966q53590
$$ y = [77886723, 87160542, 93048721, 95756868, 95862908, 94070893, 91043885, 87328116, 83337059, 79366755, 75622052, 72237574, 69287536, 66790319, 64714954, 62991370, 61524611, 60213127, 58966439, 57713784, 56400902, 54981758, 53414320, 51664429, 49716549, 47586682, 45329509, 43032288, 40795879, 38711977, 36846119, 35229364, 33856758, 32690602, 31667477, 30707980, 29728851, 28657328, 27445493, 26080804, 24590901, 23042803, 21534478, 20175502, 19059872, 18243455, 17737690, 17518587, 17539507, 17738770, 18042883, 18370758, 18641025, 18780448, 18731339, 18458264, 17954992, 17250171, 16406423, 15507441, 14634317, 13841804, 13147293, 12536043, 11973898, 11416164, 10810647, 10102681, 9249091]
9821I249091j011684j139713j200562j177514j076751r18206p24242n13711l00846
9812A185862r5181R7200K67466L94766M44181L80224J89608j05039m52596p94937
9802A511554j083945j284358j369632j323270j147592q70713n43020k24077L2152
9793f302901J87139K22045J40195k9720k32675l95462m46988l44034q9423K66966
9783g024858O44175R55842J136716J162346J055744Q77314P00490N83159N49282
9774F40210N90393O82877Q04839R38143J056956J118583J071216Q78184N43701
9765H325102J21675l02278o48935q81607j016486j100990j178291j264240j348535
9756G05415j411680j441886j442270j426806j408773j389565j356824j294366
$$ y = [9249091, 8237407, 7097694, 5897132, 4719618, 3642867, 2724661, 2000419, 1486708, 1185862, 1090681, 1187881, 1455347, 1850113, 2294294, 2674518, 2864126, 2759087, 2306491, 1511554, 427609, -856749, -2226381, -3549651, -4697243, -5567956, -6110976, -6335053, -6302901, -6115762, -5893717, -5753522, -5783242, -6015917, -6411379, -6858367, -7202401, -7291824, -7024858, -6380683, -5424841, -4288125, -3125779, -2070035, -1192721, -492231, 90928, 640210, 1230603, 1913480, 2718319, 3656462, 4713418, 5832001, 6903217, 7781401, 8325102, 8446777, 8144499, 7495564, 6613957, 5597471, 4496481, 3318190, 2053950, 705415, -706265, -2148151, -3590421, -5017227, -6426000, -7815565, -9172389, -10466755]
9748a0466755j195852j070293r34813q00869o64818n10382l22641j04325J19286
9739a5951462L14446M64077N83899P14320Q92798J127770J392777J641011J825199
9730f995165J908706J866403J683065J355428Q97572L45765k41551p92501j240065
9721a212343j542413j691982j706449j610402j423921j164367q52804n14696j75617
9712a1894994J40358M07852N99530O92058O74332N51512L45460R6074j38691k93558
9702h820067l20299k12053p507K30356M44812O03865O99541P37177P26177O75545
9692e242453N91645M76537L28082J43190p6508l19422n62820p77362r34536j011935
9682g385582r94746q77150o66829l89361q5532K00353M34809O03599P11105P73138
$$ y = [-10466755, -11662607, -12732900, -13667713, -14468582, -15133400, -15643782, -15966423, -16070748, -15951462, -15637016, -15172939, -14589040, -13874720, -12981922, -11854152, -10461375, -8820364, -6995165, -5086459, -3220056, -1536991, -181563, 716009, 1061774, 820223, 27722, -1212343, -2754756, -4446738, -6153187, -7763589, -9187510, -10351877, -11204681, -11719377, -11894994, -11754636, -11346784, -10747254, -10055196, -9380864, -8829352, -8483892, -8387818, -8526509, -8820067, -9140366, -9352419, -9359926, -9129570, -8684758, -8080893, -7381352, -6644175, -5917998, -5242453, -4650808, -4174271, -3846189, -3702999, -3779507, -4098929, -4661749, -5439111, -6373647, -7385582, -8380328, -9257478, -9924307, -10313668, -10399200, -10198847, -9764038, -9160439, -8449334, -7676196]
9672g676196Q07245Q23974Q22959P96588P38365O47784N26754L73179J82541m0374
9662a997181k70981m68885n96526o39486o14491n60559n18515n09267n21978n18055
9652g215924m47689k69559L3426M44549R12491J363736J726863J956056K038812
9643E42761J985150J810475J526979J147966O98154K19304k34528o09630q66133
9634F220498r87050r81638q82289p33287n73897m25741k93537j76172p4995Q530
9624A100422Q0066J53879K45791L63334M99216O30065P21015P36137O51972M68137
9614E650034K09938p7216l38000n18905n80975n13186l41621j25723O2948J71319
9604C598613J86408J33911N6721r619m8843o0596n0437k2893J9187P1733J27067
$$ y = [-7676196, -6868951, -6044977, -5222018, -4425430, -3687065, -3039281, -2512527, -2139348, -1956807, -1997181, -2268162, -2737047, -3333573, -3973059, -4587550, -5148109, -5666624, -6175891, -6697869, -7215924, -7663613, -7933172, -7899746, -7455197, -6542706, -5178970, -3452107, -1496051, 542761, 2527911, 4338386, 5865365, 7013331, 7711485, 7930789, 7696261, 7086631, 6220498, 5233448, 4251810, 3369521, 2636234, 2062337, 1636596, 1343059, 1166887, 1091892, 1100422, 1180488, 1334367, 1580158, 1943492, 2442708, 3072773, 3793788, 4529925, 5181897, 5650034, 5859972, 5782756, 5444756, 4925851, 4344876, 3831690, 3490069, 3364346, 3427294, 3598613, 3785021, 3918932, 3975653, 3966034, 3917191, 3856595, 3806158, 3783265, 3802452, 3874185, 4001252]
9593D001252J73900J99497J93190J50376P5595j7365j09676j85075k37123k71315
9583C973256l00102l34318l77848m29313m88530n62442o67120q24611j054239
9574a065267j360448j724022k103876k449684k717622k881382k935825k893833
9566b0131959k777172k604404k382853k110259j784145j410976j008989o04741
9558c4815498k27163R7503L49108N16740O03330O30045O34866O60823P37247Q64788
9548b9948211J013745J136229J183957J122834R41453O55586L09477k9732k87679
9539b3902341m04561l53092j44710J76580N48840R11041J220717J462901J644761
9530a8839864J778551J864150J884163J816712J657894J435905J202673J006325
$$ y = [4001252, 4175152, 4374649, 4567839, 4718215, 4793810, 4776445, 4666769, 4481694, 4244571, 3973256, 3673154, 3338836, 2960988, 2531675, 2043145, 1480703, 813583, -11028, -1065267, -2425715, -4149737, -6253613, -8703297, -11420919, -14302301, -17238126, -20131959, -22909131, -25513535, -27896388, -30006647, -31790792, -33201768, -34210757, -34815498, -35042661, -34945158, -34596050, -34079310, -33475980, -32845935, -32211069, -31550246, -30812999, -29948211, -28934466, -27798237, -26614280, -25491446, -24549993, -23894407, -23584930, -23614662, -23902341, -24306902, -24659994, -24804704, -24628124, -24079284, -23168243, -21947526, -20484625, -18839864, -17061313, -15197163, -13313000, -11496288, -9838394, -8402489, -7199816, -6193491]
9522f193491Q64975P61591O61972N40508L96016K50245J33713P0369P1164J37862
9512b305076K69231M61069O99475R53898J176042J306967J292290J102116P47094
9503E703106K80432k17508o65730j009062j233631j363811j441110j497478j540883
9494b985675j560662j542888j479984j369826j212502j012876p85663n52999l31432
9485a2834507j19134J02096L48392O14167Q68293J068451J181560J197751J133525
9476f439406J025305R15957Q39407Q10535Q24638Q64815R12264R54465R86645
9467A694625J005122R98377R45920Q28564O42247M03794J44133j06366l31235
9458F225181n31511p17096q93434j055546j193524j301295j379628j434101j473070
$$ y = [-6193491, -5328516, -4566925, -3904953, -3364445, -2968429, -2718184, -2584471, -2514102, -2442938, -2305076, -2035845, -1574776, -875301, 78597, 1254639, 2561606, 3853896, 4956012, 5703106, 5983538, 5766030, 5100300, 4091238, 2857607, 1493796, 52686, -1444792, -2985675, -4546337, -6089225, -7569209, -8939035, -10151537, -11164413, -11950076, -12503075, -12834507, -12953641, -12851545, -12503153, -11888986, -11020693, -9952242, -8770682, -7572931, -6439406, -5414101, -4498144, -3658737, -2848202, -2023564, -1158749, -246485, 707980, 1694625, 2699747, 3698124, 4644044, 5472608, 6114855, 6518649, 6662782, 6556416, 6225181, 5693670, 4976574, 4083140, 3027594, 1834070, 532775, -846853, -2280954, -3754024]
9449c754024j504883j530426j534881j489135j364988j155191q84424o02979l64820
9440a4185751k00932j04228l6687M6534J74148L50963N63932P91541J009878J196363
9430a0394239J333976J415897J448510J451201J452956J486565J580747J750394
9422A526007J987301K256802K504585K671608K710204K596009K334106J958517
9414B0545139J523467J088343P03297M01852K00162R7739P6578J00970J22871
9405B4860418R4957j2390j98800m34020o71185q66874r99371j077570j135051
9396A9560114j209468j318384j448832j567895j642429j649587j574160j405557
9388G743802j144935q16128m65430j45535J05495K75638L75783M27713M51780
$$ y = [-3754024, -5258907, -6789333, -8324214, -9813349, -11178337, -12333528, -13217952, -13820931, -14185751, -14386683, -14490911, -14527598, -14481064, -14306916, -13955953, -13392021, -12600480, -11590602, -10394239, -9060263, -7644366, -6195856, -4744655, -3291699, -1805134, -224387, 1526007, 3513308, 5770110, 8274695, 10946303, 13656507, 16252516, 18586622, 20545139, 22068606, 23156949, 23860246, 24262098, 24462260, 24559999, 24636577, 24737547, 24860418, 24955375, 24942985, 24744185, 24310165, 23638980, 22772106, 21772735, 20695165, 19560114, 18350646, 17032262, 15583430, 14015535, 12373106, 10723519, 9149359, 7743802, 6598867, 5782739, 5317309, 5171774, 5277269, 5552907, 5928690, 6356403, 6808183]
9379F808183M58770M45829L95686K80934P6126k24814n96224r84502j328199j580921
9369C750868j722383j755519j699343j584862j450464j330075j237059j156615
9361h185452j055812r05810p00742m61315k23628k3524J13111J71031J42424K6974
9351a1102743j62776l96430o28736q12280r13235r20851q46077p11541n39330
9342a7033999l43554j32339Q2687K78341M22153M83820M45439L03524O7312k39036
9332a5665652n72439q74525j085789j161767j081806q49082m85210k1743N08300
9323b1289713J073448J639506K164994K604342K917486L077313L071251K901707
9315a839666K589433K175754J715896J261916Q44199M65224J12435k18802n11677
$$ y = [6808183, 7266953, 7712782, 8108468, 8389402, 8465528, 8240714, 7644490, 6659988, 5331789, 3750868, 2028485, 272966, -1426377, -3011239, -4461703, -5791778, -7028837, -8185452, -9241264, -10147074, -10847816, -11309131, -11532759, -11556283, -11443172, -11272141, -11129717, -11102743, -11265519, -11661949, -12290685, -13102965, -14016200, -14937051, -15783128, -16494669, -17033999, -17377553, -17509892, -17427205, -17148864, -16726711, -16242891, -15797452, -15493928, -15426616, -15665652, -16238091, -17112616, -18198405, -19360172, -20441978, -21291060, -21776270, -21798013, -21289713, -20216265, -18576759, -16411765, -13807423, -10889937, -7812624, -4741373, -1839666, 749767, 2925521, 4641417, 5903333, 6747532, 7212756, 7325191, 7106389, 6594712]
9306F594712p36292q72496r27273r33237r30140r40916r55357r32470q24371o09624
9296b067464l13359P45K60459M16173M55167L94984K64767Q8631j18857l45805
9286i64559n74416p79548r34366j016800j012232r13848p24743m62737j63587
9277g546836J23575L49177M77223M92097L97561K13363k8024k87339n28008p24272
9267g061483q63092r40168r53308q96223p57293n27344k12460J60965N56837R47311
9257a0546258J321621J679221K015311K311232K536440K661087K671560K577939
9249G228153K407466K189834J946107J686788J415581J134121Q46404N61767K94088
9240A9710309N7698j36538k83654l87953m67102n52038o79106q77394j157024
$$ y = [6594712, 5858420, 4985924, 4058651, 3125414, 2195274, 1254358, 299001, -633469, -1457840, -2067464, -2380823, -2380078, -2119619, -1703446, -1248279, -853295, -588528, -499897, -618754, -964559, -1538975, -2318523, -3252889, -4269689, -5281921, -6195769, -6920512, -7383249, -7546836, -7423261, -7074084, -6596861, -6104764, -5707203, -5493840, -5521864, -5809203, -6337211, -7061483, -7924575, -8864743, -9818051, -10714274, -11471567, -11998911, -12211371, -12050406, -11493569, -10546258, -9224637, -7545416, -5530105, -3218873, -682433, 1978654, 4650214, 7228153, 9635619, 11825453, 13771560, 15458348, 16873929, 18008050, 18854454, 19416221, 19710309, 19768007, 19631469, 19347815, 18959862, 18492760, 17940722, 17261616, 16384222, 15227198]
9231A5227198j502001j869979k200929k432693k516468k426496k164122j757994
9223a643484j258664p26325k16952K26041N74040Q14505R52730J009442J012099
9214G43432R85103R45155R01465Q56210Q04243P35855O44921N38762M42488L92874
9204G990508M23321N47658P52241J000871J248510J455054J593026J649097J621645
9195A8281931J515244J333729J076999P46231L54296o8849m81991q44948j128108
9186B0784534j316660j413395j440924j438109j447915j502918j617743j790094
9178H816776k003661k227825k417498k520703k495449k327176k034622j659800
9170h869958j250278q46368m77980j65103Q5183K83484M56753O37905Q53145J115443
$$ y = [15227198, 13725197, 11855218, 9654289, 7221596, 4705128, 2278632, 114510, -1643484, -2902148, -3628473, -3845425, -3619384, -3045344, -2230839, -1278109, -268667, 743432, 1728535, 2673690, 3575155, 4431365, 5235608, 5971463, 6616384, 7155146, 7597634, 7990508, 8413829, 8961487, 9713728, 10714599, 11963109, 13418163, 15011189, 16660286, 18281931, 19797175, 21130904, 22207903, 22954134, 23308430, 23239581, 22757590, 21912642, 20784534, 19467874, 18054479, 16613555, 15175446, 13727531, 12224613, 10606870, 8816776, 6813115, 4585290, 2167792, -352911, -2848360, -5175536, -7210158, -8869958, -10120236, -10966604, -11444584, -11609687, -11524504, -11241020, -10784267, -10146362, -9293217, -8177774]
9160h177774J424439J766032K108872K404186K597014K646501K542203K305352
9152I616825J976781J602575J225407Q80537N91945L68190K01750P4052l6019
9143A6502043j44835k60558l82787n03200o07458o80449p14789p17244p06976
9134A1783747p05899p28594p78481q49849r31191j008178j068660j110226j145260
9125C457409j196735j284106j407771j543758j653083j698892j659497j531399
9117h517832j325577j062939p70406m75737k00824M3998K61924M66679O74491
9108a0906223Q93278J114138J309690J439438J459533J336079J061581O68174
9100a624312K25867j79579m78959o43114o86072o50446n85116n24171m74461m17907
$$ y = [-8177774, -6753335, -4987303, -2878431, -474245, 2122769, 4769270, 7311473, 9616825, 11593606, 13196181, 14421588, 15302125, 15894070, 16262260, 16464010, 16538062, 16502043, 16357208, 16096650, 15713863, 15210663, 14603205, 13922756, 13207967, 12490723, 11783747, 11077848, 10349254, 9570773, 8720924, 7789733, 6781555, 5712895, 4602669, 3457409, 2260674, 976568, -431203, -1974961, -3628044, -5326936, -6986433, -8517832, -9843409, -10906348, -11676754, -12152491, -12353315, -12309317, -12047393, -11580714, -10906223, -10012945, -8898807, -7589117, -6149679, -4690146, -3354067, -2292486, -1624312, -1398445, -1578024, -2056983, -2700097, -3386169, -4036615, -4621731, -5145902, -5620363, -6038270]
9090f038270l28723j95283l2213J24016K30413K53424J79410J8613j96987m21605
9080f407205o07476p17237p33648o63854n35775l86870k50769j49410r3191q3861
9070a0629296j14003j64011k03805k03991j51541n8697M2874J19929J55961J58645
9060a1047935J53356J68461K21153L10615M21442N35802O47196P65336R06450
9051f918124J075093J252226J400191J481372J476567J390752J244801J061413
9043C464291Q54893O29170L82429J13695j72650m66230p52941j017342j242666
9034A792649j408934j492606j470754j328272j063538o89696k33943K61752P40025
9025d893317J133771J381393J446213J329708J071766P38160L99798J09863j12467
$$ y = [-6038270, -6366993, -6562276, -6594489, -6470473, -6240060, -5986636, -5807226, -5788613, -5985600, -6407205, -7014681, -7731918, -8465566, -9129420, -9665195, -10052065, -10302834, -10452244, -10545435, -10629296, -10743299, -10907310, -11111115, -11315106, -11466647, -11525344, -11482470, -11362541, -11206580, -11047935, -10894579, -10726118, -10504965, -10194350, -9772908, -9237106, -8589910, -7824574, -6918124, -5843031, -4590805, -3190614, -1709242, -232675, 1158077, 2402878, 3464291, 4319184, 4948354, 5330783, 5444478, 5271828, 4805598, 4052657, 3035315, 1792649, 383715, -1108891, -2579645, -3907917, -4971455, -5661151, -5895094, -5633342, -4893317, -3759546, -2378153, -931940, 397768, 1469534, 2207694, 2607492, 2717355, 2604888]
9016B604888k82448m32047n84179p35710q58993r17691q84931p55187n48172l05417
9006c699887p8983Q6477J71086J85729J61369J28202R8486O3236K117j01897k51957
8995c236022m35273o29084q09853r59087j062441j106276j079232r80333q25272
8986a1122873o41170m50798k58218m7677K03612N08302Q57415J218455J541597
8977h191355J771194J860034J782877J545102J183308P57644L37896j3376k56516
8968G76808l84235m20095m04642l74152l42951k99871k20665q7142R9659L17742
8958a339544N30409O95714P78182P62145O60937N14526L74991K87799K78032L45035
8948C888226M64467N96613O99711P44664P25106O58061N74471N03163M55060M15748
$$ y = [2604888, 2322440, 1890393, 1306214, 570504, -288489, -1206180, -2091111, -2846298, -3394470, -3699887, -3778870, -3692393, -3521307, -3335578, -3174209, -3046007, -2947521, -2884285, -2882168, -2984065, -3236022, -3671295, -4300379, -5110232, -6069319, -7131760, -8238036, -9317268, -10297601, -11122873, -11764043, -12214841, -12473059, -12520736, -12317124, -11808822, -10951407, -9732952, -8191355, -6420161, -4560127, -2777250, -1232148, -48840, 708804, 1046700, 1033324, 776808, 392573, -27522, -432164, -806316, -1149267, -1449138, -1669803, -1756945, -1657286, -1339544, -809135, -113421, 664761, 1426906, 2087843, 2602369, 2977360, 3265159, 3543191, 3888226, 4352693, 4949306, 5649017, 6393681, 7118787, 7776848, 8351319, 8854482, 9309542, 9725290]
8938I725290L52067K30544L7222k13458m85246p35766r30968j053253j104535
8929E821897j105572j089295j086860j112197j155455j190642j192282j149111
8921c259517j066008r54412q20147o58956m63196k32876K0010K78588N32507P81073
8911e842934J023222J244088J414171J506015J514446J461188J380525J301619
8903E002340J242533J213733J219016J250945J289752J311236J297186J239354
8895A5066095J137330R96287Q26557O42071M56608K80361J18587k7883j60172
8886A9335841k77182l72912m38756m68824m62096m19802l43812k40609j26345
8877A6185503k4726M2683O5222M4505q770p6456j33554j53478j19161l2561Q5082
$$ y = [9725290, 10077357, 10307901, 10345123, 10131665, 9646419, 8910653, 7979685, 6926432, 5821897, 4716325, 3627030, 2540170, 1427973, 272518, -918124, -2110406, -3259517, -4325525, -5279937, -6100084, -6759040, -7222236, -7455112, -7435102, -7156514, -6624007, -5842934, -4819712, -3575624, -2161453, -655438, 859008, 2320196, 3700721, 5002340, 6244873, 7458606, 8677622, 9928567, 11218319, 12529555, 13826741, 15066095, 16203425, 17199712, 18026269, 18668340, 19124948, 19405309, 19523896, 19496013, 19335841, 19058659, 18685747, 18246991, 17778167, 17316071, 16896269, 16552457, 16311848, 16185503, 16160777, 16203460, 16268682, 16313187, 16304417, 16227961, 16094407, 15940929, 15821768, 15789207, 15874289]
8866A5874289K01129K80055K88475J99510N38k97467o55393j011532j297091j456049
8856A2126464j461485j322280j078477p87733n07182k76553j09473K188P3503
8847F658972J11199J08211N0374p1081k50474m67647o95763r10648j095101j236628
8837B201414j322662j338603j270807j112948q72140n71154k44844O8036L34070
8828d129638N32002O54867P05914O89618O04097M42845K05945q9242m08021p08156
8818a499769r50519j105625j158790j115516j001086q48459o80011m98009k92650
8809i150434o0380J83557M07474N76743O68675O81729O35702N61920M86914M19334
8799d588766L49488K61803J50850L0892o5794j01542n2246P7714K55107M32264
$$ y = [15874289, 16075418, 16355473, 16643948, 16843458, 16843996, 16546529, 15891136, 14879604, 13582513, 12126464, 10664979, 9342699, 8264222, 7476489, 6969307, 6692754, 6583281, 6585469, 6658972, 6770171, 6878382, 6928756, 6857675, 6607201, 6139554, 5443791, 4533143, 3438042, 2201414, 878752, -459851, -1730658, -2843606, -3715746, -4286900, -4531744, -4463708, -4129638, -3597636, -2942769, -2236855, -1547237, -943140, -500295, -294350, -383592, -791613, -1499769, -2450288, -3555913, -4714703, -5830219, -6831305, -7679764, -8359775, -8857784, -9150434, -9210814, -9027257, -8619783, -8043040, -7374365, -6692636, -6056934, -5495014, -5008100, -4588766, -4239278, -3977475, -3826625, -3795733, -3861527, -3963069, -4015315, -3937601, -3682494, -3250230]
8789c250230N64311O18134N74534M31770K11885l7727k53848l76248l68081k28887
8779b114387P338K89503N71275Q21629J018653J137960J151995J044652Q29162
8770D757780N52361K77864N7040r2950j88703k58882l18409l57007l47764k66294
8760C815036j06328J16548L71623O23448Q39826R95831J075515J073153R94308
8751I798960Q55404O80257M93576L14652J55571K4915o7442j09961r4942k6571
8741A2024419P3875J71075K29117K29720J82394J17380O6556M7896O3514J07809
8731A3313755J75893K67364L86280N38176P23376R28153J119828J252507J283787
8722A9989119J193099R88711O98247L51735k7868m20117p95972j113197j324712
$$ y = [-3250230, -2685919, -2067785, -1493251, -1061481, -849596, -887323, -1141171, -1517419, -1885500, -2114387, -2107049, -1817546, -1246271, -424642, 594011, 1731971, 2883966, 3928618, 4757780, 5310141, 5588005, 5645045, 5552095, 5363392, 5104510, 4786101, 4429094, 4081330, 3815036, 3708708, 3825256, 4196879, 4820327, 5660153, 6655984, 7731499, 8804652, 9798960, 10654364, 11334621, 11828197, 12142849, 12298420, 12323335, 12255893, 12145932, 12050990, 12024419, 12098294, 12269369, 12498486, 12728206, 12910600, 13027980, 13094536, 13142432, 13205946, 13313755, 13489648, 13757012, 14143292, 14681468, 15404844, 16332997, 17452825, 18705332, 19989119, 21182218, 22170929, 22869176, 23220911, 23193043, 22772926, 21976954, 20863757, 19539045]
8713A9539045j395595j317653j111920q18230m80347j36166J84894M61135O76375
8704A5601538Q15343Q59192P87643N89604K75276j18204n29141q80384j096332
8695A6304535j126756r67541o64749k97352N2875L29115N11920O10976O43113
8686A5396136O13469N14180L39234J00501j68431m22335o21731p49175q16741
8677A4185107q59761r19395j024209j180223j371189j565160j723897j813080
8669C728193j810305j707725j509494j227912q81780m97386j09510K40598N11854
8660c263467O73044P11735O38577M85778L00418J33886K8855O839O1067J59332
8650f3936K57743L20144L32812L05212K56096J95051J13023j1895j98897m50672
$$ y = [19539045, 18143450, 16825797, 15713877, 14895647, 14415300, 14279134, 14464028, 14925163, 15601538, 16416881, 17276073, 18063716, 18653320, 18928596, 18810392, 18281251, 17400867, 16304535, 15177779, 14210238, 13545489, 13248137, 13301012, 13630127, 14142047, 14753023, 15396136, 16009605, 16523785, 16863019, 16963520, 16795089, 16372754, 15751023, 15001848, 14185107, 13325346, 12405951, 11381742, 10201519, 8830330, 7265170, 5541273, 3728193, 1917888, 210163, -1299331, -2527243, -3409023, -3906409, -4015919, -3775321, -3263467, -2590423, -1878688, -1240111, -754333, -453915, -320029, -291174, -284335, -223268, -63936, 193807, 513951, 846763, 1151975, 1408071, 1603122, 1716145, 1704250, 1505353, 1054681]
8640A054681p48890j058076j332754j525301j595821j523855j316550j006537
8632i053103o39095k56676J09639M39090P15653R24010J048688J074899R91419
8623d645476P97268N10756J73932j53868m12270n57205n70588m59100k44866M5746
8613e515671L88403P59403J130853J470131J746171J937512K035966K044824J973602
8604G971194J830606J616144J322700R45535M96341P095m79471r22791j289738
8595A1497615j553021j691523j696774j580633j376504j131385q91818o90019
8587H85938n36471m22300l29407k42529j57378q1793k9809j1768k6729o3043j06720
8576a122009j49689j89900k23831k40620k25411j69864q0731J9418R7771J18828
$$ y = [1054681, 305791, -752285, -2085039, -3610340, -5206161, -6730016, -8046566, -9053103, -9692198, -9948874, -9839235, -9400145, -8684492, -7760482, -6711794, -5636895, -4645476, -3848208, -3337452, -3163520, -3317388, -3729658, -4286863, -4857451, -5316551, -5561417, -5515671, -5127268, -4367865, -3237012, -1766881, -20710, 1916802, 3952768, 5997592, 7971194, 9801800, 11417944, 12740644, 13686179, 14182520, 14189615, 13710144, 12787353, 11497615, 9944594, 8253071, 6556297, 4975664, 3599160, 2467775, 1575957, 885938, 349467, -72833, -402240, -644769, -802147, -883940, -913749, -925517, -952246, -1015289, -1122009, -1271698, -1461598, -1685429, -1926049, -2151460, -2321324, -2402055, -2382637, -2284866, -2166038]
8566b166038N2763j14927l75398o96032j030036j330629j560957j695102j712909
8557a0629265j595413j326346r01538l42930K90946R08891J410732J722787J825343
8548h636793J754717J580208J373234J186751J049741R70079R39223R37274R38194
8539B092628R13443Q34230O76172M28933J06917k46825n68321p90826q67644p90883
8529A787824n96184l47658j08636Q4978K32356L53583M66749N73810O62989P21543
8519C831354P46634P46715P35091P21985P09894O92950O59409N97195N02071L85083
8509A0328381K72942J97445J78067K09007K60550K94215K80832K09531Q3846q8991
8499A2225825l06034n68237q72990j205783j537802j832503k058467k200960k264894
$$ y = [-2166038, -2113275, -2228202, -2603600, -3299632, -4329668, -5660297, -7221254, -8916356, -10629265, -12224678, -13551024, -14452562, -14795492, -14504546, -13595655, -12184923, -10462136, -8636793, -6882076, -5301868, -3928634, -2741883, -1692142, -722063, 217160, 1154434, 2092628, 3006071, 3840301, 4516473, 4945406, 5052323, 4805498, 4237177, 3446351, 2578707, 1787824, 1191640, 843982, 735346, 820324, 1052680, 1406263, 1873012, 2446822, 3109811, 3831354, 4577988, 5324703, 6059794, 6781779, 7491673, 8184623, 8844032, 9441227, 9943298, 10328381, 10601323, 10798768, 10976835, 11185842, 11446392, 11740607, 12021439, 12230970, 12314816, 12225825, 11919791, 11351554, 10478564, 9272781, 7734979, 5902476, 3844009, 1643049, -621845]
8490f21845k267792k228565k159489k063921j937439j770993j556947j296443
8482a5903434j001109o84453l50178P943L89981P72017J106383J343346J456972
8473a2862532J455897J375960J265464J171972J130631J152944J221506J297870
8465b790288J341990J331617J269814J177550J078120R84325Q96302Q09119P20725
8456F819274O31550N37585M27226K87559J13727q8910l11303n47757p95406j045658
8446F027887j274369j440232j497272j417289j207593r09926n80561k65644J2862
8437b552137K54725M66255O42495P60442P92490P33485O19015N15468M84996N49848
8427C267082O81191Q19373R11209R39285R24492R02688Q95833R00025Q95334Q63672
$$ y = [-621845, -2889637, -5118202, -7277691, -9341612, -11279051, -13050044, -14606991, -15903434, -16904543, -17588996, -17939174, -17931231, -17541250, -16769233, -15662850, -14319504, -12862532, -11406635, -10030675, -8765211, -7593239, -6462608, -5309664, -4088158, -2790288, -1448298, -116681, 1153133, 2330683, 3408803, 4393128, 5289430, 6098549, 6819274, 7450824, 7988409, 8415635, 8703194, 8816921, 8728011, 8416708, 7868951, 7073545, 6027887, 4753518, 3313286, 1816014, 398725, -808868, -1718794, -2299355, -2564999, -2552137, -2297412, -1831157, -1188662, -428220, 364270, 1097755, 1716770, 2232238, 2717234, 3267082, 3948273, 4767646, 5678855, 6618140, 7542632, 8445320, 9341153, 10241178, 11136512, 12000184]
8417A2000184P98408P01709N76681M23004K39984L5166j68351l34052m25762m25540
8407A3421431l43929k16518r0160p465L742o6133k10009m07438o28120q36308
8397A0619093r96960j082821j080717r95640q50901o82347n27027m10906l41530
8388C650244l07806k85966k50604j88305j06155k6162L2559O7785Q9682J02268
8378B777540R0797K8384j05506l12016n73317q60473j140092j378011j543338
8369c016032j614322j583382j457745j254754r94653o95401l72278m0832K81000
8360a0748399N74191Q22504J015941J150978J226159J234304J156171R62807O30633
8351a974711J64312l86882r34228j379763j656611j754441j713970j596755j452741
$$ y = [12000184, 12798592, 13500301, 14076982, 14499986, 14739970, 14775136, 14606785, 14272733, 13846971, 13421431, 13077502, 12860984, 12770824, 12763359, 12767101, 12700968, 12490959, 12083521, 11455401, 10619093, 9622133, 8539312, 7458595, 6462955, 5612054, 4929707, 4402680, 3991774, 3650244, 3342438, 3056472, 2805868, 2617563, 2511408, 2485246, 2517805, 2585590, 2675272, 2777540, 2868337, 2896721, 2791215, 2479199, 1905882, 1045409, -94683, -1472694, -3016032, -4630354, -6213736, -7671481, -8926235, -9920888, -10616289, -10988567, -11029399, -10748399, -10174208, -9351704, -8335763, -7184785, -5958626, -4724322, -3568151, -2605344, -1974711, -1810399, -2197281, -3131509, -4511272, -6167883, -7922324, -9636294, -11233049, -12685790]
8342a2685790j305001j154466r94194q21740o44179m75905l32068k21713j43589
8333a8778645q5059k3658O7265K07375L96615O10921Q13374R74867J088069J163033
8323a3565843J209471J222352J183080J074033Q94777O69914M45001K72102J90457
8314f404656K11448L16132M65955O18381P37800P98296P81434O74423M72209J83101
8304a145477j66638n34790q72896j139320j310643j388926j402058j392667j395626
8295a0749041j415422j419549j354173j172067q56531m31011M6837N02987Q70179
8286a5977791J106700J202325J170743J036758Q28535N78480L27117J20635j570
8277i608068k2223M8476J83339L56044N51070P59264R67456J155275J302710J400824
$$ y = [-12685790, -13990791, -15145257, -16139451, -16961191, -17605370, -18081275, -18413343, -18635056, -18778645, -18863704, -18887362, -18820097, -18612722, -18216107, -17605186, -16791812, -15816945, -14728876, -13565843, -12356372, -11134020, -9950940, -8876907, -7982130, -7312216, -6867215, -6595113, -6404656, -6193208, -5877076, -5411121, -4792740, -4054940, -3256644, -2475210, -1800787, -1328578, -1145477, -1312115, -1846905, -2719801, -3859121, -5169764, -6558690, -7960748, -9353415, -10749041, -12164463, -13584012, -14938185, -16110252, -16966783, -17397794, -17350957, -16847970, -15977791, -14871091, -13668766, -12498023, -11461265, -10632730, -10054250, -9727133, -9606498, -9608068, -9630291, -9581815, -9398476, -9042432, -8491362, -7732098, -6764642, -5609367, -4306657, -2905833]
8267b905833J456687J490714J529762J598576J710311J858105K012070K125338
8259A0875730K148430K046443J811254J463015J041425N93175J61997k18141n29147
8250A9394181p72377r63385j117472j237093j313091j337729j314728j256306
8242A0082000j173191j070472r53385q35619p41577p00740p37138q57937j045628
8233A966313j258927j444258j553620j560569j467637j303416j111841r38553
8225h672508q18943p70358p88856q50790r20220r60937r48090q73418p42507n68163
8215a6914790l65238j49343O1686K46903L85598M65846M93200M90928M88626N06852
8205a4289732N49777O09618O75540P38457P91320Q30060Q56785Q80927R14679
$$ y = [-2905833, -1449146, 41568, 1571330, 3169906, 4880217, 6738322, 8750392, 10875730, 13024160, 15070603, 16881857, 18344872, 19386297, 19979472, 20141469, 19923328, 19394181, 18621804, 17658419, 16540947, 15303854, 13990763, 12653034, 11338306, 10082000, 8908809, 7838337, 6884952, 6049333, 5307756, 4607016, 3869878, 3011941, 1966313, 707386, -736872, -2290492, -3851061, -5318698, -6622114, -7733955, -8672508, -9491451, -10261809, -11050665, -11901455, -12821675, -13782612, -14730702, -15604120, -16346627, -16914790, -17280028, -17429371, -17367685, -17120782, -16735184, -16269338, -15776138, -15285210, -14796584, -14289732, -13739955, -13130337, -12454797, -11716340, -10925020, -10094960, -9238175, -8357248, -7442569]
8196g442569R65241J030062J098581J158338J200908J224504J233309J235136
8188A703510J238126J246379J255454J250903J212196J120574R66411P53783N02897
8179A1250233K50394M3719p3940q4617j0900Q6216J29945O0700j38633m39462
8169A1073655p85585j117118j383941j546710j576892j464978j231937r31313
8161A035181o36422m19335l31920l93792n86782q55806j118808j287986j298746
8152e894416j135089q37272m85314j66789N3052J45172J14070j3251j98885m02767
8142h821489n88109p24630p92082p85231p17508o18744n25828m69984m66064n07568
8132a5017237n68957o14631o11341n39726m01956k23675m7963P9787J31480J09820
$$ y = [-7442569, -6477328, -5447266, -4348685, -3190347, -1989439, -764935, 468374, 1703510, 2941636, 4188015, 5443469, 6694372, 7906568, 9027142, 9993553, 10747336, 11250233, 11500627, 11544346, 11470406, 11385789, 11374889, 11461105, 11591050, 11651750, 11513117, 11073655, 10288070, 9170952, 7787011, 6240301, 4663409, 3198431, 1966494, 1035181, 398759, -20576, -352496, -746288, -1333070, -2188876, -3307684, -4595670, -5894416, -7029505, -7866777, -8352091, -8518880, -8465828, -8320656, -8206586, -8219837, -8418722, -8821489, -9409598, -10134228, -10926310, -11711541, -12429049, -13047793, -13573621, -14043605, -14509669, -15017237, -15586194, -16200825, -16812166, -17351892, -17753848, -17977523, -18025486, -17945699, -17814219, -17704399]
8122a7704399M6917j1598k7618J4294J03845K13163L10035L68967L76594L32666
8112a5977134K48841J45199M4047l6651q5747r6057n9662L3864J94662M27031
8102a5161607P23671J062025J404715J705366J918770K011291J967188J790042
8094b578539J502546J146834P82109M73582K73195K02195K47006L69580N23030
8085B941538O63896P60693Q01604P98741P82664P87666Q38236R46118J114637
8076A0435793J338415J594059J832545J987468K000056J845598J543393J144384
8068B3721711P05865K69930j41994n18670q44468j094121j240596j268977j186736
8059A8401944j025442q32799o55992n21949m25728l36481k18369n2423J54263
$$ y = [-17704399, -17657482, -17669080, -17696698, -17682404, -17578559, -17365396, -17055361, -16686394, -16309800, -15977134, -15728293, -15583094, -15539047, -15575698, -15661445, -15757502, -15817164, -15783300, -15588638, -15161607, -14437936, -13375911, -11971196, -10265830, -8347060, -6335769, -4368581, -2578539, -1075993, 70841, 852950, 1326532, 1599727, 1801922, 2048928, 2418508, 2941538, 3605434, 4366127, 5167731, 5966472, 6749136, 7536802, 8375038, 9321156, 10435793, 11774208, 13368267, 15200812, 17188280, 19188336, 21033934, 22577327, 23721711, 24427576, 24697506, 24555512, 24036842, 23192374, 22098253, 20857657, 19588680, 18401944, 17376502, 16543703, 15887711, 15365762, 14940034, 14603553, 14385184, 14332761, 14487024]
8050A4487024L74325N73082P19562P91809P78161O77444M99632K67264J7012k00813
8040A8984502l29015l18691j47843J66899N72433R92837J347111J566526J610419
8031B4445178J477031J203009Q48714M75316J25030j87000m67948p34482r98022
8022B6186826j253131j473789j621890j667160j607191j471149j301840j130447
8014A4660229r65050p99221o28265m58635l07829j99584j56657j91632l00389
8005A0652967m64701o63172q80764j107845j329582j515329j618290j588717j394956
7996H9611j041239n72585o3478M05372P72192J009183J120427J127083J052981
7987C899547R20333P53157N79204M25394L09349K31767J73647J02412j2401j81947
$$ y = [14487024, 14861349, 15434431, 16153993, 16945802, 17723963, 18401407, 18901039, 19168303, 19185315, 18984502, 18655487, 18336796, 18188953, 18355852, 18928285, 19921122, 21268233, 22834759, 24445178, 25922209, 27125218, 27973932, 28449248, 28574278, 28387278, 27919330, 27184848, 26186826, 24933695, 23459906, 21838016, 20170856, 18563665, 17092516, 15790676, 14660229, 13695179, 12895958, 12267693, 11809058, 11501229, 11301645, 11144988, 10953356, 10652967, 10188266, 9525094, 8644330, 7536485, 6206903, 4691574, 3073284, 1484567, 89611, -951628, -1524213, -1587691, -1182319, -410127, 599056, 1719483, 2846566, 3899547, 4819880, 5573037, 6152241, 6577635, 6886984, 7118751, 7292398, 7394810, 7382409, 7200462]
7977G200462l92442o14878q18822r76561j058135j030868q72359n89422k26353
7968F20622J46616M58035O57228P21574O49581M50593J41741k46992o68452j063945
7958A866601j379362j582746j672252j669586j603491j493400j342313j141269
7950a0017818q80632n60690j96644J82384N37974Q28910J018996J085424J025338
7941f976758Q57505O17291L46694Q4685j36590k88801l43545k75528p4521K41901
7931e947667O25492J007789J317534J496171J508202J348797J050003O81049L35757
7922C423127J05798M9640J73232M33389P61045J089570J372516J585020J715136
7913A0708473J756344J707482J577356J386565J162682R31693P11114N07352L16516
$$ y = [7200462, 6808020, 6193142, 5374320, 4397759, 3339624, 2308756, 1436397, 846975, 620622, 767238, 1225273, 1882501, 2604075, 3253656, 3704249, 3845990, 3598998, 2930546, 1866601, 487239, -1095507, -2767759, -4437345, -6040836, -7534236, -8876549, -10017818, -10898450, -11459140, -11655784, -11473400, -10935426, -10106516, -9087520, -8002096, -6976758, -6119253, -5501962, -5155268, -5070583, -5207173, -5495974, -5839519, -6115047, -6189568, -5947667, -5322175, -4314386, -2996852, -1500681, 7521, 1356318, 2406321, 3087370, 3423127, 3528925, 3578565, 3751797, 4185186, 4946231, 6035801, 7408317, 8993337, 10708473, 12464817, 14172299, 15749655, 17136220, 18298902, 19230595, 19941709, 20449061, 20765577]
7904B0765577J27703p1436k87964n17836p42599r29881j040412j043383r35341
7895A5324428p50441n52226m09939l74118m64711o73074r69442j308963j637315
7886H184199j900822k061217k107717k057606j943840j796901j630999j440895
7878f755798j209668r23344n85478k23934J14674L80265N35810N66738M80949
$$ y = [20765577, 20893280, 20821844, 20533880, 20016044, 19273445, 18343564, 17303152, 16259769, 15324428, 14573987, 14021761, 13611822, 13237704, 12772993, 12099919, 11130477, 9821514, 8184199, 6283377, 4222160, 2114443, 56837, -1887003, -3683904, -5314903, -6755798, -7965466, -8888810, -9474288, -9698222, -9583548, -9203283, -8667473, -8100735, -7619786]
$$ [...]
##END NTUPLES=NMR SPECTRUM
##END=
