##TITLE=31Pdec_DE-20HM2
 CDCl3 
  24 sc
 25.10.2023
##JCAMPDX= 6.0         $$ Bruker NMR JCAMP-DX V2.0
##DATA TYPE= NMR SPECTRUM
##DATA CLASS= NTUPLES
##ORIGIN= UXNMR, Bruker Analytische Messtechnik GmbH
##OWNER= root
$$ XWIN-NMR		Version 3.5
$$ Wed Oct 25 14:59:08 2023 Russian Standard Time (UT+4h)  she@DPX200
##.OBSERVE FREQUENCY= 81.013821
##.OBSERVE NUCLEUS= ^31P
##.ACQUISITION MODE= SIMULTANEOUS
##.ACQUISITION SCHEME= undefined
##.AVERAGES= 28
##.DIGITISER RES= 16
##SPECTROMETER/DATA SYSTEM= spect
##.PULSE SEQUENCE= zgpg30
##.SOLVENT NAME= D2O
##.SHIFT REFERENCE= (INTERNAL, D2O, 0, 248.564)
##AUDIT TRAIL= $$ (NUMBER, WHEN, WHO, WHERE, WHAT)
$$ ##TITLE= Audit trail, XWIN-NMR		Version 3.5
$$ ##JCAMPDX= 5.01
$$ ##ORIGIN= Bruker BioSpin GmbH
$$ ##OWNER= she
$$ F:/spectra/data/she/nmr/P31/1/pdata/1/auditp.txt
$$ ##AUDIT TRAIL=  $$ (NUMBER, WHEN, WHO, WHERE, WHAT)
(   1,<2023-10-25 14:57:28.45 +0400>,<she>,<DPX200>,
      <created by zg, POWCHK disabled, PULCHK disabled
       terminated by command 'halt'
       configuration hash MD5:
       00 E9 B6 7A A2 85 ED C7 34 08 36 98 17 FE 4E 26
       data hash MD5: 32K
       C8 A7 40 F8 E8 2F 82 B8 5E D6 21 07 2C F2 EA C7>)
(   2,<2023-10-25 14:57:35.18 +0400>,<she>,<DPX200>,
      <Start of raw data processing
       efp BC_mod = 2 LB = 5 FT_mod = 6 PKNL = 1 PHC0 = -10682.77 PHC1 = 146.0862 SI = 64K 
       data hash MD5: 64K
       EA B6 C8 26 7B 91 FD 65 68 FC 18 05 07 E1 6F F2>)
(   3,<2023-10-25 14:57:53.59 +0400>,<she>,<DPX200>,
      <pk PHC0 = -129.0969 PHC1 = 271.8001 
       data hash MD5: 64K
       CF 32 D9 61 AF E8 DC BE 7C 00 5F 1D E0 79 8A ED>)
(   4,<2023-10-25 14:58:29.84 +0400>,<she>,<DPX200>,
      <pk PHC0 = -545.955 PHC1 = 1258.403 
       data hash MD5: 64K
       39 12 99 E4 51 B4 82 59 9C E3 21 08 A4 83 1E F8>)
(   5,<2023-10-25 14:58:37.29 +0400>,<she>,<DPX200>,
      <abs ABSG = 5 
       data hash MD5: 64K
       A0 91 3A 3F 0F CF 1E AE 98 B8 EF 24 41 89 47 8F>)
$$ ##END=
$$ 
$$ hash MD5
$$ 9B 4E 80 30 58 4E 70 F8 3F 7B 62 35 19 9F 44 C5
##$RELAX= 
##$RELAX= 
##$RELAX= 
##$RELAX= 
##$RELAX= 
##$RELAX= 
##$RELAX= 
##$RELAX= 
##$RELAX= 
$$ Bruker specific parameters
$$ --------------------------
##$DU= <F:/spectra>
##$EXPNO= 1
##$NAME= <P31>
##$PROCNO= 1
##$TYPE= <nmr>
##$USER= <she>
##$AMP= (0..31)
100 100 100 100 100 100 100 100 100 100 100 100 100 100 100 100 100 100 
100 100 100 100 100 100 100 100 100 100 100 100 100 100 
##$AQSEQ= 0
##$AQ_mod= 1
##$AUNM= <au_zg>
##$AUTOPOS= <>
##$BF1= 81.014009
##$BF2= 200.13
##$BF3= 200.13
##$BF4= 200.13
##$BF5= 200.13
##$BF6= 200.13
##$BF7= 200.13
##$BF8= 200.13
##$BYTORDA= 1
##$CFDGTYP= 0
##$CFRGTYP= 5
##$CHEMSTR= <none>
##$CNST= (0..31)
1 1 145 1 1 1 1 1 1 1 1 1 1 1 1 1 1 1 1 1 1 1 1 1 1 1 1 1 1 1 1 1 
##$CPDPRG= <waltz16>
##$CPDPRG1= <>
##$CPDPRG2= <waltz16>
##$CPDPRG3= <>
##$CPDPRG4= <mlev>
##$CPDPRG5= <mlev>
##$CPDPRG6= <mlev>
##$CPDPRG7= <mlev>
##$CPDPRG8= <mlev>
##$CPDPRGB= <>
##$CPDPRGT= <>
##$D= (0..31)
$$ [...]
##$SUBNAM3= <"">
##$SUBNAM4= <"">
##$SUBNAM5= <"">
##$SUBNAM6= <"">
##$SUBNAM7= <"">
##$SUBNAM8= <"">
##$SUBNAM9= <"">
##$SW= 501.771253377433
##$SWIBOX= (0..15)
0 1 3 0 0 0 0 0 0 0 0 0 0 0 0 0 
##$SW_h= 40650.406504065
##$TD= 32768
##$TD0= 1
##$TE= 0
##$TE2= 300
##$TE3= 300
##$TEG= 300
##$TL= (0..7)
0 120 53 12 22 120 120 120 
##$TP= (0..7)
150 150 150 150 150 150 150 150 
##$TP07= 0
##$TPNAME0= <>
##$TPNAME1= <>
##$TPNAME2= <>
##$TPNAME3= <>
##$TPNAME4= <>
##$TPNAME5= <>
##$TPNAME6= <>
##$TPNAME7= <>
##$TPOAL= (0..7)
0.5 0.5 0.5 0.5 0.5 0.5 0.5 0.5 
##$TPOFFS= (0..7)
0 0 0 0 0 0 0 0 
##$TUNHIN= 0
##$TUNHOUT= 0
##$TUNXOUT= 0
##$USERA1= <user>
##$USERA2= <user>
##$USERA3= <user>
##$USERA4= <user>
##$USERA5= <user>
##$V9= 5
##$VALIST= <valist>
##$VCLIST= <CCCCCCCCCCCCCCC>
##$VD= 0
##$VDLIST= <DDDDDDDDDDDDDDD>
##$VPLIST= <PPPPPPPPPPPPPPP>
##$VTLIST= <TTTTTTTTTTTTTTT>
##$WBST= 1024
##$WBSW= 4
##$XGAIN= (0..3)
0 0 0 0 
##$XL= 0
##$YL= 0
##$YMAX_a= 1602
##$YMIN_a= -1969
##$ZGOPTNS= <>
##$ZL1= 120
##$ZL2= 120
##$ZL3= 120
##$ZL4= 120
##$ABSF1= 248.5645
##$ABSF2= -253.2056
##$ABSG= 5
##$ABSL= 3
##$ALPHA= 0
##$AQORDER= 0
##$ASSFAC= 0
##$ASSFACI= 0
##$ASSFACX= 0
##$ASSWID= 0
##$AUNMP= <proc_1d>
##$AZFE= 0.1
##$AZFW= 0.5
##$BCFW= 0
##$BC_mod= 2
##$BYTORDP= 0
##$COROFFS= 0
##$CY= -3
##$DATMOD= 1
##$DC= 0
##$DFILT= <>
##$DTYPP= 0
##$F1P= 0
##$F2P= 0
##$FCOR= 1
##$FTSIZE= 65536
##$FT_mod= 6
##$GAMMA= 0
##$GB= 0
##$INTBC= 1
##$INTSCL= 6.047779e-11
##$ISEN= 30
##$LB= 5
##$LEV0= 0
##$LPBIN= 0
##$MAXI= 10000
##$MC2= 0
##$MEAN= 0
##$ME_mod= 0
##$MI= 50
##$NCOEF= 0
##$NC_proc= -11
##$NLEV= 6
##$NOISF1= 182.463
##$NOISF2= 159.3651
##$NSP= 0
##$NTH_PI= 0
##$NZP= 0
##$OFFSET= 248.5645
##$PC= 4
##$PHC0= -11357.83
##$PHC1= 1676.289
##$PH_mod= 1
##$PKNL= yes
##$PPARMOD= 0
##$PSCAL= 0
##$PSIGN= 0
##$REVERSE= no
##$SF= 81.0140089999694
##$SI= 65536
##$SIGF1= 159.3651
##$SIGF2= -187.1042
##$SINO= 113.3802
##$SIOLD= 16384
##$SREGLST= <1H.CDCl3>
##$SSB= 0
##$STSI= 65536
##$STSR= 0
##$SW_p= 40650.406504065
##$SYMM= 0
##$S_DEV= 0
##$TDeff= 32768
##$TDoff= 0
##$TI= <>
##$TILT= no
##$TM1= 0
##$TM2= 0
##$TOPLEV= 0
##$USERP1= <user>
##$USERP2= <user>
##$USERP3= <user>
##$USERP4= <user>
##$USERP5= <user>
##$WDW= 1
##$XDIM= 65536
##$YMAX_p= 461781257
##$YMIN_p= -223049197
$$ End of Bruker specific parameters
$$ ---------------------------------
##NTUPLES= NMR SPECTRUM
##VAR_NAME=  FREQUENCY,     SPECTRUM/REAL,   SPECTRUM/IMAG
##SYMBOL=    X,             R,               I
##VAR_TYPE=  INDEPENDENT,   DEPENDENT,       DEPENDENT
##VAR_FORM=  AFFN,          ASDF,            ASDF
##VAR_DIM=   65536,         65536,           65536
##UNITS=     HZ,            ARBITRARY UNITS, ARBITRARY UNITS
##FACTOR=    0.620285442955139, 1,           1
##FIRST=     20137.2065510682, 0,            0
##LAST=      -20513.1999529968, 0,           0
##MIN=       -20513.1999529968, -223049197,  0
##MAX=       20137.2065510682, 461781257,    0
$$ Real data points
##PAGE= N=1
##DATA TABLE= (X++(R..R)), XYDATA
$$ [...]
39759a9049862M670468P522596Q887095Q192377O409486M989064M423614M091908
39751C0136746L237457J739996k7818j762368l394198m739384n302332m713317
39743A5174782l258875j626308j31454J353943K604434K787317J506985k74046
39735A8136778r90727o3702J737396L358868M277815M295790L309832J685793
39727C5747843L65272Q3488O27751J168131J153473O10440k38852j250810k263861
39718C6002875l057136l505987l611629l366163k809348k279079k345909l269072
39710A1758552m595491n463340n249616l812410j324377J684963M084615M527741
39702A610637K633834l46132k529192l121160k806053k459874k040393j041421
$$ plain form
39759 -19049862 -14379394 -6856798 2030297 10222674 16632160 21621224 26044838 30136746
39751 30136746 33374203 35114199 35086381 33324013 29929815 25190431 19888099 15174782
39743 15174782 11915907 10289599 10158145 11512088 14116522 16903839 18410824 18136778
39735 18136778 17146051 17082349 18819745 22178613 26456428 30752218 34062050 35747843
39727 35747843 36113115 36196603 36824354 37992485 39145958 39756398 39517546 38266736 36002875
39718 36002875 32945739 29439752 25828123 22461960 19652612 17373533 15027624 11758552
39710 11758552 7163061 1699721 -3549895 -7362305 -8686682 -7001719 -2917104 1610637
39702 1610637 4244471 3898339 1369147 -1752013 -4558066 -7017940 -9058333 -10099754
39694a0099754M02563J403726J221666j21656k125227m336040o410157p820696
39686b7885575p776280n658575j700398K820897O311093P910061P763650O401843
39678a1813284M284626K071005P78544J120388K790457M741098O048972O274212
39670A6296018N324098L556543J929857J417958K076283L028462L427670L049510
39662D0106399J969306L09947j398481k218345j790609j087483j563403l485593
39654C0841738n515880o093210m963941l194409j902747j271568q05791k57690
39646F836502M1636j77279m74207p1047J125863K219288K230582J115996l47229
39637A2500105j534993k493543l445803m145689m076165l228076k295399j874238
$$ plain form
39694 -10099754 -9697191 -8293465 -7071799 -7193455 -9318682 -13654722 -20064879 -27885575
39686 -27885575 -35661855 -41320430 -43020828 -40199931 -33888838 -25978777 -18215127 -11813284
39678 -11813284 -7528658 -5457653 -4679109 -3558721 -768264 3972834 10021806 16296018
39670 16296018 21620116 25176659 27106516 28524474 30600757 33629219 37056889 40106399
39662 40106399 42075705 42385652 40987171 38768826 36978217 35890734 34327331 30841738
39654 30841738 25325858 19232648 14268707 11074298 9171551 7899983 7094192 6836502
39646 6836502 6878138 6700859 6226652 6155605 7281468 9500756 11731338 12847334 12500105
39637 12500105 10965112 8471569 5025766 880077 -3196088 -6424164 -8719563 -10593801
39629a0593801j708393j093737O0967J052199J372184J364093J507403J464544
39621f574541M70241j447048l263530m067130l828822k932495j550305J11921
39613b3081709J425451J818694J535558J440996K073672L232806M429107N265717
39605a859708N267637L856302R81672k323247m455214m541866l170051j728536
39597g973011j064982q59038k64983R96750K293084K741460K076411Q50143j02523
39588a306689l34566k0686L28816L18679j24032q52096j637908k174251k099898
39579g902631j203595L95705K330644M161291N367791N340474L750023J108026
39571A3347728j211376j813118l75802J979325L465234K990932R23536j498007
$$ plain form
39629 -10593801 -12302194 -13395931 -13334964 -12282765 -10910581 -9546488 -8039085 -6574541
39621 -6574541 -6104300 -7551348 -10814878 -14882008 -18710830 -21643325 -23193630 -23081709
39613 -23081709 -21656258 -19837564 -18302006 -16861010 -14787338 -11554532 -7125425 -1859708
39605 -1859708 3407929 7264231 8245903 5922656 1467442 -3074424 -6244475 -7973011
39597 -7973011 -9037993 -9897031 -10162014 -9165264 -6872180 -4130720 -2054309 -1204166 -1306689
39588 -1306689 -1641255 -1661941 -1333125 -1014446 -1138478 -1990574 -3628482 -5802733 -7902631
39579 -7902631 -9106226 -8710521 -6379877 -2218586 3149205 8489679 12239702 13347728
39571 13347728 12136352 10323234 9947432 11926757 15391991 18382923 19306459 17808452
39563A7808452l449832n005279o345073o994942o298521m388611k131460j73613
39555a6978879J394057K403410K333954J040721o96501j810236j934282j465085
39547a5712841q85607l80668N3509N14056J202302K272492L616254M844908N400605
39538I25010M746445K821451M58696j055416j161475m77117J92776Q56805J892987
39529I200162L045465L576583L202938K138427L38681k403988n491870p551802
39521F054596p840427o923836n543585l568501p59554K054598L544596L414539
39513i567574K489362J323900l38550k456951l887701l352406q94465K107256
39505a4577129M183968M677956L692022J786350j48064j200579j040908j81260
$$ plain form
39563 17808452 14358620 9353341 3008268 -3986674 -10285195 -14673806 -16805266 -16978879
39555 -16978879 -15584822 -13181412 -10847458 -9806737 -10503238 -12313474 -14247756 -15712841
39547 -15712841 -16598448 -16979116 -16925607 -16411551 -15209249 -12936757 -9320503 -4475595 925010
39538 925010 5671455 8492906 8951602 7896186 6734711 6257594 6450370 7307175 9200162
39529 9200162 12245627 15822210 19025148 21163575 21502256 19098268 13606398 6054596
39521 6054596 -1785831 -8709667 -14253252 -17821753 -18581307 -16526709 -12982113 -9567574
39513 -9567574 -7078212 -5754312 -6092862 -8549813 -12437514 -15789920 -16684385 -14577129
39505 -14577129 -10393161 -5715205 -2023183 -236833 -384897 -1585476 -2626384 -2807644
39497b807644N13799N37637j03758j233066k619122l678522l490923j622250J062219
39488a3441630K856798K749623J291560k35145j208512j893775k569509l046604
39480a5497194l141374l104783l277057l595498l703072l340669k422010r50465
39472c9032122Q59594K534192L690709M361138M795019N118494N403017N804741
39464f465218O236359O076633M717565K407679J13434j471403k310973k432635
39456F871441j657227k56933P59521O67058K2297J2274R53380K058898K663015
39447A2093724K979076L403048L654410L103665J677842m9784j618961l129934
39439B2113086m846275o636400p964833q252255p082533m274767j60423M138218
$$ plain form
39497 -2807644 -2293845 -1756208 -1859966 -3093032 -5712154 -9390676 -12881599 -14503849 -13441630
39488 -13441630 -10584832 -7835209 -6543649 -6778794 -7987306 -9881081 -12450590 -15497194
39480 -15497194 -18638568 -21743351 -25020408 -28615906 -32318978 -35659647 -38081657 -39032122
39472 -39032122 -38172528 -35638336 -31947627 -27586489 -22791470 -17672976 -12269959 -6465218
39464 -6465218 -228859 5847774 10565339 12973018 13086452 11615049 9304076 6871441
39456 6871441 5214214 4957281 5716802 6383860 6406157 6418431 7371811 9430709 12093724
39447 12093724 15072800 18475848 22130258 25233923 26911765 26861981 25243020 22113086
39439 22113086 17266811 10630411 2665578 -5586677 -12669210 -16943977 -17104400 -12966182
39431a2966182P108346P910697O972542N285017L280592Q01860j957174m160081
39423A2275617n213946n352465m910798l580581j115614J529964K696199J809898
39415a861726L729j304230j848904k169105k374532j928881n49580J219075K505489
39406h308665K973193L043300L278222L611399L344753K055436L31629p59369
39398I569898r17596q91322j386162k135125k337682j675254n41169M83665J031583
39389A200836J043241Q44327R73803J559532J986575J577558N19092l10387m35069
39380H959508l10433p11190j955461l804299n726853p049791p140239n757862
39372b3496620l207164q7470K963414N218829N800563L993152j53455n372235
$$ plain form
39431 -12966182 -5857836 2052861 9025403 14310420 17591012 18392872 16435698 12275617
39423 12275617 7061671 1709206 -3201592 -6782173 -7897787 -6367823 -3671624 -1861726
39415 -1861726 -1857997 -3162227 -5011131 -7180236 -9554768 -11483649 -12033229 -10814154 -8308665
39406 -8308665 -5335472 -2292172 986050 4597449 7942202 9997638 10329267 9569898
39398 9569898 8652302 7760980 6374818 4239693 1902011 226757 -314412 169253 1200836
39389 1200836 2244077 3088404 4062207 5621739 7608314 9185872 9704964 9394577 8959508
39380 8959508 8649075 7937885 5982424 2178125 -3548728 -10598519 -17738758 -23496620
39372 -23496620 -26703784 -26791254 -23827840 -18609011 -12808448 -8815296 -8968751 -14340986
39364a4340986r384662j0077818p141450k646079M72829Q39508n07782j592861
39356d4379301j400909k16079J302727K776295M042351N051898N955762O941337
39348a9925919P830937Q042665P065086M913670K226177J12560k77932J411177
39340A1398421M136693O090928O332076N609103N249054N415783M943318K906411
39332E2081787j11863k514082l124657j980547j49265Q34385k18329l070615n698805
39323C6048009n748785k832413R74232L281334L656406L296698K900715J818011
39315D3394207n64593l466544n349025n549307m792440m280833m670516n708399
39307I012550o330710n164209j530472L732498Q646968J1447791J1517137R219805
$$ plain form
39364 -14340986 -23725648 -33803466 -40944916 -43590995 -43118166 -42278658 -42786440 -44379301
39356 -44379301 -45780210 -45996289 -44693562 -41917267 -37874916 -32823018 -26867256 -19925919
39348 -19925919 -12094982 -4052317 3012769 7926439 10152616 10265176 9987244 11398421
39340 11398421 15535114 21626042 27958118 33567221 38816275 44232058 49175376 52081787
39332 52081787 51969924 49455842 46331185 44350638 44201373 45035758 44817429 41746814 36048009
39323 36048009 30299224 27466811 28441043 31722377 35378783 38675481 41576196 43394207
39315 43394207 42829614 39363070 34014045 28464738 23672298 19391465 14720949 9012550
39307 9012550 2681840 -2482369 -4012841 -280343 8366625 19814416 31331553 40551358
39299D0551358N378426J082653k504571m671166n447563n223875m325457l197902
39291B1641903k643108l305276m924564o483998p116333o611869n222773l489640
39283a8155658k202347j839968j799311p63815J745957M588901O138955N809385
39275f477901M090097J667561p23097j952170j096385J370557L719299M631195
39267E229156M241220L352974K285962R45093m98482j628457k287614k608473
39259I031379k711122k760912l112027l891622m510692m074646k364939r7902
39251a4492483J813532K958024L419860L490688L525114L767443M117854M228186
39243A2828218L917925L304394K457730J202208n48467k452468l962255m777885
$$ plain form
39299 40551358 45929784 47012437 44507866 39836700 34389137 29165262 24839805 21641903
39291 21641903 18998795 15693519 10768955 4284957 -2831376 -9443245 -14666018 -18155658
39283 -18155658 -20358005 -22197973 -23997284 -24761099 -23015142 -18426241 -12287286 -6477901
39275 -6477901 -2387804 -720243 -1443340 -3395510 -4491895 -3121338 597961 5229156
39267 5229156 9470376 12823350 15109312 16054405 15555923 13927466 11639852 9031379
39259 9031379 6320257 3559345 447318 -3444304 -7954996 -12029642 -14394581 -14492483
39251 -14492483 -12678951 -9720927 -6301067 -2810379 714735 4482178 8600032 12828218
39243 12828218 16746143 20050537 22508267 23710475 23162008 20709540 16747285 11969400
39235A1969400m883049m241976k755857n85800J697164L459295M462108M888202
39227A4009487M960655M652718L778010K265856L37445j457067k356816j822695
39219B4367593j36618J546019K112629J559115R10602J032193J806839K578718
39211C5777090K999189L087506K723866J590710l19123k440070m004495m582798
39203C4831875m306417l725049l403328l463084l503973l085629k231536j329458
39195I783401o56771k38407j06215m03816j159418k120180k845820k868080j880856
39186b496162o6247J753737K591924K087610P26571p21665j774163k230996j965640
39177b095031j052331l6625K41940o62330k261626l426208l394924k504110j754380
$$ plain form
39235 11969400 7086351 2844375 88518 -497282 1199882 4659177 9121285 14009487
39227 14009487 18970142 23622860 27400870 29666726 30004171 28547104 26190288 24367593
39219 24367593 24230975 25776994 27889623 29448738 30359340 31391533 33198372 35777090
39211 35777090 38776279 41863785 44587651 46178361 45859238 43419168 39414673 34831875
39203 34831875 30525458 26800409 23397081 19933997 16430024 13344395 11112859 9783401
39195 9783401 9126630 8888223 8782008 8378192 7218774 5098594 2252774 -615306 -2496162
39186 -2496162 -2562409 -808672 1783252 3870862 4597433 3875768 2101605 -129391 -2095031
39177 -2095031 -3147362 -3183987 -2942047 -3604377 -5866003 -9292211 -12687135 -15191245 -16945625
39168a6945625j655844j760581j396685m73985O83004J865865K847379L063108
39160a3773364K202347J105043J257012L035530N015024N449822M060142J941097
39152A0292653J03228j276608k311281k826110k616462j944509j434220j474852
39144c488161j857589k036741j711792j088082n21346O412Q67655K173097L294879
39135d361668L170959J230878j823576m161652m091884j575887J571628L300563
39127f740639L124425K069935J072418O4853j245430k414143k602513j569047
39119h240141J15843J662759K553338K668917K312872J986895J863682J641080
39111F565245J155505Q20541J011686J264526O99525p61013k150289k545979j951886
$$ plain form
39168 -16945625 -18601469 -20362050 -21758735 -22232720 -21549716 -19683851 -16836472 -13773364
39160 -13773364 -11571017 -10465974 -9208962 -6173432 -1158408 4291414 8351556 10292653
39152 10292653 10395881 9119273 6807992 3981882 1365420 -579089 -2013309 -3488161
39144 -3488161 -5345750 -7382491 -9094283 -10182365 -10703711 -10697299 -9829644 -7656547 -4361668
39135 -4361668 -1190709 40169 -1783407 -5945059 -10036943 -11612830 -10041202 -6740639
39127 -6740639 -3616214 -1546279 -473861 -409008 -1654438 -4068581 -6671094 -8240141
39119 -8240141 -8124298 -6461539 -3908201 -1239284 1073588 3060483 4924165 6565245
39111 6565245 7720750 8541291 9552977 10817503 11517028 10756015 8605726 6059747 4107861
39102D107861r74259j15889L28447J12733p17781j537719j524740m51359J074571
39093C01865K200288K514173K111337J187496j81781j840035l372303m341717
39085a420677m608636m190449k907580n74230K357441M761868N756257N413117
39077D587111M333735K877678J223054j72401q67995j148083j773933k915079
39069F144087l930433m403730m741551n321009n607803m775015k905182q92825
39061b6433461P58115K347723M047137N154083M683663K454279o72164l413268
39053a1073893m720734m149257k088782L23479J873961K079890J343263M21204
39045a5990869q5481J08280Q63105J521011J282088j7592j639155k617196k508977
$$ plain form
39102 4107861 3133602 3017713 3346160 3458893 2741112 1203393 -321347 -772706 301865
39093 301865 2502153 5016326 7127663 8315159 8133378 6293343 2921040 -1420677
39085 -1420677 -6029313 -10219762 -13127342 -13701572 -11344131 -6582263 -826006 4587111
39077 4587111 8920846 11798524 13021578 12849177 11981182 10833099 9059166 6144087
39069 6144087 2213654 -2190076 -6931627 -12252636 -17860439 -22635454 -25540636 -26433461
39061 -26433461 -25675346 -23327623 -19280486 -14126403 -9442740 -6988461 -7660625 -11073893
39053 -11073893 -15794627 -19943884 -22032666 -21709187 -19835226 -17755336 -16412073 -15990869
39045 -15990869 -16076350 -15968070 -15104965 -13583954 -12301866 -12319458 -13958613 -16575809 -19084786
39036a9084786j348985P00609L164056N006518N317544M350639L300401K861859
39028D267855K582569J916755J241124J166107J253418K88101k109257m769766
39020E836906o073263n340287k996113J49898L364738N926987P059805O186308
39012A4114979L353751n41971m081007o150080o601760o070005n200618m205560
39004a5382271l070472j871636p74650P4354N60511P09361Q90624J642835K991675
38995a4229669M020667L452410Q59499k716860n416397n876219m032123q70144
38987b4808836K343213M544913M974504L381302M04392k511533l959278l436850
38979a9068173j414908J183907L354576M162913L123888O83440j833501k932501
$$ plain form
39036 -19084786 -20433771 -19733162 -16569106 -11562588 -6245044 -1894405 1405996 4267855
39028 4267855 6850424 8767179 10008303 11174410 12427828 12715929 10606672 5836906
39020 5836906 -236357 -5576644 -8572757 -8422859 -5058121 868866 7928671 14114979
39012 14114979 17468730 16926759 12845752 6695672 93912 -5976093 -11176711 -15382271
39004 -15382271 -18452743 -20324379 -21099029 -21024675 -20464164 -19754803 -18864179 -17221344 -14229669
38995 -14229669 -10209002 -6756592 -5897093 -8613953 -14030350 -19906569 -23938692 -24808836
38987 -24808836 -22465623 -17920710 -12946206 -9564904 -9160512 -11672045 -15631323 -19068173
38979 -19068173 -20483081 -19299174 -15944598 -11781685 -8657797 -7974357 -9807858 -12740359
38971a2740359j783550J236645M491212N888426M468032J412335r34953j273942
38963G63846k85302O59738J085581J281169J164761J98317j506445k752215k389516
38954a780066n88717J398762K594566L056866L379296L887226M511847N092915
38946B1552695N406134N032902L666145J635907k26503j395834k025194k414483
38938C1231769k573805k615461l072475m223045n390406n625767n004938m538851
38930a812979m751636n068803m791283l939425k791107j301754M60003J873456
38922b2123528K458915K642954L111778L611392L130730J264733j250014l430217
38914a0583257m880675n577474n407803m344412k816526j539298r67680r78258
$$ plain form
38971 -12740359 -14523909 -13287264 -8796052 -2907626 1560406 2972741 2037788 763846
38963 763846 478544 1138282 2223863 3505032 4669793 4868110 3361665 609450 -1780066
38954 -1780066 -2368783 -970021 1624545 4681411 8060707 11947933 16459780 21552695
38946 21552695 26958829 31991731 35657876 37293783 37067280 35671446 33646252 31231769
38938 31231769 28657964 26042503 22970028 18746983 13356577 7730810 2725872 -1812979
38930 -1812979 -6564615 -11633418 -16424701 -20364126 -23155233 -24456987 -23996984 -22123528
38922 -22123528 -19664613 -17021659 -13909881 -10298489 -7167759 -5903026 -7153040 -10583257
38914 -10583257 -15463932 -21041406 -26449209 -30793621 -33610147 -35149445 -36117125 -37095383
38906c7095383r80333l34002J125375K847139L931190L810560K608967R81232
38898b3105255k83077p06277m62553j95930k69528l18895J93170J178235K073107
38889b1897003K614602K935865K981901K511212J816999J757919K682377L815130
38881g80998M128039L416685K107227M55436j422258k953292l256016k010469
38873c15646J74760K261996L344809K867901Q55802j906326m265213n481787n552956
38864h016660m894453m016019l394088l175404k908449j968862l68124J255112
38856b7486947K579481M058360O108179Q181679R042721P830032M666266N12727
38848A5492498l286134n631337o319299o002599n253507l910285j708843P77666
$$ plain form
38906 -37095383 -38075716 -38409718 -37284343 -34437204 -30506014 -26695454 -24086487 -23105255
38898 -23105255 -23388332 -24094609 -24557162 -24753092 -25022620 -25341515 -25148345 -23970110 -21897003
38889 -21897003 -19282401 -16346536 -13364635 -10853423 -9036424 -7278505 -4596128 -780998
38881 -780998 3347041 6763726 8870953 9326389 7904131 4950839 1694823 -315646
38873 -315646 -140886 2121110 5465919 8333820 9189622 7283296 3018083 -2463704 -8016660
38864 -8016660 -12911113 -16927132 -20321220 -23496624 -26405073 -28373935 -28742059 -27486947
38856 -27486947 -24907466 -20849106 -14740927 -6559248 2483473 10313505 14979771 15492498
38848 15492498 12206364 6575027 255728 -5746871 -11000378 -14910663 -16619506 -15841840
38840a5841840K496655L151659L428464L899106M316056M172441L320578J706425
38832A0649544q47679l974638o312371o498306m570791j865803L65003J671851
38824a1383190J904282R04652r03181k255005k015880k34879K136018M318959
38816g528224O040580O998248O710570N164629L190501J798656J237783R13679
38808B4526422J58711j066049k128680k235358j124112N02693J302992L56085
38800B0292704j982021m397541n791942n996082n425691m421539l077743j403704
38792a2203559N83637K695145M287666M474397L018081Q26710q42578j518900
38784A320599j473874q57786L81132J779044K458206K276907K162437K844764
$$ plain form
38840 -15841840 -13345185 -10193526 -6765062 -2865956 1450100 5622541 8943119 10649544
38832 10649544 9801865 5827227 -485144 -6983450 -11554241 -13420044 -13055041 -11383190
38824 -11383190 -9478908 -8574256 -9477437 -11732442 -13748322 -13983201 -11847183 -7528224
38816 -7528224 -1487644 5510604 12221174 17385803 20576304 22374960 23612743 24526422
38808 24526422 24685133 23619084 21490404 19255046 18130934 18633627 19936619 20292704
38800 20292704 18310683 13913142 8121200 2125118 -3300573 -7722112 -10799855 -12203559
38792 -12203559 -11619922 -8924777 -4637111 -162714 2855367 3682077 2839499 1320599
38784 1320599 -153275 -1011061 -629929 1149115 3607321 5884228 8046665 10891429
38776A0891429L866105M367739M268993L984105L472869K443599J222982M95584
38768C5013405K15469l76690j586000k913749l985340m952720n667366n322636
38760A0424373l513762j044856R53610K275769L398012M352702M555018L651056
38752B5051922J968026J05042j546864k919496m202770n545628o550577o328902
38744C0753m499147j926017O3522J088329J783673K542306K891205K324436J152553
38735E451613J29072m11880p00838j081635j728529k616309l494098m033272m198296
38726a2684172m265689m261818l665864k046339J93325K149215L421827M319719
38718a6839796N062400N361617N045447M560567M327570L892879K367846k82707
$$ plain form
38776 10891429 14757534 19125273 23394266 27378371 30851240 33294839 34517821 35013405
38768 35013405 35228874 34852184 33266184 30352435 26367095 21414375 15747009 10424373
38760 10424373 6910611 5865755 6819365 9095134 12493146 16845848 21400866 25051922
38752 25051922 27019948 27124990 25578126 22658630 18455860 12910232 6359655 30753
38744 30753 -4468394 -6394411 -6330889 -5242560 -3458887 -916581 1974624 4299060 5451613
38735 5451613 5580685 5168805 4467967 3386332 1657803 -958506 -4452604 -8485876 -12684172
38726 -12684172 -16949861 -21211679 -24877543 -26923882 -26730557 -24581342 -21159515 -16839796
38718 -16839796 -11777396 -6415779 -1370332 3190235 7517805 11410684 13778530 13495823
38710A3495823k949694m538246m956496m730189m120480l068230j691593k76779
38702a2835884J141602K700185M195864N089021N076921M279685K831941P86487
38694A3265822j422543k970641l503632l662890m305400n376126n929782n147227
38686a9052419l018390k07561K318923L618801L284986J877401N67328R4888J48072
38677a0367971j23372j078896k202227k714144k412653j748151j095159k77410
38669b2019983Q76872J747800J327159m16842k134108k471564j512895m24373
38661b5027934O750p0566k61169m80606p11066o99312j19798J180286L091333
38652b3092082N099506O316217O123865M890382L646755K941899K385344J408829
$$ plain form
38710 13495823 10546129 6007883 1051387 -3678802 -7799282 -10867512 -12559105 -12835884
38702 -12835884 -11694282 -8994097 -4798233 290788 5367709 9647394 12479335 13265822
38694 13265822 11843279 8872638 5369006 1706116 -2599284 -7975410 -13905192 -19052419
38686 -19052419 -22070809 -22278370 -19959447 -16340646 -13055660 -11178259 -10610931 -10516043 -10367971
38677 -10367971 -10491343 -11570239 -13772466 -16486610 -18899263 -20647414 -21742573 -22019983
38669 -22019983 -21143111 -19395311 -18068152 -18484994 -20619102 -23090666 -24603561 -25027934
38661 -25027934 -25021184 -25091750 -25352919 -25833525 -26544591 -27243903 -27363701 -26183415 -23092082
38652 -23092082 -17992576 -11676359 -5552494 -662112 2984643 5926542 8311886 9720715
38644I720715K2725j379162k500255l090174k802795j582590l8304R61786J026091
38635C38037L48693p19437j813076k360304j798945k87971J067017J122752q2058
38626d185292j261513j228093j70925O62308M62382m09153j294651k237806l516236
38617a3178979m516492l943220j347374K138149M855066N980384N669133M462625
38609A19292L024317J988975J405270M91095j453595l866686n122281m026854
38601g440467q68846K944076N887300O985798O098483L981737J868024N83479
38593B0039584O515n03979j232876j849190j988564j823434j841883k141666k218182
38584F446325j582630m04953O87399J351282J765402K121149K242563J918785
$$ plain form
38644 9720715 9743440 8364278 5864023 2773849 -28946 -1611536 -1649840 -688054 338037
38635 338037 686730 -32707 -1845783 -4206087 -6005032 -6293003 -5225986 -4103234 -4185292
38626 -4185292 -5446805 -6674898 -6845823 -6183515 -5721133 -6130286 -7424937 -9662743 -13178979
38617 -13178979 -17695471 -21638691 -22986065 -20847916 -15992850 -10012466 -4343333 119292
38609 119292 3143609 5132584 6537854 7028949 5575354 1708668 -3413613 -7440467
38601 -7440467 -8309313 -5365237 522063 7507861 13606344 17588081 19456105 20039584
38593 20039584 20046099 19542120 18309244 16460054 14471490 12648056 10806173 8664507 6446325
38584 6446325 4863695 4458742 5146141 6497423 8262825 10383974 12626537 14545322
38576A4545322J358901J030100J157731J603820K091807K252611J556846l48045
38568B5249093l046998n361134o195903n364195l551936j692263n36597n68013
38560a067946j817744l574010m591199l995400k065061Q069J130459J033562K24024
38551a4715246m30866j37163J274864K953458L525548K375421K85260j429309
38543f298033k179392k234030j985782j649607j460528j441236r38172R04422
38535a7282358L949756O869318Q394095Q315067P062812M943230K278361j92298
38527B4337983j748734k431251k892977l573045m320759m702635m370870l264810
38519b967098j755133m70396L00403R33979K000029L612106N369998O613734O537067
$$ plain form
38576 14545322 15904223 16934323 18092054 19695874 21787681 24040292 25597138 25249093
38568 25249093 22202095 16840961 10645058 5280863 1728927 36664 -499933 -1067946
38560 -1067946 -2885690 -6459700 -11050899 -15046299 -17111360 -17103291 -15972832 -14939270 -14715246
38551 -14715246 -15146112 -15283275 -14008411 -11054953 -7529405 -5153984 -4868724 -6298033
38543 -6298033 -8477425 -10711455 -12697237 -14346844 -15807372 -17248608 -18186780 -17282358
38535 -17282358 -13332602 -6463284 1930811 10245878 17308690 22251920 24530281 24337983
38527 24337983 22589249 20157998 17265021 13691976 9371217 4668582 297712 -2967098
38519 -2967098 -4722231 -5192627 -4892224 -3958245 -1958216 1653890 7023888 13637622 20174689
38510B0174689M584017J281629j687709k936674k781247k643687l227412l960155
38502H803451m140888l792656l206166k455148j817105k047511l554132n500457
38494a7710612o284997n009540k283905M15071K062275K772852L234453L569690
38486a9234713L093903J439647m37164r69762L35510K453767M077456M701636
38478d539720M420769L443700K257329J660914J995681K641301K808415K567582
38470A7255971K532075K731369K500363J552360N26055J18308R907r41751l442364
38461B2842293o862104r623435j0436255r174479o673779l903109j473632K81626
38453b5022874J233692J620167J933777K367833K558310K113818J231099N14906
$$ plain form
38510 20174689 24758706 26040335 24352626 21415952 18634705 15991018 12763606 8803451
38502 8803451 4662563 869907 -2336259 -4791407 -6608512 -8656023 -12210155 -17710612
38494 -17710612 -23995609 -29005149 -31289054 -30873983 -28811708 -26038856 -22804403 -19234713
38486 -19234713 -16140810 -14701163 -15138327 -16108089 -15772579 -13318812 -9241356 -4539720
38478 -4539720 -118951 3324749 5582078 7242992 9238673 11879974 14688389 17255971
38470 17255971 19788046 22519415 25019778 26572138 27098193 27216501 27226408 26284657 22842293
38461 22842293 15980189 6356754 -4079501 -13253980 -19927759 -23830868 -25304500 -25022874
38453 -25022874 -23789182 -22169015 -20235238 -17867405 -15309095 -13195277 -11964178 -11449272
38445a1449272K90166L46369L15677J07129J0312N02043J816869L501704M512533
38436d6470M025471K169173j59393k079157l150590l246244k439158j084391L17439
38427e693320J512259K595233L628922M312322M159739K958858J013947r86489
38419A3501471k321135k591660j893932p07293M12617J138698J491179J662932
38411A0692877J678934J321960N42491k10702m43838m00740q93068k101632l003224
38402G183058k450545n53811J480759K664915K837321K153060P58001q22113j626562
38393A1624083j076374M19209J965956L024553L463986L088118J613156q42902
38385B3279785l533858n470851o026738n285934l942015k809280k352251k674531
$$ plain form
38445 -11449272 -11159106 -10812737 -10497060 -10389931 -10379619 -9877576 -8060707 -4559003 -46470
38436 -46470 3979001 6148174 5988781 3909624 759034 -2487210 -4926368 -6010759 -5693320
38427 -5693320 -4181061 -1585828 2043094 6355416 10515155 13474013 14487960 13501471
38419 13501471 11180336 8588676 6694744 5987451 6400068 7538766 9029945 10692877
38411 10692877 12371811 13693771 14236262 14025560 13581722 13180982 12287914 10186282 7183058
38402 7183058 4732513 4178702 5659461 8324376 11161697 13314757 14072758 13250645 11624083
38393 11624083 10547709 10966918 12932874 15957427 19421413 22509531 24122687 23279785
38385 23279785 19745927 14275076 8248338 2962404 -979611 -3788891 -6141142 -8815673
38377h815673l756925n298082o301388n445378k408216J396857L924504M332543
38369b2371758L413572K383155J777336J540626J556386J756291K095285K745942
38361e103165M006887N681766O846059O679570N379884L827272K469553J040517
38353C0828343o38616k162044l044748l248179k918727k049587q37665k2273k42898
38344A5663606j121931j560501j068569l34136k62167q65596j466372j720447
38336G263887j963885k539712l176047l248630k498384j257092L0977J270768
38328f118118K500540L352356L153986J783549R2066r41101j292322j612590j944494
38319a026128j473946J18877J754243K121869J458273J356141K694669M352944
$$ plain form
38377 -8815673 -12572598 -17870680 -24172068 -29617446 -32025662 -30628805 -26704301 -22371758
38369 -22371758 -18958186 -16575031 -14797695 -13257069 -11700683 -9944392 -7849107 -5103165
38361 -5103165 -1096278 4585488 11431547 18111117 23491001 27318273 29787826 30828343
38353 30828343 30189727 28027683 24982935 21734756 18816029 16766442 15928777 15906504 15663606
38344 15663606 14541675 12981174 11912605 11578469 11316302 10450706 8984334 7263887
38336 7263887 5300002 2760290 -415757 -3664387 -6162771 -7419863 -7388886 -6118118
38328 -6118118 -3617578 -265222 2888764 4672313 4764379 3823278 2530956 918366 -1026128
38319 -1026128 -2500074 -2381197 -626954 1494915 2953188 4309329 7003998 11356942
38311A1356942M277799J544415k797403o614907q218209p296467m779546j948679
38303a4476055L60323J870579K579872K662908K459699K144964J461201K05559
38295g30950j049923j302502l61802Q10401J319570J341704J418441J293076K66510
38286C004525j506563k970677l510158l530246l431804k804230j227183O86106
38278a5290230J818502J900045J616566J422321R64096j22990j451317k281920
38270a1424927k296837j609516l58673J214819K485022K836230K449281K245288
38262d459313K798042L565630L460499K048826j5563j635370k131001j539258
38254B092492l61596Q11871J516033J459018N62167r26263k419011l298820l361225
$$ plain form
38311 11356942 15634741 17179156 14381753 7766846 -451363 -7747830 -12527376 -14476055
38303 -14476055 -14115732 -12245153 -9665281 -7002373 -4542674 -2397710 -936509 -730950
38295 -730950 -1780873 -3083375 -3445177 -2634776 -1315206 26498 1444939 2738015 3004525
38286 3004525 1497962 -1472715 -4982873 -8513119 -11944923 -14749153 -15976336 -15290230
38278 -15290230 -13471728 -11571683 -9955117 -8532796 -7568700 -7691690 -9143007 -11424927
38270 -11424927 -13721764 -15331280 -15689953 -14475134 -11990112 -9153882 -6704601 -4459313
38262 -4459313 -1661271 1904359 5364858 7413684 7398121 5762751 3631750 2092492
38254 2092492 1730896 2542767 4058800 5517818 6079985 5153722 2734711 -564109 -3925334
38245c925334k883366k207663j384293l17975Q83706J907683K537150K794301
38237b595791K804083K662648K434360K150782J809207J438119J052717L95579
38229A2151704j081018l556744o136003p278628o289736m177171k699353k645702
38221b1712651l308914l506170k690562j003775J281855L948323O578615Q524538
38213a1888741R313555Q973661P841760O137389L887635J262896j245243l187325
38205B1095587m613280n890222o994718p281967o246225m385504k943838k673980
38197a9934147l042950k763674r83670K068468N331719P592166Q128833P069639
38189C466384N209243L326156J627923o9239j719876k861342l099697k574289
$$ plain form
38245 -3925334 -6808700 -9016363 -10400656 -10718631 -9834925 -7927242 -5390092 -2595791
38237 -2595791 208292 2870940 5305300 7456082 9265289 10703408 11756125 12151704
38229 12151704 11070686 7513942 1377939 -5900689 -12190425 -16367596 -19066949 -21712651
38221 -21712651 -25021565 -28527735 -31218297 -32222072 -30940217 -26991894 -20413279 -11888741
38213 -11888741 -2575186 6398475 14240235 20377624 24265259 25528155 24282912 21095587
38205 21095587 16482307 10592085 3597367 -3684600 -9930825 -14316329 -17260167 -19934147
38197 -19934147 -22977097 -25740771 -26724441 -24655973 -19324254 -11732088 -3603255 3466384
38189 3466384 8675627 12001783 13629706 13560467 11840591 8979249 5879552 3305263
38181C305263j794456j101055l90161O62764K120438L465222L836684K816103
38173A2920802J017909l53433o77994m40359m23600o69153n81666Q8996P95009
38164A1676511P45261m23198k570405n257379p788900r288343r045072o860833
38156b8812358l098247J439590N669207Q583123R729621R316472P771370N337514
38148A5936292K213081j076577l683165m875620m505321l131579j626241m06197
38140a155327R59070L047112N399285O513390N420316K959716R60996K74539J46105
38131B4525202m66107j565757k377704k481798k251830k320224k946295l873472
38123F242015m550199m474660l538377k139996q79090n4387N31062J267467K307487
$$ plain form
38181 3305263 1510807 409752 19591 682355 2802793 6268015 10104699 12920802
38173 12920802 13938711 13585278 12907284 12466925 12043325 11374172 10792506 10881502 11676511
38164 11676511 12421772 11998574 9428169 4170790 -3618110 -12906453 -21951525 -28812358
38156 -28812358 -31910605 -30471015 -24801808 -16218685 -6489064 2827408 10598778 15936292
38148 15936292 18149373 17072796 13389631 8514011 4008690 877111 -749130 -1155327
38140 -1155327 -196257 2850855 8250140 14763530 20183846 23143562 24104558 24379097 24525202
38131 24525202 24059095 22493338 20115634 17633836 15382006 13061782 10115487 6242015
38123 6242015 1691816 -2782844 -6321221 -8461217 -9340307 -9394694 -8863632 -7596165 -5288678
38114e288678L489927M611101N568349O142859N863148M399674K057214m62097
38106B6381497k830591n226110p512854q760897q059329n582227k370124Q01527
38098a3159108L805407O471532Q165566Q342159P155216N282518L417806K093032
38090C1574128J638487J973831K573967K870998K623249J845198O44482o85274
38082D5059066j654314j941276j669666j146113m80786K99453Q85168P45391l68551
38073C9728372k105543l730558m592325m409925l247196j380506O91162K219155
38065B3172636K574383J881577R93024M56404k22295j718945l481875m028752
38057A9626157k834918j092995j12182L22963J275684K847980L953174L752031
$$ plain form
38114 -5288678 -1798751 2812350 8380699 14523558 20386706 24786380 26843594 26381497
38106 26381497 23550906 18324796 10811942 2051045 -6008284 -11590511 -13960635 -13159108
38098 -13159108 -9353701 -2882169 5283397 13625556 20780772 26063290 29481096 31574128
38090 31574128 33212615 35186446 37760413 40631411 43254660 45099858 45744340 45059066
38082 45059066 43404752 41463476 39793810 38647697 38166911 38466364 39351532 40096923 39728372
38073 39728372 37622829 33892271 29299946 24890021 21642825 20262319 20953481 23172636
38065 23172636 25747019 27628596 28621620 29078024 28855729 27136784 23654909 19626157
38057 19626157 16791239 15698244 15586062 15909025 17184709 20032689 23985863 27737894
38049B7737894K490374Q28356r31625k630362l738537l481651j437823K033010
38041B0869636N836055Q705897R998391R966239R181771P938782O508485N664993
38033H4670249O324831Q595400J1596971J4274466J6049292J6797885J6820175
38026A75129269J6978191J8223412K0457386K2009024K0556189J4673886M757223
38019B92784580p050998j7744120k4849217k7548665k6618695k3444526j9338053
38012A46190306j5505580j2811524j1180425r740936p984139o418572n719378
38005G6829752n647949n333719m361299l057583j888775j123006j002028j642307
37997E2773086k607184l000042k243190o30065R38452J593439R17513r30631l296672
$$ plain form
38049 27737894 30228268 31056624 30124999 27494637 23756100 20274449 18836626 20869636
38041 20869636 26705691 35411588 45409979 55376218 64557989 72496771 79005256 84670249
38033 84670249 90995080 99590480 111187451 125461917 141511209 158309094 175129269
38026 175129269 192107460 210330872 230788258 252797282 273353471 288027357 292784580
38019 292784580 285733582 267989462 243140245 215591580 188972885 165528359 146190306
38012 146190306 130684726 117873202 106692777 96951841 88967702 82549130 76829752
38005 76829752 71181803 65848084 61486785 58429202 56540427 55417421 54415393 52773086
37997 52773086 50165902 47165860 44922670 44292605 45231057 46824496 47742009 46811378 43514706
37988D3514706n325226o335043o056997m735602l109292k036629j797267j782442
37980A2336208j131429K96702J741919K294650J676509L89180o44237o43763M62976
37971A6778715J896188K624893K218180J021429m23258j828848k991199l558228
37963A5737872l316661k578357j916666j429925n33241J267857L472082M750896
37955A5453857M193716K260160L20289o63845q18780q75922j376794k350076l321537
37946A2821068l440982j998777Q08082L813526N873243O750898O826933O323357
37938C7777348N320530M282232L845616L973498L845730K799299J006171r15179
37930F1935245k543506l705682m306717m457879m506204m595825m380913l480750
$$ plain form
37988 43514706 38189480 31854437 25797440 21061838 17952546 15915917 14118650 12336208
37980 12336208 11204779 11501481 13243400 15538050 17214559 17603739 16959502 16315739 16778715
37971 16778715 18674903 21299796 23517976 24539405 24116147 22287299 19296100 15737872
37963 15737872 12421211 9842854 7926188 6496263 5963022 7230879 10702961 15453857
37955 15453857 19647573 21907733 22228022 21564177 20745397 19869475 18492681 16142605 12821068
37946 12821068 9380086 7381309 8189391 12002917 17876160 24627058 31453991 37777348
37938 37777348 43097878 47380110 51225726 55199224 59044954 61844253 62850424 61935245
37930 61935245 59391739 55686057 51379340 46921461 42415257 37819432 33438519 29957769
37922B9957769k069970p21999J90346O13583M77466k97099j400295k175542k285483
37913B2288776k050641j888686j713418j305912j109831k012356m069978n938843
37905B199111o124159m663712l070955k620665l218971m074811m835574n573051
37897c1982787o073414n825665m675539l004914j260113K79263J285406J465936
37889d9791827J064627R15697J747345L582515N862159P872475Q987045Q859706
37881a0900258P613926N671559L347257R11035r27207j148204N70071L274547
37873H412726N542220O670916O781346O056625M442781K088993l97514k333721
37865C7264372l406942l686032l387795k714666j819274r01691l62638o90625
$$ plain form
37922 29957769 27887799 27165800 27356146 27969729 28447195 28150096 26749801 24574259 22288776
37913 22288776 20238135 18349449 16636031 15330119 14220288 12207932 8137954 2199111
37905 2199111 -3925048 -8588760 -11659715 -14280380 -17499351 -21574162 -26409736 -31982787
37897 -31982787 -38056201 -43881866 -48557405 -51562319 -52822432 -52543169 -51257763 -49791827
37889 -49791827 -48727200 -47811503 -46064158 -42481643 -36619484 -28747009 -19759964 -10900258
37881 -10900258 -3286332 2385227 5732484 6643519 5716312 4568108 5138179 8412726
37873 8412726 13954946 20625862 27407208 33463833 37906614 39995607 39598093 37264372
37865 37264372 33857430 30171398 26783603 24068937 22249663 21347972 20985334 20294709
37857B0294709j972592l569015m494156m153327k641306m92601J582566K814617
37849G368895K684912J387258j70860j064422j102338q62499j004377j570689
37841E665880j979458j740170j145624j086979k067099l519590m284137l705901
37833a3863078k097381j64986J753809L734046N672056O897868O581916M611779
37825A3126029J968801L7508n35615k41560m3972n31375j708009l249889m712981
37816D108937n683287n993527n743422n010161l739994k095834o48852J05550
37808b4700590K93600M38519Q22826J372593K010982K711109L252273L338959
37800a0459729K974385K334077J285122m61831k574153l975141l866133k605975
$$ plain form
37857 20294709 18322117 14753102 10258946 6105619 3464313 2971712 4554278 7368895
37849 7368895 10053807 11441065 11270205 10205783 9103445 8240946 7236569 5665880
37841 5665880 3686422 1946252 800628 -286351 -2353450 -5873040 -10157177 -13863078
37833 -13863078 -15960459 -16125445 -14371636 -10637590 -4965534 1932334 8514250 13126029
37825 13126029 15094830 15132338 14596723 14355163 14311191 13779816 12071807 8821918 4108937
37816 4108937 -1574350 -7567877 -13311299 -18321460 -22061454 -24157288 -24806140 -24700590
37808 -24700590 -24406990 -23968471 -23145645 -21773052 -19762070 -17050961 -13798688 -10459729
37800 -10459729 -7485344 -5151267 -3866145 -4327976 -6902129 -10877270 -14743403 -17349378
37792a7349378j258989m48412P4854Q92644K254658L875963N119582N375757M491231
37783C027910K930663J444812N31483K35652M53517J334724L223507O036891Q733902
37774B7953061R728796Q138380M575157N51923k741783m870090n713386n271474
37766C2350584m016335k885755k542959k824101l083763k872609k175546j301636
37758A0647880p46427q96507j622191k314006k447358j922984q55112N23154J560949
37749A927398J350909k90406k273837l162703k514316r29089R87417L120797N314389
37740C530559O912818P142966N801073L474420J164172l84252j123681j421707
37732B5096368j337114n43288Q32273J818128J623005P25783K47855M09869L99111
$$ plain form
37792 -17349378 -18608367 -19056779 -18981925 -18089281 -15834623 -11958660 -6839078 -1463321 3027910
37783 3027910 5958573 7403385 7934868 8170520 8624037 9958761 13182268 19219159 27953061
37774 27953061 37681857 45820237 50395394 50947317 48205534 43335444 37622058 32350584
37766 32350584 28334249 25448494 22905535 20081434 16997671 14125062 11949516 10647880
37758 10647880 9901453 9004946 7382755 5068749 2621391 698407 -156705 366449 1927398
37749 1927398 3278307 2987901 714064 -2448639 -4962955 -5892044 -4904627 -1783830 3530559
37740 3530559 10443377 17586343 23387416 26861836 28026008 27641756 26518075 25096368
37732 25096368 23759254 23215966 24048239 25866367 27489372 28215155 28463010 28872879 29271990
37723B9271990k26120q44987p20192J17731J276074K559909L597825L524251J760193
37714D0316674j173958m174721o576560q104234q214670o404090l207083j01051
37706B360307J868924K854431L382057L334725K215409J52054j805021k394328
37698A1968558j039067J751469M613542O077856N415004K940686l70439l403177
37690B7954432n154765n019734l273362j109714K58907O28067O77615Q39317O91267
37681A6492030l20127j911156l140584l465210l200785k861134k448679j704686
37673b560331q26785m92772j087952k175622k881939k670155j635601j84893J391193
37664a3124857L024978M629509N778710N746506M119412J467361q39846j743155
$$ plain form
37723 29271990 29045870 28200883 27480691 27598422 28874496 31434405 35032230 38556481 40316674
37714 40316674 39142716 34967995 28391435 20287201 12072531 5668441 2461358 2360307
37706 2360307 4229231 7083662 10465719 13800444 16015853 16167907 14362886 11968558
37698 11968558 10929491 12680960 17294502 23372358 28787362 31728048 31357609 27954432
37690 27954432 22799667 17779933 14506571 13396857 13655764 14283831 14961446 15800763 16492030
37681 16492030 16171903 14260747 11120163 7654953 4454168 1593034 -855645 -2560331
37673 -2560331 -3387116 -3879888 -4967840 -7143462 -10025401 -12695556 -14331157 -14516050 -13124857
37664 -13124857 -10099879 -5470370 308340 6054846 10174258 11641619 10801773 9058618
37656I058618j355278n75721m8733J85342J55305l95968j637971l242713m556859
37647b413978m961585l956610j318181K391411N681115P032344O087927L778856
37639A2321299J385386k26133o25314K51149J890917L320697L819036L404024
37631B5541061K464044J188733l33556j690597k288345j988886j351343j142665
37623B0398446j688693k650483l306327l112632k119656p99907N39579J936026
37615I196353L265919L967159L677842K918466K630256L071988L574564L329030
37607C5631577K023455j46606k504443l967316l835008k738572k189765k892162
37599A9381160m053104m628202m526290m093555l164233j492305L26551J355452
$$ plain form
37656 9058618 7703340 7127619 7078886 7264228 7419533 7023565 5385594 2142881 -2413978
37647 -2413978 -7375563 -11332173 -12650354 -10258943 -4577828 2454516 8542443 12321299
37639 12321299 13706685 13480552 12855238 13106387 14997304 18318001 22137037 25541061
37631 25541061 28005105 29193838 28860282 27169685 24881340 22892454 21541111 20398446
37623 20398446 18709753 16059270 12752943 9640311 7520655 6720748 7260327 9196353
37615 9196353 12462272 16429431 20107273 23025739 25655995 28727983 32302547 35631577
37607 35631577 37655032 37508426 35003983 31036667 27201659 24463087 22273322 19381160
37599 19381160 15328056 10699854 6173564 2080009 -1084224 -2576529 -2249978 -894526
37591h94526J618999J999252K756939K997897J922919r438j563901k015415j672514
37582E140212j373618j657588k249275k292578j267195L98303J887710K968770
37574A554741L904094M540826M254578K988221J636631R66506O38820k52736k030122
37565A8201559m210335o085864p080130o795579n222044k880001n06007J320180
37557a3258221K177967J869687Q37885J59259O12901J902872L178319M058763
37549A539432M610854M520561L082146K76279k639481m032391l302119j277022
37541B778259O31818J547213J529280J083539M54695m62378j639877k740257l573225
37532c90933m368146n298780o035831o136042n611647m673571l149585p55631
$$ plain form
37591 -894526 724473 2723725 5480664 8478561 10401480 10392042 8828141 6812726 5140212
37582 5140212 3766594 2109006 -140269 -2432847 -3700042 -3301739 -1414029 1554741
37574 1554741 5458835 9999661 14254239 17242460 18879091 19845597 20484417 20231681 18201559
37565 18201559 13991224 7905360 825230 -5970349 -11192393 -14072394 -14578401 -13258221
37557 -13258221 -11080254 -9210567 -8372682 -8213423 -7600522 -5697650 -2519331 1539432
37549 1539432 6150286 10670847 13752993 14029272 11389791 7357400 4055281 2778259
37541 2778259 3410077 4957290 6486570 7570109 8024804 7562426 5922549 3182292 -390933
37532 -390933 -4759079 -10057859 -16093690 -22229732 -27841379 -32514950 -35664535 -36420166
37524c6420166K091410M305313N101940M557479L206285J596645L38915O291O18667
37515a4597221J528348K085808K187895K021251J612583R03154K3065p43436j064739
37506f043292n22818J130509L360241M833483M495816K578444K42333j606307
37498H468409k826855l633134m217707m729089n058166m557511k564311M73956
37490a8644408K873732L246627J967636O36476J80172N1167n95334j530818j711020
37481a3525770o06578J208430K697499L159829K446368R24442n69345j154377
37473e419502o22368M33784J339821J886382J989548J303081k73429j910001k297140
37464c569824r03927J537538L789709M995727M869084L548317J540545m30721
$$ plain form
37524 -36420166 -34328756 -30023443 -24921503 -20364024 -17157739 -15561094 -15222179 -15215888 -14597221
37515 -14597221 -13068873 -10983065 -8795170 -6773919 -5161336 -4258182 -4235117 -4978553 -6043292
37506 -6043292 -6566110 -5435601 -2075360 2758123 7253939 9832383 10074716 8468409
37498 8468409 5641554 2008420 -2209287 -6938376 -11996542 -16554053 -19118364 -18644408
37490 -18644408 -15770676 -12524049 -10556413 -9919937 -9739765 -9688598 -10283932 -11814750 -13525770
37481 -13525770 -14132348 -12923918 -10226419 -7066590 -4620222 -3695780 -4265125 -5419502
37473 -5419502 -6041870 -5608086 -4268265 -2381883 -392335 910746 637317 -1272684 -3569824
37464 -3569824 -4473751 -2936213 853496 5849223 10718307 14266624 15807169 15376448
37456A5376448j722021j894813p58901J313223L234414L990095L770315L794495
37448B7103255M707302N611989N126638L084026P30313n76145m64845M64420J271024
37439D7057977J256646K79213j344049l243749n132919o440467o232680m074827
37431B2125145r69914J054868N92651j952608m758773n984146m915854k209918
37423B981451P11943K639592L228882K863376K008066Q00250p93555k592386m045976
37414G801643m472845l566709j794810k30146J95683o21793j959242k854910k726047
37405a0229176j641529j78015J044981J776506K051609J803610Q95723l66431
37397d842722j170802j002999k84098J43464j3112l72349m87492j18034R10238
$$ plain form
37456 15376448 13654427 11759614 11000713 12313936 15548350 19538445 23308760 27103255
37448 27103255 31810557 37422546 42549184 45633210 46363523 45787378 45322533 45786953 47057977
37439 47057977 48314623 48593836 47249787 44006038 38873119 32432652 26199972 22125145
37431 22125145 21155231 22210099 22802750 20850142 16091369 10107223 5191369 2981451
37423 2981451 3693394 6332986 9561868 12425244 14433310 15233560 14440005 11847619 7801643
37414 7801643 3328798 -237911 -2032721 -2262867 -2067184 -2688977 -4648219 -7503129 -10229176
37405 -10229176 -11870705 -12048720 -11003739 -9227233 -7175624 -5372014 -4476291 -4842722
37397 -4842722 -6013524 -7016523 -7300621 -7157157 -7170269 -7542618 -8030110 -8148144 -7237906
37388g237906K481498L813431L963415K943547J794582J247673Q19096l23654
37380I501682k024039l296656l655345l610722l706133l583604k382676J23133
37372a2634360L097619N343264O271190O167722N645212M967070L965140K557095
37364B5379952J158202L91654L79960M98953k0953j302341k745743l672456l812977
37355A6254251l135739j561962P73612L100055M324147L976538K631196J249215
37347B7611313L20054k23727n55089p44491q32483p25872k2718J718075M372571
37338C0917633P084520Q907972R691650J0292798J1786114J4371703J7237680
37331A10290070J9718824K2328278K6136144L1325836L7166382M3242110M9083607
$$ plain form
37388 -7237906 -4756408 -942977 3020438 5963985 7758567 9006240 9825336 9501682
37380 9501682 7477643 4180987 525642 -3085080 -6791213 -10374817 -12757493 -12634360
37372 -12634360 -9536741 -4193477 2077713 8245435 13890647 18857717 22822857 25379952
37364 25379952 26538154 26929808 27309768 27808721 27787768 26485427 23739684 20067228 16254251
37355 16254251 13118512 11556550 12330162 15430217 19754364 23730902 26362098 27611313
37347 27611313 27931367 27707640 27152551 26408060 25575577 24849705 24826987 26545062 30917633
37338 30917633 38002153 46910125 56601775 66894573 78680687 93052390 110290070
37331 110290070 130008894 152337172 178473316 209799152 246965534 290207644 339291251
37324C39291251N1686120M5166602K5637284l089941l0452554m6940683n0541248
37317C30756831m5701722l7923397l0576953k5236151k2287805k0640144j8415046
37310A29975613j4894527j1238792q908234q007933p590247o987032o272335n765685
37302F0310828n649267n959742o531763o976137p028171o908983p050092p385960
37294F820713p166155n687415l172555p43795N58590O39702J66581k97527p08844
37285i590705j166671j512257j426786n95475J356185M587773Q263182J0428901
37277A0344147R400151N377465L32953l655124n615965n566371m087404k269280
37269D260572j294218j423969j703464j157725m5932N64770K96900p0336K77686
$$ plain form
37324 339291251 390977371 436143973 461781257 458691316 428238762 381298079 330756831
37317 330756831 285055109 247131712 216554759 191318608 169030803 148390659 129975613
37310 129975613 115081086 103842294 94934060 86926127 79335880 72348848 66076513 60310828
37302 60310828 54661561 48701819 42170056 35193919 28165748 21256765 14206673 6820713
37294 6820713 -345442 -6032857 -9205412 -9949207 -9390617 -8750915 -8584334 -8881861 -9590705
37285 -9590705 -10757376 -12269633 -13696419 -14291894 -12935709 -8347936 -84754 10344147
37277 10344147 19744298 25121763 25454716 21799592 16183627 10617256 6529852 4260572
37269 4260572 2966354 1542385 -161079 -1318804 -1364736 -799966 -503066 -573402 -295716
37260b95716J114976J544622J189331O27591O16697J149262J478802R99823j38749
37251H286639j367943k396383l310121m086223m351559l720408k182194j34621
37243a3262813J739108K648666K183628Q77109r682L79882J671627K791086L174586
37234B193197L152178L190383L112414K258610L58132j843207k931257k015613
37226G474837L28801K503790L409963L329460L177042L277246L296248L032647
37218B9830034K539555J478930q13037m190966p204802q357315p596631n984520
37210b98752m073500j406240K131201N152648N707436L353963j83558k624920
37202G758278l185848k896943l112559l999580m499895l555276j239740J247328
$$ plain form
37260 -295716 819260 2363882 3553213 4180804 4797501 5946763 7425565 8425388 8286639
37251 8286639 6918696 4522313 1212192 -2874031 -7225590 -10945998 -13128192 -13262813
37243 -13262813 -11523705 -8875039 -6691411 -5814302 -5823984 -5444102 -3772475 -981389 2193197
37234 2193197 5345375 8535758 11648172 13906782 14264914 12421707 9490450 7474837
37226 7474837 7803638 10307428 13717391 17046851 20223893 23501139 26797387 29830034
37218 29830034 32369589 33848519 33035482 28844516 21639714 13282399 5685768 -298752
37210 -298752 -4372252 -5778492 -3647291 1505357 7212793 10566756 10383198 7758278
37202 7758278 4572430 1675487 -1437072 -5436652 -9936547 -13491823 -14731563 -13484235
37194a3484235K626781K602992J938752J524681J504467J421013J039171O56150
37186a70228N53948N43714L09424r0577m23486p94720j529438k569378l372253
37177g542994l472466k861233j829229p94868k88141o13657j352622j651812j266931
37168b1673953q71792r85699j105976n32981L03889K40900q32689j417882q1330
37159b6957513K813889N546028O903020P110322P041492P065325O849392N972447
37151B2344402M441830K670828J154847K42414Q2121N31895R94485N83897j129584
37142C1917135l454083m982496m882429l601452k176890j212776q81993j530439
37134I194577l457418n949257p262305o155852l199965j23601J940909L115300
$$ plain form
37194 -13484235 -10857454 -8254462 -6315710 -4791029 -3286562 -1865549 -826378 -170228
37186 -170228 383720 927434 1236858 1146281 722795 -71925 -1601363 -4170741 -7542994
37177 -7542994 -11015460 -13876693 -15705922 -16500790 -16788931 -17402588 -18755210 -20407022 -21673953
37168 -21673953 -22545745 -23531444 -24637420 -25170401 -24866512 -24625612 -25458301 -26876183 -26957513
37159 -26957513 -24143624 -18597596 -11694576 -4584254 2457238 9522563 16371955 22344402
37151 22344402 26786232 29457060 30611907 30854321 30936442 31468337 32462822 33046719 31917135
37142 31917135 28463052 23480556 18598127 14996675 12819785 11607009 10725016 9194577
37134 9194577 5737159 -212098 -7474403 -13630255 -16830220 -16953821 -15012912 -11897612
37126a1897612L913865M480015M843566N215033N485877M871539K736232l31793
37118A9316722k845896l828484l405834k078659j74938J696477K437374J460788
37110A2577550l93583j606783j550144q05423r6321M19291P82238R16048J014405
37101A1257278J695343L285293N196441O363162O117229M405009J465212k236038
37093C7548929n819215q194274q714696p653275o038628m939325m660370m520487
37085a2991341l561883j544229R05021L052946M590450N342792M969309L311479
37077D074544P57873k008557m330325n447091m616148j963289J097192K970071
37069i465730L370570L265975L492247L949430M023108L204334J362854r62354
$$ plain form
37126 -11897612 -7983747 -3503732 1339834 6554867 12040744 16912283 19648515 19316722
37118 19316722 16470826 12642342 9236508 7157849 6982911 8679388 11116762 12577550
37110 12577550 12183967 10577184 9027040 8221617 8125296 8544587 9326825 10242873 11257278
37101 11257278 12952621 16237914 21434355 27797517 33914746 38319755 39784967 37548929
37093 37548929 31729714 23535440 14820744 7167469 1128841 -3810484 -8470854 -12991341
37085 -12991341 -16553224 -18097453 -17192432 -14139486 -9549036 -4206244 763065 4074544
37077 4074544 4832417 2823860 -1506465 -6953556 -11569704 -13532993 -12435801 -9465730
37069 -9465730 -6095160 -2829185 663062 4612492 8635600 11839934 13202788 12240434
37061A2240434k545481k411403r20516O23306J473980J905737K159898J833838
37053A4359793O90347p07755j709635k306706k608974k218445q80641O29194J063266
37044F310444M3776j674029l078559l524115k755724j025541Q29726J990164K385121
37035d98737K474886K460494K177120J587793P88192l75557k030081l602627m106931
37026a125448l287082j967352j143685j221550k171947l722776n143995n536444
37018b5320279m777924l668492k726323j388685J029501M034167O296882P055425
37010a9465728O522908N104087L017185Q12818m87024k77581Q68096J692901J445070
37001g67268M28995m92364p66832n98241o85994j533648k932782m080446m193887
$$ plain form
37061 12240434 9694953 7283550 6363034 6986340 8460320 10366057 12525955 14359793
37053 14359793 15050140 14342385 12632750 10326044 7717070 5498625 4617984 5247178 6310444
37044 6310444 6354220 4680191 1601632 -1922483 -4678207 -5703748 -4874022 -2883858 -498737
37035 -498737 1976149 4436643 6613763 8201556 8989748 8614191 6584110 2981483 -1125448
37026 -1125448 -4412530 -6379882 -7523567 -8745117 -10917064 -14639840 -19783835 -25320279
37018 -25320279 -30098203 -33766695 -36493018 -37881703 -36852202 -32818035 -26521153 -19465728
37010 -19465728 -12942820 -7838733 -4821548 -4008730 -4495754 -4773335 -3905239 -2212338 -767268
37001 -767268 -338273 -830637 -1597469 -2195710 -2881704 -4415352 -7348134 -11428580 -15622467
36992a5622467l063633j169719O00372J435643J070341o2262j174175j703618
36984a9689518j603495j139915n36548J30615P83447J237499J317436J038577
36976a8461902O08295K48961O7641N8363P4956k46863j306467k992126m355960
36967b6305102m158039j952556J403804M385813N921386N978029N280877M565814
36959d879974L978068L078969J485409m86107j956995k347602j961631j589278
36951d679141j653025j916365j932513j496902n94347Q01870K541962L949417
36943d979044M082591K699712Q16251j47606J29782O13740L32045m41211q67866
36934B238394r61909j490785k496811k819320j532245P29135K456526K985472
$$ plain form
36992 -15622467 -18686100 -19855819 -19255447 -17819804 -16749463 -16811725 -17985900 -19689518
36984 -19689518 -21293013 -22432928 -22969476 -22838861 -22055414 -20817915 -19500479 -18461902
36976 -18461902 -17853607 -17604646 -17537005 -17478642 -17403686 -17650549 -18957016 -21949142 -26305102
36967 -26305102 -30463141 -32415697 -31011893 -26626080 -20704694 -14726665 -9445788 -4879974
36959 -4879974 -901906 2177063 3662472 3176365 1219370 -1128232 -3089863 -4679141
36951 -4679141 -6332166 -8248531 -10181044 -11677946 -12272293 -11470423 -8928461 -4979044
36943 -4979044 -896453 1803259 2619510 2471904 2601686 3215426 3547471 3106260 2238394
36934 2238394 1276485 -214300 -2711111 -5530431 -7062676 -6333541 -3877015 -891543
36926h91543K983369L337832M035691M229955L194589J188129n66105r45821j30182
36917A6435914N12352k9381j266444j971943j803311j629306k348876l934017
36909C964988n636069o553192n880347l266686O08985M170585O122786O403749
36901f5201N765233M721834L330703J775464N29819k06346p60723j362454j554821
36892A2173508o74089J095796K537767K520343J173015k89671q88733p52592n50019
36883A6345325l59837M19526J948439L205855K896180J086771n45789m30268J139982
36874B5706184K291956J524948r58799l782320n689395o106149n010361k895140
36866E080924p02372P95243J583274J970247J673778m209k952075n847425p338246
$$ plain form
36926 -891543 2091826 5429658 9465349 13695304 16889893 18078022 17511917 16566096 16435914
36917 16435914 16948266 16918885 15652441 13680498 11877187 10247881 7899005 3964988
36909 3964988 -1671081 -8224273 -14104620 -17371306 -16762321 -12591736 -6468950 -65201
36901 -65201 5700032 10421866 13752569 15528033 16057852 15851506 15090783 13728329 12173508
36892 12173508 11499419 12595215 15132982 17653325 18826340 18536669 17647936 16895344 16345325
36883 16345325 15985488 16405014 18353453 21559308 24455488 25542259 24996470 24566202 25706184
36874 25706184 27998140 29523088 28564289 24781969 19092574 12986425 7976064 5080924
36866 5080924 4378552 5173795 6757069 8727316 10401094 10396885 7444810 1597385 -5740861
36857e740861p166457n843087l826432j549680L01370J359136K203994L666573
36849a6595444N559398O771088O605339N376681L688435J875668L03548n81347
36841A3003366q79998j285136k057978k511332k008854r92590m35039o52074j291863
36832H88502k187401l427398m611237m793062l469093j240807P14708J633497
36824a6492291J635134J533716K200164L746693N254255N641202M912685M227158
36816A2658716M583713N748753O638231O417884M953095K485378o44202l913434
36808C8928134o593154q043882q111199p270573o316558n698209n084753l778415
36800a1968609j657655N15368J884995K336937K278357J863624R30975l55031
$$ plain form
36857 -5740861 -12907318 -18750405 -22576837 -24126517 -23825147 -22466011 -20262017 -16595444
36849 -16595444 -11036046 -4264958 2340381 7717062 11405497 13281165 13584713 13003366
36841 13003366 12123368 10838232 8780254 6268922 4260068 3267478 2832439 2180365 888502
36832 888502 -1298899 -4726297 -9337534 -14130596 -17599689 -18840496 -18125788 -16492291
36824 -16492291 -14857157 -13323441 -11123277 -7376584 -2122329 3518873 8431558 12658716
36816 12658716 17242429 22991182 29629413 36047297 41000392 43485770 42841568 38928134
36808 38928134 32334980 24291098 16179899 8909326 2592768 -3105441 -8190194 -11968609
36800 -11968609 -13626264 -13110896 -11225901 -8888964 -6610607 -4746983 -3816008 -4171039
36792d171039j349404j605042j306917q00764p6621R12537J728479J786488J169137
36783c713146O04787N11805M63919j71003j354175k410989k762458k366406j568948
36774a2766614q10615m40659n42369q65654j085039j159572j302590j577306j686813
36765b2237231j259613k70906Q87898J753137K225862K691928L614925M922863
36757g671137N938390O123627N791322N753840O238905O514944N785886M159723
36749C8635500K407756R48477m88263k135415l541139l977310l395341k676704
36741B5777561k804233l860030m907940m820779l208316o82205J604411K723495
36733I821964K556915J782604J163596P50456n8953j565516l143743l859439l506670
$$ plain form
36792 -4171039 -5520443 -7125485 -8432402 -9233166 -9309787 -8397250 -6668771 -4882283 -3713146
36783 -3713146 -3108359 -2596554 -2132635 -2303638 -3657813 -6068802 -8831260 -11197666 -12766614
36774 -12766614 -13577229 -14017888 -14560257 -15425911 -16510950 -17670522 -18973112 -20550418 -22237231
36765 -22237231 -23496844 -23767750 -22879852 -21126715 -18900853 -16208925 -12594000 -7671137
36757 -7671137 -1732747 4390880 10182202 15936042 22174947 28689891 34475777 38635500
36749 38635500 41043256 41991733 41503470 39368055 35826916 31849606 28454265 25777561
36741 25777561 22973328 19113298 14205358 9384579 6176263 5494058 7098469 9821964
36733 9821964 12378879 14161483 15325079 16075535 16016582 14451066 11307323 7447884 3941214
36724C941214k617024j558226j90709J470110K830982L343297L195107K976990
36716A3391741K871346K522241J520991k95071k755673n114038o141063n144984
36708H55490k942564j204970o57418m65476L61502J552911K023251J284128j80666
36699F26188j666260k692630k797500j669729K08278J576838J496964K19986j295288
36690e993153k450810l241767l667477l463949k521359j187199N3078R98842J689589
36681a9784205K121455K206964J938942J441639Q87228M26592J05326k33784q05186
36672a1695029j453577j513319m10618J566740L381625M239766M234554L865707
36664B215849L223526K033613L97057j010779j674971j820637j919329j841190
$$ plain form
36724 3941214 1324190 -234036 -424745 1045365 3876347 7219644 10414751 13391741
36716 13391741 16263087 18785328 20306319 20011248 17255575 12141537 6000474 855490
36708 855490 -2087074 -3292044 -3949462 -4414938 -4053436 -2500525 -477274 806854 626188
36699 626188 -1040072 -3732702 -6530202 -8199931 -7991653 -6414815 -4917851 -4697865 -5993153
36690 -5993153 -8443963 -11685730 -15353207 -18817156 -21338515 -22525714 -22472636 -21473794 -19784205
36681 -19784205 -17662750 -15455786 -13516844 -12075205 -11187977 -10761385 -10656059 -10889843 -11695029
36672 -11695029 -13148606 -14661925 -15072543 -13505803 -10124178 -5884412 -1649858 2215849
36664 2215849 5439375 7472988 7870045 6859266 5184295 3363658 1444329 -396861
36656c96861j001933N88024J904766J883388N92379q69157j483060j005901K29139
36647D40784J630064K412848J959327M85901r79988j640254j692505j767870j959648
36638a111341j898256j547858j311629j359626j379666j039305k20059J208401
36630h659339L228363N109830N637341M337826K140981N02512J74649J010654
36622A3482817K408546L489519L360666J933032K95587l42426J0321L64469J64257
36613B5166788j82357j55917J77495M66031M79669J5552j069939k489793l680691
36604A8726838m582060n707724p042983p428483n733534k420433P00163K235953
36596a1252263K224469J449690M35140n99992j305910j298335o54118M8155L11434
$$ plain form
36656 -396861 -1398794 -810770 1093996 2977384 3569763 2700606 1217546 211645 440784
36647 440784 2070848 4483696 6443023 6928924 5948936 4308682 2616177 848307 -1111341
36638 -1111341 -3009597 -4557455 -5869084 -7228710 -8608376 -9647681 -9867740 -8659339
36630 -8659339 -5430976 -321146 5316195 9654021 11795002 12297514 12472163 13482817
36622 13482817 15891363 19380882 22741548 24674580 24970167 24627741 24638062 25002531 25166788
36613 25166788 24984431 24828514 25006009 25472040 25951709 25967261 24897322 22407529 18726838
36604 18726838 14144778 8437054 1394071 -6034412 -11767946 -14188379 -13488216 -11252263
36596 -11252263 -9027794 -7578104 -7142964 -7742956 -9048866 -10347201 -11001319 -10953164 -10641730
36587a0641730K22035L00172R18729J927776K811004L134218K843784K236698
36579C752686J726217J558800J598865J373880M78244r81881k411535l236486
36571C858790l327429k925320k316142j698875j251983j103215j157133j061096
36563a0982403m81846N51159J672042K624468L537639M489632M862658L673279
36555I946628R11801j839470k754433j656450K36R99569J488326K061246K580667
36546A1738120K543682K045616J535093Q53978o15209k786249m585023n067962
36538E662046m297227k884880j208440N46553K003779K822959L224640L870006
36530I739436N109067O480654O971855N760999K874291p44714l905750o027896
$$ plain form
36587 -10641730 -10419695 -10119523 -9200794 -7273018 -4462014 -1327796 1515988 3752686
36579 3752686 5478903 7037703 8636568 10010448 10488692 9506811 7095276 3858790
36571 3858790 531361 -2393959 -4710101 -6408976 -7660959 -8764174 -9921307 -10982403
36563 -10982403 -11464249 -10913090 -9241048 -6616580 -3078941 1410691 6273349 9946628
36555 9946628 10858429 9018959 6264526 4608076 4608312 5607881 7096207 9157453 11738120
36546 11738120 14281802 16327418 17862511 18716489 18101280 15315031 10730008 5662046
36538 5662046 1364819 -1520061 -2728501 -2181948 -178169 2644790 5869430 9739436
36530 9739436 14848503 21329157 28301012 34062011 36936302 36191588 32285838 26257942
36522B6257942p297495q042427q233352p707917o581567n183783l790104k667627
36514b3246330k172092k443460l095967l527892l456610k825209j341074J291473
36506d0817161M513918O832995P054867N415327L180570J326082n1195j223353
36498a3767950k286051l202050l931659m273675l879737k720994j350053l87608
36490c5799777J61947Q09551J880474L233131M621046N875457O573992O008331
36482f635848L949494J248295q28433j885622k618679l652031m569496m370254
36474a9362574k628564J02276K870817M974915O098986O194318N426104M157311
36466G833589K891569K156109K213003K675166K567475J159271j160210l082717
$$ plain form
36522 26257942 18960447 10918020 2684668 -5023249 -11604816 -16788599 -20578703 -23246330
36514 -23246330 -25418422 -27861882 -30957849 -34485741 -37942351 -40767560 -42108634 -40817161
36506 -40817161 -36303243 -29470248 -22415381 -17000054 -13819484 -12493402 -12544597 -13767950
36498 -13767950 -16054001 -19256051 -23187710 -27461385 -31341122 -34062116 -35412169 -35799777
36490 -35799777 -35637830 -34828279 -32947805 -29714674 -25093628 -19218171 -12644179 -6635848
36482 -6635848 -2686354 -1438059 -2266492 -4152114 -6770793 -10422824 -14992320 -19362574
36474 -19362574 -21991138 -21888862 -19018045 -14043130 -7944144 -1749826 3676278 7833589
36466 7833589 10725158 12881267 15094270 17769436 20336911 21496182 20335972 17253255
36458A7253255l583443k779237j585984q25011p99607j396045k202075k609826
36450A472027k152521q40273R30715K704622M027661M376496L477431J802195
36442A5798353L73715j93071k77050o70280j623449k812509m142959o047672q663728
36433h258650j1004068j1496252r529364o174769l104249r65430Q38575K881979
36425d6812228M801706N904271O218969O400765O749870O912571O617585O146769
36417B940278N781876N196474L828543J680102o16838k424488l449917l555422
36409I380608k661822j017434O84750J692892J686858Q55039m08885j792101l082005
36400E337900m002335m174285l413629k092385r85447n63662n41857k98342L91481
$$ plain form
36458 17253255 13669812 10890575 9304591 8479580 7679973 6283928 4081853 1472027
36450 1472027 -680494 -1520767 -590052 2114570 6142231 10518727 13996158 15798353
36442 15798353 16172068 15978997 15701947 15031667 13408218 10595709 6452750 405078 -8258650
36433 -8258650 -19262718 -30758970 -40288334 -46463103 -49567352 -50532782 -49694207 -46812228
36425 -46812228 -42010522 -36106251 -29887282 -23486517 -16736647 -9824076 -3206491 2940278
36417 2940278 8722154 13918628 17747171 19427273 18810435 16385947 12936030 9380608
36409 9380608 6718786 5701352 6386102 8078994 9765852 10620891 10212006 8419905 5337900
36400 5337900 1335565 -2838720 -6252349 -8344734 -9330181 -9893843 -10435700 -10734042 -10342561
36391a0342561J287146K219393L281517M383498M961405M397544K612917J05127
36383A2905986k427800m294041m810602l544658q37459K001473L363749K542107
36375D898755L71853j462453j905532j300393o92150n97089o55533l16261M58324
36366a200479J122973R25226n34524k722898m190622l695215j528928O21782J325810
36357i876875N83077p40934k039610l059836l388765k654119j201674M7598N27728
36348b1803410L94943l1892o42616j169405r77997L46402K395794M196028M941333
36339a2350820M347585K578541J97022j873020k696493j888654P1698K040138
36331i574003K852703K115383N55086n34399l55480Q85322K451276L775171M587102
$$ plain form
36391 -10342561 -9055415 -6836022 -3554505 828993 5790398 10187942 12800859 12905986
36383 12905986 10478186 6184145 1373543 -2171115 -3008574 -1007101 2356648 4898755
36375 4898755 5270608 3808155 1902623 602230 -89920 -687009 -1342542 -1658803 -1200479
36366 -1200479 -77506 847720 313196 -2409702 -6600324 -10295539 -11824467 -11202685 -9876875
36357 -9876875 -9293798 -10034732 -12074342 -15134178 -18522943 -21177062 -22378736 -22331138 -21803410
36348 -21803410 -21408467 -21440359 -22082975 -23252380 -24230377 -23883975 -21488181 -17292153 -12350820
36339 -12350820 -8003235 -5424694 -5227672 -7100692 -9797185 -11685839 -11614141 -9574003
36331 -9574003 -6721300 -4605917 -4050831 -4585230 -4940710 -4055388 -1604112 2171059 6758161
36322F758161M666869L802938J950369p14824l764413o412053p723993p318536
36314h755482n782065m071448k560137r83605Q03859K543049M084394N549409
36306i172026O612337O176277L503429m23158l338234l741619k195494n03138
36298c081626j1996q83041k461022l766350l843903k337715M7606K011774K768155
36289a1558118K472426J572231K51387j228821k196519k210597j803833j897744
36281a6599588k467801k484145j437497l00182m16122j743342k799095k339168
36273c0586940o34083J044227J879913K231258K985303M354868N441578N147902
36265h135974L525931J914280J484351J873663J633927p7462k677688m995248
$$ plain form
36322 6758161 11425030 15227968 17178337 16463513 12699100 6287047 -1436946 -8755482
36314 -8755482 -14537547 -18608995 -21169132 -22152737 -21348878 -18805829 -14721435 -9172026
36306 -9172026 -2559689 3616588 7120017 6696859 3358625 -382994 -2578488 -3081626
36298 -3081626 -3093622 -3976663 -6437685 -10204035 -14047938 -16385653 -16338047 -14326273 -11558118
36289 -11558118 -9085692 -7513461 -7262074 -8490895 -10687414 -12898011 -14701844 -16599588
36281 -16599588 -19067389 -21551534 -22989031 -23289213 -23705335 -25448677 -28247772 -30586940
36273 -30586940 -31221023 -30176796 -28296883 -26065625 -23080322 -18725454 -13283876 -8135974
36265 -8135974 -4610043 -2695763 -1211412 662251 2296178 2218716 -458972 -5454220
36257e454220o414637p024909p097804o767920n966376m379340j739379J491258
36249d3353327L983071M608002L648414K530850K296489K687253K804634K248278
36241a8546336J373793P55311P24138J265207K045116K578620K579039K116928
36233e108184J325432J31753j464853l002946l838356l829156l384620k762189
36225b1933119j728305j58387J392133K155594K071950J854675K154549K982031
36217a1208879L934580M573750M450909L211077J079167r22559j627209o53218
36209B837618J428796L707954N463143O225711N758269M150587J754690j037944
36201C0288824l753217n583509n635005l804245j244328M34858N12511m31238
$$ plain form
36257 -5454220 -11868857 -18893766 -25991570 -32759490 -38725866 -43105206 -44844585 -43353327
36249 -43353327 -39370256 -34762254 -31113840 -28582990 -26286501 -23599248 -20794614 -18546336
36241 -18546336 -17172543 -16417232 -15693094 -14427887 -12382771 -9804151 -7225112 -5108184
36233 -5108184 -3782752 -3650999 -5115852 -8118798 -11957154 -15786310 -19170930 -21933119
36225 -21933119 -23661424 -23819811 -22427678 -20272084 -18200134 -16345459 -14190910 -11208879
36217 -11208879 -7274299 -2700549 1750360 4961437 6040604 5118045 3490836 2837618
36209 2837618 4266414 7974368 13437511 19663222 25421491 29572078 31326768 30288824
36201 30288824 26535607 20952098 15317093 11512848 10268520 10703378 11215889 10784651
36193A0784651j349629j682225j466723r00083j57521L95732J66688j180033l154278
36184A456579m563075m438300k871326p99189R90707K374959L395535L723274
36176g30836L031499J638546K28198j000767k299343l400481l345335j808831
36168g687350q5052M8811j616331l463975l916935k940103j478401o8011J405749
36159a9801598K908723L922946L995673L213608K060156J142230J078484K153624
36151F73846L776322M634032L857593J979638M19398M9274N49611J108267J328176
36142A8376157J296641J113353O62737k48937j685282l365933m544576m375177
36134G228983k729843n46129R61404J432275J482502J783900K352367K743615
$$ plain form
36193 10784651 9435022 7752797 6286074 5385991 5228470 5624202 5790890 4610857 1456579
36184 1456579 -3106496 -7544796 -10416122 -11215311 -10224604 -7849645 -4454110 -730836
36176 -730836 2300663 3939209 4167407 3166640 867297 -2533184 -5878519 -7687350
36168 -7687350 -7772402 -7723591 -9339922 -12803897 -16720832 -19660935 -21139336 -21207347 -19801598
36159 -19801598 -16892875 -12969929 -8974256 -5760648 -3700492 -2558262 -1479778 673846
36151 673846 4450168 9084200 12941793 14921431 15340829 15390103 15939714 17047981 18376157
36142 18376157 19672798 20786151 21448888 21199951 19514669 16148736 11604160 7228983
36134 7228983 4499140 3953011 4914415 6346690 7829192 9613092 11965459 14709074
36126A4709074K552361J547333l57118k944220n613030p691395q854241r196431
36118a5847667r005462q534529p854387o785141n035664k515798M82652L375454
36110e1720542N492746O370168O154203N687773N791663O342965O444765N677316
36102c758943M742324M541789N004741N264377M704319L352328J507039m13371
36094B4944603j762523k054553j554730j011066p78366p12037q98195j749196
36086A4423937l107987l924769l314539j543865L96097J746890K091162J061364
36078G828290j245005l687454m673819l560883j169958J047621K004418J327502
36070b129288n87657k676434l892770m131243m144673m338572m108499k816684
$$ plain form
36126 14709074 17261435 18808768 18451650 15507430 9894400 2203005 -6651236 -15847667
36118 -15847667 -24853129 -33387658 -41242045 -48027186 -53062850 -55578648 -55095996 -51720542
36110 -51720542 -46227796 -39857628 -33703425 -28015652 -22223989 -15881024 -9436259 -3758943
36102 -3758943 983381 5525170 10529911 15794288 20498607 23850935 25357974 24944603
36094 24944603 23182080 21127527 19572797 18561731 17783365 17071328 16173133 14423937
36086 14423937 11315950 7391181 4076642 2532777 2928874 4675764 6766926 7828290
36078 7828290 6583285 2895831 -1777988 -5338871 -6508829 -5461208 -3456790 -2129288
36070 -2129288 -2716945 -5393379 -9286149 -13417392 -17562065 -21900637 -26009136 -28825820
36062b8825820j079550m00969j436393l078619l467958j657937J799339N527652
36054c2620255Q281215R523210R567875R218708Q962104Q427631O852018M072024
36046C2284530P35810k507358n533625q172376r625533r151303p212707n249755
36038a4432317m108786l179628j345845J580555M642288O644631O994321N899458
36030B694677M093502K280759O58863r01906k145449k271644q42118J374494K873802
36021G814980K706770J080577j152372l237701m812270n831186o318535o090389
36013a5840126m851793k760309o66254N97471J064053J376792J775803J843886
36005a7460477J298654M76492k24235r26652j909892k923859l281036k583939
$$ plain form
36062 -28825820 -29905370 -30306339 -31742732 -34821351 -38289309 -39947246 -38147907 -32620255
36054 -32620255 -24339040 -14815830 -5247955 3970753 12932857 21360488 28212506 32284530
36046 32284530 33020340 30512982 24979357 16806981 7181448 -1969855 -9182562 -14432317
36038 -14432317 -18541103 -21720731 -23066576 -21486021 -16843733 -10199102 -3204781 2694677
36030 2694677 6788179 9068938 9727801 8825895 6680446 4408802 3566684 4941178 7814980
36021 7814980 10521750 11602327 10449955 7212254 2399984 -3431202 -9749737 -15840126
36013 -15840126 -20691919 -23452228 -24118482 -23521011 -22456958 -21080166 -19304363 -17460477
36005 -17460477 -16161823 -15685331 -15909566 -16836218 -18746110 -21669969 -24951005 -27534944
35997b7534944j125502L69354J229904J207369O35946K23730M68778J213974J859770
35988b1451621J987001J644448J060061L12576n23987j001113l66259J734208
35980a6604686M632568O925237P510522O326541M144388J900911L04837l00201
35972A4840117j20210J37781r5255o09218p13774k07492L13318K60534j76251
35963A3629550l68302j54517j5704k91680n33257O8448J580762K889221K630357
35954A9434878N99249j983113l685696m111446l798282l238162k410291j134728
35946c27591N68622K478366M146160M862608M084834K065462k25716j926726k834256
35937A2891763l205388l420115l856560m591977n060839m495980k948221j384685
$$ plain form
35997 -27534944 -28660446 -28291092 -27061188 -25853819 -25217873 -24994143 -24525365 -23311391 -21451621
35988 -21451621 -19464620 -17820172 -16760111 -16447535 -16971522 -17972635 -18338894 -16604686
35980 -16604686 -11972118 -5046881 2463641 8790182 12934570 14835481 15140318 14840117
35972 14840117 14719907 14857688 14762433 14153215 13439441 13231949 13545267 13805801 13629550
35963 13629550 13261248 13106731 13091027 12799347 12266090 12334538 13915300 16804521 19434878
35954 19434878 20034127 18051014 14365318 10253872 6455590 3217428 807137 -327591
35946 -327591 241031 2719397 6865557 11728165 15812999 17878461 17652745 15726019 12891763
35937 12891763 9686375 6266260 2409700 -2182277 -7243116 -11739096 -14687317 -16072002
35929a6072002m82609J15233Q64793J213034K65016j634811k864483k257636k68031
35920b1121496J819272L275989M143786M504718M186901L247531K325408K216162
35912D598271L115165M383230N073721M661406L313490J626637K13741o10250
35904B6375411j019124j577944k715701m208659n351408n653805n148962m052945
35896c353137k533885r37051K38725R20700J658194K863402M180410N046621N550408
35887A3634387O108082O455038N690464L462785N66096j825563l085795l180740
35879B7824754k327160r44011M02519J354792J910880K101317J847378J318259
35871C3488728J010728J126650J223564R18785O36121J076799K089251K687463
$$ plain form
35929 -16072002 -16554611 -16439378 -15574585 -14361551 -14096535 -15731346 -18595829 -20853465 -21121496
35920 -21121496 -19302224 -16026235 -11882449 -7377731 -3190830 56701 2382109 4598271
35912 4598271 7713436 12096666 17170387 21831793 25145283 26771920 26985661 26375411
35904 26375411 25356287 23778343 21062642 16853983 11502575 5848770 699808 -3353137
35896 -3353137 -5887022 -6824073 -6585348 -5664648 -4006454 -1143052 3037358 8083979 13634387
35887 13634387 19742469 26197507 31887971 35350756 35916852 34091289 31005494 27824754
35879 27824754 25497594 24553583 24956102 26310894 28221774 30323091 32170469 33488728
35871 33488728 34499456 35626106 36849670 37768455 38404576 39481375 41570626 44258089
35863D4258089K218352R11876q29212k957347n180803o499341o157900m857806
35855B0905908m214966m914066o049913o469833o079651n430137m661527l554145
35847b0468330k266520j268568o61973k30293n9733l58126o66299j41078J141863
35838b4979057K067241K112393K201926L176158M165176L565300J262285j220703
35830g649281k686117l293541l523040l193239j977160j06263J957218L930532
35822a6540891N301502N155323L158424L96232j465967j759447j061808o2253
35814f878885J197632K923462M957508O772813P769005P460933N691066K874724
35806C2768258j10668k456535l860505m499305m713428m696377m308802l167674
$$ plain form
35863 44258089 46476441 47388317 46559105 43601758 38420955 31921614 25763714 20905908
35855 20905908 16690942 11776876 5726963 -742870 -6822521 -12252658 -16914185 -20468330
35847 -20468330 -22734850 -24003418 -24665391 -24895684 -24955417 -25313543 -25979842 -26120920 -24979057
35838 -24979057 -22911816 -20799423 -18597497 -15421339 -11256163 -7690863 -6428578 -7649281
35830 -7649281 -10335398 -13628939 -17151979 -20345218 -22322378 -22428641 -20471423 -16540891
35822 -16540891 -11239389 -6084066 -2925642 -2529410 -3995377 -5754824 -6816632 -6878885
35814 -6878885 -5681253 -2757791 2199717 8972530 16741535 24202468 29893534 32768258
35806 32768258 32657590 30201055 26340550 21841245 17127817 12431440 8122638 4954964
35798D954964j102282J402092L386468M196326M003860L431096K737840J611229
35790B4621593j72143k095005l169064k853452j516904K3610J186777J783988
35782A7809400J833727J532536J242825J158542J009953L64957q08916k100364
35774B2042660l036940l200897k170872N4678K502462L670074K828566N75862
35766B3265593j993693m181494n595073n865552n021339l748358k718133j918772
35758g776821j133153p31719j297706k595036l590681l563489k709580j704041
35750b5102226j208044j717285l135827m327852l817584j349394J692006L707299
35742c5258907M281503L926310L063049J822089M55744o54332j232113r60347
$$ plain form
35798 4954964 3852682 5254774 8641242 12837568 16841428 20272524 23010364 24621593
35790 24621593 24449450 22354445 19185381 16331929 14815025 14838635 16025412 17809400
35782 17809400 19643127 21175663 22418488 23577030 24586983 24951940 24143024 22042660
35774 22042660 19005720 15804823 13633951 13688629 16191091 19861165 22689731 23265593
35766 23265593 21271900 17090406 11495333 5629781 608442 -3139916 -5858049 -7776821
35758 -7776821 -8909974 -9641693 -10939399 -13534435 -17125116 -20688605 -23398185 -25102226
35750 -25102226 -26310270 -28027555 -31163382 -35491234 -39308818 -40658212 -38966206 -35258907
35742 -35258907 -30977404 -27051094 -23988045 -22165956 -21710212 -22364544 -23596657 -24557004
35734b4557004N50829L065002N249261N655253M234907K341505J204023R53366
35726a302858J156346J528013J749556J240014k26392j936333k847608k720028
35718c359290k200175j820783j383811m62571Q81021K186258L222425M183784
35710A246858N194895N871436N624803M369129K653047R76974p19872k574608
35702B2642662m052809m279875l192001j757543p37339K23472J685655K971661
35694A3503883K484832l73135m193343o800895p239379o339147n576911n586143
35686b0120238n642096m469459j643779J806663M362801N507372N930416O280072
35678g988248O248837N175211L111919Q38506r73175k182597k889768l131068
$$ plain form
35734 -24557004 -24006175 -20941173 -15691912 -10036659 -5801752 -3460247 -2256224 -1302858
35726 -1302858 -146512 1381501 3131057 4371071 4144679 2208346 -639262 -3359290
35718 -3359290 -5559465 -7380248 -8764059 -9226630 -8345609 -6159351 -2936926 1246858
35710 1246858 6441753 12313189 17937992 22307121 24960168 25937142 25217270 22642662
35702 22642662 18589853 14309978 11117977 9360434 8623095 8846567 10532222 13503883
35694 13503883 15988715 15615580 11422237 4621342 -2618037 -8957184 -14534095 -20120238
35686 -20120238 -25762334 -30231793 -31875572 -30068909 -25706108 -20198736 -14268320 -7988248
35678 -7988248 -1739411 3435800 6547719 7386225 6413050 4230453 1340685 -1790383
35670a790383k876696k060134o41196J114094K494104K805232J998983N90155
35662A634159j025572k842944m746350o051976n846378l820465p36972J952013
35654b1484485L111145K765516J969892J744466K180572K663882K785265K753457
35646a510290K955055L360081L390558K267906l34809l676939o094842o214697
35638e857977m184325j502305L64850R37220M61201o29368j673544j712858j08463
35629a3905569K710282N388722O614838N946091L924932J640443N2600o01058
35621A1771281q65589j437428k422234l278477l503245l281999l343581m088086
35613a0449358m903030m578338k599090J10741K028544K583831K537398K770115
$$ plain form
35670 -1790383 -4667079 -6727213 -7368409 -6254315 -3760211 -954979 1044004 1634159
35662 1634159 608587 -2234357 -6980707 -13032683 -18879061 -22699526 -23436498 -21484485
35654 -21484485 -18373340 -15607824 -13637932 -11893466 -9712894 -7049012 -4263747 -1510290
35646 -1510290 1444765 4804846 8195404 10463310 10128501 6451562 356720 -5857977
35638 -5857977 -10042302 -11544607 -11179757 -10242537 -9781336 -10410704 -12084248 -13797106 -13905569
35629 -13905569 -11195287 -5806565 808273 6754364 10679296 12319739 12372339 11771281
35621 11771281 10905692 9468264 7046030 3767553 264308 -3017691 -6361272 -10449358
35613 -10449358 -15352388 -19930726 -22529816 -22419075 -20390531 -17806700 -15269302 -12499187
35605a2499187L117169K690087J069075j226876l370041m943728n969285o521040
35597b7653826o519221n789544m170449j650066J374645L954687N016727M253132
35589c1183915K521324J066224L68531P8885k8300K45895N96153j82202k762491
35580b9279896n807233o914789n115010j672451J602901L934702N300510N685458
35572c2265808N333600M994310N047997M792457L384076J210770m39270r22383
35564h864251p17692m22990j9261P34072J787030K911343L886780M391467M087416
35555G773914L009999J592765J87368j170906k460665l474276m034208m103543
35547b679552l583284k363433p62751M46878P95259O97527R51415J743015K472395
$$ plain form
35605 -12499187 -9382018 -6691931 -5622856 -6849732 -10219773 -15163501 -21132786 -27653826
35597 -27653826 -34173047 -39962591 -44133040 -45783106 -44408461 -40453774 -35437047 -31183915
35589 -31183915 -28662591 -27596367 -27227836 -27148951 -27177251 -26931356 -26335203 -26517405 -29279896
35580 -29279896 -35087129 -42001918 -47116928 -48789379 -47186478 -43251776 -37951266 -32265808
35572 -32265808 -26932208 -21937898 -16889901 -12097444 -8713368 -7502598 -7941868 -8864251
35564 -8864251 -9581943 -10004933 -10024194 -9290122 -7503092 -4591749 -704969 3686498 7773914
35555 7773914 10783913 12376678 12564046 11393140 8932475 5458199 1423991 -2679552
35547 -2679552 -6262836 -8626269 -9389020 -8942142 -8146883 -7449356 -6497941 -4754926 -2282531
35538b282531K578548K228195K003437K072705J941474J048636o34534k735474
35530F220456m935063o918284q011089p468469n386302k907420j144367j62373
35522c0712911O35167J457545K018916K299191K738303L552465M382648M825442
35514h803234M856405M433711L096414M75838k880727n660937o947555p022072
35506a8452157o815743o673852n973287m081778j390561J002197K547139L687405
35498c6150637M921436N937424O056373N171214L768431K239294O83579o93976
35490h066862j506839j584678j112767l51566M92586J161096J445750J380294
35482h142986J022097J34121j492617l420679m752149n067416m827933m740860
$$ plain form
35538 -2282531 296017 2524212 4527649 6600354 8541828 9590464 8955930 6220456
35530 6220456 1285393 -5632891 -13643980 -21112449 -26498751 -29406171 -30550538 -30712911
35522 -30712911 -30077744 -28620199 -26601283 -24302092 -21563789 -18011324 -13628676 -8803234
35514 -8803234 -3946829 486882 3583296 4059134 1178407 -4482530 -11430085 -18452157
35506 -18452157 -25267900 -31941752 -37915039 -41996817 -43387378 -42385181 -39838042 -36150637
35498 -36150637 -31229201 -25291777 -19235404 -14064190 -10295759 -8056465 -7372886 -8066862
35490 -8066862 -9573701 -11158379 -12271146 -12622712 -12130126 -10969030 -9523280 -8142986
35482 -8142986 -7120889 -6986768 -8479385 -11900064 -16652213 -21719629 -26547562 -31288422
35474c1288422n036941n427984n411059m529590k725196o02084R53941J548439
35466e2518896J427945Q92129L5428p84782p50986P19024L288688O003302Q122212
35457c3565936R446671R999034R675577Q312467O103419L886796K679038K602038
35449A9139104K529037J303375q20417k522504l094526l011997k783223k181944
35441H556905j092313l17715p93925k401962m171919n320539n528783m602177
35433a5672428k639254m10256J146502J880561K395947L055029L497261L225586
35425c521052K260059J058543J8887q68951j971823l466404m681657m334709j912389
35416a7419496J328796L297962L097899J782986J110087J904967L613076M929274
$$ plain form
35474 -31288422 -36325363 -41753347 -47164406 -51693996 -54419192 -55021276 -54067335 -52518896
35466 -52518896 -51090951 -50198822 -50163394 -50948176 -51699162 -50980138 -47691450 -41688148 -33565936
35457 -33565936 -24119265 -14120231 -4444654 3867813 9971232 13858028 16537066 19139104
35449 19139104 21668141 22971516 22151099 19628595 16534069 13522072 10738849 8556905
35441 8556905 7464592 7146877 6352952 3950990 -220929 -5541468 -11070251 -15672428
35433 -15672428 -18311682 -18721938 -17575436 -15694875 -13298928 -10243899 -6746638 -3521052
35425 -3521052 -1260993 -202450 -183563 -1052514 -3024337 -6490741 -11172398 -15507107 -17419496
35416 -17419496 -16090700 -12792738 -9694839 -7911853 -6801766 -4896799 -1283723 3645551
35408C645551M693805K628238m26286l119314m632287n070570m883704m244100
35400a1408667l179481k012483j249475r82703o57565L71544K076690L663825
35392a3378315M258510L556820J780379o65192l094696m334392l383620o54294
35384a5914800J940911K682927J653990K76917m80993q77066j473968k165916
35376a4357998k459336k329397k311089k707267l009634k404842q94999M36333
35368c0038229P02458O05493J837598M807370P618351P948033N596842K519139
35360A597055N54738j33144m20283q38644j143465p96357L87908J812966K282248
35351C303022J036724j243637k855020k669667j063846P56045J899110K153283
$$ plain form
35408 3645551 8339356 10967594 10541308 7421994 2789707 -2280863 -7164567 -11408667
35400 -11408667 -14588148 -16600631 -17850106 -18832809 -19490374 -19118830 -17042140 -13378315
35392 -13378315 -9119805 -5562985 -3782606 -4447798 -7542494 -11876886 -15260506 -15914800
35384 -15914800 -13973889 -11290962 -9636972 -9360055 -9841048 -10718114 -12192082 -14357998
35376 -14357998 -16817334 -19146731 -21457820 -24165087 -27174721 -29579563 -30474562 -30038229
35368 -30038229 -29335771 -28730278 -26892680 -22085310 -14466959 -6518926 -922084 1597055
35360 1597055 2151793 2018649 1598366 759722 -383743 -1180100 -792192 1020774 3303022
35351 3303022 4339746 3096109 241089 -2428578 -3492424 -2736379 -837269 1316014
35343A316014J786342J424644J808785L149133M695772N216573M027118J593272
35335B5017653q03924k079136k224296k148229k453293k554872j434540Q46928
35327A2166291L002997L996378M028351L770471L257360K122835N16218r26433
35319C1934468j900332k587425k957060k505888r94510Q80572J908590J445846
35311B5224261n6463j580548k487604k890551l160074l263185k787511j579292
35303G419033j20600Q26808Q36723N7794r79864j726884j964436j932110k045085
35294C71379k440006k850193k859054k154889p10170R71544J907849J425727k1394
35285f359207j259395j704434j747367j676972r63680P85186K679654L222654
$$ plain form
35343 1316014 3102356 4527000 6335785 9484918 14180690 19397263 23424381 25017653
35335 25017653 24213729 22134593 19910297 17762068 15308775 12753903 11319363 12166291
35327 12166291 15169288 19165666 23194017 26964488 30221848 32344683 32860901 31934468
35319 31934468 30034136 27446711 24489651 21983763 20989253 21869825 23778415 25224261
35311 25224261 25167798 23587250 21099646 18209095 15049021 11785836 8998325 7419033
35303 7419033 7298433 8125241 8961964 9019758 8039894 6313010 4348574 2416464 371379
35294 371379 -2068627 -4918820 -7777874 -9932763 -10642933 -9671389 -7763540 -6337813 -6359207
35285 -6359207 -7618602 -9323036 -11070403 -12747375 -13711055 -12925869 -10246215 -7023561
35277g023561K070360M38931l20409J965P25387J226728J306567R76201K94636
35268c03195o26511j623023k441856k707323k150018r93020R2007O27164Q46605
35259i279170J383932K444850L447368L579311K676159J447565P66216P66227
35251G232458P40904o3071j655332l307242m190330l971933l001219k070414j812214
35242a2098393k082360k013118r18040Q70661K262137K485409J715263O71440
35234i107001q4511l34794j2374P89905J612040J758720R07453m56506j426458
35225f353526j545806j097324m38294O16435K343801M211164N039402M284850
35217G060702K719022J525226J082469J015288J084804J435687K056577K550998
$$ plain form
35277 -7023561 -4953201 -4514270 -4834679 -4832714 -4107327 -2880599 -1574032 -597831 -303195
35268 -303195 -929706 -2552729 -4994585 -7701908 -9851926 -10844946 -10752939 -10125775 -9279170
35259 -9279170 -7895238 -5450388 -2003020 1576291 4252450 5700015 6466231 7232458
35251 7232458 7973362 7910291 6254959 2947717 -1242613 -5214546 -8215765 -10286179 -12098393
35242 -12098393 -14180753 -16193871 -17111911 -16241250 -13979113 -11493704 -9778441 -9107001
35234 -9107001 -9191512 -9526306 -9538680 -8748775 -7136735 -5378015 -4470562 -4927068 -6353526
35225 -6353526 -7899332 -8996656 -9434950 -8818515 -6474714 -2263550 2775852 7060702
35217 7060702 9779724 11304950 12387419 13402707 14487511 15923198 17979775 20530773
35209B0530773K524825J825580M17293j500702l168744l578476k381020j59978
35201A4509551K347433M833169O947313P833224O851006M592768K473064J209717
35193E1597245K83260r11088j994205k185000j552539r82936r33483r08050m43550
35184D1969654n0178o19570k170702l792453m780777n223135n332899m851375
35176A5148565l554012j945291r07080p86070j200775j576430j480310o57547
35168C041050O82162J660793J419957J34836j165729j912953k556297l547594
35160b243775m355534m006074k272898J49723K425505M067608M841663M701388
35152C307606L851559K576150J057551m15066j311724j376346j129524j358988
$$ plain form
35209 20530773 23055598 24881178 25298471 23797769 20629025 17050549 14669529 14509551
35201 14509551 16856984 21690153 28637466 36470690 43321696 47914464 50387528 51597245
35193 51597245 51880505 50969417 48975212 46790212 45237673 44254737 43321254 42413204 41969654
35184 41969654 41919476 41299906 39129204 35336751 30555974 25332839 19999940 15148565
35176 15148565 11594553 9649262 8742182 7956112 6755337 5178907 3698597 3041050
35168 3041050 3723212 5384005 6803962 6938798 5773069 3860116 1303819 -2243775
35160 -2243775 -6599309 -10605383 -12878281 -12728558 -10303053 -6235445 -1393782 3307606
35152 3307606 7159165 9735315 10792866 10377800 9066076 7689730 6560206 5201218
35144E201218k139768k809317k855540k285085j106587Q62499L370499N420277
35136C658196N985971M815553K403489m02197k594101l419421l101948k788490
35128D557052l328559m437026n459313o437585p687887q687518q363431o525163
35120d6369430m148850k016818J38079K718514N150124O333248N968704M947081
35112b7279348M460026M936892N720520N626868M001860J384270j007383k444156
35104d600451l064193l149933k614363j442601r6394R35151J573903J744983J029787
35095i684111o43712k317739k805349k132167j496845j690478k116946j588836
35087b4476183K76363K608383L980076L549578J816039K19403l09611k91241q20609
$$ plain form
35144 5201218 3061450 252133 -2603407 -4888492 -5995079 -5132580 -1762081 3658196
35136 3658196 9644167 14459720 16863209 16461012 13866911 10447490 7345542 4557052
35128 4557052 1228493 -3208533 -8667846 -15105431 -22793318 -31480836 -39844267 -46369430
35120 -46369430 -50518280 -52535098 -52397019 -49678505 -44528381 -38195133 -32226429 -27279348
35112 -27279348 -22819322 -17882430 -12161910 -6535042 -2533182 -1148912 -2156295 -4600451
35104 -4600451 -7664644 -10814577 -13428940 -14871541 -14967935 -14032784 -12458881 -10713898 -9684111
35095 -9684111 -10327823 -12645562 -15450911 -17583078 -19079923 -20770401 -22887347 -24476183
35087 -24476183 -24199820 -21591437 -17611361 -14061783 -12245744 -12026341 -12335952 -12627193 -13447802
35078a3447802j960859k643252k141813r29451J17305O99749R79798J098109J245559
35069a6982657J732534K515813L031420K943349K700273K861931L186316K923755
35061D912734J783088N7212j998570m239877o119921o824111o217870n246071
35053b3893386n069197n949470p084952p343776o122677l779326j398199L4136
35045f0606847L96547L97170Q56665K159941M257021O804945R190295J0713691
35037b5830572J0995066J0123582Q370671N987450L423060J453477O72703P87424
35029A5982861O86678n65765k817434m978022o040986n841775m809863l195609
35021a1579915q07512K468356O118649R124667J0554638R986714P568720L955911
$$ plain form
35078 -13447802 -15408661 -18051913 -20193726 -21123177 -21005872 -20306123 -19326325 -18228216 -16982657
35069 -16982657 -15250123 -12734310 -9702890 -6759541 -4059268 -1197337 1988979 4912734
35061 4912734 6695822 6753034 4754464 514587 -5605334 -12429445 -18647315 -23893386
35053 -23893386 -28962583 -34912053 -41997005 -49340781 -55463458 -59242784 -60640983 -60606847
35045 -60606847 -60210300 -59813130 -58956465 -56796524 -52539503 -45734558 -36544263 -25830572
35037 -25830572 -14835506 -4711924 3658747 9646197 13069257 14522734 15195437 15982861
35029 15982861 16669539 16103774 13286340 8308318 2267332 -3574443 -8384306 -11579915
35021 -11579915 -12387427 -9919071 -3800422 5324245 15878883 25865597 33434317 37390228
35013C7390228J91663k658579m060587m281105m001959l552544k570729o05445
35005A5850943J920051L664228L611500K224095R49511N82825N55988n6329j378156
34996B7924656k938863m545638o268361p671115p761889o002369l032794j21180
34988a0417553J955333L311821M386073N200234N247474M063437J860942m61676
34980A5146085j968905k312276j778643r55818m49675o43435j376606j896679
34972C764048j437220M7162J847534L211514L948733M336601M605528M593345
34964B4917245L833839J986499p22335l481660n409572o106462n699973m495922
34956D821659k776986r08434N83317J189684P16222n54944k006317l120083l834262
$$ plain form
35013 37390228 37581891 34923312 30862725 26581620 22579661 19027117 16456388 15850943
35005 15850943 17770994 21435222 25046722 27270817 28220328 28803153 29359141 29302812 27924656
34996 27924656 24985793 20440155 14171794 6500679 -1261210 -7263579 -10296373 -10417553
34988 -10417553 -8462220 -5150399 -764326 4435908 9683382 13746819 15607761 15146085
34980 15146085 13177180 10864904 9086261 8130443 7680768 7037333 5660727 3764048
34972 3764048 2326828 2373990 4221524 7433038 11381771 15718372 20323900 24917245
34964 24917245 28751084 30737583 30015248 26533588 21124016 15017554 9317581 4821659
34956 4821659 2044673 1136239 1719556 2909240 3625462 3070518 1064201 -2055882 -5890144
34947e890144m337520m490969l762590j981409Q8174J330874J413067J013113
34939a6617404R17391J217338J514246J645118J958225K873322M224867N079727
34931B812830M382194J994157r33575k808996k851757j486674K65720J491365
34923B865264J640636O24374j075775k589883l180888k609698j061782J068390
34915d319362L265693M979270N796601N547096M292071K352573L28521j115213
34907B1127250j625684j349513p85359m41640m65588n05180j33099M34472L18144
34898A6573803r87062k755073l661679l220680k174343j506519j558748k125305
34890a415606k781998k861194j705918M91948K379160K516789P93729j499614
$$ plain form
34947 -5890144 -10227664 -14718633 -18481223 -20462632 -20374458 -19043584 -17630517 -16617404
34939 -16617404 -15700013 -14482675 -12968429 -11323311 -9365086 -6491764 -2266897 2812830
34931 2812830 7195024 9189181 8255606 5446610 2594853 1108179 1373899 2865264
34923 2865264 4505900 5130274 4054499 1464616 -1716272 -4325970 -5387752 -4319362
34915 -4319362 -1053669 3925601 9722202 15269298 19561369 21913942 22242463 21127250
34907 21127250 19501566 18152053 17366694 16925054 16459466 15954286 15821187 16255659 16573803
34898 16573803 15586741 12831668 9169989 5949309 3774966 2268447 709699 -1415606
34890 -1415606 -4197604 -7058798 -8764716 -8272768 -5893608 -3376819 -2583090 -4082704
34882d082704k951838l159513k697527k318253k296748k411736k398298k259422
$$ plain form
34882 -4082704 -7034542 -10194055 -12891582 -15209835 -17506583 -19918319 -22316617 -24576039
$$ [...]
##END NTUPLES=NMR SPECTRUM
##END=
