##TITLE=31Pdec_DE-20HM
 D2O 
  24 sc
 24.10.2023
##JCAMPDX= 6.0         $$ Bruker NMR JCAMP-DX V2.0
##DATA TYPE= NMR SPECTRUM
##DATA CLASS= NTUPLES
##ORIGIN= UXNMR, Bruker Analytische Messtechnik GmbH
##OWNER= root
$$ XWIN-NMR		Version 3.5
$$ Tue Oct 24 16:40:11 2023 Russian Standard Time (UT+4h)  she@DPX200
##.OBSERVE FREQUENCY= 81.013821
##.OBSERVE NUCLEUS= ^31P
##.ACQUISITION MODE= SIMULTANEOUS
##.ACQUISITION SCHEME= undefined
##.AVERAGES= 24
##.DIGITISER RES= 16
##SPECTROMETER/DATA SYSTEM= spect
##.PULSE SEQUENCE= zgpg30
##.SOLVENT NAME= CDCl3
##.SHIFT REFERENCE= (INTERNAL, CDCl3, 0, 248.564)
##AUDIT TRAIL= $$ (NUMBER, WHEN, WHO, WHERE, WHAT)
$$ ##TITLE= Audit trail, XWIN-NMR		Version 3.5
$$ ##JCAMPDX= 5.01
$$ ##ORIGIN= Bruker BioSpin GmbH
$$ ##OWNER= she
$$ F:/spectra/data/she/nmr/P31/1/pdata/1/auditp.txt
$$ ##AUDIT TRAIL=  $$ (NUMBER, WHEN, WHO, WHERE, WHAT)
(   1,<2023-10-24 16:39:18.78 +0400>,<she>,<DPX200>,
      <created by zg, POWCHK disabled, PULCHK disabled
       configuration hash MD5:
       00 E9 B6 7A A2 85 ED C7 34 08 36 98 17 FE 4E 26
       data hash MD5: 32K
       01 A3 5A 56 C9 9E CD 23 73 32 45 13 0D 69 81 AA>)
(   2,<2023-10-24 16:39:20.85 +0400>,<she>,<DPX200>,
      <Start of raw data processing
       efp BC_mod = 2 LB = 5 FT_mod = 6 PKNL = 1 PHC0 = -10671.04 PHC1 = 76.0864 SI = 64K 
       data hash MD5: 64K
       EA BB 43 7B 48 68 0C 6B 9F 2F 4E 08 FD 9B 13 3E>)
(   3,<2023-10-24 16:39:40.93 +0400>,<she>,<DPX200>,
      <pk PHC0 = -130.3105 PHC1 = 308.1998 
       data hash MD5: 64K
       82 A4 E3 8C 86 88 07 58 D3 14 B6 34 13 E5 F4 CB>)
(   4,<2023-10-24 16:39:46.98 +0400>,<she>,<DPX200>,
      <abs ABSG = 5 
       data hash MD5: 64K
       32 94 DF E9 E7 E2 20 D4 8A 66 55 93 C0 6B B5 C3>)
$$ ##END=
$$ 
$$ hash MD5
$$ 2C C5 3A 2A 66 D9 3A 65 9C 26 EC 66 66 D4 0C BE
##$RELAX= 
##$RELAX= 
##$RELAX= 
##$RELAX= 
##$RELAX= 
##$RELAX= 
##$RELAX= 
##$RELAX= 
##$RELAX= 
$$ Bruker specific parameters
$$ --------------------------
##$DU= <F:/spectra>
##$EXPNO= 1
##$NAME= <P31>
##$PROCNO= 1
##$TYPE= <nmr>
##$USER= <she>
##$AMP= (0..31)
100 100 100 100 100 100 100 100 100 100 100 100 100 100 100 100 100 100 
100 100 100 100 100 100 100 100 100 100 100 100 100 100 
##$AQSEQ= 0
##$AQ_mod= 1
##$AUNM= <au_zg>
##$AUTOPOS= <>
##$BF1= 81.014009
##$BF2= 200.13
##$BF3= 200.13
##$BF4= 200.13
##$BF5= 200.13
##$BF6= 200.13
##$BF7= 200.13
##$BF8= 200.13
##$BYTORDA= 1
##$CFDGTYP= 0
##$CFRGTYP= 5
##$CHEMSTR= <none>
##$CNST= (0..31)
1 1 145 1 1 1 1 1 1 1 1 1 1 1 1 1 1 1 1 1 1 1 1 1 1 1 1 1 1 1 1 1 
##$CPDPRG= <waltz16>
##$CPDPRG1= <>
##$CPDPRG2= <waltz16>
##$CPDPRG3= <>
##$CPDPRG4= <mlev>
##$CPDPRG5= <mlev>
##$CPDPRG6= <mlev>
##$CPDPRG7= <mlev>
##$CPDPRG8= <mlev>
##$CPDPRGB= <>
##$CPDPRGT= <>
##$D= (0..31)
0 1 0 0 0 0 0 0 0 0 0 0.03 2e-05 3e-06 0 0 0 0 0 0 0 0 0 0 0 0 0 0 0 0 
0 0 
##$DATE= 1698151158
##$DBL= (0..7)
120 120 120 11 120 120 24 19 
##$DBP= (0..7)
150 150 150 150 150 150 150 150 
##$DBP07= 0
##$DBPNAM0= <>
##$DBPNAM1= <>
$$ [...]
##$SUBNAM3= <"">
##$SUBNAM4= <"">
##$SUBNAM5= <"">
##$SUBNAM6= <"">
##$SUBNAM7= <"">
##$SUBNAM8= <"">
##$SUBNAM9= <"">
##$SW= 501.771253377433
##$SWIBOX= (0..15)
0 1 3 0 0 0 0 0 0 0 0 0 0 0 0 0 
##$SW_h= 40650.406504065
##$TD= 32768
##$TD0= 1
##$TE= 0
##$TE2= 300
##$TE3= 300
##$TEG= 300
##$TL= (0..7)
0 120 53 12 22 120 120 120 
##$TP= (0..7)
150 150 150 150 150 150 150 150 
##$TP07= 0
##$TPNAME0= <>
##$TPNAME1= <>
##$TPNAME2= <>
##$TPNAME3= <>
##$TPNAME4= <>
##$TPNAME5= <>
##$TPNAME6= <>
##$TPNAME7= <>
##$TPOAL= (0..7)
0.5 0.5 0.5 0.5 0.5 0.5 0.5 0.5 
##$TPOFFS= (0..7)
0 0 0 0 0 0 0 0 
##$TUNHIN= 0
##$TUNHOUT= 0
##$TUNXOUT= 0
##$USERA1= <user>
##$USERA2= <user>
##$USERA3= <user>
##$USERA4= <user>
##$USERA5= <user>
##$V9= 5
##$VALIST= <valist>
##$VCLIST= <CCCCCCCCCCCCCCC>
##$VD= 0
##$VDLIST= <DDDDDDDDDDDDDDD>
##$VPLIST= <PPPPPPPPPPPPPPP>
##$VTLIST= <TTTTTTTTTTTTTTT>
##$WBST= 1024
##$WBSW= 4
##$XGAIN= (0..3)
0 0 0 0 
##$XL= 0
##$YL= 0
##$YMAX_a= 2684
##$YMIN_a= -1131
##$ZGOPTNS= <>
##$ZL1= 120
##$ZL2= 120
##$ZL3= 120
##$ZL4= 120
##$ABSF1= 248.5645
##$ABSF2= -253.2056
##$ABSG= 5
##$ABSL= 3
##$ALPHA= 0
##$AQORDER= 0
##$ASSFAC= 0
##$ASSFACI= 0
##$ASSFACX= 0
##$ASSWID= 0
##$AUNMP= <proc_1d>
##$AZFE= 0.1
##$AZFW= 0.5
##$BCFW= 0
##$BC_mod= 2
##$BYTORDP= 0
##$COROFFS= 0
##$CY= -3
##$DATMOD= 1
##$DC= 0
##$DFILT= <>
##$DTYPP= 0
##$F1P= 0
##$F2P= 0
##$FCOR= 1
##$FTSIZE= 65536
##$FT_mod= 6
##$GAMMA= 0
##$GB= 0
##$INTBC= 1
##$INTSCL= 6.047779e-11
##$ISEN= 30
##$LB= 5
##$LEV0= 0
##$LPBIN= 0
##$MAXI= 10000
##$MC2= 0
##$MEAN= 0
##$ME_mod= 0
##$MI= 50
##$NCOEF= 0
##$NC_proc= -11
##$NLEV= 6
##$NOISF1= 182.463
##$NOISF2= 159.3651
##$NSP= 0
##$NTH_PI= 0
##$NZP= 0
##$OFFSET= 248.5645
##$PC= 4
##$PHC0= -10801.35
##$PHC1= 384.2862
##$PH_mod= 1
##$PKNL= yes
##$PPARMOD= 0
##$PSCAL= 0
##$PSIGN= 0
##$REVERSE= no
##$SF= 81.0140089999694
##$SI= 65536
##$SIGF1= 159.3651
##$SIGF2= -187.1042
##$SINO= 113.3802
##$SIOLD= 16384
##$SREGLST= <1H.CDCl3>
##$SSB= 0
##$STSI= 65536
##$STSR= 0
##$SW_p= 40650.406504065
##$SYMM= 0
##$S_DEV= 0
##$TDeff= 32768
##$TDoff= 0
##$TI= <>
##$TILT= no
##$TM1= 0
##$TM2= 0
##$TOPLEV= 0
##$USERP1= <user>
##$USERP2= <user>
##$USERP3= <user>
##$USERP4= <user>
##$USERP5= <user>
##$WDW= 1
##$XDIM= 65536
##$YMAX_p= 466972350
##$YMIN_p= -141598362
$$ End of Bruker specific parameters
$$ ---------------------------------
##NTUPLES= NMR SPECTRUM
##VAR_NAME=  FREQUENCY,     SPECTRUM/REAL,   SPECTRUM/IMAG
##SYMBOL=    X,             R,               I
##VAR_TYPE=  INDEPENDENT,   DEPENDENT,       DEPENDENT
##VAR_FORM=  AFFN,          ASDF,            ASDF
##VAR_DIM=   65536,         65536,           65536
##UNITS=     HZ,            ARBITRARY UNITS, ARBITRARY UNITS
##FACTOR=    0.620285442955139, 1,           1
##FIRST=     20137.2065510682, 0,            0
##LAST=      -20513.1999529968, 0,           0
##MIN=       -20513.1999529968, -141598362,  0
##MAX=       20137.2065510682, 466972350,    0
$$ Real data points
##PAGE= N=1
##DATA TABLE= (X++(R..R)), XYDATA
$$ [...]
$$ plain form
40480 -21435473 -19278962 -16229590 -13790012 -13213801 -14468852 -16514036 -18703763 -21349293
40472 -21349293 -24597850 -27317205 -27694348 -24810172 -19314468 -12836072 -7169713 -3751892
40464 -3751892 -3146330 -4720639 -7129648 -9384169 -11468321 -14074782 -18011218 -23716111
40456 -23716111 -30796385 -37803662 -42851395 -44867766 -44224366 -42046892 -39151422 -35865175
40448 -35865175 -32558924 -29788307 -27825080 -26443311 -25345676 -24501783 -23856115 -23006468
40440 -23006468 -21542375 -19531083 -17198248 -14107245 -9171703 -1833336 6976936 15357937
40432 15357937 21880682 26418785 29798065 32973672 36482372 40269565 43758640 46127785
40424 46127785 46694093 45242245 42230679 38731052 35832969 33726643 31403273 27544582
$$ packed form
40480b1435473K156511L049372K439578N76211j255051k045184k189727k645530
40472b1349293l248557k719355l77143K884176N495704O478396N666359L417821
40464c751892O05562j574309k409009k254521k084152k606461l936436n704893
40456b3716111p080274p007277n047733k016371O43400K177474K895470L286247
40448c5865175L306251K770617J963227J381769J097635Q43893O45668Q49647
40440b3006468J464093K011292K332835L091003M935542P338367Q810272Q381001
40432A5357937O522745M538103L379280L175607L508700L787193L489075K369145
40424D6127785N66308j451848l011566l499627k898083k106326k323370l858691
$$ plain form
40416 27544582 21758757 14811224 7763868 1179231 -4879604 -10419205 -15162745 -18356747
40408 -18356747 -18894721 -15980576 -9877637 -1888096 6408448 13728865 19130912 22130401
40400 22130401 23016322 22593982 21283406 18801708 15034882 10822732 7364211 5003992
40392 5003992 3044507 672589 -2273965 -5276082 -7362109 -7447547 -5133590 -1553535
40384 -1553535 879348 31983 -4402707 -10715841 -16330668 -19297560 -19227491 -17258237 -15179981
40375 -15179981 -14354035 -15126541 -16898660 -18548765 -18998716 -17841386 -15672995 -13717038
40367 -13717038 -12957401 -13551178 -14949292 -16420109 -17496259 -18179456 -18891513 -20126847 -21937379
40358 -21937379 -23664458 -24257109 -23011684 -20090179 -16261348 -12074220 -7418506 -2097519
$$ packed form
40416B7544582n785825o947533p047356o584637o058835n539601m743540l194002
40408a8356747n37974K914145O102939P989541Q296544P320417N402047K999489
40400B2130401Q85921m22340j310576k481698l766826m212150l458521k360219
40392E003992j959485k371918k946554l002117k086027q5438K313957L580055
40384a553535K432883q47365m434690o313134n614827k966892P0069J969254K078256
40375a5179981Q25946p72506j772119j650105m49951J157330K168391J955957
40367a3717038P59637n93777j398114j470817j076150o83197p12057j235334j810532
40358b1937379j727079n92651J245425K921505L828831M187128M655714N320987
$$ plain form
40350 -2097519 3262382 7242091 8725910 7759371 5217584 1925810 -1640900 -5044906
40342 -5044906 -7705052 -9087001 -8922725 -7336140 -4969423 -2896783 -2089418 -2786688 -4356512
40333 -4356512 -5683525 -5731741 -4089333 -1278304 1605436 3813502 5405494 6635745
40325 6635745 7200377 6540892 4753773 2687262 1076295 -52557 -1114477 -2541700
40317 -2541700 -4711596 -7837736 -11653202 -15449100 -18652280 -21220036 -23353443 -25005695
40309 -25005695 -25793150 -25262739 -23229579 -20054548 -16595824 -13607876 -11110859 -8591840
40301 -8591840 -5849222 -3297942 -1347413 125922 1447199 2598550 3312155 3521925
40293 3521925 3454750 3381360 3450256 3630665 3691113 3453039 3244439 3831182 5565221 7726554
$$ packed form
40350b097519N359901L979709J483819r66539k541787l291774l566710l404006
40342e044906k660146j381949J64276J586585K366717K072640Q07365o97270j569824
40333d356512j327013m8216J642408K811029K883740K208066J591992J230251
40325F635745N64632o59485j787119k066511j610967j128852j061920j427223
40317b541700k169896l126140l815466l795898l203180k567756k133407j652252
40309b5005695p87455N30411K033160L175031L458724K987948K497017K519019
40301h591840K742618K551280J950529J473335J321277J151351P13605K09770
40293C521925o7175p3390O8896J80409O0448k38074k08600N86743J734039K161333
$$ plain form
40283 7726554 9036325 8841462 7667268 6754935 7284455 9865097 14309661 19690567 24779691
40274 24779691 28654741 31026042 32136001 32431809 32241624 31657607 30737734 29723347 28782533
40265 28782533 27519581 25204197 21847022 18716819 17214412 17248079 17203320 15615227 12466260
40256 12466260 8738804 5244111 2343252 481457 290587 1952452 4821202 7960684
40248 7960684 10922996 13789445 16550418 18729634 19690571 19131087 17192574 14286015
40240 14286015 11026404 8227749 6610055 6267136 6426186 5875642 3856462 800648
40232 800648 -1721723 -2044672 253660 3975757 7379880 9593662 10863604 11620510 11702271
40223 11702271 10541273 7779445 3600291 -1205718 -5335420 -7520387 -7425083 -5959486
$$ packed form
40283G726554J309771j94863j174194r12333N29520K580642M444564N380906N089124
40274B4779691L875050K371301J109959K95808j90185n84017r19873j014387r40814
40265B8782533j262952k315384l357175l130203j502407L3667m4759j588093l148967
40256A2466260l727456l494693k900859j861795j90870J661865K868750L139482
40248G960684K962312K866449K760973K179216R60937n59484j938513k906559
40240A4286015l259611k798655j617694l42919J59050n50544k019180l055814
40232H00648k522371l22949K298332L722097L404123K213782J269942P56906Q1761
40223A1702271j160998k761828m179154m806009m129702k184967R5304J465597
$$ plain form
40215 -5959486 -4413680 -3234008 -1782972 697537 3979129 6684806 7214589 4966608
40207 4966608 792863 -3696195 -7222870 -9269654 -9783941 -8955376 -7319121 -5622628
40199 -5622628 -4348700 -3592595 -3443621 -4041286 -5079881 -5808832 -5974112 -6374546 -7985573
40190 -7985573 -10847838 -14363121 -18325678 -22802835 -27019034 -29278892 -28445901 -25023741
40182 -25023741 -20448014 -15758373 -11372635 -7772479 -5739112 -5755893 -7410606 -9528352
40174 -9528352 -10988493 -11623042 -12374756 -14317072 -17336651 -19962816 -20683458 -19293049 -16825289
40165 -16825289 -14432880 -12648327 -11562280 -11239968 -11788235 -13223793 -15385034 -17789023
40157 -17789023 -19454426 -19103427 -15954118 -10543318 -4684962 -368792 1523159 1570829
$$ packed form
40215e959486J545806J179672J451036K480509L281592K705677N29783k247981
40207D966608m173745m489058l526675k046784n14287Q28565J636255J696493
40199e622628J273928P56105J48974n97665j038595p28951j65280m00434j611027
40190g985573k862265l515283l962557m477157m216199k259858Q32991L422160
40182b5023741M575727M689641M385738L600156K033367j6781j654713k117746
40174i528352j460141o34549p51714j942316l019579k626165p20642J390409K467760
40165a6825289K392409J784553J086047L22312n48267j435558k161241k403989
40157a7789023j665403L50999L149309N410800N858356M316170J891951M7670
$$ plain form
40149 1570829 1066305 1032441 1831217 3292900 4910349 6104986 6734914 7367845 8656068
40140 8656068 10288442 10925005 9469018 6178701 2236024 -1508256 -4863659 -7509100
40132 -7509100 -8609776 -7637029 -5217452 -2709839 -1062012 -440790 -816739 -2296896 -4647450
40123 -4647450 -6913509 -7924928 -7090245 -4556187 -943897 2617185 4421312 2939505
40115 2939505 -1879720 -8187128 -13309749 -15274730 -13548021 -8950934 -3263824 1445706
40107 1445706 3765307 3513521 1411375 -1674523 -5094902 -8378409 -11295905 -14016820
40099 -14016820 -16962056 -20413480 -24268261 -27982897 -30630857 -31351302 -30181930 -28356203
40091 -28356203 -27366788 -27706417 -28773926 -29829103 -30546319 -30725504 -30170307 -29116151 -28220455
$$ packed form
40149A570829n04524l3864P98776J461683J617449J194637O29928O32931J288223
40140H656068J632374O36563j455987l290317l942677l744280l355403k645441
40132g509100j100676R72747K419577K507613J647827O21222l75949j480157k350554
40123d647450k266059j011419Q34683K534058L612290L561082J804127j481807
40115B939505m819225o307408n122621j964981J726709M597087N687110M709530
40107A445706K319601k51786k102146l085898l420379l283507k917496k720915
40099a4016820k945236l451424l854781l714636k647960p20445J169372J825727
40091b8356203R89415l39629j067509j055177p17216j79185N55197J054156Q95696
$$ plain form
40082 -28220455 -27720242 -26974715 -25245926 -22634166 -19834291 -17247348 -14832596 -12654317
40074 -12654317 -10974723 -9754000 -8573857 -7269182 -6296523 -6243058 -7170247 -8607583 -10009404
40065 -10009404 -11046182 -11609806 -11776325 -11770601 -11854140 -12218426 -12958679 -14028811 -15173297
40056 -15173297 -16040860 -16482090 -16657674 -16763651 -16750222 -16434554 -15796261 -15007360 -14269692
40047 -14269692 -13846974 -14166237 -15482773 -17290741 -18442404 -18252968 -17358117 -17077310 -17905775
40038 -17905775 -18963838 -18980015 -17458757 -14771255 -11544327 -8314812 -5469300 -3000787
40030 -3000787 -347991 3110919 7284980 11275666 14021401 14823713 13402632 9961977
40022 9961977 5384392 967151 -2398036 -4730645 -6590555 -8433747 -10436788 -12597491
$$ packed form
40082b8220455N00213P45527J728789K611760K799875K586943K414752K178279
40074a2654317J679594J220723J180143J304675R72659N3465r27189j437336j401821
40065a0009404j036778n63624j66519N724q3539l64286p40253j070132j144486
40056a5173297q67563m41230j75584j05977J3429L15668O38293P88901P37668
40047a4269692M22718l19263j316536j807968j151663J89436Q94851K80807q28465
40038a7905775j058063j6177J521258K687502L226928L229515K845512K468513
40030c000787K652796L458910M174061L990686K745735Q02312j421081l440655
40022I961977m577585m417241l365187k332609j859910j843192k003041k160703
$$ plain form
40014 -12597491 -14629733 -15887171 -15783527 -14394258 -12470453 -10780275 -9495238 -8209335
40006 -8209335 -6499338 -4518278 -3116088 -3300048 -5420107 -8807850 -12180761 -14376281
39998 -14376281 -14836018 -13696435 -11578225 -9139720 -6681288 -4251107 -2129222 -892237
39990 -892237 -751967 -1021177 -544371 1370537 4577918 8402119 11945157 14212748 14475195
39981 14475195 12784007 9976999 7049048 4576091 2612994 758607 -1784497 -5796174
39973 -5796174 -11271250 -17098336 -21708412 -24057674 -23992983 -21967592 -18730297 -15182071
39965 -15182071 -12104747 -9789069 -8003382 -6394680 -4853640 -3531507 -2745672 -2993536
39957 -2993536 -4806251 -8204531 -12213286 -15154450 -15639239 -13313051 -8727211 -2806716
$$ packed form
40014a2597491k032242j257438J03644J389269J923805J690178J285037J285903
40006h209335J709997J981060J402190j83960k120059l387743l372911k195520
39998a4376281m59737J139583K118210K438505K458432K430181K121885J236985
39990h92237J40270k69210M76806J914908L207381L824201L543038K267591K62447
39981A4475195j691188k807008k927951k472957j963097j854387k543104m011677
39973e796174n475076n827086m610076k349262O4691K025391L237295L548226
39965a5182071L077324K315678J785687J608702J541040J322133P85835k47864
39957b993536j812715l398280m008755k941164m84789K326188M585840N920495
$$ plain form
39949 -2806716 3322949 8258192 10688926 10231047 7827363 5163462 3654814 3844790
39941 3844790 5342149 7013693 7443374 5687728 1805023 -3395779 -9057952 -14605690
39933 -14605690 -19582470 -23613950 -26657966 -28961718 -30534496 -30861520 -29393279 -26228072
39925 -26228072 -22121840 -17923190 -14201257 -11307195 -9440385 -8521923 -8180382 -7959083
39917 -7959083 -7396635 -5877267 -2752870 1968584 7046191 10496200 10985644 8768467
39909 8768467 5174615 1261262 -2902879 -7718271 -13097925 -18137780 -21594308 -22587611
39901 -22587611 -20997574 -17432686 -12903098 -8422548 -4745927 -2253377 -852904 24492
39893 24492 1087491 2636374 4408050 6043337 7534448 9039335 10461795 11557507
$$ packed form
39949b806716O129665M935243K430734m57879k403684k663901j508648J89976
39941C844790J497359J671544M29681j755646l882705n200802n662173n547738
39933a4605690m976780m031480l044016k303752j572778l27024J468241L165207
39925b6228072M106232M198650L721933K894062J866810R18462L41541K21299
39917g959083N62448J519368L124397M721454N077607L450009M89444k217177
39909H768467l593852l913353m164141m815392n379654n039855l456528r93303
39901b2587611J590037L564888M529588M480550L676621K492550J400473Q77396
39893B4492J062999J548883J771676J635287J491111J504887J422460J095712
$$ plain form
39885 11557507 12379167 13217904 14026922 14258045 13448682 11725345 9596128 7555454 6111931
39876 6111931 5853452 7009139 8997786 10777319 11707439 11891782 11768970 11679034 11794862
39867 11794862 12078211 12160594 11588772 10423736 9399156 9248926 9985000 11029445 11952793
39858 11952793 12847169 13982281 15296220 16312494 16518395 15864259 14992009 14934704 16408169
39849 16408169 19255050 22544703 25205918 26596090 26620340 25523346 23655730 21345102
39841 21345102 18848508 16356963 14039898 12097517 10766729 10237253 10518520 11406931
39833 11406931 12644426 14106637 15764572 17463493 18865391 19707347 20075323 20342046
39825 20342046 20821693 21481641 21951171 21827590 21069944 20115863 19527137 19535838 20096916 21360929
$$ packed form
39885A1557507Q21660Q38737Q09018K31123q09363j723337k129217k040674j443523
39876F111931k58479J155687J988647J779533R30120J84343j22812q9936J15828
39867A1794862K83349Q2383n71822j165036j024580j50230P36074J044445R23348
39858A1952793Q94376J135112J313939J016274K05901o54136q72250n7305J473465
39849A6408169K846881L289653K661215J390172K4250j096994j867616k310628
39841B1345102k496594k491545k317065j942381j330788n29476K81267Q88411
39833A1406931J237495J462211J657935J698921J401898Q41956L67976K66723
39825B0342046M79647O59948M69530j23581p57646r54081n88726Q701N61078J264013
$$ plain form
39815 21360929 23728772 27154926 30602260 32597793 32406702 30470481 27711043 24653651
39807 24653651 21281044 17537749 13899482 11546237 11836486 15195814 20366535 25063515
39799 25063515 27670626 28273789 28040681 27870807 27782724 27275714 25922243 23712870 21101240
39790 21101240 18662533 16539847 14381412 12039478 10088567 9225374 9251481 9175043 8476228
39781 8476228 7867830 8518556 10751397 13803431 16785374 19600291 22782762 26459192
39773 26459192 29613740 30685356 29128252 26207850 23873929 22874591 22394425 21574484
39765 21574484 20772647 20907696 21971854 22812961 22361668 20677113 18834166 18201096 19807537
39756 19807537 23826482 29265462 34371159 37717851 39000431 38740452 37333024 34499172
$$ packed form
39815B1360929K367843L426154L447334J995533j91091j936221k759438l057392
39807B4653651l372607l743295l638267k353245K90249L359328N170721M696980
39799B5063515K607111O03163k33108j69874q8083n07010j353471k209373k611630
39790B1101240k438707k122686k158435k341934j950911q63193K6107p6438o98815
39781H476228o08398O50726K232841L052034K981943K814917L182471L676430
39773B6459192L154548J071616j557104k920402k333921r99338m80166q19941
39765B1574484q01837J35049J064158Q41107m51293j684555j842947o33070J606441
39756A9807537M018945N438980N105697L346692J282580k59979j407428k833852
$$ plain form
39748 34499172 29615433 22508970 14002005 5731163 -697792 -4570045 -6204239 -6359899
39740 -6359899 -5624973 -4298484 -2542725 -447068 1886077 4108498 5641012 6227624
39732 6227624 6402456 7009326 8127250 8797345 8092047 6312075 4881596 5124851 7312527
39723 7312527 10735378 14303267 16970670 17950350 16956054 14405572 11347640 9073450
39715 9073450 8558548 9984403 12721336 15962416 19490220 23689021 28721140 33910628
39707 33910628 38173907 40950529 42464950 43133572 43014991 41924781 39866304 37191650
39699 37191650 34417883 31950374 29888762 28021516 26045177 23801452 21277349 18506614
39691 18506614 15703201 13457181 12436173 12658705 13256776 13258878 12609055 12232946 13084578
$$ packed form
39748C4499172m883739p106463q506965q270842o428955l872253j634194j55660
39740f359899P34926J326489J755759K095657K333145K222421J532514N86612
39732F227624J74832O06870J117924O70095p05298j779972j430479K43255K187676
39723G312527L422851L567889K667403R79680r94296k550482l057932k274190
39715I073450n14902J425855K736933L241080L527804M198801N032119N189488
39707C3910628M263279K776622J514421O68622j18581j090210k058477k674654
39699C7191650k773767k467509k061612j867246j976339k243725k524103k770735
39691A8506614k803413k246020j021008K22532N98071K102o49823l76109Q51632
$$ plain form
39682 13084578 15246589 17930593 20163199 21395834 21612002 21090498 20210299 19446690 19330733
39673 19330733 20136271 21526618 22677304 22906770 22156802 20816192 19220666 17452304
39665 17452304 15447878 13003417 9701225 5189941 -246194 -5533996 -9412863 -11193859
39657 -11193859 -10961517 -9308920 -7129170 -5504979 -5363921 -7041675 -10341365 -15091467
39649 -15091467 -21350747 -28788000 -36076421 -41412695 -43846799 -43920331 -42921182 -41754931
39641 -41754931 -40645076 -39533975 -38303787 -36674429 -34333292 -31330109 -28109671 -25034522
39633 -25034522 -22086645 -19196329 -16703753 -15285564 -15415449 -16909104 -18873655 -20055781
39625 -20055781 -19449493 -16809455 -12622069 -7582311 -2226089 2900579 7017461 9430153
$$ packed form
39682A3084578K162011K684004K232606J232635K16168n21504q80199p63609j15957
39673A9330733Q05538J390347J150686K29466p49968j340610j595526j768362
39665A7452304k004426k444461l302192m511284n436135n287802l878867j780996
39657a1193859K32342J652597K179750J624191J41058j677754l299690m750102
39649a5091467o259280p437253p288421n336274k434104p3532R99149J166251
39641d1754931J109855J111101J230188J629358K341137L003183L220438L075149
39633b5034522K947877K890316K492576J418189j29885j493655j964551j182126
39625b0055781O06288K640038M187386N039758N356222N126668M116882K412692
$$ plain form
39617 9430153 10119521 9809307 9374084 9282147 9587565 10180059 10796800 10906865 9994394 8262733
39607 8262733 6955145 7574397 10496042 14391741 17128919 17164278 14094960 8402133 1344365
39598 1344365 -4971088 -8311603 -7812657 -4610504 -631522 3089314 6615397 10025183
39590 10025183 12843618 14631123 15532117 15916785 15878288 15491267 15320010 16143426 18087169
39581 18087169 20353314 21969439 22595982 22406772 21361497 18986862 15016268 9996968
39573 9996968 4985180 702752 -2747289 -5343439 -6682333 -6298553 -4324005 -1637334
39565 -1637334 620101 1652433 1343928 180930 -1249816 -2798682 -4634313 -6479668
39557 -6479668 -7299734 -6179326 -3445362 -555033 1143813 1310781 488326 -341073 -10241
$$ packed form
39617I430153O89368l10214m35223r1937L05418N92494O16741J10065r12471j731661
39607H262733j307588O19252K921645L895699K737178L5359l069318n692827p057768
39598A344365o315453l340515M98946L202153L978982L720836L526083L409786
39590A0025183K818435J787505R00994L84668l8497l87021j71257Q23416J943743
39581A8087169K266145J616125O26543j89210j045275k374635l970594n019300
39573I996968n011788m282428l450041k596150j338894L83780J974548K686671
39565a637334K257435J032332l08505j162998j430746j548866j835631j845355
39557f479668q20066J120408K733964K890329J698846J66968q22455q29399L30832
$$ plain form
39548 -10241 2367361 6703466 11913001 16864724 21160812 24814425 27589526 29162859
39540 29162859 29745853 30007358 30386478 30930146 31805282 33398278 35648351 37716313 38693474
39531 38693474 38381159 37026002 34572334 30732089 25740181 20420031 15237082 9752102
39523 9752102 3491406 -2810747 -7309528 -8482281 -6267630 -1873407 3143192 7519692
39515 7519692 10512352 12008271 12460530 12485969 12462546 12541283 12829618 13224124 13062737 11327558
39505 11327558 7517201 2301939 -2857353 -6814411 -9466262 -11447267 -13223247 -14576631
39497 -14576631 -14962870 -14223622 -12777940 -11111717 -9272175 -6997102 -4221498 -1265064
39489 -1265064 1456962 3726420 5478831 6615405 6991344 6598700 5734752 4984389 4979639
$$ packed form
39548a0241K377602M336105N209535M951723M296088L653613K775101J573333
39540B9162859N82994K61505L79120N43668Q75136J592996K250073K067962R77161
39531C8693474l12315j355157k453668l840245m991908n320150n182949n484980
39523I752102o260696o302153m498781j172753K214651M394223N016599M376500
39515G519692K992660J495919M52259K5439k3423P8737K88335L94506j61387j735179
39505A1327558l810357n215262n159292l957058k651851j981005j775980j353384
39497a4576631l86239P39248J445682J666223J839542K275073K775604K956434
39489a265064K722026K269458J752411J136574L75939l92644q63948p50363m750
$$ plain form
39480 4979639 6029889 7825198 9436120 9726501 8054088 4796831 1154907 -1723039
39472 -1723039 -3398405 -3873474 -2997432 -712633 2077701 3616634 2868908 769355 -552807
39463 -552807 355302 3524513 8292472 13904424 19239758 22756129 23410201 21533864 18428057
39454 18428057 15065425 11313083 6374920 -38242 -6835135 -11820416 -13118429 -10554536
39446 -10554536 -5648869 -360791 3957441 6622028 7408844 6716542 5538067 4692027
39438 4692027 4051423 2773050 236670 -3401883 -7438333 -11206409 -14622702 -18368511
39430 -18368511 -23276776 -29147413 -34286467 -36642330 -35472287 -31714559 -26919497 -22257361
39422 -22257361 -18462959 -16019596 -14928961 -14552466 -14054247 -12965539 -11215447 -8878870
$$ packed form
39480D979639J050250J795309J610922K90381j672413l257257l641924k877946
39472a723039j675366m75069Q76042K284799K790334J538933p47726k099553j322162
39463e52807R08109L169211M767959N611952N335334L516371O54072j876337l105807
39454A8428057l362632l752342m938163o413162o796893m985281j298013K563893
39446a0554536M905667N288078M318232K664587P86816o92302j178475q46040
39438D692027o40604j278373k536380l638553m036450l768076l416293l745809
39430a8368511m908265n870637n139054k355863J170043L757728M795062M662136
39422b2257361L794402K443363J090635L76495M98219J088708J750092K336577
$$ plain form
39414 -8878870 -6211434 -3784286 -2163153 -1324573 -594198 720401 2722808 4918697
39406 4918697 6562118 6930962 5619390 3009122 442037 -523199 655205 3104477
39398 3104477 5507866 7309549 8808879 10388472 12173602 14442463 17768842 22334270
39390 22334270 27311561 31325731 33571045 34323508 34377657 34093695 32951658 29945956 24492548
39381 24492548 17092462 9152766 2197326 -2707616 -4993963 -4568875 -1938437 2030140
39373 2030140 6792367 12303817 18184320 23039400 25233810 24351013 21418735 17679782
39365 17679782 13671161 9623281 6085845 3594544 1989311 598990 -921439 -2302450
39357 -2302450 -3184088 -3543108 -3489774 -2966789 -1906287 -544905 687347 1652221 2789143
$$ packed form
39414h878870K667436K427148J621133Q38580P30375J314599K002407K195889
39406D918697J643421L68844j311572k610268k567085r65236J178404K449272
39398C104477K403389J801683J499330J579593J785130K268861L326379M565428
39390B2334270M977291M014170K245314P52463N4149k83962j142037l005702n453408
39381B4492548p400086p939696o955440m904942k286347M25088K630438L968577
39373B030140M762227N511450N880503M855080K194410q82797k932278l738953
39365A7679782m008621m047880l537436k491301j605233j390321j520429j381011
39357b302450q81638l59020N3334N22985J060502J361382J232252R64874J136922
$$ plain form
39348 2789143 4894702 8626157 14079424 20592960 26866759 31506689 33815679 34215445
39340 34215445 33815088 33470184 33239067 32663563 31393447 29484203 27252401 24962090 22536112
39331 22536112 19442591 14987014 8956467 2038128 -4508741 -9690412 -13372415 -16188522
39323 -16188522 -18950452 -22039258 -25194168 -27811519 -29413161 -29799489 -28903145 -26814161
39315 -26814161 -24014710 -21219980 -18695871 -15977778 -12637766 -9186173 -6758162 -5859489
39307 -5859489 -5800162 -5509886 -4640051 -3715288 -3423212 -3908265 -4577787 -4444006 -2827220
39298 -2827220 46226 3147265 5452786 6692823 7367807 8173539 9426699 10889204
39290 10889204 12052482 12655960 12955788 13428493 14276094 15381827 16682794 18295167 20205744
$$ packed form
39348B789143K105559L731455N453267O513536O273799M639930K308990L99766
39340C4215445m00357l44904k31117n75504j270116j909244k231802k290311k425978
39331B2536112l093521m455577o030547o918339o546869n181671l682003k816107
39323a6188522k761930l088806l154910k617351j601642l86328Q96344K088984
39315b6814161K799451K794730K524109K718093L340012L451593K428011Q98673
39307e859489N9327K90276Q69835R24763K92076m85053o69522J33781J616786
39298b827220K873446L101039K305521J240037O74984Q05732J253160J462505
39290A0889204J163278O03478K99828M72705Q47601J105733J300967J612373J910577
$$ plain form
39281 20205744 22128846 23864031 25634226 27881297 30767754 33895513 36353009 37060841
39273 37060841 35478979 32301342 29287584 28086875 29209884 32217014 36614996 42155035
39265 42155035 48303472 53851396 57253142 57243375 53221476 45514323 35625784 26043150
39257 26043150 19261936 16529547 17271886 19644594 21766711 22776256 23066253 23648714
39249 23648714 25199451 27552475 29998510 31998402 33548946 34838469 35622654 35100206
39241 35100206 32549556 28125780 22973528 18488633 15428767 13713027 13035541 13559702
39233 13559702 15817552 19780885 24144723 26871185 26676415 23946160 20186821 16837293
39225 16837293 14745908 14351167 15704872 18237359 20995749 23377900 25398987 27159860
$$ packed form
39281B0205744J923102J735185J770195K247071K886457L127759K457496P07832
39273C7060841j581862l177637l013758j200709J123009L007130M397982N540039
39265D2155035O148437N547924L401746r767m021899p707153r888539r582634
39257B6043150o781214k732389P42339K372708K122117J009545K89997N82461
39249B3648714J550737K353024K446035J999892J550544J289523P84185n22448
39241C5100206k550650m423776n152252m484895l059866j715740o77486N24161
39233A3559702K257850L963333M363838K726462j94770k730255l759339l349528
39225A6837293k091385l94741J353705K532487K758390K382151K021087J760873
$$ plain form
39217 27159860 28473920 29291652 30107075 31457009 33138022 34329686 34459670 33584104 31912618
39208 31912618 29360645 25752135 21248276 16463201 12362341 10127536 10783768 14557436
39200 14557436 20533765 27067759 32555386 35841083 36195215 33372330 27885281 20979642
39192 20979642 13992114 7631222 1959098 -2983694 -6772338 -8907150 -9324120 -8395187
39184 -8395187 -6532135 -4030929 -1273365 1198616 2930513 3742054 3605654 2484015
39176 2484015 385309 -2479369 -5596120 -8146873 -9290906 -8820331 -7583205 -6870048
39168 -6870048 -7147365 -7609524 -7106903 -5203015 -2146731 1722765 6045817 10198990 13600860
39159 13600860 16255841 18515525 20292898 21024120 20528379 19422965 18467600 17929502 17913448
$$ packed form
39217B7159860J314060Q17732Q15423J349934J681013J191664J29984q75566j671486
39208C1912618k551973l608510m503859m785075m100860k234805O56232L773668
39200A4557436N976329O533994N487627L285697L54132k822885n487049o905639
39192B0979642o987528o360892n672124m942792l788644k134812m16970R28933
39184h395187J863052K501206K757564K471981J731897Q11541j36400j121639
39176B484015k098706k864678l116751k550753j144033M70575J237126P13157
39168f870048k77317m62159N02621J903888L056284L869496M323052M153173L401870
39159A3600860K654981K259684J777373P31222m95741j105414r55365n38098j6054
$$ plain form
39150 17913448 18964670 21896553 27103272 34270546 42562240 50772451 57481413 61586597
39142 61586597 62901026 62083192 59905563 56661016 52182145 46189540 38615426 29878670
39134 29878670 21015418 13377906 7973849 5024795 4095874 4442059 5110857 4988281 3281404
39125 3281404 260398 -2651612 -3911494 -3161508 -1425730 55301 1072556 2454169
39117 2454169 4983700 8519413 12119163 14756825 15829255 15233630 13281461 10591713
39109 10591713 7874688 5623456 3931860 2592598 1360293 119135 -1152061 -2451169
39101 -2451169 -3690293 -4664262 -5334761 -6200108 -8045500 -10953083 -13626998 -14107697 -11403446
39092 -11403446 -6390736 -1137261 2530088 3966454 3802288 3473212 4385470 6989291
$$ packed form
39150A7913448J051222K931883N206719P167274Q291694Q210211O708962M105184
39142F1586597J314429q17834k177629l244547m478871n992605p574114q736756
39134B9878670q863252p637512n404057k949054r28921L46185O68798j22576j706877
39125C281404l021006k912010j259882P49986J735778J481031J017255J381613
39117B454169K529531L535713L599750K637662J072430n95625j952169k689748
39109A0591713k717025k251232j691596j339262j232305j241158j271196j299108
39101b451169j239124r73969o70499q65347j845392k907583k673915m80699K704251
39092a1403446N012710N253475L667349J436366j64166l29076R12258K603821
$$ plain form
39084 6989291 10417216 13117018 13979282 13005493 11136602 9595876 9232439 10172640 11936033
39075 11936033 13863402 15387819 15949765 14983799 12333871 8640919 5030827 2340626
39067 2340626 788795 333684 1013147 2786241 5305442 8112502 10975720 13839349
39059 13839349 16496760 18505894 19423261 18964670 16959841 13424403 8895862 4605041
39051 4605041 1992845 1758443 3254111 4839351 4937166 2924192 -746973 -5044319 -8955604
39042 -8955604 -11899634 -13900483 -15413746 -16761140 -17579522 -16893820 -13836733 -8312734
39034 -8312734 -1049111 6756479 13747461 18712967 21081050 21261820 20298654 19051113
39026 19051113 17812377 16702695 16104092 16405045 17389668 18154382 17764290 16030223 13791003
$$ packed form
39084F989291L427925K699802Q62264r73789j868891j540726l63437R40201J763393
39075A1936033J927369J524417N61946r65966k649928l692952l610092k690201
39067B340626j551831m55111O79463J773094K519201K807060K863218K863629
39059A3839349K657411K009134R17367m58591k004829l535438m528541m290821
39051D605041k612196k34402J495668J585240R7815k012974l671165m297346l911285
39042h955604k944030k000849j513263j347394q18382O85702L057087N523999
39034h312734P263623P805590O990982M965506K368083J80770r63166j247541
39026A9051113j238736j109682n98603L00953R84623P64714l90092j734067k239220
$$ plain form
39017 13791003 12558365 13673450 17368087 22433837 26962056 29631611 30389432 30025605
39009 30025605 29272479 28258745 26519046 23387776 18628305 12931997 7727477 4330941
39001 4330941 3263070 4253971 6477704 8602164 9164480 7584400 4730303 1944991
38993 1944991 -441336 -3023872 -5724637 -7095729 -5710292 -1749856 3302380 8115797
38985 8115797 12039535 14575456 15314256 14586899 13458763 12658552 11866482 10302498 7607816
38976 7607816 3826671 -1049963 -6923824 -13051110 -18172436 -21338785 -22382871 -21545355
38968 -21545355 -18957636 -14723631 -9397302 -4155852 -380809 1055483 319461 -1376814
38960 -1376814 -2361204 -1402016 1620548 5726813 9495766 11827331 12289819 11081154 8964710
$$ packed form
39017A3791003j232638J115085L694637N065750M528219K669555P57821l63827
39009C0025605p53126j013734j739699l131270m759471n696308n204520l396536
39001D330941j067871R90901K223733K124460N62316j580080k854097k785312
38993A944991k386327k582536k700765j371092J385437L960436N052236M813417
38985H115797L923738K535921P38800p27357j128136q00211p92070j563984k694682
38976G607816l781145m876634n873861o127286n121326l166349j044086Q37516
38968b1545355K587719M234005N326329N241450L775043J436292p36022j696275
38960a376814r84390R59188L022564M106265L768953K331565M62488j208665k116444
$$ plain form
38951 8964710 7156121 6754444 7897875 9688032 11340507 13250510 16367393 20486012
38943 20486012 23846241 24882056 23979364 22968481 23032608 23582822 23122893 20768521 16901351
38934 16901351 12762093 9500846 7234695 4854825 1061824 -4204167 -9548957 -13405885
38926 -13405885 -15225934 -15293363 -13868815 -11036333 -7244153 -3487206 -818382 150776
38918 150776 -615778 -2563708 -4660215 -6001865 -6668317 -7836798 -10768025 -15626155 -21334806
38909 -21334806 -26480824 -30253871 -32664405 -34155813 -35115849 -35592008 -35276363 -33766940
38901 -33766940 -31018505 -27672287 -24871964 -23523056 -23552031 -23907468 -23409795 -21658561 -19113727
38892 -19113727 -16393028 -13695192 -11007031 -8715530 -7724767 -8788418 -11735514 -15438575
$$ packed form
38951H964710j808589m01677J143431J790157J652475J910003L116883M118619
38943B0486012L360229J035815r02692j010883O4127N50214m59929k354372l867170
38934A6901351m139258l261247k266151k379870l793001n265991n344790l856928
38926a3405885j820049o7429J424548K832482L792180L756947K668824R69158
38918A50776p66554j947930k096507j341650o66452j168481k931227m858130n708651
38909b1334806n146018l773047k410534j491408r60036m76159L15645J509423
38901c3766940K748435L346218K800323J348908k8975l55437M97673J751234K544834
38892a9113727K720699K697836K688161K291501R90763j063651k947096l703061
$$ plain form
38884 -15438575 -18586773 -20513614 -21365742 -21622223 -21509687 -20765735 -18848293 -15462388 -11064997
38875 -11064997 -6801730 -3639563 -1389933 1212081 5177603 10009726 13957737 15570634
38867 15570634 14908727 13251404 11835285 11055877 10805324 11214905 12621494 14641751 15658932
38858 15658932 13911095 9413035 4463009 1784800 2196774 4366669 6647456 8592215
38850 8592215 10621797 12893863 15041956 16775918 18222643 19660045 21217176 22805715
38842 22805715 24034379 24194328 22718677 19873137 16793511 14620447 13651607 13431926
38834 13431926 13522366 13965197 15037342 16801730 19063042 21698238 24867781 28805280
38826 28805280 33402778 38046296 41884570 44270120 44984683 44138876 41962814 38739142
$$ packed form
38884a5438575l148198j926841q52128k56481J12536P43952J917442L385905M397391
38875a1064997M263267L162167K249630K602014L965522M832123L948011J612897
38867A5570634o61907j657323j416119p79408k50553M09581J406589K020257J017181
38858A5658932j747837m498060m950026k678209M11974K169895K280787J944759
38850H592215K029582K272066K148093J733962J446725J437402J557131J588539
38842B2805715J228664J59949j475651k845540l079626k173064r68840k19681
38834A3431926R0440M42831J072145J764388K261312K635196L169543L937499
38826B8805280M597498M643518L838274K385550P14563q45807k176062l223672
$$ plain form
38818 38739142 34887306 30972165 27463225 24413359 21454634 18222702 14789840 11659250
38810 11659250 9438523 8614485 9462838 11845063 15088445 18442141 21850200 25989691
38802 25989691 31244553 36786872 40943887 42380772 40739363 36421915 30334890 23916952
38794 23916952 18852733 16276769 16247902 18041310 20735473 23434123 25304862 25862251
38786 25862251 25252105 24048207 22735296 21474290 20276312 19210195 18427979 18089997
38778 18089997 18212039 18442433 18034532 16240538 12818696 8117505 2736016 -2736335
38770 -2736335 -7685597 -11464545 -13612919 -14004688 -12644038 -9399481 -4164886 2624078
38762 2624078 9770116 15819674 19909148 22146891 23205248 23586182 23221323 21615570
$$ packed form
38818C8739142l851836l915141l508940l049866k958725l231932l432862l130590
38810A1659250k220727q24038Q48353K382225L243382L353696L408059M139491
38802B5989691N254862N542319M157015J436885j641409m317448o087025o417938
38794B3916952n064219k575964k8867J793408K694163K698650J870739N57389
38786B5862251o10146j203898j312911j261006j197978j066117p82216l37982
38778A8089997J22042K30394m07901j793994l421842m701191n381489n472351
38770b736335m949262l778948k148374l91769J360650L244557N234595O788964
38762B624078P146038O049558M089474K237743J058357L80934l64859j605753
$$ plain form
38754 21615570 18329669 13521825 8198118 3784735 1167628 148641 30691 610636
38746 610636 2185184 4554413 6588446 7216260 6625885 6152531 7170417 10403895 16010370
38737 16010370 23656525 32352688 40619915 47035755 50499139 50180068 45881427 38752223
38729 38752223 31179129 25432203 22359831 21410208 21534121 21762955 21282181 19598845 16821540
38720 16821540 13560916 10499738 8123756 6633285 5752936 4713623 2875007 517724
38712 517724 -1270391 -1673832 -949669 -61302 268409 -5712 -522906 -890459 -758128
38703 -758128 213350 2152946 4591301 6368220 6253207 3924980 282669 -3373937 -6361357
38694 -6361357 -8608784 -9870691 -9525293 -7375697 -4267872 -1569517 -197709 -367894
$$ packed form
38754B1615570l285901m807844n323707m413383k617107j018987j17950N79945
38746F10636J574548K369229K034033O27814n90375m73354J017886L233478N606475
38737A6010370P646155Q696163Q267227O415840L463384l19071m298641p129204
38729C8752223p573094n746926l072372r49623J23913K28834m80774j683336k777305
38720A6821540l260624l061178k375982j490471q80349j039313j838616k357283
38712E17724j788115m03441P24163Q88367L29711k74121n17194l67553J32331
38703g58128R71478J939596K438355J776919j15013k328227l642311l656606k987420
38694f361357k247427j261907L45398K149596L107825K698355J371808j70185
$$ plain form
38686 -367894 -1997934 -4862052 -8331311 -11397643 -13251149 -13787931 -13453770 -12587599 -10884141
38677 -10884141 -7472211 -1688756 5965776 13622245 19044318 21075860 20213831 17910398
38669 17910398 15507147 13814890 13374385 14721243 18191950 23419311 29028398 32977398
38661 32977398 33529462 30253888 24308030 17803609 12747426 10179559 9831047 10409112
38653 10409112 10462043 9366943 7671359 6478421 6507237 7721455 9637520 11697950 13375024
38644 13375024 14311537 14645563 15000977 15799691 16606003 16471116 14955257 12445137 9350192
38635 9350192 5493633 795054 -3702336 -6179985 -5664324 -3030072 -310602 718921
38627 718921 -672581 -4159817 -8645748 -12778625 -15639831 -17020065 -17010091 -15600024 -12885683
$$ packed form
38686c67894j630040k864118l469259l066332j853506n36782L34161Q66171J703458
38677a0884141L411930N783455P654532P656469N422073K031542q62029k303433
38669A7910398k403251j692257m40505J346858L470707N227361N609087L949000
38661C2977398N52064l275574n945858o504421n056183k567867l48512N78065
38653A0409112N2931j095100j695584j192938K8816J214218J916065K060430J677074
38644A3375024R36513L34026L55414P98714Q06312j34887j515859k510120l094945
38635I350192l856559m698579m497390k477649N15661K634252K719470J029523
38627G18921j391502l487236m485931m132877k861206j380234R974J410067K714341
$$ plain form
38618 -12885683 -9344849 -5495911 -1438001 2863988 6938320 9902823 11232485 11054918
38610 11054918 9642191 7008093 3148136 -1648284 -6893442 -12053974 -16482712 -19492505
38602 -19492505 -20726042 -20306309 -18514817 -15530956 -11602051 -7205769 -2828892 1247663
38594 1247663 4796330 7525134 9389648 10875592 12635660 14767626 16566990 17040809
38586 17040809 15732139 13245793 11073476 10727545 12814945 16855814 21851764 26810588
38578 26810588 30823289 33121383 33357854 31665351 28344262 23793914 18861187 14755323
38570 14755323 12162229 10702894 9718680 9406973 10660112 13766759 17673223 20636635
38562 20636635 21449196 20160178 17918865 16017311 14705675 12941245 9619780 5046574
$$ packed form
38618a2885683L540834L848938M057910M301989M074332K964503J329662j77567
38610A1054918j412727k634098l859957m796420n245158n160532m428738l009793
38602a9492505j233537M19733J791492K983861L928905M396282M376877M076555
38594A247663L548667K728804J864514J485944J760068K131966J799364M73819
38586A7040809j308670k486346k172317l45931K087400M040869M995950M958824
38578B6810588M012701K298094K36471j692503l321089m550348m932727m105864
38570A4755323k593094j459335r84214l11707J253139L106647L906464K963412
38562B0636635Q12561j289018k241313j901554j311636j764430l321465m573206
$$ plain form
38554 5046574 886923 -1304774 -1186058 623605 3337325 6365619 9318015 12009241
38546 12009241 14412776 16517737 18272505 19549142 19981701 19066100 16838749 14321543
38538 14321543 12716864 12062934 11161154 8951654 5515934 1662869 -1867489 -4576573
38530 -4576573 -6258019 -7337953 -8656991 -10365806 -11369400 -10373956 -7262869 -3113875
38522 -3113875 678375 2754884 1815043 -2661618 -9591770 -16868133 -22962017 -27562506
38514 -27562506 -30758799 -32375559 -32387590 -31355767 -29958102 -28366274 -26398968 -24025606
38506 -24025606 -21415695 -18718331 -16138324 -14150873 -13368353 -14113452 -16080320 -18262771
38498 -18262771 -19276161 -18167168 -15217107 -11837557 -9492585 -8744184 -9247410 -10244309
$$ packed form
38554E046574m159651k191697J18716J809663K713720L028294K952396K691226
38546A2009241K403535K104961J754768J276637M32559r15601k227351k517206
38538A4321543j604679o53930r01780k209500l435720l853065l530358k709084
38530d576573j681446j079934j319038j708815j003594R95444L111087M148994
38522c113875L792250K076509r39841m476661o930152p276363o093884m600489
38514b7562506l196293j616760j2031J031823J397665J591828J967306K373362
38506b4025606K609911K697364K580007J987451P82520p45099j966868k182451
38498a8262771j013390J108993K950061L379550K344972P48401n03226r96899
$$ plain form
38490 -10244309 -10802927 -9902347 -6772750 -1252011 6257620 14979860 23705745 30838049
38482 30838049 35031424 35925591 34021329 29852906 23628282 15763685 7341265 -371781
38474 -371781 -6780725 -12051878 -16341992 -19203098 -19902384 -18230618 -14867391 -10973885
38466 -10973885 -7488207 -4722149 -2403307 70446 3377634 8039625 14157717 21183075
38458 21183075 27929421 33010199 35555418 35686912 34326471 32526423 30906953 29450326
38450 29450326 27470170 23803853 17586580 9331905 1123045 -4743182 -7496473 -8194597
38442 -8194597 -8409595 -8931430 -9733287 -10682012 -11840328 -13153198 -14148526 -14058676 -12215704
38433 -12215704 -8415795 -3043476 3105392 9134532 14252804 17885839 19833573 20342672
$$ packed form
38490a0244309n58618R00580L129597N520739P509631Q722240Q725885P132304
38482C0838049M193375Q94167j904262m168423o224624p864597q422420p713046
38474c71781o408944n271153m290114k861106o99286J671766L363227L893506
38466a0973885L485678K766058K318842K473753L307188M661991O118092P025358
38458B1183075O746346N080778K545219J31494j360441j800048j619470j456627
38450B9450326j980156l666317o217273q254675q208860n866227k753291o98124
38442h194597k14998n21835q01857r48725j158316j312870r95328Q9850J842972
38433a2215704L799909N372319O148868O029140N118272L633035J947734N09099
$$ plain form
38425 20342672 19898334 19011205 18384286 19071828 21876296 26323545 30591286 32788862 32180473
38416 32180473 29102622 24213868 18310688 12498330 7741691 4111850 993751 -1785013
38408 -1785013 -3478390 -3342488 -1703391 240857 1569294 2372010 3434570 5367423
38400 5367423 7968192 10266221 11169204 10105283 7071401 2292980 -3774806 -10072796
38392 -10072796 -15052900 -17607851 -17822855 -16602137 -14714103 -12455632 -10018924 -7648512
38384 -7648512 -5319156 -2664831 497267 3756120 6433357 8220060 9376962 10497583
38376 10497583 12279680 15309410 19603796 24226699 27656682 28810011 27673115 24892835
38368 24892835 21014074 16437000 12010022 9169405 9153205 12124469 17141312 22783830
$$ packed form
38425B0342672m44338q87129o26919O87542K804468M447249M267741K197576o08389
38416C2180473l077851m888754n903180n812358m756639l629841l118099k778764
38408a785013j693377J35902J639097J944248J328437Q02716J062560J932853
38400E367423K600769K298029R02983j063921l033882m778421o067786o297990
38392a0072796m980104k554951k15004J220718J888034K258471K436708K370412
38384g648512K329356K654325L162098L258853K677237J786703J156902J120621
38376A0497583J782097L029730M294386M622903L429983J153329j136896k780280
38368B4892835l878761m577074m426978k840617j6200K971264N016843N642518
$$ plain form
38360 22783830 27621953 30336560 29964280 26370725 20422350 13554904 7141440 2128762
38352 2128762 -1108927 -2895056 -4195794 -6182680 -9666781 -14850261 -21431897 -28745882
38344 -28745882 -35795938 -41358201 -44285282 -43930510 -40534638 -35379131 -30447174 -27540872
38336 -27540872 -27328905 -29061655 -31225372 -32610008 -32944575 -32684226 -32268679 -31565712 -29948587
38327 -29948587 -26807410 -21945282 -15615092 -8427736 -1332069 4515508 8188403 9496283
38319 9496283 9123144 8286059 8149470 9255728 11221813 12990685 13604144 12869254 11284866
38310 11284866 9426202 7576739 5896643 4610033 3799965 3154809 2163894 603995
38302 603995 -1254527 -2887551 -3834872 -3813828 -2779983 -1140555 78666 -452718 -3540070
$$ packed form
38360B2783830M838123K714607l72280l593555n948375o867446o413464n012678
38352B128762l237689j786129j300738j986886l484101n183480o581636p313985
38344b8745882p050056n562263k927081L54772L395872N155507M931957K906302
38336b7540872K11967j732750k163717j384636l34567K60349M15547P02967J617125
38327b9948587L141177M862128O330190P187356P095667N847577L672895J307880
38319I496283l73139q37085j36589J106258J966085J768872O13459p34890j584388
38310A1284866j858664j849463j680096j286610q10068o45156r90915j559899
38302F03995j858522j633024r47321K1044J033845J639428J219221n31384l087352
$$ plain form
38293 -3540070 -8745172 -14478347 -18860941 -20625746 -19511383 -16237109 -12224133 -8928844
38285 -8928844 -6964557 -5848915 -4792094 -3555032 -2218035 -398819 2514929 6145539
38277 6145539 8852100 9279932 7849497 6109450 4794047 3176509 369695 -3409200
38269 -3409200 -7199356 -10454036 -13334749 -15968828 -17829074 -17992983 -15913867 -11910881
38261 -11910881 -6983814 -2186356 1861806 4975342 7150268 8476864 9197033 9600388
38253 9600388 9813990 9819461 9625620 9187263 8139828 5914183 2301029 -2212002 -6709560
38244 -6709560 -10255619 -12023434 -11470200 -8815443 -5253375 -2326151 -958874 -1116627
38236 -1116627 -2140271 -3046798 -2611396 214783 5447057 11611894 16388108 17886362
$$ packed form
38293c540070n205102n733175m382594j764805J114363L274274M012976L295289
38285h928844J964287J115642J056821J237062J336997J819216K913748L630610
38277F145539K706561M27832j430435j740047j315403j617538k806814l778895
38269c409200l790156l254680k880713k634079j860246j63909K079116M002986
38261a1910881M927067M797458M048162L113536K174926J326596P20169M03355
38253I600388K13602N471j93841m38357j047435k225645l613154m513031m497558
38244f709560l546059j767815N53234K654757L562068K927224J367277j57753
38236a116627j023644r06527M35402K826179N232274O164837M776214J498254
$$ plain form
38228 17886362 15512424 9981717 2884371 -3801092 -8358873 -10247759 -10667723 -11903361
38220 -11903361 -15595819 -21463194 -27769153 -32922195 -36360677 -38043595 -37764652 -35407540
38212 -35407540 -31504431 -26906360 -21862596 -15888019 -8725773 -1142982 5465486 10147538
38204 10147538 12944719 14516892 15420275 15792679 15664603 15409242 15608663 16304927 16593150
38195 16593150 15348344 12437144 8972793 6302884 4952788 4566241 4490307 4157525 3161061
38186 3161061 1369002 -956750 -3250202 -4795629 -4804832 -2714523 1205704 5665789 9204528
38177 9204528 11343559 12705476 14050234 15568941 17181866 19012193 21110528 22898369
38169 22898369 23364773 21928073 18895623 15081359 11259104 8046718 5927009 5000816
$$ packed form
38228A7886362k373938n530707p097346o685463m557781j888886m19964j235638
38220a1903361l692458n867375o305959n153042l438482j682918K78943K357112
38212c5407540L903109M598071N043764N974577P162246P582791O608468M682052
38204A0147538K797181J572173R03383L72404j28076k55361J99421O96264K88223
38195A6593150j244806k911200l464351k669909j350096l86547p5934l32782r96464
38186C161061j792059k325752k293452j545427r203K090309L920227M460085L538739
38177I204528K139031J361917J344758J518707J612925J830327K098335J787841
38169B2898369M66404j436700l032450l814264l822255l212386k119709r26193
$$ plain form
38161 5000816 4824051 4855552 5158892 6425297 9152008 12912890 16540023 18935461 19710848
38152 19710848 19363846 19136669 20472164 23980707 28608931 32088959 32624783 30266079
38144 30266079 26623201 23410773 21429680 20700100 20998583 21950036 22814172 22560838 20305323
38135 20305323 15699904 9070992 1395053 -5881478 -11278676 -13816624 -13268235 -10041165
38127 -10041165 -4995609 649634 5623849 9306413 12282215 15954700 21279802 27751597
38119 27751597 33680024 37545488 39171871 39691185 40427604 41760388 42970182 43136874
38111 43136874 42152259 40807701 39922452 39547300 39128628 38300458 37236143 36163108 34773801
38102 34773801 32369841 28615784 24035448 19697750 16432227 14376221 13244654 12892140
$$ packed form
38161E000816j76765L1501L03340J266405K726711L760882L627133K395438P75387
38152A9710848l47002k27177J335495L508543M628224L480028N35824k358704
38144C0266079l642878l212428j981093p29580K98483R51453Q64136k53334k255515
38135B0305323m605419o628912p675939p276531n397198k537948N48389L227070
38127a0041165N045556N645243M974215L682564K975802L672485N325102O471795
38119B7751597N928427L865464J626383N19314P36419J332784J209794J66692
38111D3136874r84615j344558q85249l75152m18672q28170j064315j073035j389307
38102C4773801k403960l754057m580336m337698l265523k056006j131567l52514
$$ plain form
38094 12892140 13421203 14706442 16036607 16485913 15645260 13836443 11659114 9607921
38086 9607921 8221904 8273956 10392383 14397630 19173409 23323603 26023931 27354296
38078 27354296 27924968 28177114 27973666 26837621 24549907 21453160 18261285 15828425
38070 15828425 15138728 17073950 21671522 27607337 32820426 35898942 36837362 36568188
38062 36568188 36096221 36140312 37179059 39431627 42831668 47218641 52513740 58613653
38054 58613653 65295283 72471555 80443310 89601861 99853769 110586189 121321574 132309810
38046 132309810 144456741 158808599 176132426 196818327 221022912 248846219 280253245
38039 280253245 314653411 350548765 385709101 417632954 443674816 460965196 466972350
$$ packed form
38094A2892140N29063J285239J330165M49306q40653j808817k177329k051193
38086I607921j386017N2052K118427M005247M775779M150194K700328J330365
38078B7354296N70672K52146k03448j136045k287714l096747l191875k432860
38070A5828425o89697J935222M597572N935815N213089L078516R38420k69174
38062C6568188m71967M4091J038747K252568L400041M386973N295099O099913
38054E8613653O681630P176272P971755R158551J0251908J0732420J0735385J0988236
38046A32309810J2146931J4351858J7323827K0685901K4204585K7823307L1407026
38039B80253245L4400166L5895354L5160336L1923853K6041862J7290380O007154
$$ plain form
38032 466972350 460793929 443927841 419533934 390953815 360989241 332104567 306408392
38025 306408392 284910988 266980585 250903008 235136313 219191514 203678727 189746638
38018 189746638 178230391 168901434 160461424 151527846 141770921 132012984 123294720 116181850
38010 116181850 111094238 108821471 110037174 114166955 119172680 122803862 123966617 122766976
38002 122766976 119585280 114596559 108098491 100710622 92979290 85142582 77580297 71173077
37994 71173077 66729069 64074903 62042911 59376391 55445453 50245304 44202257 38123436
37986 38123436 32907318 28934346 25829785 22964528 20029587 17012415 13894953 10686183
37978 10686183 7639998 5165988 3562323 3020918 3757336 5781513 8493096 10812224
$$ packed form
38032D66972350o178421j6866088k4393907k8580119k9964574k8884674k5696175
38025C06408392k1497404j7930403j6077577j5766695j5944799j5512787j3932089
38018A89746638j1516247r328957q440010q933578r756925r757937q718264p112870
38010A16181850n087612k272767J215703M129781N005725L631182J162755j199641
38002A22766976l181696m988721o498068p387869p731332p836708p562285o407220
37994G1173077m444008k654166k031992k666520l930938n200149o043047o078821
37986C8123436n216118l972972l104561k865257k934941l017172l117462l208770
37978A0686183l046185k474010j603665n41405P36418K024177K711583K319128
$$ plain form
37970 10812224 11911643 11742351 10813697 9663455 8675225 8187418 8391212 8987246 9185728
37961 9185728 8392424 7010736 6404446 7881429 11682846 16935503 22375009 26981268
37953 26981268 30258678 32476968 34715483 38159122 43016553 48350610 53125983 57068681
37945 57068681 60265138 62415449 63081333 62483082 61473540 60743906 60500437 60823814 61759848
37936 61759848 63013067 64149576 65255228 66794810 68570146 69476737 68822897 67423787
37928 67423787 66721694 67021683 67203475 66094459 63521416 59939563 55627495 50603865
37920 50603865 45041904 39424278 34374372 30539572 28571416 28964938 31700085 35905276
37912 35905276 39878193 41700839 40251584 35900064 30269588 25256929 22114481 21175184
$$ packed form
37970A0812224J099419j69292r28654j150242r88230m87807K03794N96034J98482
37961I185728p93304j381688o06290J476983L801417N252657N439506M606259
37953B6981268L277410K218290K238515L443639M857431N334057M775373L942698
37945E7068681L196457K150311O65884n98251j009542p29634k43469L23377R36034
37936F1759848J253219J136509J105652J539582J775336R06591o53840j399110
37928F7423787p02093K99989J81792j109016k573043l581853m312068n023630
37920E0603865n561961n617626n049906l834800j968156L93522K735147M205191
37912C5905276L972917J822646j449255m351520n630476n012659l142448r39297
$$ plain form
37904 21175184 22161942 24641290 28190527 32196427 35749976 38167058 39771771 41788122
37896 41788122 45035040 48869622 51844157 53333667 53964207 54276162 53532956 50373474
37888 50373474 44438751 36866444 29224482 22453925 16985795 13324842 11885762 12265725
37880 12265725 13191290 13506901 13090161 12649288 12820851 13697812 15025893 16417636 17381692
37871 17381692 17646758 17698782 18592320 20801019 23418962 24876291 24365131 22244967 19202324
37862 19202324 15555764 11505371 7554110 4270532 1801976 -59382 -1352913 -1672310
37854 -1672310 -393025 2897689 8043082 14144702 19738447 23367690 24220755 22381644
37846 22381644 18591213 13763339 8548522 3179172 -2272378 -7416211 -11366116 -13182727
$$ packed form
37904B1175184R86758K479348L549237M005900L553549K417082J604713K016351
37896D1788122L246918L834582K974535J489510O30540L11955p43206l159482
37888E0373474n934723p572307p641962o770557n468130l660953j439080L79963
37880A2265725R25565L15611m16740m40873J71563Q76961J328081J391743R64056
37871A7381692K65066N2024Q93538K208699K617943J457329n11160k120164l042643
37862A9202324l646560m050393l951261l283578k468556j861358j293531l19397
37854a672310J279285L290714N145393O101620N593745L629243Q53065j839111
37846B2381644l790431m827874n214817n369350n451550n143833l949905j816611
$$ plain form
37838 -13182727 -12606852 -10379461 -7795966 -5831409 -4545187 -3238833 -1181909 1805928
37830 1805928 5451105 9558143 14257762 19680636 25516601 31007125 35352948 38141457
37822 38141457 39556807 40360218 41605586 44081635 47748708 51615987 54232874 54460149
37814 54460149 51958486 47109600 40602232 33161216 25600409 18877141 13784767 10476580
37806 10476580 8443284 7176306 6900387 8515641 12665596 18821388 25326327 30381279
37798 30381279 33028518 33314124 31755896 28870418 25189830 21499418 18810182 17924291
37790 17924291 18885513 20827407 22563300 23572098 24364325 25653501 27219604 27945129
37782 27945129 27083216 25165753 23468477 22872706 23479113 24982500 26974070 29030028
$$ packed form
37838a3182727N75875K227391K583495J964557J286222J306354K056924K987837
37830A805928L645177M107038M699619N422874N835965N490524M345823K788509
37822C8141457J415350Q03411J245368K476049L667073L867279K616887K27275
37814E4460149k501663m848886o507368p441016p560807o723268n092374l308187
37806A0476580k033296j266978k75919J615254M149955O155792O504939N054952
37798C0381279K647239K85606j558228k885478l680588l690412k689236q85891
37790A7924291R61222J941894J735893J008798P92227J289176J566103P25525
37782B7945129q61913j917463j697276n95771O06407J503387J991570K055958
$$ plain form
37774 29030028 30946904 32863417 34825704 36351392 36853010 36428106 35737362 35080597 34115603
37765 34115603 32583494 30734123 28809100 26707024 24586748 23291390 23557382 25043801
37757 25043801 26682418 27816688 28475220 28679038 28129762 26663828 24472615 21697757
37749 21697757 18267227 14393086 10892547 8699581 8174932 8988940 10430278 11693005
37741 11693005 12191873 11955719 11650090 12019362 13379817 15763142 19309658 24143798 29808499
37732 29808499 35032881 38191885 38070366 34409901 27974086 20077768 11844378 3805473
37724 3805473 -3801835 -10505285 -15585249 -18595135 -19731404 -19670140 -19172367 -18800921 -18719143
37715 -18719143 -18571970 -17700478 -15683729 -12698062 -9328788 -6131346 -3400227 -1139803
$$ packed form
37774B9030028J916876J916513J962287J525688N01618m24904o90744o56765r64994
37765C4115603j532109j849371j925023k102076k120276j295358K65992J486419
37757B5043801J638617J134270O58532K03818n49276j465934k191213k774858
37749B1697757l430530l874141l500539k192966n24649Q14008J441338J262727
37741A1693005M98868k36154l05629L69272J360455K383325L546516M834140N664701
37732B9808499N224382L159004j21519l660465o435815p896318q233390q038905
37724C805473p607308o703450n079964l009886j136269O1264M97773L71446Q1778
37715a8719143J47173Q71492K016749K985667L369274L197442K731119K260424
$$ plain form
37707 -1139803 932299 3192662 5667727 7891645 9514517 10971112 13086212 15869608
37699 15869608 18129366 18646859 17535983 16103709 15491845 15791550 16404908 16830584 16926868
37690 16926868 16679336 15986145 14712682 12954781 11232156 10195312 9851826 9149051 6692683
37681 6692683 2061078 -3666688 -8598805 -11015737 -9894357 -5199612 1857535 9109022
37673 9109022 14477322 16947068 16655770 14412770 11324060 8480432 6447494 4973267
37665 4973267 3406762 1397882 -906147 -3124747 -4794566 -5393155 -4606874 -2646010
37657 -2646010 -75425 2702263 5672191 9019399 12907185 17296717 21702623 25245441
37649 25245441 27292498 27980504 27742818 26409203 23298561 18308681 12401528 6720951
$$ packed form
37707a139803K072102K260363K475065K223918J622872J456595K115100K783396
37699A5869608K259758N17493j110876j432274o11864K99705O13358M25676R6284
37690A6926868k47532o93191j273463j757901j722625j036844l43486p02775k456368
37681F692683m631605n727766m932117k416932J121380M694745P057147P251487
37673I109022N368300K469746k91298k243000l088710k843628k032938j474227
37665D973267j566505k008880k304029k218600j669819n98589P86281J960864
37657b646010K570585K777688K969928L347208L887786M389532M405906L542818
37649B5245441K047057O88006k37686j333615l110642m989880n907153n680577
$$ plain form
37641 6720951 1592263 -3280697 -7895265 -11601281 -13602367 -13611185 -12114374 -10115624 -8420809
37632 -8420809 -6975212 -5039206 -2153495 1266260 4439062 7044098 9284945 11396003
37624 11396003 13443081 15419623 17107298 17934965 17470764 16146703 15085452 15001306 15507587
37615 15507587 15619549 14638937 12349050 8669301 3591186 -2480979 -8615348 -13810717
37607 -13810717 -17618461 -20308283 -22423132 -24155585 -25148733 -24902677 -23326878 -20824900
37599 -20824900 -17842426 -14403509 -10135138 -4772043 1297630 6964459 11026021 13118172
37591 13118172 14108000 15478352 18225422 22253682 26617136 30119275 31775862 31156053
37583 31156053 28712632 25866787 24555490 26369279 31770128 39830959 48628180 56064454
$$ packed form
37641F720951n128688m872960m614568l706016k001086q818J496811J998750J694815
37632h420809J445597J936006K885711L419755L172802K605036K240847K111058
37624A1396003K047078J976542J687675Q27667m64201j324061j061251q4146N06281
37615A5507587J11962r80612k289887l679749n078115o072165o134369n195369
37607a3810717l807744k689822k114849j732453r93148K46056J575799K501978
37599b0824900K982474L438917M268371N363095O069673N666829M061562K092151
37591A3118172R89828J370352K747070M028260M363454L502139J656587o19809
37583C1156053k443421k845845j311297J813789N400849Q060831Q797221P436274
$$ plain form
37575 56064454 60656131 61893202 60147269 56365443 51715889 47237099 43619495 41243637
37567 41243637 40340829 41019768 43174173 46504963 50673567 55360077 60185336 64704900
37559 64704900 68509307 71217114 72351077 71394359 68118158 62848695 56396277 49748581
37551 49748581 43704464 38505429 33692043 28525716 22761943 16945146 11854306 7832374
37543 7832374 4828612 2873870 2128069 2449800 3223799 3685624 3202691 1298404 -2084264
37534 -2084264 -6010391 -8593992 -8211551 -4837898 21807 4690095 8286818 10355667
37526 10355667 10123021 6742683 314888 -7677631 -15082066 -20118665 -21863385 -20228684
37518 -20228684 -15884118 -10098355 -4304641 356391 3129255 3551582 1638589 -1793136
$$ packed form
37575E6064454M591677J237071j745933l781826m649554m478790l617604k375858
37567D1243637r02808O78939K154405L330790M168604M686510M825259M519564
37559F4704900L804407K707807J133963r56718l276201n269463o452418o647696
37551D9748581o044117n199035m813386n166327n763773n816797n090840m021932
37543G832374l003762j954742p45801L21731P73999M61825m82933j904287l382668
37534b084264l926127k583601L82441L373653M859705M668288L596723K068849
37526A0355667k32646l380338o427795p992519p404435n036599j744720J634701
37518b0228684M344566N785763N793714M661032K772864M22327j912993l431725
$$ plain form
37510 -1793136 -5289371 -7479242 -7630714 -5578055 -1461770 4186942 10286504 15547331
37502 15547331 19182082 21257907 22375111 23082125 23509132 23315948 21894874 18810778
37494 18810778 14275132 9202900 4619427 831232 -2830807 -7285975 -12562202 -17422736
37486 -17422736 -20333673 -20876659 -20068309 -19246221 -18855246 -18430668 -17459488 -15916742 -14111793
37477 -14111793 -12403697 -11036565 -9857550 -8138882 -5092496 -793132 3631011 6871356
37469 6871356 8315858 8075531 6620447 4663073 2989502 1951839 1338658 1130158 2096309
37460 2096309 5040261 9495886 13771799 16434160 17318687 17017699 15979504 14477324
37452 14477324 13006437 12141868 12059765 12474930 12908448 12776809 11497140 9015082 6222402
$$ packed form
37510a793136l496235k189871j51472K052659M116285N648712O099562N260827
37502A5547331L634751K075825J117204P07014M27007j93184j421074l084096
37494A8810778m535646n072232m583473l788195l662039m455168n276227m860534
37486a7422736k910937n42986Q08350Q22088L90975M24578R71180J542746J804949
37477a4111793J708096J367132J179015J718668L046386M299364M424143L240345
37469F871356J444502k40327j455084j957374j673571j037663o13181k08500R66151
37460B096309K943952M455625M275913K662361Q84527l00988j038195j502180
37452A4477324j470887q64569q2103M15165M33518j31639j279669k482058k792680
$$ plain form
37443 6222402 4381088 3898758 3850448 2823078 105361 -3941034 -8362647 -12212434 -14805295
37434 -14805295 -15717534 -14769931 -12096556 -8228904 -4040854 -509274 1569172 1808230
37426 1808230 488190 -1235136 -1596142 822028 6049264 12585674 18358117 21959127
37418 21959127 23254425 23146584 22856874 23194875 24185831 25213287 25508476 24647668 22828555
37409 22828555 20788148 19253808 18204116 16762841 14199843 11136769 9396294 10322036
37401 10322036 13343263 16436314 17937594 17684661 16479551 14877492 12796747 10141496
37393 10141496 7396452 5393088 4600771 4848539 5745947 7167906 9193118 11729869
37385 11729869 14469945 17200543 19871893 22218245 23572514 23417376 22169031 21158383
$$ packed form
37443F222402j841314m82330m8310j027370k717717m046395m421613l849787k592861
37434a4805295r12239R47603K673375L867652M188050L531580K078446K39058
37426A808230j320040j723326l61006K418170N227236O536410N772443L601010
37418B1959127J295298j07841k89710L38001R90956J027456K95189q60808j819113
37409B2828555k040407j534340j049692j441275k562998l063074j740475R25742
37401A0322036L021227L093051J501280k52933j205110j602059k080745k655251
37393A0141496k745044k003364p92317K47768Q97408J421959K025212K536751
37385A1729869K740076K730598K671350K346352J354269j55138j248345j010648
$$ plain form
37377 21158383 21580379 23375354 25181486 25477791 23882629 21405600 19453238 18600242
37369 18600242 18283638 17498905 15582200 12400188 8178483 3433060 -1063743 -4559078
37361 -4559078 -6663181 -7355661 -6673138 -4453749 -305750 6275217 15607453 27365213
37353 27365213 40428868 53522380 66242907 79415289 94375218 112049026 132835220
37346 132835220 157135456 185556878 218381029 254953221 293697513 332502360 368686853
37339 368686853 398534862 417475102 421678746 410156881 385477460 352449466 316087021
37332 316087021 280362836 247778175 219077149 193353215 169228763 146436915 126083329
37325 126083329 109266122 95876351 85059724 76412711 70089182 65797766 62292817
$$ packed form
37377B1158383M21996J794975J806132K96305j595162k477029j952362q52996
37369A8600242l16604p84733j916705l182012m221705m745423m496803l495335
37361d559078k104103o92480O82523K219389M147999O580967R332236J1757760
37353B7365213J3063655J3093512J2720527J3172382J4959929J7673808K0786194
37346A32835220K4300236K8421422L2824151L6572192L8744292L8804847L6184493
37339C68686853K9848009J8940240M203644j1521865k4679421l3027994l6362445
37332C16087021l5724185l2584661k8701026k5723934k4124452k2791848k0353586
37325A26083329j6817207j3389771j0816627q647013o323529m291416l504949
$$ plain form
37318 62292817 58112444 52592307 46096100 39578963 34073116 30238031 27988179 26525270
37310 26525270 24899301 22577112 19505039 15876896 12090229 8819888 6783076 6222062
37302 6222062 6614506 6893604 5967976 3252224 -949273 -5447481 -8795932 -10248192 -10229682
37293 -10229682 -9855119 -10011426 -10924523 -12417202 -14237539 -16013982 -17200693 -17488478 -17305061
37284 -17305061 -17534403 -18435002 -18934286 -17280816 -12510166 -5253679 2769330 9844631
37276 9844631 14924305 17633899 18029550 16429955 13360204 9521176 5652195 2234995
37268 2234995 -720733 -3477736 -6096488 -8276102 -9725970 -10510714 -10834116 -10571431 -9252753
37259 -9252753 -6582740 -2908701 825840 3582655 4857914 5035123 5076026 5620255 6285496
$$ packed form
37318F2292817m180373n520137o496207o517137n505847l835085k249852j462909
37310B6525270j625969k322189l072073l628143l786667l270341k036812n61014
37302F222062L92444K79098r25628k715752m201497m498208l348451j452260J8510
37293a0229682L74563j56307r13097j492679j820337j776443j186711k87785J83417
37284a7305061k29342r00599m99284J653470M770650P256487Q023009P075301
37276I844631N079674K709594L95651j599595l069751l839028l868981l417200
37268B234995k955728k757003k618752k179614j449868p84744l23402K62685J318678
37259i252753K670013L674039L734541K756815J275259J77209M0903N44229O65241
$$ plain form
37250 6285496 5946683 3749082 -174754 -4837142 -8967611 -11460369 -11634353 -9415952
37242 -9415952 -5341409 -333529 4533923 8192497 9863390 9479275 7802168 5961225
37234 5961225 4812622 4687112 5504522 6841798 7888683 7648765 5521408 1820785 -2361753
37225 -2361753 -5991659 -8893291 -11648136 -14587102 -16968603 -17352051 -14792449 -9516474
37217 -9516474 -2501111 5245541 12822946 19191871 23215132 24053845 21518316 16218944
37209 16218944 9555443 3405095 -508919 -1152108 1687580 7396986 14485601 20963319
37201 20963319 25400536 27784136 29164032 30536431 32263570 34261465 36094727 36834415
37193 36834415 35539140 32357101 28788771 26329240 24905653 22966665 19032035 12871654
$$ packed form
37250F285496l38813k197601l923836m662388m130469k492758j73984K218401
37242i415952M074543N007880M867452L658574J670893l84115j677107j840943
37234E961225j148603j25510Q17410J337276J046885k39918k127357l700623m182538
37225b361753l629906k901632k754845k938966k381501l83448K559602N275975
37217i516474P015363P746652P577405O368925M023261Q38713k535529n299372
37209A6218944o663501o150348l914014o43189K839688N709406P088615O477718
37201B0963319M437217K383600J379896J372399J727139J997895J833262P39688
37193C6834415j295275l182039l568330k459531j423587j938988l934630o160381
$$ plain form
37185 12871654 5287556 -2775009 -10644291 -17663745 -22904178 -25447663 -25124219 -22892805
37177 -22892805 -20243751 -18120416 -16551116 -15289625 -14403507 -13972807 -13545040 -12360395
37169 -12360395 -10048139 -6721948 -2439397 2955732 9278721 15631187 20853874 24231121
37161 24231121 25628732 25134635 22791281 18635400 12880346 6123794 -536729 -5731147
37153 -5731147 -8420263 -8440099 -6519196 -3779846 -1093001 1364905 4116281 7865987
37145 7865987 12764134 18058353 22476486 25027908 25584294 24831014 23653372 22473149
37137 22473149 21201307 19908984 19356828 20471097 23188286 26132745 27672855 27156913
37129 27156913 25061921 22365422 20155195 19461962 20650493 22733865 23800121 22543391
$$ packed form
37185A2871654p584098q062565p869282p019454n240433k543485L23444K231414
37177b2892805K649054K123335J569300J261491Q86118M30700M27767J184645
37169a2360395K312256L326191M282551N395129O322989O352466N222687L377247
37161B4231121J397611m94097k343354m155881n755054o756552o660523n194418
37153e731147k689116j9836J920903K739350K686845K457906K751376L749706
37145G865987M898147N294219M418133K551422N56386p53280j177642j180223
37137B2473149j271842j292323n52156J114269K717189K944459J540110n15942
37129B7156913k094992k696499k210227o93233J188531K083372J066256j256730
$$ plain form
37121 22543391 19261834 15212472 11259905 7416812 3447182 -553787 -4245448 -7409762
37113 -7409762 -10081381 -12405761 -14405663 -15794344 -16010999 -14545895 -11262864 -6380534
37105 -6380534 -260324 6600515 13454384 19563456 24841672 30150044 36735702 45275841
37097 45275841 55379965 65793195 74907644 81259319 83972160 82998064 78866455 72093794
37089 72093794 62968347 52115140 41155561 32331803 27037732 24637634 22883572 19603182
37081 19603182 14099599 7266284 786830 -3758354 -5554142 -4915049 -3100380 -1563072
37073 -1563072 -1257061 -2589956 -5749622 -10740239 -17097279 -23790552 -29471689 -32808819
37065 -32808819 -32894007 -29824587 -24975485 -20297530 -17018793 -15013728 -13332623 -11034453
$$ packed form
37121B2543391l281557m049362l952567l843093l969630m000969l691661l164314
37113g409762k671619k324380j999902j388681k16655J465104L283031M882330
37105f380534O120210O860839O853869O109072N278216N308372O585658Q540139
37097D5275841J0104124J0413230R114449O351675K712841r74096m131609o772661
37089G2093794r125447j0853207j0959579q823758n294071k400098j754062l280390
37081A9603182n503583o833315o479454m545184j795788O39093J814669J537308
37073a563072L06011j332895l159666m990617o357040o693273n681137l337130
37065c2808819q5188L069420M849102M677955L278737K005065J681105K298170
$$ plain form
37057 -11034453 -7534921 -2727516 2783672 7797578 11297768 13150673 13913622 14193984
37049 14193984 14481810 15327891 17091121 19405734 21332329 22304053 22756163 23652087 25457808
37040 25457808 27626126 28992933 28685954 26788833 24135730 21353047 18146439 13665125
37032 13665125 7480352 -5130 -8018047 -15938014 -23306696 -29636462 -34413319 -37196228
37024 -37196228 -37709042 -36066233 -32993825 -29599744 -26734107 -24592359 -22891430 -21232969
37016 -21232969 -19292627 -16913612 -14128887 -10976708 -7367338 -3413428 169644 2455587
37008 2455587 3259253 3338648 3516317 4064273 5230927 7834653 12673474 19425761 26567332
36999 26567332 32355346 35671837 36212526 34461432 31553324 28712168 26604783 25357048
$$ packed form
37057a1034453L499532M807405N511188N013906L500190J852905P62949K80362
37049A4193984K87826Q46081J763230K314613J926595R71724M52110Q95924J805721
37040B5457808K168318J366807l06979j897121k653103k782683l206608m481314
37032A3665125o184773p485482q012917p919967p368682o329766m776857k782909
37024c7196228n12814J642809L072408L394081K865637K141748J700929J658461
37016b1232969J940342K379015K784725L152179L609370L953910L583072K285943
37008B455587Q03666P9395J77669N47956J166654K603726M838821O752287P141571
36999B6567332N788014L316491N40689j751094k908108k841156k107385j247735
$$ plain form
36991 25357048 25055654 25785602 27071672 27692551 26400451 22826794 17633005 11832660
36983 11832660 5931375 -369477 -7525847 -15048676 -21214587 -24263595 -23991613 -21974750
36975 -21974750 -20210936 -19703843 -20218734 -20913601 -20954512 -19787994 -17202911 -13309082 -8543951
36966 -8543951 -3711763 229174 2745397 4100561 4943892 5562545 5718664 5059501 3351430
36957 3351430 466333 -3346775 -7184942 -10094228 -12191351 -14718111 -18672005 -23721342
36949 -23721342 -28707605 -32793399 -35752970 -37519617 -37962861 -36941776 -34151389 -29051608
36941 -29051608 -21382115 -11742096 -1389587 8452417 16891119 23277203 27343946 29391244
36933 29391244 29909407 29042055 26832288 23952557 21599284 20378297 19600392 17892323
$$ packed form
36991B5357048l01394P29948J286070O20879j292100l573657n193789n800345
36983A1832660n901285o300852p156370p522829o165911l049008K71982K016863
36975b1974750J763814N07093n14891o94867m0911J166518K585083L893829M765131
36966h543951M832188L940937K516223J355164Q43331O18653J56119o59163j708071
36957C351430k885097l813108l838167k909286k097123k526760l953894n049337
36949b3721342m986263m085794k959571j766647m43244J021085K790387N099781
36941b9051608P669493R640019J0352509R842004Q438702O386084M066743K047298
36933B9391244N18163q67352k209767k879731k353273j220987p77905j708069
$$ plain form
36925 17892323 14297645 8743866 1906546 -5004049 -10572194 -13778470 -14429420 -12979820
36917 -12979820 -10125404 -6747489 -3983423 -2795377 -3202229 -4108472 -4142891 -2740745 -412347
36908 -412347 1930834 3738486 4897337 5286002 4579955 2615818 -242638 -3354982 -6447583
36899 -6447583 -9850740 -13998250 -18726950 -23119798 -26048428 -26894070 -25792398 -23262460
36891 -23262460 -19760238 -15737039 -11991763 -9527312 -8767765 -9081023 -9366531 -9087054 -8553283
36882 -8553283 -8348334 -8822093 -10123768 -12294303 -15087394 -17929079 -20306526 -22111487
36874 -22111487 -23439947 -24148378 -23807784 -22117355 -19267920 -15883674 -12656370 -10039690
36866 -10039690 -8252294 -7467411 -7785742 -8856626 -9657350 -9008601 -6550939 -3230313 -833531
$$ packed form
36925A7892323l594678n553779o837320o910595n568145l206276o50950J449600
36917a2979820K854416L377915K764066J188046m06852r06243l4419J402146K328398
36908d12347K343181J807652J158851L88665p06047j964137k858456l112344l092601
36899f447583l403157m147510m728700m392848k928630q45642J101672K529938
36891b3262460L502222M023199L745276K464451P59547l13258k85508K79477N33771
36882h553283K04949m73759j301675k170535k793091k841685k377447j804961
36874b2111487j328460p08431L40594J690429K849435L384246L227304K616680
36866a0039690J787396P84883l18331j070884q00724O48749K457662L320626K396782
$$ plain form
36857 -833531 -1058265 -4734151 -11342578 -18954665 -24954615 -27436389 -26241604 -22696045
36849 -22696045 -18400435 -14317781 -10791243 -7984960 -6030787 -4873241 -4286542 -4193023
36841 -4193023 -4826226 -6350901 -8310325 -9712004 -9878765 -9110825 -8280976 -7817493 -7319676
36832 -7319676 -6171906 -4263274 -2001046 176437 2177492 4300791 6970052 10238996
36824 10238996 13505522 15980303 17565569 18983476 20827615 22770774 24005289 24209072
36816 24209072 23673236 22653654 21127200 19248036 17592933 16727490 16745795 17343140 18093255
36807 18093255 18514182 18122353 16747981 14878702 13634104 14265356 17351191 22169234
36799 22169234 26966560 30230432 31748062 32169565 31676935 29682724 25977392 21488843
$$ packed form
36857h33531k24734l675886o608427p612087n999950k481774J194785L545559
36849b2696045M295610M082654L526538K806283J954173J157546N86699R3519
36841d193023o33203j524675j959424j401679j66761P67940Q29849M63483M97817
36832g319676J147770J908632K262228K177483K001055K123299K669261L268944
36824A0238996L266526K474781J585266J417907J844139J943159J234515K03783
36816B4209072n35836j019582j526454j879164j655103q65443J8305N97345P50115
36807A8093255M20927l91829j374372j869279j244598O31252L085835M818043
36799B2169234M797326L263872J517630M21503m92630j994211l705332m488549
$$ plain form
36791 21488843 17389518 13899613 10620670 7776905 6292776 6501719 7445984 7827623
36783 7827623 7259361 6217851 5073257 3643201 1654270 -747200 -3068644 -4867618
36775 -4867618 -5995996 -6615047 -7110941 -7904604 -9102885 -10181775 -10120940 -8150094 -4532698
36766 -4532698 -449509 3138818 6466373 10568252 15910979 21645253 26240910 28592861
36758 28592861 28462351 26287440 22971080 19648081 17119374 15319774 13546010 11318447
36750 11318447 8883541 6828045 5389657 4281317 3106437 1838937 900322 744977
36742 744977 1286924 1793635 1571514 846510 779811 2432845 5768942 9747027 13266302
36733 13266302 15919010 18046675 20372629 23487536 27265384 30596894 31971544 30631049
$$ packed form
36791B1488843m099325l489905l278943k843765j484129K08943R44265L81639
36783G827623n68262j041510j144594j430056j988931k401470k321444j798974
36775d867618j128378o19051m95894p93663j198281j078890O0835J970846L617396
36766d532698M083189L588327L327555M101879N342727N734274M595657K351951
36758B8592861j30510k174911l316360l322999k528707j799600j773764k227563
36750A1318447k434906k055496j438388j108340j174880j267500r38615j55345
36742G44977N41947N06711k22121p25004o6699J653034L336097L978085L519275
36733A3266302K652708K127665K325954L114907L777848L331510J374650j340495
$$ plain form
36725 30631049 27148801 22800380 18513008 14575522 11144809 8599190 7266569 7057408
36717 7057408 7559134 8406326 9474666 10849526 12738844 15301915 18366543 21309087
36709 21309087 23331051 23882853 22806948 20180122 16160485 10985320 5076460 -755540
36701 -755540 -5179108 -6755094 -4977021 -992478 3052671 5623855 6677581 6977254
36693 6977254 6900427 6143436 4308328 1398736 -2158732 -5612264 -8007510 -8612985 -7456902
36684 -7456902 -5299149 -2923919 -552618 1937408 4323151 5778693 5436729 3242232
36676 3242232 219023 -2201223 -3195326 -2925432 -1991550 -706047 1001909 3152025 5399284
36667 5399284 7096893 7547974 6359678 3814079 809593 -1858144 -4139625 -6387428
$$ packed form
36725C0631049l482248m348421m287372l937486l430713k545619j332621k09161
36717G057408N01726Q47192J068340J374860J889318K563071L064628K942544
36709B1309087K021964N51802j075905k626826m019637n175165n908860n832000
36701g55540m423568j575986J778073L984543M045149K571184J053726K99673
36693F977254p6827p56991j835108k909592l557468l453532k395246o05475J156083
36684g456902K157753K375230K371301K490026K385743J455542l41964k194497
36676C242232l023209k420246r94103K69894R33882J285503J707956K150116K247259
36667E399284J697609M51081j188296k545599l004486k667737k281481k247803
$$ plain form
36659 -6387428 -8432815 -9422181 -8664795 -6223070 -2452413 2616382 9011374 16161474
36651 16161474 22968143 28540104 32582458 35125306 36233966 36099290 35193691 34190089
36643 34190089 33729760 34139863 35158467 35988213 35937423 35178650 34755266 35696072 38090134
36634 38090134 40981338 43123639 43976817 44190383 45119380 47651477 51374150 54893200
36626 54893200 56886148 56731108 54298338 49607309 42953319 35148495 27270874 20067193
36618 20067193 13687271 8006280 3084072 -774626 -3348978 -4728348 -5100420 -4385356
36610 -4385356 -2263728 1393894 6290831 11957888 18031184 24143793 29805040 34704047
36602 34704047 38989658 42869653 45970510 47539524 47458061 46731496 46669359 47629332 48699430
$$ packed form
36659f387428k045387r89366P57386K441725L770657N068795O394992P150100
36651A6161474O806669N571961M042354K542848J108660j34676r05599j003602
36643C4190089m60329M10103J018604Q29746n0790p58773m23384R40806K394062
36634C8090134K891204K142301Q53178K13566R28997K532097L722673L519050
36626E4893200J992948j55040k432770m691029o653990p804824p877621p203681
36618B0067193o379922n680991m922208l858698k574352j379370l72072P15064
36610d385356K121628L657622M896937N667057O073296O112609N661247M899007
36602C4704047M285611L879995L100857J569014q1463p26565o2137R59973J070098
$$ plain form
36593 48699430 48625064 47152083 45679457 46528766 51133284 58631567 66333926 71716200
36585 71716200 73930563 73527273 71226102 67316259 62012693 55939288 50098284 45347880
36577 45347880 41756246 38433154 34310213 29337427 24737523 21896712 21222397 22236710
36569 22236710 24334107 26955442 29357472 30988627 32179100 33842952 36242013 38449247
36561 38449247 39243123 38178843 35628696 32241216 28677068 25416173 22258247 18179891
36553 18179891 12207454 4472119 -3889107 -11772734 -18659963 -24239963 -28102960 -30066975
36545 -30066975 -30372849 -29184271 -26227447 -21478248 -16147496 -12385212 -11634190 -13403391
36537 -13403391 -15799169 -17066323 -16493468 -14247699 -10962427 -7536006 -4739542 -2620116
$$ packed form
36593D8699430p4366j472981j472626Q49309M604518P498283P702359N382274
36585G1716200K214363m03290k301171l909843n303566o073405n841004m750404
36577D5347880l591634l323092m122941m972786m599904k840811o74315J014313
36569B2236710K097397K621335K402030J631155J190473J663852K399061K207234
36561C8449247P93876j064280k550147l387480l564148l260895l157926m078356
36553A8179891n972437p735335q361226p883627o887229n580000l862997j964015
36545c0066975l05874J188578K956824M749199N330752L762284P51022j769201
36537a3403391k395778j267154N72855K245769L285272L426421K796464K119426
$$ plain form
36529 -2620116 -587913 1488916 2483754 864311 -3578606 -9317275 -14595695 -18934972
36521 -18934972 -22803082 -26172729 -28063325 -27576791 -24861655 -20746392 -15737866 -9827618
36513 -9827618 -3274652 2782408 6704414 7292433 4379329 -1229172 -8142313 -14834745
36505 -14834745 -20143539 -23662756 -25692137 -26711728 -26892418 -26121543 -24397309 -22051722
36497 -22051722 -19545364 -17072653 -14386624 -11092561 -7293082 -3994377 -2622538 -3840444
36489 -3840444 -6854053 -10069355 -12393282 -13719223 -14314088 -14229562 -13497048 -12519532 -11912204
36480 -11912204 -12080380 -13162037 -15172663 -17865359 -20546328 -22400587 -23044786 -22495273
36472 -22495273 -20603179 -16921246 -11364415 -4797775 1274929 5579464 7608504 7559551
$$ packed form
36529b620116K032203K076829R94838j619443m442917n738669n278420m339277
36521a8934972l868110l369647j890596M86534K715136M115263N008526N910248
36513i827618O552966O057060L922006N88019k913104n608501o913141o692432
36505a4834745n308794l519217k029381j019591j80690P70875J724234K345587
36497b2051722K506358K472711K686029L294063L799479L298705J371839j217906
36489c840444l013609l215302k323927j325941n94865Q4526P32514R77516O07328
36480a1912204j68176j081657k010626k692696k680969j854259o44199N49513
36472b2495273J892094L681933N556831O566640O072704M304535K029040m8953
$$ plain form
36464 7559551 6032844 3768436 1451885 -378507 -1341020 -1301566 -522300 493873 1542235
36455 1542235 2997465 5275743 8027882 10191943 11005053 10749933 10299787 10048352 9455843
36446 9455843 7494997 3294522 -3487646 -12376197 -21862765 -29802204 -34599406 -36267446
36438 -36267446 -36210700 -35850876 -35505131 -34600618 -32753149 -30352522 -28079193 -26148394 -24319094
36429 -24319094 -22589264 -21523323 -21622816 -22465120 -22751901 -21344269 -18193625 -14270854 -10758639
36420 -10758639 -8371959 -7211193 -6945537 -7074286 -7178168 -7055460 -6678909 -6136056 -5690714
36411 -5690714 -5735092 -6383174 -7058888 -6740897 -4815241 -1629667 1850326 4751115 6474642
36402 6474642 6367608 3712045 -1583769 -8340792 -14503515 -18482956 -20180522 -20623342
$$ packed form
36464G559551j526707k264408k316551j830392r62513L9454P79266J016173J048362
36455A542235J455230K278278K752139K164061Q13110k55120m50146k51435n92509
36446I455843j960846m200475o782168q888551r486568p939439m797202j668040
36438c6267446N6746L59824L45745R04513J847469K400627K273329J930799J829300
36429b4319094J729830J065941r9493q42304k86781J407632L150644L922771L512215
36420a0758639K386680J160766K65656j28749j03882J22708L76551N42853M45342
36411e690714m4378o48082o75714L17991J925656L185574L479993K900789J723527
36402F474642j07034k655563n295814o757023o162723l979441j697566m42820
$$ plain form
36394 -20623342 -20637769 -20064790 -18316297 -15421167 -12219884 -9581932 -7684784 -6044187
36386 -6044187 -3971417 -970986 2943406 7079519 10419090 12401023 13269293 13515441
36378 13515441 13220447 12262455 11005209 10306821 10734537 12077306 13754177 15403579 16838170
36369 16838170 17632475 17137521 15060017 11986252 9261378 8201396 9167332 11246064
36361 11246064 12880989 12923294 11155365 7999336 4039284 -86717 -3674546 -6262588
36353 -6262588 -8012263 -9543600 -11239679 -12762890 -13313487 -12319328 -9847879 -6458602
36345 -6458602 -2854825 205288 1791461 961556 -2642321 -8354563 -14860972 -21115162
36337 -21115162 -26799714 -31895337 -36031397 -38446526 -38542038 -36425957 -33024692 -29640460
$$ packed form
36394b0623342j4427N72979J748493K895130L201283K637952J897148J640597
36386f044187K072770L000431L914392M136113L339571J981933Q68270K46148
36378A3515441k94994r57992j257246o98388M27716J342769J676871J649402J434591
36369A6838170P94305m94954k077504l073765k724874j059982R65936K078732
36361A1246064J634925M2305j767929l156029l960052m126001l587829k588042
36353f262588j749675j531337j696079j523211n50597R94159K471449L389277
36345f458602L603777L060113J586173q29905l603877n712242o506409o254190
36337b1115162n684552n095623m136060k415129r5512K116081L401265L384232
$$ plain form
36329 -29640460 -27034367 -24637973 -20885016 -14777846 -7180224 -243920 4511512 7254011
36321 7254011 8944997 9882368 9543174 7660292 4971483 2801104 2131121 3094429 5073432
36312 5073432 7126094 8512496 9062569 9077752 8852725 8371921 7510814 6391384 5399424
36303 5399424 4910596 5096797 5910806 7135994 8581378 10461227 13483339 18164638 23923684
36294 23923684 29189342 32696600 34501250 35508259 36326760 37078635 38118019 40091164
36286 40091164 42889655 45088918 45051741 42464868 38377355 33925364 29604517 25764259
36278 25764259 23056425 21903956 21844523 21861692 21291690 20118860 18474638 16164895 12729011
36269 12729011 7806774 1525328 -5244011 -11082671 -14836559 -16416060 -16688067 -16542585
$$ packed form
36329b9640460K606093K396394L752957O107170P597622O936304M755432K742499
36321G254011J690986R37371l39194j882882k688809k170379o69983R63308J979003
36312E073432K052662J386402N50073J5183k25027m80804q61107j119430r91960
36303E399424m88828J86201Q14009J225188J445384J879849L022112M681299N759046
36294B3923684N265658L507258J804650J007009Q18501P51875J039384J973145
36286D0091164K798491K199263l7177k586873m087513m451991m320847l840258
36278B5764259k707834j152469n9433J7169n70002j172830j644222k309743l435884
36269A2729011m922237o281446o769339n838660l753888j579501k72007J45482
$$ plain form
36261 -16542585 -16203443 -15436601 -14153339 -12623598 -11202022 -9970274 -8623483 -6752402
36253 -6752402 -4415421 -2399394 -1579901 -1880598 -2186308 -1538936 -125432 1274848 2537585
36244 2537585 4310460 6936833 9901165 12577466 15016955 17590771 20186780 22261490
36236 22261490 23616134 24747351 26412556 29073173 32668827 36578363 39732866 41064582
36228 41064582 40074141 37001745 32583417 27835304 23934643 21852796 21826844 23250068
36220 23250068 25109225 26421178 26379416 24530017 21051017 16637638 11907323 7098392
36212 7098392 2505527 -1119774 -3055674 -3471391 -3435996 -3920423 -4923797 -5626849 -5283756
36203 -5283756 -3946253 -2431713 -1618837 -1740184 -2419904 -3418347 -5100583 -7934008 -11686839
$$ packed form
36261a6542585L39142P66842J283262J529741J421576J231748J346791J871081
36253f752402K336981K016027Q19493l00697l05710O47372J413504J400280J262737
36244B537585J772875K626373K964332K676301K439489K573816K596009K074710
36236B2261490J354644J131217J665205K660617L595654L909536L154503J331716
36228D1064582r90441l072396m418328m748113l900661k081847k5952J423224
36220B3250068J859157J311953m1762j849399l479000m413379m730315m808931
36212G098392m592865l625301j935900m15717L5395m84427j003374p03052L43093
36203e283756J337503J514540Q12876j21347o79720r98443j682236k833425l752831
$$ plain form
36194 -11686839 -15467680 -18509939 -20554793 -21473272 -21050906 -19497688 -17867367 -17494405
36186 -17494405 -18953931 -21747115 -24934863 -27834200 -30098876 -31415735 -31379880 -29723965
36178 -29723965 -26626189 -22713209 -18659907 -14768863 -11026776 -7559702 -4837138 -3314041
36170 -3314041 -3023920 -3672474 -4987891 -6781951 -8815814 -10950527 -13460265 -16856409
36162 -16856409 -21163204 -25485922 -28502715 -29414926 -28388773 -26171934 -23433389 -20485220
36154 -20485220 -17485049 -14702326 -12451771 -10750592 -9100926 -6637507 -2487539 3868673
36146 3868673 12227437 21354732 29174946 33740442 34434891 32371433 29589619 27742151
36138 27742151 27277946 27532882 27434286 26247830 23918690 20930061 17969571 15693383 14570052
$$ packed form
36194a1686839l780841l042259k044854r18479M22366J553218J630321L72962
36186a7494405j459526k793184l187748k899337k264676j316859L5855J655915
36178b9723965L097776L912980M053302L891044L742087L467074K722564J523097
36170c314041K90121o48554j315417j794060k033863k134713k509738l396144
36162a6856409m306795m322718l016793r12211J026153K216839K738545K948169
36154b0485220L000171K782723K250555J701179J649666K463419M149968O356212
36146C868673Q358764R127295P820214M565496O94449k063458k781814j847468
36138B7742151m64205K54936r8596j186456k329140k988629k960490k276188j123331
$$ plain form
36129 14570052 14713421 15860814 17608491 19589143 21305362 22010973 21174958 19117233
36121 19117233 16838308 15086223 13877967 13027496 12675088 12919820 13263209 12932388 11632178
36112 11632178 9526496 6615436 2764204 -1543101 -5114595 -7112872 -7831994 -8024844
36104 -8024844 -7766291 -6480654 -3958429 -818274 2112495 4457057 6156129 7005039
36096 7005039 6629860 4865130 2020618 -1159849 -3736364 -4948048 -4639661 -3450913
36088 -3450913 -2522362 -2834037 -4587925 -7068277 -9192593 -10465332 -11514742 -13554503
36080 -13554503 -17159497 -21578652 -25285735 -27128117 -26897003 -24941763 -21483952 -16444407
36072 -16444407 -9941036 -2873533 3193139 7011594 8620329 9151522 9530692 9535218 8357629
$$ packed form
36129A4570052J43369J147393J747677J980652J716219P05611q36015k057725
36121A9117233k278925j752085j208256q50471l52408K44732L43389l30821j300210
36112A1632178k105682k911060l851232m307305l571494j998277p19122j92850
36104h024844K58553J285637K522225L140155K930769K344562J699072Q48910
36096G005039l75179j764730k844512l180467k576515j211684L08387J188748
36088c450913R28551l11675j753888k480352k124316j272739j049410k039761
36080a3554503l604994m419155l707083j842382K31114J955240L457811N039545
36072a6444407O503371P067503O066672L818455J608735N31193L79170M526j177589
$$ plain form
36063 8357629 5955131 3493995 2424709 3409203 6232104 10393809 15441499 20849486
36055 20849486 25982183 30366770 33887528 36574271 38220114 38328166 36548691 33196854
36047 33196854 29236705 25620484 22666226 20224074 18402890 17805465 18830070 20950215
36039 20950215 23040482 24430639 25364612 26335470 27225822 27341112 26240159 24378044 22900440
36030 22900440 22802594 24153961 25998911 27078935 26883135 26135945 26186470 27755413 30190239
36021 30190239 31967358 31969235 30282252 27781115 25071530 21992900 18113471 13471385
36013 13471385 8701440 4610628 1820025 648477 968158 2104088 3181056 3756459
36005 3756459 3944022 3808531 2937009 938016 -1785286 -4178288 -5515735 -5930407 -5884096
$$ packed form
36063H357629k402498k461136j069286R84494K822901M161705N047690N407987
36055B0849486N132697M384587L520758K686743J645843J08052j779475l351837
36047C3196854l960149l616221k954258k442152j821184n97425J024605K120145
36039B0950215K090267J390157R33973R70858Q90352J15290j100953j862115j477604
36030B2900440r7846J351367J844950J080024j95800p47190N0525J568943K434826
36021C0190239J777119J877j686983k501137k709585l078630l879429m642086
36013A3471385m769945m090812k790603j171548L19681J135930J076968N75403
36005C756459J87563j35491q71522j998993k723302k393002j337447m14672M6311
$$ plain form
35996 -5884096 -5502408 -4751049 -4006718 -3918103 -4578164 -5202852 -4919258 -3732973 -2481670
35987 -2481670 -1937488 -2239388 -3162129 -4511066 -5983398 -6899633 -6486642 -4453561 -1045908
35978 -1045908 3430070 8770127 14452281 19463953 22945675 24893084 25901175 26279501
35970 26279501 25779738 24252314 22214212 20533090 19714867 19660972 19911716 19834570 18696402
35961 18696402 16024771 12198391 8532998 6418220 6131045 6497767 5866857 3579454
35953 3579454 589585 -1343401 -1131393 845278 3254021 5018215 6045055 6900009
35945 6900009 7916720 8715948 8594897 7293354 5266412 3219513 1539273 295836
35937 295836 -306306 293374 2666590 6803104 11783725 16007459 17957432 17112541 14315933
$$ packed form
35996e884096L81688P51359P44331Q8615o60061o24688K83594J186285J251303
35987b481670N44182l01900r22741j348937j472332r16235M12991K033081L407653
35978a045908M475978N340057N682154N011672L481722J947409J008091L78326
35970B6279501m99763j527424k038102j681122q18223n3895K50744p7146j138168
35961A8696402k671631l826380l665393k114778k87175L66722o30910k287403
35953C579454k989869j932986K12008J976671K408743J764194J026840Q54954
35945F900009J016711P99228j21051j301543k026942k046899j680240j243437
35937B95836o02142N99680K373216M136514M980621M223734J949973q44891k796608
$$ plain form
35928 14315933 11247589 9502506 10037539 13019700 17642376 22128539 24602536 24459112
35920 24459112 22705868 20716960 18915805 16951580 14744598 12710782 11074812 9654773
35912 9654773 8459726 7876247 7936035 7887767 6952140 5208597 3286275 1378301 -937600
35903 -937600 -3916024 -7098316 -9653964 -11041422 -11327307 -11080790 -10903785 -10736292 -9583867
35894 -9583867 -6288125 -780818 5562410 10860121 13808002 13879145 11011928 5598328
35886 5598328 -1337557 -8377213 -14281631 -18312684 -20225108 -20314811 -19484562 -18905706 -19379982
35877 -19379982 -21052622 -23662886 -26797185 -29856840 -32137133 -33201043 -32979777 -31279316
35869 -31279316 -27483773 -21293821 -13820589 -7442958 -4178970 -4278732 -6583439 -10065894
$$ packed form
35928A4315933l068344j745083N35033K982161M622676M486163K473997j43424
35920B4459112j753244j988908j801155j964225k206982k033816j635970j420039
35912I654773j195047n83479N9788m8268r35627j743543j922322j907974k315901
35903i37600k978424l182292k555648j387458k85885K46517J77005J67493J152425
35894i583867L295742N507307O343228N297711K947881P1143k867217n413600
35886E598328o935885p039656n904418m031053j912424q9703Q30249N78856m74276
35877a9379982j672640k610264l134299l059655k280293j063910K21266J700461
35869c1279316L795543O189952P473232O377631L263988r9762k304707l482455
$$ plain form
35861 -10065894 -14677305 -20679039 -27458539 -33247406 -36070650 -35071103 -31071061 -25890483
35853 -25890483 -21029894 -16941476 -13485854 -10826850 -9578060 -10090589 -11900708 -14039391
35845 -14039391 -15756555 -16864013 -17551042 -18040144 -18357499 -18317729 -17747032 -16716047 -15423774
35836 -15423774 -13850729 -11779880 -9312716 -7151758 -6123247 -6488465 -7855422 -9599677
35828 -9599677 -11169161 -12171957 -12517201 -12439988 -12104771 -11197741 -9174179 -5904401 -1834676
35819 -1834676 2444148 6490563 9924593 12436298 13916776 14151540 12280115 7136654
35811 7136654 -1346557 -11216091 -19379799 -23564142 -23553615 -20951440 -18015042 -16363949
35803 -16363949 -16177012 -16358994 -15528818 -12909056 -8500302 -2954135 2410714 5918393
$$ packed form
35861a0065894m611411o001734o779500n788867k823244R99547M000042N180578
35853b5890483M860589M088418L455622K659004J248790n12529j810119k138683
35845a4039391j717164j107458o87029m89102l17355L9770N70697J030985J292273
35836a5423774J573045K070849K467164K160958J028511l65218j366957j744255
35828i599677j569484j002796l45244P7213L35217R07030K023562L269778M069725
35819a834676M278824M046415L434030K511705J480478K34764j871425n143461
35811G136654q483211r869534q163708m184343J0527K602175K936398J651093
35803a6363949J86937j81982Q30176K619762M408754N546167N364849L507679
$$ plain form
35795 5918393 6555476 4822082 2343280 683242 653553 2314150 4915058 6838337 6365872
35786 6365872 3008401 -2088360 -7186494 -11155733 -13640547 -14601470 -14115128 -12392767
35778 -12392767 -9649015 -6089430 -2272798 730069 1924557 1141432 -980965 -3632042
35770 -3632042 -6223953 -8393996 -10138546 -12031559 -14844379 -18584919 -22062076 -23739845
35762 -23739845 -23138445 -21340800 -20127063 -20650558 -22852385 -25893726 -28900172 -31263184
35754 -31263184 -32504874 -32256786 -30558387 -28010558 -25369937 -22949638 -20582494 -18247491
35746 -18247491 -16561221 -16412597 -18056633 -20701111 -23083509 -24379307 -24460016 -23419112
35738 -23419112 -21169669 -17620795 -13019237 -7890701 -2719932 2150065 6390254 9669120
$$ packed form
35795E918393O37083j733394k478802j660038k9689J660597K600908J923279m72465
35786F365872l357471n096761n098134l969239k484814r60923M86342J722361
35778a2392767K743752L559585L816632L002867J194488p83125k122397k651077
35770c632042k591911k170043j744550j893013k812820l740540l477157j677769
35762b3739845O01400J797645J213737n23495k201827l041341l006446k363012
35754c1263184j241690K48088J698399K547829K640621K420299K367144K335003
35746a8247491J686270J48624j644036k644478k382398j295798q0709J040904
35738b3419112K249443L548874M601558N128536N170769M869997M240189L278866
$$ plain form
35730 9669120 11771917 12620969 12235653 10815522 8777802 6497025 4024273 1238794
35722 1238794 -1780508 -4760429 -7572201 -10316834 -13076414 -15774314 -18142689 -19472028
35714 -19472028 -18577689 -14755885 -9075317 -4172566 -2253418 -3460489 -6370195 -9587410
35706 -9587410 -12402433 -14407854 -15366763 -15500279 -15255652 -14604431 -12981350 -10003488 -5850574
35697 -5850574 -912224 4396614 9291189 12672122 13996402 13829973 13183701 12572355 12160030
35688 12160030 12620167 15183130 20501148 27617854 34224991 37972573 37740402 34073585
35680 34073585 28691039 23478455 19558999 16882404 14413487 10738791 4838265 -3278274
35672 -3278274 -12392641 -20508917 -25734248 -27205696 -25526156 -22270817 -18754467 -15116692
$$ packed form
35730I669120K102797Q49052l85316j420131k037720k280777k472752k785479
35722A238794l019302k979921k811772k744633k759580k697900k368375j329339
35714a9472028Q94339L821804N680568M902751J919148j207071k909706l217215
35706i587410k815023k005421r58909j33516K44627O51221J623081K977862M152914
35697e850574M938350N308838M894575L380933J324280j66429o46272o11346m12325
35688A2160030M60137K562963N318018P116706O607137L747582k32171l666817
35680C4073585n382546n212584l919456k676595k468917l674696n900526q116539
35672c278274r114367q116276n225331j471448J679540L255339L516350L637775
$$ plain form
35664 -15116692 -10742784 -5639001 -1128464 1078563 412322 -2168783 -5190655 -7720380
35656 -7720380 -9438439 -10202979 -10027863 -9394181 -9133924 -9801573 -11291894 -13091451 -14619823
35647 -14619823 -15181454 -13960537 -10597709 -5837730 -1248854 1895908 3344106 3524118
35639 3524118 2881187 1794657 868942 869509 2273076 4968545 8292205 11191073 12516042
35630 12516042 11560039 8541914 4544106 901165 -1499021 -2630098 -3300265 -4619075
35622 -4619075 -7244329 -11068281 -15583537 -20322970 -24854779 -28719196 -31748659 -34257082
35614 -34257082 -36515190 -38181186 -38709989 -38264471 -37705184 -37589711 -37619759 -37167441 -35850330
35605 -35850330 -33370478 -29298081 -23519594 -16775387 -10417404 -5580648 -2575437 -886308
$$ packed form
35664a5116692M373908N103783M510537K207027o66241k581105l021872k529725
35656g720380j718059p64540J75116O33682K60257o67649j490321j799557j528372
35647a4619823n61631J220917L362828M759979M588876L144762J448198J80012
35639C524118o42931j086530r25715N67J403567K695469L323660K898868J324969
35630A2516042r56003l018125l997808l642941k400186j131077o70167j318810
35622d619075k625254l823952m515256m739433m531809l864417l029463k508423
35614c4257082k258108j665996n28803M45518N59287J15473l0048M52318J317111
35605c5850330K479852M072397N778487O744207O357983M836756L005211J689129
$$ plain form
35597 -886308 276985 1186508 1330370 263017 -1270425 -1571632 414865 4155049 8378265
35588 8378265 12322421 15701529 17962084 18333531 16571236 13182589 8970519 4676929
$$ packed form
35597h86308J163293R09523J43862j067353j533442l01207J986497L740184M223216
35588H378265L944156L379108K260555L71447j762295l388647m212070m293590
$$ [...]
##END NTUPLES=NMR SPECTRUM
##END=
