##TITLE=31Pdec_DE-20HK2HCl
 D2O 
  24 sc
 27.10.2023
##JCAMPDX= 6.0         $$ Bruker NMR JCAMP-DX V2.0
##DATA TYPE= NMR SPECTRUM
##DATA CLASS= NTUPLES
##ORIGIN= UXNMR, Bruker Analytische Messtechnik GmbH
##OWNER= root
$$ XWIN-NMR		Version 3.5
$$ Fri Oct 27 16:30:03 2023 Russian Standard Time (UT+4h)  she@DPX200
##.OBSERVE FREQUENCY= 81.013821
##.OBSERVE NUCLEUS= ^31P
##.ACQUISITION MODE= SIMULTANEOUS
##.ACQUISITION SCHEME= undefined
##.AVERAGES= 24
##.DIGITISER RES= 16
##SPECTROMETER/DATA SYSTEM= spect
##.PULSE SEQUENCE= zgpg30
##.SOLVENT NAME= D2O
##.SHIFT REFERENCE= (INTERNAL, D2O, 0, 248.564)
##AUDIT TRAIL= $$ (NUMBER, WHEN, WHO, WHERE, WHAT)
$$ ##TITLE= Audit trail, XWIN-NMR		Version 3.5
$$ ##JCAMPDX= 5.01
$$ ##ORIGIN= Bruker BioSpin GmbH
$$ ##OWNER= she
$$ F:/spectra/data/she/nmr/P31/1/pdata/1/auditp.txt
$$ ##AUDIT TRAIL=  $$ (NUMBER, WHEN, WHO, WHERE, WHAT)
(   1,<2023-10-27 16:28:54.50 +0400>,<she>,<DPX200>,
      <created by zg, POWCHK disabled, PULCHK disabled
       configuration hash MD5:
       00 E9 B6 7A A2 85 ED C7 34 08 36 98 17 FE 4E 26
       data hash MD5: 32K
       A8 19 DA 43 37 D1 15 30 D9 B8 AB BB B8 2A 0A 97>)
(   2,<2023-10-27 16:29:13.98 +0400>,<she>,<DPX200>,
      <Start of raw data processing
       efp BC_mod = 2 LB = 5 FT_mod = 6 PKNL = 1 PHC0 = -10716.88 PHC1 = 206.89 SI = 64K 
       data hash MD5: 64K
       22 21 8F C3 80 BB 66 F6 FF 28 B6 5D 0E 1B F0 91>)
(   3,<2023-10-27 16:29:26.82 +0400>,<she>,<DPX200>,
      <pk PHC0 = -13.79803 PHC1 = 0 
       data hash MD5: 64K
       E1 A0 76 5E 02 17 0C 6F 93 AA 10 1C 1E CE FC 84>)
(   4,<2023-10-27 16:29:30.45 +0400>,<she>,<DPX200>,
      <abs ABSG = 5 
       data hash MD5: 64K
       5B 56 8A FC DD C0 41 DA 05 5D 44 18 50 5B 6F 24>)
$$ ##END=
$$ 
$$ hash MD5
$$ 88 DA 39 49 07 40 82 A3 FA 2F 5C 0D 0B 87 AB 10
##$RELAX= 
##$RELAX= 
##$RELAX= 
##$RELAX= 
##$RELAX= 
##$RELAX= 
##$RELAX= 
##$RELAX= 
##$RELAX= 
$$ Bruker specific parameters
$$ --------------------------
##$DU= <F:/spectra>
##$EXPNO= 1
##$NAME= <P31>
##$PROCNO= 1
##$TYPE= <nmr>
##$USER= <she>
##$AMP= (0..31)
100 100 100 100 100 100 100 100 100 100 100 100 100 100 100 100 100 100 
100 100 100 100 100 100 100 100 100 100 100 100 100 100 
##$AQSEQ= 0
##$AQ_mod= 1
##$AUNM= <au_zg>
##$AUTOPOS= <>
##$BF1= 81.014009
##$BF2= 200.13
##$BF3= 200.13
##$BF4= 200.13
##$BF5= 200.13
##$BF6= 200.13
##$BF7= 200.13
##$BF8= 200.13
##$BYTORDA= 1
##$CFDGTYP= 0
##$CFRGTYP= 5
##$CHEMSTR= <none>
##$CNST= (0..31)
1 1 145 1 1 1 1 1 1 1 1 1 1 1 1 1 1 1 1 1 1 1 1 1 1 1 1 1 1 1 1 1 
##$CPDPRG= <waltz16>
##$CPDPRG1= <>
##$CPDPRG2= <waltz16>
##$CPDPRG3= <>
##$CPDPRG4= <mlev>
##$CPDPRG5= <mlev>
##$CPDPRG6= <mlev>
##$CPDPRG7= <mlev>
##$CPDPRG8= <mlev>
##$CPDPRGB= <>
##$CPDPRGT= <>
##$D= (0..31)
0 1 0 0 0 0 0 0 0 0 0 0.03 2e-05 3e-06 0 0 0 0 0 0 0 0 0 0 0 0 0 0 0 0 
0 0 
##$DATE= 1698409734
##$DBL= (0..7)
120 120 120 11 120 120 24 19 
##$DBP= (0..7)
150 150 150 150 150 150 150 150 
##$DBP07= 0
##$DBPNAM0= <>
##$DBPNAM1= <>
$$ [...]
##$SUBNAM3= <"">
##$SUBNAM4= <"">
##$SUBNAM5= <"">
##$SUBNAM6= <"">
##$SUBNAM7= <"">
##$SUBNAM8= <"">
##$SUBNAM9= <"">
##$SW= 501.771253377433
##$SWIBOX= (0..15)
0 1 3 0 0 0 0 0 0 0 0 0 0 0 0 0 
##$SW_h= 40650.406504065
##$TD= 32768
##$TD0= 1
##$TE= 0
##$TE2= 300
##$TE3= 300
##$TEG= 300
##$TL= (0..7)
0 120 53 12 22 120 120 120 
##$TP= (0..7)
150 150 150 150 150 150 150 150 
##$TP07= 0
##$TPNAME0= <>
##$TPNAME1= <>
##$TPNAME2= <>
##$TPNAME3= <>
##$TPNAME4= <>
##$TPNAME5= <>
##$TPNAME6= <>
##$TPNAME7= <>
##$TPOAL= (0..7)
0.5 0.5 0.5 0.5 0.5 0.5 0.5 0.5 
##$TPOFFS= (0..7)
0 0 0 0 0 0 0 0 
##$TUNHIN= 0
##$TUNHOUT= 0
##$TUNXOUT= 0
##$USERA1= <user>
##$USERA2= <user>
##$USERA3= <user>
##$USERA4= <user>
##$USERA5= <user>
##$V9= 5
##$VALIST= <valist>
##$VCLIST= <CCCCCCCCCCCCCCC>
##$VD= 0
##$VDLIST= <DDDDDDDDDDDDDDD>
##$VPLIST= <PPPPPPPPPPPPPPP>
##$VTLIST= <TTTTTTTTTTTTTTT>
##$WBST= 1024
##$WBSW= 4
##$XGAIN= (0..3)
0 0 0 0 
##$XL= 0
##$YL= 0
##$YMAX_a= 1593
##$YMIN_a= -1655
##$ZGOPTNS= <>
##$ZL1= 120
##$ZL2= 120
##$ZL3= 120
##$ZL4= 120
##$ABSF1= 248.5645
##$ABSF2= -253.2056
##$ABSG= 5
##$ABSL= 3
##$ALPHA= 0
##$AQORDER= 0
##$ASSFAC= 0
##$ASSFACI= 0
##$ASSFACX= 0
##$ASSWID= 0
##$AUNMP= <proc_1d>
##$AZFE= 0.1
##$AZFW= 0.5
##$BCFW= 0
##$BC_mod= 2
##$BYTORDP= 0
##$COROFFS= 0
##$CY= -3
##$DATMOD= 1
##$DC= 0
##$DFILT= <>
##$DTYPP= 0
##$F1P= 0
##$F2P= 0
##$FCOR= 1
##$FTSIZE= 65536
##$FT_mod= 6
##$GAMMA= 0
##$GB= 0
##$INTBC= 1
##$INTSCL= 6.047779e-11
##$ISEN= 30
##$LB= 5
##$LEV0= 0
##$LPBIN= 0
##$MAXI= 10000
##$MC2= 0
##$MEAN= 0
##$ME_mod= 0
##$MI= 50
##$NCOEF= 0
##$NC_proc= -8
##$NLEV= 6
##$NOISF1= 182.463
##$NOISF2= 159.3651
##$NSP= 0
##$NTH_PI= 0
##$NZP= 0
##$OFFSET= 248.5645
##$PC= 4
##$PHC0= -10730.68
##$PHC1= 206.89
##$PH_mod= 1
##$PKNL= yes
##$PPARMOD= 0
##$PSCAL= 0
##$PSIGN= 0
##$REVERSE= no
##$SF= 81.0140089999694
##$SI= 65536
##$SIGF1= 159.3651
##$SIGF2= -187.1042
##$SINO= 113.3802
##$SIOLD= 16384
##$SREGLST= <1H.CDCl3>
##$SSB= 0
##$STSI= 65536
##$STSR= 0
##$SW_p= 40650.406504065
##$SYMM= 0
##$S_DEV= 0
##$TDeff= 32768
##$TDoff= 0
##$TI= <>
##$TILT= no
##$TM1= 0
##$TM2= 0
##$TOPLEV= 0
##$USERP1= <user>
##$USERP2= <user>
##$USERP3= <user>
##$USERP4= <user>
##$USERP5= <user>
##$WDW= 1
##$XDIM= 65536
##$YMAX_p= 450249058
##$YMIN_p= -7910667
$$ End of Bruker specific parameters
$$ ---------------------------------
##NTUPLES= NMR SPECTRUM
##VAR_NAME=  FREQUENCY,     SPECTRUM/REAL,   SPECTRUM/IMAG
##SYMBOL=    X,             R,               I
##VAR_TYPE=  INDEPENDENT,   DEPENDENT,       DEPENDENT
##VAR_FORM=  AFFN,          ASDF,            ASDF
##VAR_DIM=   65536,         65536,           65536
##UNITS=     HZ,            ARBITRARY UNITS, ARBITRARY UNITS
##FACTOR=    0.620285442955139, 1,           1
##FIRST=     20137.2065510682, 0,            0
##LAST=      -20513.1999529968, 0,           0
##MIN=       -20513.1999529968, -7910667,    0
##MAX=       20137.2065510682, 450249058,    0
$$ Real data points
##PAGE= N=1
##DATA TABLE= (X++(R..R)), XYDATA
$$ [...]
43370 581120 222848 -288835 -901477 -1591882 -2329494 -3018533 -3500942 -3644169 -3425204 -2916019
43360 -2916019 -2213427 -1427589 -712271 -209546 74960 271119 462342 562017 442606 142517
43350 142517 -147694 -290665 -305675 -269839 -216425 -165619 -167654 -242225 -314293 -276382 -109777
43339 -109777 91102 207489 187617 66928 -73904 -178246 -262491 -392676 -602199 -844904
43329 -844904 -1043357 -1172560 -1282387 -1446196 -1698733 -2016868 -2349627 -2663277 -2945267 -3149099
43319 -3149099 -3153410 -2824176 -2142279 -1251482 -365192 364454 894763 1259084 1516177 1707195
43309 1707195 1827919 1846847 1763880 1637280 1538431 1494945 1489388 1491015 1470383 1406025 1302754
43298 1302754 1189628 1083625 981018 908655 947598 1152185 1454916 1703886 1802709 1773995
43288 1773995 1679949 1534652 1331637 1125505 1032390 1138766 1431355 1822117 2220917 2570387
43278 2570387 2831520 2979810 3040773 3108237 3285245 3592813 3956205 4286905 4550956 4741851
43268 4741851 4818106 4706503 4364184 3816424 3141489 2440038 1805864 1285961 851189 417697
43258 417697 -93535 -710134 -1389025 -2011927 -2421642 -2525557 -2393089 -2218394 -2143930 -2115533
43248 -2115533 -1928897 -1426989 -651951 189853 899192 1414073 1782057 2040081 2164529
43239 2164529 2145002 2059788 2030033 2101534 2196446 2174349 1922396 1417958 767546 192042
43229 192042 -95675 -60501 110809 165985 -585 -282888 -485450 -502450 -405062 -378593
43219 -378593 -562077 -924131 -1288407 -1479598 -1442030 -1238996 -985357 -795486 -748417 -853177
43209 -853177 -1050721 -1265889 -1437697 -1487086 -1308856 -860505 -244011 364770 875012 1320083
43199 1320083 1737141 2073304 2239247 2201786 1986597 1642022 1259284 993030 979019 1209785
43189 1209785 1526035 1739072 1744940 1547142 1231338 924555 714076 565887 355043 9278
43179 9278 -398054 -714155 -827083 -690008 -274978 421047 1317255 2245599 3027482 3542996
43169 3542996 3748879 3685079 3470941 3237144 3024419 2776870 2460876 2162632 2036428 2171101
43159 2171101 2523032 2944532 3238284 3217661 2797679 2071837 1281239 674853 374608 339954
43149 339954 423441 458354 333303 25346 -415028 -896572 -1306272 -1531199 -1508077 -1263570
43139 -1263570 -886642 -456052 -10023 418333 769412 978521 1013981 884332 621995 267230
43129 267230 -145973 -592112 -1024039 -1339478 -1412330 -1185842 -726976 -179037 322915 687198
43119 687198 863342 850817 691917 407756 -56833 -776903 -1721239 -2719635 -3577616 -4197130
43109 -4197130 -4569820 -4699838 -4591872 -4303064 -3940492 -3576331 -3197659 -2768676 -2315585
43100 -2315585 -1909228 -1574281 -1262255 -925433 -575773 -238356 129875 630173 1318918
43091 1318918 2128299 2890776 3433887 3666865 3612934 3381070 3101597 2873786 2754466 2760765
43081 2760765 2855518 2948839 2961303 2896660 2820134 2757357 2658332 2488316 2315680 2264501 2397379
43070 2397379 2683043 3056766 3454458 3791756 3982586 4017060 3978417 3939005 3864408 3665140
43060 3665140 3331502 2975037 2739757 2712905 2918985 3332842 3847688 4264293 4388801 4176963
43050 4176963 3763848 3334965 2980577 2681127 2400350 2148446 1953241 1809886 1686555
43041 1686555 1564776 1447939 1333683 1204561 1056586 918485 823168 765057 703239 609433
43031 609433 498033 402345 336661 298561 300841 377773 551634 806595 1107107 1438706 1827067
43020 1827067 2318658 2932003 3603450 4175817 4470338 4400226 4016411 3444386 2803033 2194087
43010 2194087 1716638 1421566 1248794 1060983 759914 348734 -110629 -551244 -908304
43001 -908304 -1140212 -1284397 -1446830 -1683056 -1911529 -1989772 -1862618 -1602162 -1330353 -1156102
42991 -1156102 -1170655 -1432070 -1930494 -2604056 -3393063 -4233102 -4989151 -5466593 -5550023 -5323317
42981 -5323317 -5016636 -4821327 -4744521 -4615641 -4228614 -3516300 -2621105 -1789362 -1185141 -817419
42971 -817419 -637553 -646690 -861572 -1209274 -1523835 -1661082 -1585296 -1342735 -994524 -598519
42961 -598519 -223154 68087 258179 388024 515792 662953 794691 840941 730577 420436
42951 420436 -76153 -669005 -1216143 -1605198 -1823623 -1936960 -1997517 -1991654 -1873782 -1621492
42941 -1621492 -1250711 -817774 -436099 -254048 -353802 -657948 -967677 -1115477 -1081989 -974364
42931 -974364 -904368 -868474 -709345 -197993 792386 2149369 3559682 4707552 5452947
42922 5452947 5843039 5997218 6007630 5919346 5746315 5480286 5105478 4630580 4106597 3603303
42912 3603303 3170227 2825774 2573372 2409676 2318069 2274974 2271873 2316462 2402288 2492611 2548017
42901 2548017 2557065 2530429 2494822 2523195 2737005 3205580 3825790 4356120 4608911 4587932
42891 4587932 4423206 4213540 3965701 3646290 3238536 2766393 2313728 2008005 1926228 2003928
42881 2003928 2075352 2016239 1823219 1559275 1265296 935679 543146 74127 -424893 -822431
42871 -822431 -968461 -828354 -541481 -324985 -322695 -543207 -904599 -1308395 -1692472 -2052783
42861 -2052783 -2421960 -2815212 -3197506 -3504587 -3683389 -3712656 -3610660 -3432065 -3224472 -2963711
42851 -2963711 -2559056 -1957603 -1232492 -541543 -13377 296419 360939 161047 -261208 -761996
42841 -761996 -1154344 -1325463 -1300027 -1196091 -1123066 -1111949 -1122281 -1091179 -964086 -701451
42831 -701451 -301569 166650 588253 893887 1111806 1294983 1406128 1318502 945517 342480
42821 342480 -339156 -983037 -1576010 -2154065 -2700585 -3110999 -3267538 -3156403 -2904204 -2679053
42811 -2679053 -2544481 -2416182 -2167010 -1765987 -1305158 -896111 -556742 -207738 230643
42802 230643 755380 1288126 1731762 1997193 2005261 1726490 1245953 751521 409341 241615
42792 241615 137960 -20880 -262152 -520315 -694896 -699042 -483320 -51491 529027 1138841
42782 1138841 1653100 2004623 2211514 2334697 2407602 2419378 2360616 2250718 2098193 1852488
42772 1852488 1422235 746363 -146197 -1120326 -1970558 -2516468 -2709030 -2638457 -2414100 -2053003
42762 -2053003 -1519321 -861543 -268045 26360 -120364 -687126 -1509646 -2364356 -3076699
42753 -3076699 -3581563 -3880845 -3951538 -3722162 -3146748 -2281549 -1276072 -293713 561264
42744 561264 1252661 1757126 2010554 1937487 1550848 998687 484413 152503 62166 221911
42734 221911 588241 1050428 1486794 1845658 2124796 2281561 2242178 2028832 1813625 1790630
42724 1790630 2007127 2332505 2558223 2516622 2159805 1580302 953463 441374 148926 134892
42714 134892 388751 778356 1095352 1211076 1162412 1064143 990102 970520 1029283 1146481
42704 1146481 1231200 1221087 1190486 1272142 1463498 1581566 1435030 1004364 451074 -5375
42694 -5375 -220706 -199148 -70324 23460 26041 -50062 -201350 -436538 -713820 -943178 -1071132
42683 -1071132 -1120742 -1137386 -1138324 -1123199 -1082773 -981111 -781964 -521173 -311406 -248100 -345147
42672 -345147 -574002 -901056 -1242840 -1445005 -1387192 -1102208 -743016 -444034 -258805 -209721
42662 -209721 -320541 -573979 -882524 -1133727 -1252826 -1224387 -1093611 -964127 -955056 -1117254
42652 -1117254 -1394274 -1683531 -1924855 -2110206 -2223596 -2210902 -2019743 -1646480 -1135824 -562336
42642 -562336 -35342 303376 339878 72534 -373516 -827733 -1171456 -1373252 -1467277 -1514086
42632 -1514086 -1558590 -1602590 -1625336 -1630595 -1634132 -1579313 -1314207 -729832 69945 793552 1189097
42621 1189097 1228752 1068965 881806 761316 754314 909615 1265911 1803669 2420495 2957647
42611 2957647 3268670 3289135 3052211 2635945 2100275 1484008 856675 345582 79425 89706
42601 89706 274824 471219 551899 451134 140688 -333613 -768202 -839161 -324530 695907
42591 695907 1895479 2937685 3624999 3876915 3699618 3225925 2690933 2275490 1988692
42582 1988692 1739518 1475716 1188460 815197 233160 -614638 -1619376 -2556318 -3238750
42573 -3238750 -3646994 -3933056 -4283833 -4748066 -5199714 -5483061 -5570217 -5558296 -5557492 -5633856
42563 -5633856 -5823681 -6114543 -6396869 -6499889 -6310378 -5831888 -5134893 -4311044 -3492936
42554 -3492936 -2848262 -2497494 -2460854 -2709436 -3217700 -3914853 -4625379 -5135303 -5326623 -5212523
42544 -5212523 -4862100 -4357353 -3827992 -3445774 -3313760 -3365202 -3399295 -3215171 -2713862 -1919470
42534 -1919470 -959888 -25245 715753 1212354 1552032 1866052 2203059 2492023 2620066
42525 2620066 2536916 2292240 1997414 1764699 1662205 1689736 1781918 1848051 1824003 1687744
42515 1687744 1434527 1066104 619878 180807 -177632 -468371 -777534 -1167440 -1616815
42506 -1616815 -2063503 -2465622 -2783779 -2929990 -2800450 -2389179 -1844944 -1386465 -1156796
42497 -1156796 -1154536 -1279243 -1421610 -1522174 -1574278 -1591614 -1583806 -1570416 -1606299 -1755870 -2015012
42486 -2015012 -2273395 -2390994 -2329918 -2206417 -2205596 -2431207 -2811125 -3136175 -3220284 -3063031
42476 -3063031 -2855767 -2801702 -2929232 -3100243 -3182287 -3162614 -3093287 -2994502 -2860182 -2718687
42466 -2718687 -2623209 -2582422 -2543664 -2450373 -2285464 -2059740 -1799361 -1558779 -1405648 -1356891
42456 -1356891 -1343296 -1264379 -1070480 -768396 -359912 178748 831007 1473853 1913009 2003583
42446 2003583 1745478 1272742 751496 262932 -245700 -894437 -1725213 -2610027 -3328716
42437 -3328716 -3761030 -3988352 -4184242 -4416804 -4584722 -4538937 -4233711 -3755711 -3242507 -2797074
42427 -2797074 -2461497 -2237442 -2113828 -2074626 -2090298 -2121059 -2139762 -2137647 -2093538 -1959036 -1706099
42416 -1706099 -1375564 -1036303 -700973 -334411 45106 335679 463917 482735 499579 522943
42406 522943 431208 96610 -488817 -1198452 -1840564 -2249054 -2363531 -2256564 -2067189 -1884247
42396 -1884247 -1691016 -1419743 -1047541 -637622 -295554 -80789 50701 210371 469699
42387 469699 794136 1094292 1321349 1477276 1540666 1436550 1111451 617386 90886 -352381
42377 -352381 -692200 -980284 -1255471 -1480518 -1550214 -1354851 -846138 -71456 825341 1643482
42367 1643482 2217290 2513747 2635039 2704264 2759478 2774722 2748436 2714270 2673081 2583306 2447709
42356 2447709 2357582 2397779 2524449 2584202 2463330 2196279 1923952 1764051 1726668 1737048
42346 1737048 1723466 1688219 1713824 1913293 2360561 3035879 3823275 4585102 5269374 5936883
42336 5936883 6653822 7357499 7857373 7982053 7716391 7203052 6638802 6165130 5806677
42327 5806677 5472736 5029870 4407079 3644122 2841799 2079428 1383809 755832 212810
42318 212810 -178025 -297826 -41729 574265 1381875 2175693 2870474 3526703 4225939 4953238
42308 4953238 5606350 6077786 6297412 6226548 5867967 5292444 4613246 3902511 3148815 2322580
42298 2322580 1467969 691960 58924 -468930 -969637 -1464791 -1900448 -2196342 -2288865 -2155026
42288 -2155026 -1842789 -1473719 -1167488 -943595 -720617 -422112 -59576 294232 574570
42279 574570 737481 731677 511347 94915 -416359 -914877 -1396127 -1976467 -2771106 -3740273
42269 -3740273 -4674170 -5349997 -5694845 -5785329 -5723199 -5558514 -5316742 -5029802 -4714006 -4364453
42259 -4364453 -4001982 -3684219 -3428124 -3152572 -2753320 -2232448 -1712122 -1313442 -1048589
42250 -1048589 -835506 -594171 -325913 -124526 -117601 -369588 -815844 -1292073 -1641684 -1805590
42240 -1805590 -1820974 -1749031 -1610980 -1387862 -1069707 -692547 -324343 -27685 150579 170382
42230 170382 21597 -225769 -424671 -444470 -272024 -14906 189770 268235 237932 172050
42220 172050 132594 113815 42605 -156313 -488360 -873811 -1186728 -1304541 -1150501 -731115
42210 -731115 -144413 468817 1001389 1412654 1690502 1794062 1649670 1215088 549185 -194275
42200 -194275 -855018 -1347088 -1653734 -1775499 -1723753 -1554224 -1352536 -1169032 -1007468 -891705
42190 -891705 -887198 -1012543 -1170660 -1225670 -1131827 -941897 -713506 -469778 -240876 -69060
42180 -69060 45619 142205 208698 141715 -162844 -702581 -1376148 -2065852 -2681728 -3158453
42170 -3158453 -3466981 -3637157 -3740225 -3843475 -3997073 -4253724 -4660848 -5207243 -5783775
42161 -5783775 -6217527 -6367996 -6213043 -5852653 -5424243 -5008271 -4615446 -4252200 -3968760
42152 -3968760 -3827690 -3837714 -3926837 -3967724 -3833961 -3480078 -3009200 -2639454 -2544850 -2709577
42142 -2709577 -2959417 -3130301 -3166562 -3061942 -2790829 -2364347 -1905091 -1560035 -1316095 -981645
42132 -981645 -408906 307760 917477 1275497 1455456 1603979 1760903 1862965 1873960 1848348
42122 1848348 1871506 1975740 2115785 2199045 2139114 1907458 1546793 1127877 692390 238051
42112 238051 -260420 -834694 -1505505 -2238684 -2912558 -3367150 -3513903 -3388094 -3081878 -2641330
42102 -2641330 -2049228 -1302751 -484928 252301 770696 1009437 986087 769162 466111 204634
42092 204634 63057 -6410 -148666 -457642 -861874 -1179752 -1275106 -1132183 -800660 -326794
42082 -326794 244136 845385 1413860 1929679 2400990 2804960 3063833 3100594 2929247 2685068
42072 2685068 2545619 2607056 2840468 3160833 3499432 3788987 3932155 3863263 3642676 3422002
42062 3422002 3289328 3199423 3088084 3002498 3056062 3269258 3509085 3593263 3426327 3042642
42052 3042642 2566019 2148531 1909652 1879567 1979031 2066481 2028323 1842580 1566094 1266250
42042 1266250 966371 645084 263998 -214728 -814718 -1517297 -2242505 -2867916 -3261582
42033 -3261582 -3300969 -2912175 -2149843 -1222564 -366119 334808 958517 1570277 2092713 2385018
42023 2385018 2400497 2214481 1926043 1584023 1198036 782910 398689 165528 203795 513269
42013 513269 932466 1265805 1439439 1494159 1458925 1309915 1058461 804884 666548 681692
42003 681692 794601 900409 902887 781397 621026 530195 501748 394649 82154 -412113
41993 -412113 -944526 -1377942 -1655125 -1797709 -1881797 -1984048 -2101237 -2141656 -2043612 -1889081
41983 -1889081 -1848575 -2010404 -2300821 -2570215 -2716858 -2721730 -2610986 -2424304 -2216753 -2068576
41973 -2068576 -2063519 -2220610 -2435939 -2532020 -2406638 -2117053 -1785211 -1450470 -1072730 -655756
41963 -655756 -271556 69176 493864 1146012 2008282 2890754 3579289 3964554 4052696 3906491
41953 3906491 3589554 3145091 2622006 2123365 1802200 1773949 2031199 2456616 2903284 3244060
41943 3244060 3375832 3236293 2833937 2238491 1542448 857414 331015 96895 160675 353946
41933 353946 437433 259783 -174487 -752936 -1335669 -1806447 -2098910 -2213844 -2218484 -2212495
41923 -2212495 -2268049 -2385342 -2512535 -2622283 -2758244 -2982476 -3279011 -3533750 -3611904 -3435955
41913 -3435955 -3001439 -2372530 -1689227 -1134477 -834843 -780885 -856029 -935453 -954369 -918795
41903 -918795 -892035 -960338 -1171423 -1494842 -1853715 -2187985 -2473878 -2701243 -2859854 -2935706
41893 -2935706 -2895440 -2696949 -2360722 -2018522 -1827789 -1810395 -1807037 -1612620 -1145563 -498257
41883 -498257 125943 512121 535844 235496 -210486 -600120 -807773 -790325 -555449 -161166
41873 -161166 292426 728078 1144203 1567277 1957948 2198558 2172199 1831598 1212818 435742
41863 435742 -305259 -811646 -990368 -894190 -651167 -370965 -108751 135488 414982 793523
41853 793523 1248938 1626420 1741359 1552720 1212635 928979 797815 788120 867463 1094263
41843 1094263 1559783 2253851 3020739 3666081 4102811 4383035 4594224 4744482 4756822 4556513
41833 4556513 4139491 3557522 2865944 2108364 1341798 647230 98150 -282000 -534834
41824 -534834 -748086 -1011557 -1360119 -1742459 -2062896 -2272921 -2407260 -2508971 -2541000 -2420593
41814 -2420593 -2152051 -1888582 -1837992 -2120162 -2716842 -3514575 -4358869 -5096862 -5631980 -5961434
41804 -5961434 -6141524 -6208624 -6148067 -5935407 -5578392 -5108492 -4556405 -3954295 -3343856 -2753598
41794 -2753598 -2165841 -1528176 -821077 -126701 373368 493353 171642 -470962 -1198884
41785 -1198884 -1806919 -2234939 -2576406 -2980429 -3510552 -4060008 -4401396 -4341631 -3847413 -3042336
41775 -3042336 -2123484 -1302214 -775763 -667480 -955499 -1486939 -2088208 -2660551 -3188829
41766 -3188829 -3709726 -4283718 -4940423 -5603530 -6094139 -6249227 -6027814 -5485023 -4686054
41757 -4686054 -3702691 -2673257 -1788245 -1180549 -849583 -699560 -630004 -592693 -596691 -671242
41747 -671242 -806403 -932615 -981545 -958033 -922362 -918587 -966427 -1103641 -1356224 -1654436 -1865624
41736 -1865624 -1958289 -2063943 -2312096 -2656768 -2936755 -3059580 -3034223 -2849760 -2437907 -1788126
41726 -1788126 -1023481 -319226 214413 555539 739539 843506 955706 1107317 1237784
41717 1237784 1242150 1042932 630730 87699 -416845 -714386 -765395 -676799 -575263 -501529
41707 -501529 -441150 -385918 -305460 -110308 271385 783133 1257305 1534669 1529071 1211206
41697 1211206 617130 -109437 -748181 -1118728 -1158517 -899834 -421494 165200 733212 1180732
41687 1180732 1448349 1499620 1324204 977954 585813 268457 63085 -81485 -244145 -465504
41677 -465504 -718052 -924520 -1007370 -925676 -680424 -320936 42836 288109 391925 464435
41667 464435 608151 769325 809749 716951 640204 683655 752942 669782 378342 -27193 -431512
41656 -431512 -777301 -1039918 -1202416 -1271160 -1281372 -1287625 -1367323 -1597683 -1970841 -2341025
41646 -2341025 -2517286 -2428957 -2169058 -1867090 -1552156 -1157512 -638185 -62985 413379 674136
41636 674136 739772 734277 753935 798336 840409 914376 1078608 1303061 1445850 1360040 1013090
41625 1013090 512600 34296 -297426 -499723 -703880 -1013268 -1395940 -1739648 -1989076
41616 -1989076 -2187664 -2405521 -2685751 -3056237 -3521270 -4012153 -4397162 -4581620 -4580457 -4483279
41606 -4483279 -4388217 -4385912 -4547616 -4866875 -5231881 -5509131 -5653114 -5692684 -5613936 -5316590
41596 -5316590 -4723603 -3904947 -3042780 -2262999 -1527536 -710768 232379 1193074 1989640
41587 1989640 2493156 2677981 2592940 2311943 1892959 1356803 712496 18129 -600633 -1015793
41577 -1015793 -1169802 -1070107 -744809 -247590 311878 804374 1169679 1443207 1688969 1930391
41567 1930391 2139738 2249972 2165720 1808656 1190352 436879 -260408 -708368 -765187 -422301
41557 -422301 121274 525772 536828 166585 -363395 -840122 -1195102 -1459768 -1662567 -1802252
41547 -1802252 -1888025 -1962856 -2079880 -2267211 -2514971 -2782142 -3005954 -3113353 -3049117 -2815963
41537 -2815963 -2490639 -2190698 -2014899 -1998836 -2101713 -2228399 -2296316 -2314795 -2388147 -2610841
41527 -2610841 -2965727 -3349043 -3676515 -3924117 -4082613 -4139983 -4124126 -4101727 -4097592 -4054547
41517 -4054547 -3909068 -3676733 -3432927 -3244044 -3156385 -3216176 -3432797 -3713559 -3877005 -3760102
41507 -3760102 -3329951 -2725502 -2205011 -1997085 -2124117 -2357825 -2393150 -2093989 -1567048 -1014586
41497 -1014586 -553478 -175151 170459 490009 734298 848981 838927 787085 797624 904351
41487 904351 1030826 1045906 869100 533341 147284 -207821 -535733 -865923 -1151612 -1270019
41477 -1270019 -1139049 -798113 -350501 136893 638508 1108728 1479178 1723642 1885991
41468 1885991 2033049 2199731 2370164 2475091 2407518 2081517 1495479 727330 -122476 -958552
41458 -958552 -1685021 -2235014 -2620751 -2905757 -3099923 -3113341 -2836555 -2242559 -1401404 -437161
41448 -437161 504861 1291742 1850670 2172595 2254706 2081361 1698703 1261658 932667 734717
41438 734717 554149 281646 -107280 -609245 -1247030 -2011865 -2784321 -3362966 -3577577 -3375546
41428 -3375546 -2837793 -2146514 -1514072 -1086799 -884666 -825191 -799462 -738851 -654711 -644392
41418 -644392 -830281 -1247017 -1789003 -2295584 -2680160 -2949782 -3122018 -3186269 -3162066 -3138065
41408 -3138065 -3202573 -3344287 -3447134 -3382753 -3111682 -2724655 -2395684 -2250948 -2241052 -2162728
41398 -2162728 -1853180 -1364008 -913765 -676237 -653073 -750061 -918749 -1182230 -1547405 -1942318
41388 -1942318 -2256609 -2425774 -2457628 -2378832 -2179013 -1833562 -1380611 -940994 -631437 -462783
41378 -462783 -339386 -149301 155972 538517 880307 1016463 823155 318673 -327409 -905942
41368 -905942 -1301251 -1537294 -1724730 -1962568 -2256275 -2513126 -2634476 -2620929 -2566104 -2539988
41358 -2539988 -2508280 -2388401 -2165249 -1926732 -1790111 -1801715 -1892904 -1922043 -1779232 -1473603
41348 -1473603 -1115783 -809093 -571042 -362157 -155428 52823 276821 538809 823147
41339 823147 1057739 1153391 1053593 749777 272756 -312729 -913853 -1436423 -1828133 -2097062
41329 -2097062 -2271114 -2331404 -2204225 -1837063 -1268369 -601333 72466 691029 1187538 1503107
41319 1503107 1648496 1701718 1718704 1687420 1595110 1491782 1438591 1420070 1354305 1178150 889976
41308 889976 528828 152173 -180989 -452074 -707794 -1004140 -1317198 -1531914 -1517771 -1198506
41298 -1198506 -570800 291762 1237800 2077476 2659765 2929107 2927337 2755993 2518150 2263654
41288 2263654 1986562 1687135 1420294 1256014 1198504 1166060 1038086 698182 60073 -880833
41278 -880833 -1994070 -3043941 -3808223 -4183944 -4204346 -3990651 -3689755 -3416395 -3213536
41269 -3213536 -3052768 -2870060 -2609793 -2263795 -1891603 -1587123 -1392799 -1241396 -995664
41260 -995664 -546150 122572 921218 1680483 2220789 2454963 2428480 2236818 1924708 1507685
41250 1507685 1071490 781957 773129 1050759 1500514 1952600 2249403 2316570 2199128 1997043
41240 1997043 1748959 1405980 924648 351567 -185273 -524165 -507827 -51868 760295 1667843
41230 1667843 2364735 2662924 2550565 2143724 1610149 1104168 719480 477747 349937
41221 349937 277633 193230 63801 -75076 -161939 -194747 -240782 -353371 -518487 -701984
41211 -701984 -912772 -1192023 -1562023 -2003447 -2464864 -2890872 -3269407 -3647549 -4051313 -4383411
41201 -4383411 -4467629 -4235887 -3830735 -3488947 -3360312 -3460271 -3728521 -4062641 -4329241 -4419174
41191 -4419174 -4297519 -3968124 -3415099 -2628349 -1668885 -659055 280892 1049807 1558555
41182 1558555 1789374 1866236 1986413 2233951 2482942 2502618 2141582 1418002 480264 -492528
41172 -492528 -1375175 -2111911 -2660234 -2947537 -2926165 -2671977 -2374338 -2182344 -2064853 -1847339
41162 -1847339 -1395856 -761920 -146980 270427 465942 533408 549853 515800 421679 310710
41152 310710 236877 197269 154616 110590 113367 199245 360019 556276 728249 810098 780091
41141 780091 689939 597768 476962 247841 -88886 -404013 -554042 -512588 -371541 -250075
41131 -250075 -231447 -357793 -636635 -1033274 -1456836 -1758467 -1773644 -1415626 -746110 63411
41121 63411 842531 1480569 1907814 2096936 2111164 2088659 2118114 2147625 2054606 1782132 1361898
41110 1361898 825447 159977 -635079 -1502275 -2371621 -3222155 -4059115 -4838338 -5451063
41101 -5451063 -5801714 -5887671 -5782742 -5538778 -5120827 -4464091 -3603628 -2725805 -2054473 -1667399
41091 -1667399 -1434518 -1147432 -695783 -100540 597128 1411046 2339802 3266602 3998443
41082 3998443 4412888 4524074 4403643 4101044 3676577 3253598 2957984 2803351 2684166
41073 2684166 2488975 2186416 1805419 1387220 983121 657527 446412 318804 209890
41064 209890 98155 38117 117155 385650 817506 1317734 1766931 2083838 2274349 2428599
41054 2428599 2656691 3010317 3460560 3944440 4411216 4811061 5070569 5132275 5024352 4842346
41044 4842346 4631177 4313829 3770054 2972280 2024136 1089173 311874 -213227 -442037
41035 -442037 -366754 -3276 579967 1209016 1638062 1708499 1472456 1113959 758007 404378
41025 404378 28865 -331703 -614457 -783468 -813493 -670738 -347521 119515 692988 1350148
41015 1350148 2011661 2497999 2631323 2395148 1966815 1594570 1459477 1628326 2076598
41006 2076598 2721904 3448107 4127046 4647122 4948495 5037300 4949893 4703906 4315261 3871376
40996 3871376 3536560 3429178 3498938 3566948 3496847 3308243 3129874 3075718 3171823 3365521
40986 3365521 3575954 3750001 3899219 4085276 4345218 4613138 4726216 4538903 4053927
40977 4053927 3439173 2902980 2549601 2356299 2272264 2307609 2511723 2877861 3288505 3568810
40967 3568810 3609563 3448653 3226820 3056781 2942492 2819993 2633213 2337682 1874474 1220438
40957 1220438 472851 -181726 -614142 -826257 -858346 -684657 -258181 375968 1083077 1758927
40947 1758927 2400041 3039830 3642559 4074682 4175154 3868761 3241668 2509432 1884280
40938 1884280 1451992 1165166 930800 685051 409018 127658 -80755 -96987 180559 761383
40928 761383 1523887 2244156 2694066 2762099 2509241 2109526 1728558 1441076 1226221 1007084
40918 1007084 703612 289488 -175806 -572625 -779613 -704521 -286455 470401 1429863 2323606
40908 2323606 2883194 3005717 2783618 2374149 1869719 1309671 773965 395189 256466
40899 256466 313838 447070 566007 644379 676792 646434 530853 303112 -71646 -598321
40889 -598321 -1192536 -1688275 -1934742 -1894198 -1661043 -1411805 -1326367 -1500866 -1890504 -2336794
40879 -2336794 -2668172 -2789155 -2704392 -2498887 -2296853 -2196844 -2220515 -2334430 -2514252 -2749314
40869 -2749314 -2982895 -3105298 -3043168 -2828748 -2556566 -2297776 -2072183 -1862706 -1626935 -1332759
40859 -1332759 -1020554 -798141 -736164 -800386 -926361 -1119692 -1424189 -1825510 -2265620 -2745311
40849 -2745311 -3332422 -4046379 -4790017 -5421835 -5861490 -6114350 -6233269 -6268910 -6215328 -5986505
40839 -5986505 -5488850 -4745516 -3916435 -3159220 -2482522 -1760630 -885059 113740 1086471
40830 1086471 1891684 2502575 2989212 3396272 3660557 3678159 3446931 3110786 2858287 2795572
40820 2795572 2899383 3034234 2994015 2586253 1756956 666560 -370586 -1056242 -1268865
40811 -1268865 -1108007 -798368 -529505 -362538 -272132 -247854 -324096 -515174 -750294 -885816
40801 -885816 -784000 -406494 136343 640177 954438 1090877 1171617 1280691 1394871 1440193
40791 1440193 1355798 1091116 601058 -108933 -949884 -1788885 -2518373 -3085806 -3477564 -3683742
40781 -3683742 -3669650 -3396327 -2900740 -2341315 -1908449 -1674785 -1568832 -1494631 -1423488 -1361084
40771 -1361084 -1296266 -1224134 -1170168 -1145736 -1112695 -1029027 -899683 -752737 -599976 -450232
40761 -450232 -323142 -220938 -132753 -97302 -196421 -428234 -643793 -686362 -556823 -371165
40751 -371165 -202509 -64491 -22118 -196010 -632187 -1251344 -1941836 -2618583 -3176560 -3493491
40741 -3493491 -3541242 -3431114 -3298490 -3194301 -3121795 -3099588 -3116508 -3077707 -2876990 -2504571
40731 -2504571 -2033771 -1537893 -1081980 -757885 -633401 -653803 -652226 -472904 -57101 563362
40721 563362 1280068 1905563 2234381 2165092 1755641 1155150 511711 -55509 -459314 -675949
40711 -675949 -765317 -830130 -949132 -1145760 -1397351 -1661578 -1910589 -2149911 -2388339 -2582565
40701 -2582565 -2632733 -2447728 -2009961 -1387865 -718773 -176697 104061 123062 17962 -57147
40691 -57147 -57116 -50199 -134049 -366406 -730749 -1118872 -1379131 -1453330 -1467663 -1627075 -2000173
40680 -2000173 -2448936 -2779670 -2913848 -2893601 -2780683 -2603334 -2373612 -2104321 -1815418 -1560206
40670 -1560206 -1436117 -1524071 -1798275 -2110342 -2274286 -2181215 -1871319 -1528851 -1380918 -1530916
40660 -1530916 -1849782 -2043690 -1857151 -1232730 -307568 702973 1611943 2302435 2728583
40651 2728583 2908434 2910993 2824810 2710543 2569981 2369050 2103657 1841049 1687031 1710816
40641 1710816 1901755 2190217 2502761 2801283 3074232 3295016 3413943 3425487 3434032 3591235
40631 3591235 3931274 4303719 4508555 4469147 4236713 3873561 3411380 2907509 2447385 2060389
40621 2060389 1695661 1317273 982041 796836 834116 1100960 1536886 2015219 2401227 2650650
40611 2650650 2812424 2906636 2860105 2615073 2245356 1885672 1568922 1200237 675224 -32025
40601 -32025 -860646 -1650970 -2155996 -2183906 -1785582 -1246834 -859750 -736566 -838185 -1082947
40591 -1082947 -1371047 -1584954 -1664895 -1662250 -1647773 -1588656 -1395640 -1088142 -824720 -733532
40581 -733532 -776293 -838196 -920287 -1172040 -1712211 -2446128 -3081358 -3319323 -3036459 -2317925
40571 -2317925 -1367718 -402801 409421 983959 1334280 1547868 1715627 1870012 1993710
40562 1993710 2085679 2201055 2404842 2680980 2911300 2984378 2938858 2963014 3206968 3599014
40552 3599014 3891243 3903007 3687907 3441149 3276989 3139834 2921581 2615458 2330347 2173519
40542 2173519 2142861 2135244 2050657 1880427 1688939 1516097 1323126 1054973 742577 510401
40532 510401 474961 657403 997760 1412482 1801788 2032692 1993294 1703755 1341000 1106188
40522 1106188 1064571 1135284 1226171 1342544 1561843 1941139 2468776 3073263 3642503 4045808
40512 4045808 4177580 4003049 3566544 2961239 2286605 1608046 936699 260028 -394519
40503 -394519 -945907 -1329997 -1561891 -1697708 -1755484 -1719714 -1616444 -1529423 -1527203 -1616219 -1782805
40492 -1782805 -2036250 -2373668 -2727874 -2987238 -3059511 -2897928 -2488769 -1854588 -1072904 -263924
40482 -263924 456549 1015712 1391150 1601418 1695189 1743247 1831346 2038508 2391509 2832486
40472 2832486 3249494 3544982 3660446 3548267 3174264 2575958 1879342 1215237 633792
40463 633792 127941 -286909 -561961 -672743 -648472 -552982 -475581 -526927 -781113 -1197653
40453 -1197653 -1635159 -1961521 -2126834 -2123915 -1927006 -1515048 -946755 -381567 -14294 19772
40443 19772 -297061 -876150 -1593137 -2360509 -3139124 -3893413 -4556945 -5047845 -5309983 -5346769
40433 -5346769 -5233832 -5090268 -5003980 -4975120 -4949993 -4900745 -4830234 -4698496 -4410671 -3925268
40423 -3925268 -3341555 -2830505 -2490719 -2302071 -2189150 -2071302 -1865089 -1521072 -1101725
40414 -1101725 -783870 -735748 -988059 -1427195 -1884550 -2213814 -2321135 -2183195 -1859104 -1467890
40404 -1467890 -1137788 -964160 -985771 -1171283 -1437775 -1718790 -2024829 -2415132 -2906277 -3438964
40394 -3438964 -3945967 -4414503 -4850268 -5210349 -5417941 -5428147 -5228720 -4785859 -4063755 -3130922
40384 -3130922 -2192756 -1464065 -1024127 -818793 -758235 -756781 -713082 -544266 -267089 6576
40374 6576 185310 284132 386815 556071 788765 1019375 1153276 1140466 1041839 983927 1018640
40363 1018640 1064766 1023209 912551 839560 853791 876436 760157 381510 -298269 -1193513
40353 -1193513 -2103130 -2813388 -3223481 -3359154 -3281593 -3042877 -2743355 -2557152 -2617647 -2863565
40343 -2863565 -3028919 -2809940 -2067997 -913522 374116 1517210 2370737 2929242 3248478
40334 3248478 3393388 3452173 3540007 3726315 3944997 4009053 3756561 3209139 2589139 2165506
40324 2165506 2068082 2243424 2563377 2926595 3242813 3390708 3282148 2971868 2634121 2399447
40314 2399447 2251653 2099645 1894056 1631335 1290851 841557 311107 -206246 -631703
40305 -631703 -964666 -1246911 -1483937 -1626626 -1632599 -1525613 -1368341 -1173052 -877609 -452997
40295 -452997 -16476 228984 188394 -46656 -342370 -681924 -1115544 -1598003 -1976625 -2155802
40285 -2155802 -2201810 -2255803 -2396488 -2616962 -2875026 -3098380 -3160899 -2929914 -2378409 -1641042
40275 -1641042 -943037 -466703 -269150 -294739 -435354 -573095 -596636 -432180 -97436 282921
40265 282921 548217 605033 464199 197255 -117394 -420309 -693150 -975124 -1325740 -1742797
40255 -1742797 -2132373 -2384758 -2474535 -2471066 -2461722 -2486115 -2540174 -2615406 -2710905 -2801978 -2809113
40244 -2809113 -2629166 -2233561 -1740612 -1354394 -1195810 -1192577 -1149347 -924973 -541759 -150808
40234 -150808 76600 38308 -257700 -697612 -1117732 -1401739 -1565058 -1761204 -2189905 -2955309
40224 -2955309 -3970333 -4988244 -5748993 -6121958 -6127746 -5850576 -5365413 -4757319 -4163862
40215 -4163862 -3726397 -3466075 -3234747 -2832512 -2187013 -1407701 -675366 -109848 259033
40206 259033 455351 548891 657931 887223 1238034 1618423 1963758 2308107 2704084 3108754
40196 3108754 3403033 3510331 3437317 3194488 2749708 2113405 1432878 930664 732472 786774
40186 786774 957691 1156311 1361408 1554096 1687040 1721044 1660009 1542187 1415776 1318409
40176 1318409 1245714 1127560 866229 425095 -127370 -664163 -1063996 -1227796 -1096361 -719379
40166 -719379 -290192 -39363 -66036 -303674 -652213 -1087649 -1612835 -2153727 -2572513 -2786191
40156 -2786191 -2835141 -2828845 -2850699 -2922747 -3034675 -3175104 -3323045 -3416592 -3352210 -3041843 -2482846
40145 -2482846 -1765050 -1007210 -300196 285072 665091 760911 564074 175419 -237939 -538562
40135 -538562 -686467 -726356 -724666 -735932 -824201 -1071239 -1513847 -2072113 -2574994 -2869627
40125 -2869627 -2893192 -2657722 -2221702 -1694216 -1213021 -866815 -648560 -508261 -430743 -433132
40115 -433132 -504482 -582830 -589473 -471449 -232216 48785 240264 239022 35891 -297930 -664999
40104 -664999 -967806 -1123572 -1105396 -959518 -742284 -448552 -41761 451330 915552 1215171
40094 1215171 1256327 1001444 481320 -197893 -908523 -1579980 -2190229 -2674512 -2894331 -2733206
40084 -2733206 -2211950 -1506387 -870772 -519436 -506830 -684590 -813652 -758033 -567081 -380733
40074 -380733 -298161 -332443 -415547 -411316 -191462 234563 691974 987107 1057194 951672 730359
40063 730359 451311 213949 111144 124945 133864 37588 -166878 -419880 -640522 -728227
40053 -728227 -602454 -285043 100021 445923 752940 1073180 1397458 1631564 1671272 1482344
40043 1482344 1123355 703682 301158 -84918 -471358 -777910 -825767 -483529 214248 1120595
40033 1120595 2106281 3087916 3962592 4601573 4940425 5040704 5044055 5088508 5268560 5618335
40023 5618335 6077220 6479026 6627207 6424422 5942905 5361809 4817312 4297024 3685270
40014 3685270 2933603 2191759 1739847 1752449 2120779 2524766 2689089 2561814 2257335 1883662
40004 1883662 1481217 1109952 903265 965538 1238689 1537620 1734628 1866079 2037076 2268228
39994 2268228 2490057 2673468 2899751 3262798 3720357 4076440 4122714 3797786 3222856 2604953
39984 2604953 2103044 1745750 1429669 990922 319961 -551507 -1471649 -2286928 -2932894
39975 -2932894 -3398793 -3629734 -3510825 -2958729 -2002773 -775239 535555 1706928 2520292
39966 2520292 2866468 2842419 2713301 2745512 3059450 3618511 4322819 5094742 5887308 6637239
39956 6637239 7235496 7564780 7575400 7321106 6922577 6508596 6183685 6002066 5925059 5814593
39946 5814593 5518878 4990172 4308452 3586822 2868141 2110510 1249280 270287 -749955
39937 -749955 -1662696 -2327077 -2695539 -2824348 -2807835 -2717508 -2591773 -2441846 -2253772 -2022270
39927 -2022270 -1808463 -1731173 -1859068 -2121126 -2356929 -2454731 -2422784 -2341029 -2273751 -2220390
39917 -2220390 -2116568 -1884431 -1518861 -1134125 -894289 -876571 -1009908 -1141839 -1138742 -926959
39907 -926959 -496301 84550 668497 1095899 1293553 1319698 1317062 1411888 1623718 1842678
39897 1842678 1901765 1704456 1306085 877980 592177 528336 659911 897086 1136865 1294229
39887 1294229 1317719 1205489 1025036 908396 989516 1304984 1740562 2086884 2173035 1974699
39877 1974699 1612600 1243963 937515 643703 287766 -116291 -461651 -656951 -714755 -723178
39867 -723178 -752625 -806996 -842943 -803167 -635875 -318172 117231 584691 987469 1264643
39857 1264643 1406247 1433059 1368480 1237777 1100095 1065853 1249385 1687575 2315186 3019648
39847 3019648 3694042 4235631 4549891 4611876 4510382 4385470 4319924 4316590 4359701 4441439
39837 4441439 4526780 4556182 4517989 4481245 4518619 4609566 4636223 4456173 3977773 3223979 2379310
39826 2379310 1744926 1560433 1818036 2258147 2564099 2573064 2335451 2029492 1841926 1886910
39816 1886910 2169037 2588889 3001323 3308823 3524366 3739952 4015411 4289928 4410991
39807 4410991 4261873 3869604 3399289 3048846 2932259 3031876 3244874 3479827 3714379 3962713
39797 3962713 4207217 4391977 4484979 4518238 4554865 4635810 4761359 4889344 4933183 4799832
39787 4799832 4470671 4029113 3571890 3102162 2543147 1849105 1069202 312215 -306242
39778 -306242 -682129 -749312 -527361 -121920 348484 814965 1242343 1587413 1805989 1882200
39768 1882200 1815596 1588560 1184512 644059 71108 -438385 -868135 -1277735 -1732953 -2231941
39758 -2231941 -2679582 -2935906 -2921543 -2697248 -2423993 -2221453 -2069809 -1863805 -1550010 -1188202
39748 -1188202 -892264 -751296 -807819 -1052539 -1393373 -1658960 -1695722 -1479301 -1109830 -704399
39738 -704399 -327445 -15656 195388 307731 388831 520942 736067 1023175 1366322 1726967
39728 1726967 2006803 2094579 1974104 1753914 1574902 1515415 1593929 1818224 2187867 2657941
39718 2657941 3132135 3498017 3665389 3590499 3292218 2847443 2353255 1885212 1491580 1212803
39708 1212803 1082131 1099323 1214748 1349000 1430354 1420226 1318884 1162281 1017032 964628
39698 964628 1061524 1288203 1537986 1683413 1676651 1581571 1496394 1452403 1402832 1298836 1139387
39687 1139387 929986 625231 161688 -445255 -1080492 -1639150 -2133748 -2644317 -3168005
39678 -3168005 -3583367 -3798647 -3880875 -3965285 -4053711 -3990367 -3670323 -3203614 -2804865 -2546674
39668 -2546674 -2289945 -1857757 -1213832 -445897 368935 1223793 2127090 3047866 3929502
39659 3929502 4716588 5342551 5723355 5813930 5679287 5477150 5342516 5285098 5196536 4944974
39649 4944974 4466537 3798692 3053278 2345657 1719900 1135370 536174 -71212 -620574
39640 -620574 -1049925 -1334640 -1468952 -1464809 -1387970 -1348320 -1398981 -1445050 -1290617 -797360 4612
39629 4612 950911 1856754 2586725 3046653 3168659 2950527 2505315 2021185 1625544 1291290
39619 1291290 904525 416167 -112643 -610722 -1077733 -1530707 -1922127 -2172125 -2258939 -2215669
39609 -2215669 -2046770 -1718772 -1253955 -773329 -399581 -136414 129089 515638 1044069
39600 1044069 1610497 2045883 2241388 2250031 2240433 2318526 2419898 2412529 2272668 2100890 1982109
39589 1982109 1903954 1822637 1731063 1617837 1423142 1116580 805369 687354 859715 1198461
39579 1198461 1448716 1428397 1152116 796588 571772 598710 857850 1226240 1574119 1846647
39569 1846647 2062964 2242582 2346661 2303114 2081252 1722928 1305724 912202 652761 670214
39559 670214 1044640 1672518 2288761 2652600 2707215 2552731 2306666 2031638 1764904 1540888
39549 1540888 1359933 1176193 945558 669117 381525 128194 -26330 -607 250090 681726
39539 681726 1182694 1642838 1989330 2175386 2175191 2002997 1714294 1366711 979298 536699
39529 536699 36533 -465636 -864724 -1078404 -1123477 -1109658 -1143741 -1244702 -1354532 -1403889
39519 -1403889 -1343347 -1143755 -827250 -500289 -289832 -203368 -85317 240149 789766 1409995
39509 1409995 1924189 2252125 2402663 2414838 2330467 2179342 1952849 1612585 1152186 628981
39499 628981 107186 -399110 -875576 -1218444 -1270812 -977308 -455328 123241 686267 1261079
39489 1261079 1858438 2419078 2867159 3155808 3246361 3095977 2703659 2150137 1570843 1097581
39479 1097581 817481 738816 768736 765572 665615 551373 558980 724095 952874 1140194 1276155
39468 1276155 1425195 1632273 1869439 2057928 2126960 2059055 1886122 1637626 1299013 838134
39458 838134 268525 -338712 -909612 -1409492 -1829068 -2168590 -2458850 -2759727 -3087427 -3350491
39448 -3350491 -3405363 -3192414 -2795980 -2368176 -2023851 -1812462 -1735901 -1742311 -1727531 -1612106
39438 -1612106 -1439287 -1355662 -1463518 -1712900 -1961298 -2114218 -2176433 -2192931 -2195776 -2208309
39428 -2208309 -2241816 -2258642 -2179041 -1965619 -1682065 -1429605 -1230192 -1005146 -675665 -266463
39418 -266463 93063 259663 177936 -77766 -344512 -461343 -343185 -3016 457240 868660
39408 868660 1051966 911237 497898 -21713 -472814 -769868 -945846 -1096759 -1267378 -1373470
39398 -1373470 -1268769 -916563 -462962 -103132 92031 166390 136362 -45113 -365476 -676033
39388 -676033 -796627 -669314 -377318 -38487 294180 653057 1106299 1671957 2265366 2752979
39378 2752979 3069956 3256128 3365901 3385298 3262319 2975941 2539817 1980717 1362986 797038
39368 797038 352900 -27938 -473903 -1028466 -1594319 -2026287 -2228143 -2162807 -1848817 -1395921
39358 -1395921 -998058 -824544 -905606 -1130574 -1331212 -1348960 -1073878 -504422 205205 809825
39348 809825 1145798 1253419 1313631 1459454 1659267 1784903 1773215 1698216 1685499 1779684
39338 1779684 1914228 1999896 2012095 1978175 1904316 1755948 1522086 1268109 1090166 1022881
39328 1022881 1024430 1055543 1131752 1268818 1404458 1419027 1236378 881544 445704 20583
39318 20583 -343822 -659264 -982872 -1339125 -1638495 -1706724 -1426543 -846347 -149906 451481
39308 451481 791098 767526 358945 -367480 -1278443 -2222539 -3077542 -3783429 -4340220 -4757627
39298 -4757627 -5014263 -5104807 -5124087 -5233033 -5489250 -5743000 -5749381 -5374958 -4679857 -3845597
39288 -3845597 -3072422 -2504161 -2164870 -1952756 -1745808 -1527802 -1381486 -1366578 -1452131 -1570619
39278 -1570619 -1684859 -1777478 -1806768 -1698210 -1376069 -819402 -121265 518111 910101 1009731
39268 1009731 909367 716497 492700 311591 292759 518237 946076 1451062 1933289 2357517
39258 2357517 2714896 2995061 3193809 3313734 3350410 3293746 3141640 2901852 2589548 2236263
39248 2236263 1891228 1595981 1356564 1143824 915792 648358 371696 181197 176738 366962
39238 366962 656604 950161 1240476 1564017 1901233 2183215 2398824 2634715 2974876 3393334
39228 3393334 3783859 4076514 4281158 4419186 4463910 4375843 4160909 3850101 3442950 2933181
39218 2933181 2398738 2001062 1849485 1901414 2040006 2217567 2466820 2797575 3159056 3503665
39208 3503665 3805438 3986922 3906385 3488772 2844448 2207037 1762551 1564040 1575676 1733570
39198 1733570 1954041 2128364 2144836 1925855 1458268 802893 66046 -653723 -1287469 -1765559
39188 -1765559 -1998178 -1920453 -1556034 -1022744 -482787 -85716 85464 57216 -62326 -201009
39178 -201009 -410601 -796890 -1364561 -1983044 -2520089 -2951061 -3289705 -3452337 -3273607 -2684407
39168 -2684407 -1836653 -1022908 -488113 -329019 -528354 -1015435 -1681937 -2397100 -3056360
39159 -3056360 -3603872 -3988847 -4134918 -4002185 -3669814 -3308720 -3062543 -2978625 -3034778 -3167949
39149 -3167949 -3260407 -3162784 -2790518 -2192927 -1509653 -874249 -364235 -4084 215042 299181
39139 299181 216789 -72824 -535733 -1039484 -1441584 -1679405 -1758019 -1697994 -1538180 -1348975
39129 -1348975 -1180263 -1011202 -800802 -567881 -362514 -174667 52959 310225 488327
39120 488327 500668 394424 307846 339893 482953 660186 805865 920472 1054536 1220481
39110 1220481 1319178 1187417 741763 67713 -632430 -1158384 -1390440 -1314475 -1022210 -677470
39100 -677470 -441287 -401081 -549039 -802740 -1048700 -1206054 -1279397 -1340650 -1442835 -1558162
39090 -1558162 -1606205 -1526279 -1315172 -1021770 -733076 -554805 -573284 -818647 -1259076 -1817490
39080 -1817490 -2383968 -2825270 -3012339 -2870522 -2434746 -1875338 -1450589 -1378886 -1710970 -2316642
39070 -2316642 -2998943 -3618974 -4125788 -4513389 -4788001 -4961623 -5027653 -4919821 -4521801 -3760680
39060 -3760680 -2711576 -1599474 -673627 -60858 270129 417061 434827 310666 15445
39051 15445 -437524 -960427 -1393206 -1567629 -1428881 -1108880 -836327 -736888 -730571 -646250
39041 -646250 -429326 -215492 -198372 -439190 -811927 -1120774 -1249931 -1198663 -1013095 -743484
39031 -743484 -475064 -330968 -374722 -519353 -587714 -472816 -203895 145068 561273 1083962
39021 1083962 1723929 2419969 3056126 3504023 3672484 3546638 3178064 2628655 1933704
39012 1933704 1122499 254738 -573104 -1241789 -1632546 -1680737 -1443148 -1098616 -846258 -781703
39002 -781703 -853998 -918835 -840432 -591312 -287329 -104277 -128203 -290511 -454799 -536288
38992 -536288 -514496 -372232 -89826 289445 630914 775647 637902 245138 -296164 -866529
38982 -866529 -1375482 -1748629 -1892358 -1711376 -1191793 -453694 311641 964373 1467724 1832977
38972 1832977 2046208 2059027 1833698 1386621 797479 186906 -317344 -609882 -636791 -429726
38962 -429726 -115220 138853 210580 63616 -279715 -762214 -1280489 -1702810 -1946425 -2023471
38952 -2023471 -1982427 -1826919 -1527072 -1086600 -550308 40218 640655 1152590 1442394 1448123
38942 1448123 1242191 966864 727922 562105 476086 485529 620519 901745 1298719 1707534
38932 1707534 1995869 2094451 2044255 1953752 1922609 2002033 2194099 2461470 2740686 2956469
38922 2956469 3028510 2888319 2527576 2034292 1546028 1153402 878229 750409 842786 1169722
38912 1169722 1574914 1793687 1663247 1262319 842119 632550 697658 928456 1144502 1218651
38902 1218651 1139443 978929 815517 691155 623609 628570 716403 878878 1091102 1324124
38892 1324124 1551242 1748405 1902235 2028428 2179871 2414972 2731090 3027574 3162877
38883 3162877 3069102 2799299 2450657 2063312 1619838 1123531 633252 218542 -85628 -280046
38873 -280046 -404423 -555591 -849637 -1313646 -1830206 -2229888 -2434774 -2485476 -2446488 -2331118
38863 -2331118 -2115223 -1775046 -1302940 -736976 -198920 146933 223932 119335 800 -27087
38853 -27087 39079 166019 321807 455532 507696 472245 410492 372950 331146 211440 -26733
38842 -26733 -374429 -812742 -1324482 -1859026 -2313661 -2571409 -2564457 -2313542 -1919721 -1510470
38832 -1510470 -1169132 -900045 -658026 -405509 -135472 147892 440287 708192 857042
38823 857042 759191 343710 -329827 -1089790 -1744433 -2155084 -2246477 -2006277 -1513568 -935421
38813 -935421 -430448 -35728 329748 755632 1268870 1859173 2507300 3157096 3711590 4110635
38803 4110635 4395049 4654320 4917277 5116118 5144386 4938640 4541238 4117946 3878880 3923649
38793 3923649 4162251 4411875 4549918 4547186 4405568 4144010 3830839 3544401 3285002 2989382
38783 2989382 2647068 2340542 2156157 2126944 2286321 2684051 3271721 3827360 4084697 3931896
38773 3931896 3434790 2699219 1793370 801300 -139123 -900066 -1427470 -1713903 -1750531 -1552464
38763 -1552464 -1214578 -892891 -711216 -694062 -783990 -895362 -938565 -825975 -512432 -55529
38753 -55529 393761 700686 848946 917929 977423 1044134 1133135 1292846 1561159 1921833
38743 1921833 2330321 2753261 3155853 3477735 3653356 3642958 3433906 3053980 2616291 2305915
38733 2305915 2257379 2449370 2752849 3054765 3287494 3381617 3295928 3115742 3035031 3181404
38723 3181404 3493405 3807263 4029884 4187979 4340167 4497619 4632758 4729163 4808426 4915121
38713 4915121 5071927 5243251 5354011 5353287 5245976 5048817 4727315 4195121 3381605 2306289
38703 2306289 1100152 -48616 -991974 -1678400 -2115616 -2306891 -2269654 -2109919 -2008146
38694 -2008146 -2086431 -2319656 -2609694 -2911712 -3241312 -3584046 -3860189 -3985621 -3931745 -3728977
38684 -3728977 -3451281 -3196270 -3032535 -2947760 -2877875 -2795683 -2732071 -2689934 -2577660 -2275062
38674 -2275062 -1763439 -1164534 -647304 -305828 -119191 -7128 86190 155194 162689 91490
38664 91490 -36398 -176629 -282544 -314893 -247689 -60202 289157 861868 1671985 2614751
38654 2614751 3502135 4196793 4698314 5090199 5430081 5710668 5900161 5989777 6017470 6072502
38644 6072502 6255774 6588049 6948961 7137354 7008436 6549026 5838670 4976909 4052855
38635 4052855 3145320 2324368 1662110 1242827 1126253 1273975 1538172 1767835 1933031
38626 1933031 2121529 2407413 2739621 2964699 2949413 2690265 2334102 2100703 2149142 2479093
38616 2479093 2963879 3504522 4145793 5004702 6074900 7140729 7917215 8255413 8184441
38607 8184441 7793602 7154723 6371241 5613234 5016027 4548656 4034856 3317874 2391944
38598 2391944 1397854 540310 7240 -94097 226842 868390 1703549 2619736 3515007
38589 3515007 4304588 4949237 5447050 5782550 5917825 5856757 5682122 5485654 5273222 4977381
38579 4977381 4567732 4128035 3819921 3769712 3961761 4212616 4266005 3960808 3338139 2598604
38569 2598604 1967126 1580935 1440768 1415161 1315754 1029093 588691 102941 -357968 -758356
38559 -758356 -1017083 -1028080 -787919 -432649 -100954 197627 542343 976305 1473593 1996509
38549 1996509 2518854 2995659 3367477 3619257 3814467 4058147 4428322 4927716 5476210
38540 5476210 5946536 6219275 6211425 5876286 5224995 4366131 3475887 2684489 2019387 1498163
38530 1498163 1229674 1336654 1778764 2333105 2781626 3070065 3269839 3459610 3700593
38521 3700593 4074488 4655281 5428301 6280481 7090399 7819912 8530218 9335510 10336402
38512 10336402 11564481 12969690 14459509 15948276 17373561 18691113 19875121 20907726
38504 20907726 21741516 22279831 22423786 22147642 21522212 20681353 19793121 19049403 18625598
38495 18625598 18606432 18950198 19536726 20252173 21042304 21921519 22955941 24227208 25793476
38486 25793476 27687473 29957736 32694445 35993631 39903918 44436402 49640694 55670192
38478 55670192 62784626 71311154 81597322 93957876 108633877 125825873 145820575
38471 145820575 169111234 196376158 228285645 265180510 306586377 350519126 392870456
38464 392870456 427587787 448197230 450249058 433293395 401078261 359865118 316001033
38457 316001033 274130578 236687787 204392236 177056612 154165501 135093971 119149886
38450 119149886 105648540 94035314 83939299 75124971 67439691 60809334 55203154
38443 55203154 50522507 46532740 42962653 39682370 36746649 34254879 32199344 30448292
38435 30448292 28819211 27133727 25250253 23124874 20867974 18708227 16861551 15412826
38427 15412826 14304170 13417244 12666785 12036371 11545760 11195328 10947600 10757360 10600183
38418 10600183 10460061 10308400 10122863 9919272 9727556 9522732 9211207 8719289 8094143
38409 8094143 7500825 7116729 7022428 7162292 7379399 7503541 7452823 7273678 7072372 6907907
38399 6907907 6771080 6656805 6600604 6613207 6629070 6592401 6593106 6846953 7495247 8445442 9438766
38388 9438766 10258929 10849926 11254796 11497143 11547063 11377285 11022128 10577605 10149124 9792347
38378 9792347 9494901 9215889 8946952 8731058 8612482 8560733 8441132 8071240 7336957 6286982
38368 6286982 5120725 4060601 3209143 2517334 1882371 1265494 721068 338191 169181
38359 169181 194511 329874 472759 569748 648112 771380 966458 1210805 1484726 1801535
38349 1801535 2171216 2565856 2954200 3353790 3803830 4274848 4638094 4752582 4575933
38340 4575933 4176114 3647439 3040875 2377072 1696735 1068335 543469 119722 -244074
38331 -244074 -580464 -883287 -1114052 -1227637 -1200330 -1055617 -872699 -751658 -741023 -787206
38321 -787206 -766500 -588462 -286686 -16197 48795 -156697 -530947 -862508 -951583 -698911
38311 -698911 -118742 682969 1525722 2198980 2564559 2642498 2568927 2452823 2297408 2070529
38301 2070529 1803880 1571426 1385047 1164701 822476 342363 -229224 -830719 -1399575
38292 -1399575 -1870391 -2195833 -2366524 -2395310 -2293387 -2078994 -1799423 -1526097 -1330755 -1268085
38282 -1268085 -1352597 -1524018 -1654176 -1631170 -1446939 -1184926 -929839 -719108 -573415 -518403
38272 -518403 -541984 -557129 -448986 -169164 221001 593957 844254 959944 1024866 1136491
38262 1136491 1306700 1455638 1510710 1483992 1428798 1347311 1182483 889763 471391 -61320
38252 -61320 -707081 -1424428 -2089032 -2538220 -2665682 -2477587 -2085798 -1669564 -1419636 -1462850
38242 -1462850 -1794767 -2266393 -2642410 -2710130 -2392436 -1794884 -1132771 -578106 -158075 207598
38232 207598 591707 992224 1344407 1548827 1486870 1067326 310448 -615524 -1471701 -2080116
38222 -2080116 -2389866 -2442145 -2303365 -2034213 -1692737 -1338648 -1029307 -815216 -734970 -806566
38212 -806566 -1020067 -1335489 -1684394 -1984130 -2178898 -2287708 -2400419 -2596357 -2853514 -3049566
38202 -3049566 -3064309 -2880322 -2586134 -2296934 -2078585 -1926582 -1790976 -1625233 -1440408 -1325679
38192 -1325679 -1396770 -1697529 -2140614 -2539646 -2694885 -2467972 -1833084 -912680 41837 768562
38182 768562 1150312 1261049 1252118 1207044 1116266 954134 723780 430161 76705 -269816
38172 -269816 -451983 -325925 91339 601357 956351 1008262 762922 347862 -59694 -321423
38162 -321423 -397972 -319954 -97514 310476 917229 1628596 2283848 2775799 3111811 3367499
38152 3367499 3608242 3852322 4079077 4256367 4364889 4394539 4313916 4063700 3608226 2988996
38142 2988996 2297395 1586193 827851 -28492 -965452 -1859647 -2525964 -2820103 -2742646 -2460207
38132 -2460207 -2199601 -2094245 -2123987 -2182230 -2163020 -1980207 -1559402 -874409 -3755 872236
38122 872236 1551698 1912980 1978485 1906507 1900928 2081661 2413134 2752448 2963272 2986152
38112 2986152 2829225 2537191 2188797 1897980 1772339 1845936 2060142 2328177 2619732 2968506
38102 2968506 3396000 3850328 4233543 4470081 4528364 4394866 4064120 3557101 2925574 2236548
38092 2236548 1567713 1001116 582284 289776 87988 8232 116427 377701 617285 675937
38082 675937 579130 503265 592163 852727 1211105 1600867 1972209 2258304 2375103 2262183
38072 2262183 1927965 1464174 1003014 630532 332565 34181 -313297 -695088 -1063989
38063 -1063989 -1378580 -1616421 -1782054 -1909065 -2029456 -2127976 -2138467 -1994685 -1687086 -1281252
38053 -1281252 -886336 -580191 -337646 -47051 368841 852170 1255826 1479007 1522129 1418945
38043 1418945 1173857 793268 343609 -54833 -282153 -261248 15684 458739 878507 1051696
38033 1051696 835664 256600 -498375 -1188723 -1642401 -1784587 -1575108 -982376 -64789
38024 -64789 959897 1806339 2314905 2544037 2688820 2935751 3351819 3823383 4090771 3926505
38014 3926505 3332259 2528661 1735120 1008088 305731 -372234 -966360 -1417130 -1670387
38005 -1670387 -1661250 -1370450 -890396 -383318 21059 260184 317857 237949 136175 119251
37995 119251 183383 246513 282417 368537 595511 976477 1443770 1881127 2162558 2230532
37985 2230532 2156045 2064033 1983549 1838447 1611248 1433545 1446970 1628440 1835249 2002934
37975 2002934 2219457 2592010 3094625 3567176 3830432 3787428 3447566 2892939 2235124 1598647
37965 1598647 1121340 923477 1037046 1368581 1763381 2127278 2487758 2933257 3484701
37956 3484701 4015389 4307153 4220799 3829862 3364308 3000925 2724444 2409373 2007230 1614469
37946 1614469 1373523 1357014 1552111 1903848 2331115 2712633 2899583 2782236 2374759 1839541
37936 1839541 1392820 1143801 1026395 913684 785346 735546 818206 957247 1057885 1156583
37926 1156583 1377592 1735794 2051836 2105267 1846007 1427444 1061938 889958 971822 1323361
37916 1323361 1896614 2546004 3080008 3378055 3436844 3289164 2913500 2268416 1408601 520770
37906 520770 -172756 -523483 -474633 -35620 701562 1542917 2264786 2744809 3007903 3140904
37896 3140904 3194059 3172660 3073760 2888412 2597718 2220226 1854191 1618802 1544324 1565975
37886 1565975 1639405 1807037 2106764 2449927 2650495 2581016 2269565 1848756 1447834 1133311
37876 1133311 896058 649743 262804 -350600 -1138100 -1911444 -2459251 -2674862 -2590649 -2305777
37866 -2305777 -1897279 -1408188 -906702 -519484 -373877 -504476 -833549 -1249622 -1695129
37857 -1695129 -2173618 -2684899 -3166979 -3503422 -3589903 -3409894 -3066846 -2748655 -2637286 -2803953
37847 -2803953 -3146924 -3429825 -3428499 -3092749 -2579991 -2123552 -1869045 -1831297 -1960144 -2186009
37837 -2186009 -2401024 -2462099 -2265851 -1813700 -1183796 -459103 284820 933406 1327497 1349544
37827 1349544 1030658 566506 209398 122754 327123 773396 1430238 2257071 3104721 3721172
37817 3721172 3919699 3731042 3352971 2962312 2615792 2319255 2119514 2082524 2210785 2432679
37807 2432679 2680454 2950732 3268546 3597800 3810850 3774420 3478428 3064317 2702249 2440606
37797 2440606 2191628 1854531 1418118 937789 456977 -9498 -433304 -761143 -958600
37788 -958600 -1041228 -1047290 -994538 -880608 -718906 -552644 -422669 -330098 -246792 -167592 -140158
37777 -140158 -230699 -465451 -818667 -1249968 -1724288 -2182964 -2522035 -2635000 -2485010 -2123860
37767 -2123860 -1641360 -1109131 -571826 -72521 328589 561979 579594 389668 61850 -315353
37757 -315353 -687539 -1037518 -1343249 -1567257 -1713986 -1878721 -2195233 -2713547 -3338408 -3892031
37747 -3892031 -4222845 -4253808 -3965275 -3381822 -2590411 -1745226 -1018317 -517493 -231981 -52159
37737 -52159 139215 368008 552710 598368 507982 387332 338973 369155 399703 341721 143435
37726 143435 -198211 -627265 -1032330 -1295062 -1347776 -1179194 -811455 -318052 143372 386891
37716 386891 335273 78311 -239484 -572077 -981850 -1514505 -2105896 -2613894 -2910363 -2936948
37706 -2936948 -2698323 -2212677 -1458723 -383118 1002634 2520880 3853607 4702714 4943076
37697 4943076 4648445 4011880 3248115 2521105 1905052 1394223 954556 568186 239082
37688 239082 -19536 -197131 -310083 -424312 -623131 -926642 -1261829 -1537080 -1728353 -1862513
37678 -1862513 -1929930 -1850948 -1534198 -954094 -185968 607969 1245617 1629652 1803694 1884664
37668 1884664 1941105 1965772 1956598 1965384 2040536 2165366 2289936 2390600 2450482 2402807 2161270
37657 2161270 1728412 1228448 789716 408849 -24708 -558115 -1065891 -1348766 -1332529 -1129242
37647 -1129242 -896817 -687907 -470296 -251056 -111581 -125529 -305729 -643831 -1136474 -1729811
37637 -1729811 -2281216 -2633788 -2727216 -2613019 -2381877 -2110819 -1865149 -1698965 -1628079 -1615248
37627 -1615248 -1597415 -1533175 -1428142 -1310224 -1168954 -927249 -499026 123469 861485 1612794
37617 1612794 2269847 2683820 2713527 2380793 1918831 1582799 1439692 1412624 1479511 1699830
37607 1699830 2039282 2302879 2316668 2100995 1794348 1464657 1076281 610739 138186 -230606
37597 -230606 -409008 -357498 -100130 269820 640449 949601 1180151 1300457 1263249 1078956
37587 1078956 843870 663565 576358 581623 710276 1006216 1428319 1820639 2023341 2008103
37577 2008103 1880509 1755078 1657500 1553078 1432490 1334965 1298222 1316938 1353619 1371285
37567 1371285 1356716 1332428 1345193 1417662 1504693 1519870 1416291 1226281 1017344 830756
37557 830756 671960 537446 435403 400156 504397 835267 1422150 2178210 2923996 3480147
37547 3480147 3758307 3796770 3726403 3686440 3751050 3925743 4188024 4488449 4712554 4711925 4436704
37536 4436704 4021262 3684695 3539955 3531004 3546938 3542992 3532001 3509099 3439050 3312378 3172441
37525 3172441 3064148 2963068 2772524 2407362 1892702 1378206 1038037 939882 1007018 1109538
37515 1109538 1191458 1308985 1551544 1932580 2353691 2663072 2746940 2585277 2246800 1834770
37505 1834770 1417864 999223 554370 91990 -341996 -710462 -989684 -1117709 -1001780
37496 -1001780 -634724 -170570 180659 320050 267734 39006 -380387 -915115 -1357834 -1513314
37486 -1513314 -1337808 -898387 -263855 498892 1281260 1984997 2611205 3226795 3836655
37477 3836655 4333500 4567997 4431743 3900987 3069246 2135682 1293610 605132 16264
37468 16264 -507770 -911801 -1125572 -1167504 -1153164 -1213104 -1389250 -1579868 -1599807 -1337463
37458 -1337463 -847465 -256157 394473 1142646 1963717 2722486 3295692 3677465 3937712
37449 3937712 4141662 4347081 4613968 4947276 5247090 5353702 5131892 4515235 3540775
37440 3540775 2395066 1374108 707768 403815 289141 191278 53565 -91791 -194128
37431 -194128 -216915 -151979 -36861 52848 49676 -56099 -202218 -288688 -249794 -121324 -42877
37420 -42877 -179118 -614425 -1290854 -2022940 -2586049 -2832752 -2749844 -2410904 -1900854 -1314499
37410 -1314499 -793588 -484528 -427793 -521277 -604442 -553342 -317948 51642 398824 564491
37400 564491 544509 479761 447248 340791 31559 -424159 -839278 -1116641 -1306264 -1457323
37390 -1457323 -1526868 -1458553 -1264198 -996152 -711736 -499438 -470084 -661210 -973073 -1227674
37380 -1227674 -1271167 -1022973 -492772 209327 926065 1568037 2153440 2697720 3097590 3186552
37370 3186552 2909789 2405856 1907057 1578987 1444228 1410622 1346165 1159302 860406 564227
37360 564227 411516 465831 684758 987299 1320103 1636508 1844882 1840910 1603915 1218758
37350 1218758 788878 370699 6865 -239989 -334641 -304180 -170026 114852 588794 1160562
37340 1160562 1640248 1898139 1947191 1883134 1808613 1812305 1946229 2196360 2516137 2886875
37330 2886875 3289538 3630169 3788364 3766699 3702921 3680582 3595793 3271265 2649163 1817405
37320 1817405 907830 47392 -636400 -1064799 -1267438 -1325157 -1251544 -992830 -547659 -17265
37310 -17265 491281 962765 1440428 1923797 2331453 2554480 2529588 2270610 1849031 1353454
37300 1353454 870457 492493 306367 340058 531410 784513 1063018 1403809 1833081 2294563
37290 2294563 2678997 2914953 3017194 3049795 3055891 3030882 2955289 2830036 2665135 2455534
37280 2455534 2205780 1976021 1854930 1857991 1880988 1791177 1558924 1278421 1065266 947858
37270 947858 847934 655232 339062 3294 -188503 -164423 -5444 160467 296741 461452
37260 461452 704548 1013756 1347285 1655717 1858039 1855454 1617499 1241627 896760 702726
37250 702726 666591 719910 797738 878840 962935 1032423 1062112 1072553 1150037 1389415 1819486
37239 1819486 2392038 3025781 3637480 4139646 4438502 4450812 4131523 3508568 2707610 1921794
37229 1921794 1320278 969424 830997 807570 780834 654374 415203 150331 -30411 -85462
37219 -85462 -38500 89647 306792 620286 1017685 1461246 1867314 2120388 2166815 2082060
37209 2082060 1986173 1903356 1770226 1568080 1352906 1140829 868644 523587 230510 132734
37199 132734 232268 413562 587105 745359 909718 1092275 1295686 1495121 1636492 1702699
37189 1702699 1756289 1854923 1945023 1906439 1684692 1300882 745325 -26979 -955299 -1816579
37179 -1816579 -2383866 -2611508 -2628841 -2596560 -2611050 -2696436 -2812610 -2876094 -2825978 -2675603
37169 -2675603 -2475780 -2247728 -1992296 -1743821 -1552222 -1403611 -1210795 -903498 -490689
37160 -490689 -17290 493042 1011501 1454958 1727499 1821177 1830962 1838131 1792142 1533079 935865
37149 935865 30017 -1007277 -1951908 -2630714 -2969448 -3005445 -2870102 -2716658 -2611999 -2488859
37139 -2488859 -2228367 -1799339 -1302170 -877312 -599759 -472589 -484954 -639373 -941638 -1405830
37129 -1405830 -2061029 -2903354 -3825477 -4629743 -5140341 -5301758 -5181766 -4917875 -4658867
37120 -4658867 -4491522 -4377789 -4198555 -3902443 -3581380 -3355199 -3220846 -3087626 -2940613
37111 -2940613 -2878457 -2976602 -3199089 -3481893 -3821283 -4207930 -4520953 -4569568 -4240199 -3567547
37101 -3567547 -2690647 -1793407 -1059205 -596566 -382748 -323765 -382132 -605910 -1028478 -1595295
37091 -1595295 -2212369 -2816203 -3357054 -3750991 -3903051 -3777384 -3420553 -2925614 -2392484
37082 -2392484 -1901309 -1483849 -1118607 -782843 -518644 -430404 -605133 -1031716 -1584007 -2069223
37072 -2069223 -2309102 -2212563 -1798618 -1164662 -446571 200354 640687 846450 946205 1123033
37062 1123033 1418754 1659499 1609556 1191592 534207 -174746 -831772 -1411699 -1879289 -2167413
37052 -2167413 -2247243 -2185458 -2111142 -2135036 -2311994 -2668492 -3233391 -4015766 -4953479 -5903959
37042 -5903959 -6701271 -7223925 -7415063 -7269624 -6836917 -6228832 -5579642 -4968832 -4399419
37033 -4399419 -3867075 -3418809 -3102250 -2874857 -2624890 -2301603 -1976617 -1738086 -1554892
37024 -1554892 -1296985 -886701 -387029 69066 398808 596015 668331 601308 411141 215849
37014 215849 206710 502329 1022467 1542422 1904788 2161853 2474937 2884414 3226829 3289523
37004 3289523 3003436 2461312 1793033 1078304 366564 -283221 -817917 -1224079 -1514029
36995 -1514029 -1671539 -1629226 -1329354 -828915 -329604 -53730 -57558 -184994 -228561 -114206
36985 -114206 97435 348165 643624 976108 1262873 1403037 1356664 1141330 803893 444715
36975 444715 219726 231628 418627 620887 775160 983162 1349540 1791053 2053081 1910024
36965 1910024 1335769 509107 -300540 -853210 -1001381 -704267 -30878 838072 1646711
36956 1646711 2160770 2262310 1956123 1306585 409754 -575140 -1433824 -1994246 -2209418
36947 -2209418 -2123642 -1785277 -1231878 -540285 166160 774759 1221163 1474559 1531995 1448044
36937 1448044 1332161 1269243 1232546 1090577 716765 110483 -573768 -1118479 -1384217 -1381549
36927 -1381549 -1224263 -1030188 -860103 -710656 -538747 -325006 -159878 -247925 -757614 -1633996
36917 -1633996 -2581640 -3247677 -3423089 -3113910 -2505129 -1877071 -1469892 -1339569 -1347800 -1334275
36907 -1334275 -1292863 -1350379 -1591840 -1950207 -2262301 -2390242 -2284102 -1972049 -1523191 -1009936
36897 -1009936 -483749 22688 475660 828346 1026022 1024540 824037 505733 224924 127394
36887 127394 235250 405112 421322 172867 -234418 -557847 -644545 -580429 -591859 -811494
36877 -811494 -1176672 -1535076 -1768994 -1800592 -1576983 -1136715 -645136 -275290 -61579 72042
36867 72042 168806 207025 198105 215437 295062 383817 426790 443633 467907 457764 326456 45852
36855 45852 -316494 -649890 -873289 -989763 -1096476 -1303214 -1596987 -1808762 -1756011 -1410266
36845 -1410266 -905987 -420181 -80324 58149 30670 -34635 -6075 126136 245916 244908
36835 244908 119667 -75383 -308882 -550146 -695667 -590487 -151493 547006 1312900 1943575
36825 1943575 2309904 2399353 2331663 2319487 2549174 3047329 3655336 4149089 4398877 4434301
36815 4434301 4385353 4372723 4425137 4460284 4340172 3975384 3399389 2743857 2144020 1671406
36805 1671406 1338679 1134706 1045269 1058776 1158776 1297928 1387620 1349110 1188230 994148
36795 994148 849702 758599 656110 449885 45023 -601103 -1389964 -2084142 -2473033 -2545309
36785 -2545309 -2458603 -2346285 -2204217 -1967196 -1632902 -1278830 -1000342 -872004 -940078 -1196302
36775 -1196302 -1545616 -1827630 -1900093 -1725643 -1400609 -1104299 -994050 -1114263 -1387023 -1680252
36765 -1680252 -1878965 -1910641 -1755420 -1476781 -1229999 -1183675 -1392843 -1757204 -2125473 -2429238
36755 -2429238 -2683941 -2869914 -2877817 -2615155 -2128640 -1561039 -1005637 -476451 -21678 230560
36745 230560 193094 -82161 -492776 -1009879 -1616965 -2163422 -2413900 -2284433 -1942733 -1621778
36735 -1621778 -1391789 -1160058 -834000 -414657 41136 485023 907489 1347203 1865604
36726 1865604 2477013 3103088 3614334 3908194 3944821 3754049 3446258 3176450 3034360 2977178
36716 2977178 2910462 2810103 2707320 2579945 2348715 1995734 1607895 1269900 979663 709528
36706 709528 486517 349275 270189 195531 147712 217772 445042 748674 991915 1092304
36696 1092304 1078801 1078124 1238779 1617197 2115572 2552866 2803442 2848355 2710000 2399079
36686 2399079 1950047 1460260 1045151 759798 577167 419281 196310 -140075 -533626
36677 -533626 -835064 -932852 -877452 -835418 -913771 -1066517 -1179534 -1197297 -1138376 -1036169 -929365
36666 -929365 -899841 -1047036 -1384707 -1795981 -2135509 -2367904 -2566446 -2775756 -2924350 -2900186
36656 -2900186 -2677258 -2324574 -1908934 -1441530 -922856 -387639 120422 587440 1024115
36647 1024115 1454929 1932928 2523042 3227486 3950585 4576442 5060069 5400775 5551490
36638 5551490 5417619 4948545 4186935 3238063 2249508 1413949 898655 712825 679464 578822
36628 578822 302652 -136473 -681630 -1260211 -1770233 -2107421 -2226793 -2171392 -2054408 -2011014
36618 -2011014 -2115864 -2312516 -2460082 -2483211 -2434508 -2368450 -2210004 -1826778 -1206707 -489455
36608 -489455 160249 631155 840285 753535 479409 255815 269890 517040 860648 1175521
36598 1175521 1403480 1548235 1694052 1981875 2472518 3038749 3467536 3677614 3775794 3888186
36588 3888186 4000287 3999832 3836357 3593097 3409887 3358020 3381839 3344751 3141961 2794726
36578 2794726 2447059 2260576 2289317 2434802 2521642 2440306 2235412 2047358 1957612 1907147
36568 1907147 1784558 1576668 1402593 1407728 1654017 2101760 2643009 3128247 3403008 3372826
36558 3372826 3044386 2495132 1814689 1091479 438016 -14293 -176019 -63960 196985
36549 196985 451686 626812 787960 1075528 1562438 2173068 2749359 3188322 3508170 3802736
36539 3802736 4154535 4564705 4914821 5002192 4684616 4036429 3328800 2811172 2522681 2337459
36529 2337459 2151925 1969793 1830070 1741590 1719401 1823340 2101209 2502659 2879469 3076292
36519 3076292 3031024 2815974 2581008 2412438 2229346 1856525 1216998 405006 -455261 -1353117
36509 -1353117 -2324957 -3293134 -4072749 -4549664 -4784173 -4924182 -5070228 -5231636 -5347266
36500 -5347266 -5324296 -5121494 -4838636 -4673045 -4726911 -4872622 -4846671 -4463939 -3720064 -2726569
36490 -2726569 -1609215 -468398 614329 1561036 2286720 2715829 2834373 2723304 2516946
36481 2516946 2323709 2194768 2148591 2184137 2263810 2326678 2358337 2439543 2687091 3123582
36471 3123582 3618373 3984763 4145917 4195174 4292215 4520003 4847470 5190372 5462113 5576610
36461 5576610 5455774 5063091 4423954 3620982 2789074 2092151 1649226 1470476 1498392 1704467
36451 1704467 2087904 2574068 2994558 3219048 3260505 3207721 3108797 2986782 2927504 3056987
36441 3056987 3415812 3903656 4350082 4600392 4549328 4168547 3540347 2834219 2216272 1766815
36431 1766815 1451849 1137500 660076 -41806 -836014 -1474823 -1788492 -1789904 -1606768 -1372671
36421 -1372671 -1199960 -1186463 -1374192 -1705587 -2063645 -2367355 -2618856 -2868153 -3149910 -3447543
36411 -3447543 -3699198 -3836052 -3825310 -3684083 -3461535 -3216835 -3000548 -2824004 -2636932 -2364558
36401 -2364558 -1990473 -1583919 -1214877 -851576 -384703 224019 841226 1249510 1348288 1249869
36391 1249869 1166024 1219101 1379221 1551929 1672896 1719978 1694936 1624827 1541127 1421318
36381 1421318 1179083 747732 154627 -509933 -1164546 -1746251 -2192852 -2475609 -2627618
36372 -2627618 -2680906 -2591155 -2291179 -1820665 -1344438 -1031218 -951661 -1078480 -1317559 -1538592
36362 -1538592 -1656915 -1717357 -1838520 -2046922 -2227882 -2276526 -2234373 -2218423 -2256022 -2252339 -2104814
36351 -2104814 -1801351 -1412742 -1024961 -678674 -357762 -44732 209198 298731 165396 -142773
36341 -142773 -525206 -906143 -1236665 -1458740 -1506599 -1334151 -935190 -371777 206898 626960
36331 626960 807119 782772 600980 254440 -242916 -782730 -1231969 -1535868 -1698577 -1719497
36321 -1719497 -1629138 -1540965 -1562185 -1662348 -1719302 -1687780 -1628928 -1571999 -1452821 -1218165 -892754
36310 -892754 -493023 36942 724673 1454365 2026982 2314921 2313077 2079320 1698723 1291992
36300 1291992 973642 758524 537008 174711 -360523 -971861 -1522453 -1940395 -2231001
36291 -2231001 -2392142 -2347097 -1997996 -1350299 -555011 190583 774584 1205206 1545729 1836604
36281 1836604 2066369 2193687 2190962 2068824 1857670 1569362 1181730 653803 -44109 -886036
36271 -886036 -1748368 -2434909 -2791275 -2803816 -2572877 -2221420 -1882204 -1742138 -1982865 -2612722
36261 -2612722 -3406900 -4075461 -4478582 -4656055 -4695038 -4629560 -4448059 -4130561 -3662874 -3055259
36251 -3055259 -2369917 -1714010 -1189861 -844718 -650193 -515408 -337391 -69017 254856
36242 254856 562829 810402 994697 1123874 1182062 1109686 822402 297810 -325454 -775710
36232 -775710 -835099 -504054 38789 615117 1150187 1632277 2041476 2327829 2412193 2208218
36222 2208218 1706173 1056624 511189 231829 180202 211906 227803 186999 23370 -352898
36212 -352898 -946442 -1619047 -2168174 -2444510 -2398832 -2073159 -1590654 -1129455 -852087 -835144
36202 -835144 -1061853 -1460579 -1929135 -2344373 -2601506 -2670816 -2604280 -2482977 -2378384 -2361195
36192 -2361195 -2491619 -2748329 -2983829 -3010107 -2753711 -2306013 -1816930 -1373706 -996853 -705019
36182 -705019 -523176 -426380 -320660 -104250 261746 741697 1252279 1679744 1895762 1808713
36172 1808713 1434453 916592 458372 216217 242979 509149 946853 1458159 1904151 2134632
36162 2134632 2065506 1736489 1290006 887737 627637 507850 449766 364607 217528 35895
36152 35895 -140457 -307196 -493596 -730413 -1028993 -1371809 -1699895 -1921160 -1964998 -1839830
36142 -1839830 -1620595 -1375676 -1126375 -884513 -699124 -632522 -694140 -824669 -952965 -1053877
36132 -1053877 -1148587 -1272321 -1455761 -1711629 -1999787 -2207681 -2213991 -2009542 -1740561 -1596406
36122 -1596406 -1651874 -1843661 -2095720 -2420644 -2869931 -3417060 -3938657 -4313905 -4512301 -4580840
36112 -4580840 -4577500 -4527683 -4406254 -4123916 -3551530 -2616803 -1406917 -154129 913052
36103 913052 1715788 2328946 2859914 3334913 3680417 3778252 3537973 2956675 2141096 1263386
36093 1263386 471058 -170069 -652191 -966850 -1085016 -986395 -699104 -322561 -15412 75771
36083 75771 -78898 -358099 -587631 -676532 -640437 -512995 -290696 19345 345044 581869
36073 581869 664423 589034 397318 171921 20551 2126 50232 3094 -264246 -741325
36063 -741325 -1312850 -1861651 -2327317 -2690591 -2944280 -3093517 -3159620 -3159917 -3097264 -2998577 -2953449
36052 -2953449 -3060681 -3307415 -3539315 -3595424 -3450428 -3177827 -2804078 -2288929 -1666469 -1115533
36042 -1115533 -822605 -813770 -973061 -1185093 -1392972 -1546748 -1590618 -1530171 -1458622 -1481669
36032 -1481669 -1633137 -1865096 -2085182 -2197120 -2147187 -1957653 -1699023 -1426071 -1169116 -985950
36022 -985950 -966767 -1150453 -1461911 -1763290 -1951386 -1988913 -1879553 -1662734 -1421270 -1240616
36012 -1240616 -1140335 -1068230 -973562 -869295 -811899 -830176 -880633 -867466 -710820 -416157
36002 -416157 -90960 113579 98079 -119046 -400087 -543996 -382684 112904 787652 1386773
35992 1386773 1734997 1859329 1933257 2097109 2339833 2551933 2663447 2699419 2707805 2676062
35982 2676062 2549781 2319697 2053688 1827007 1634960 1390830 1010084 490906 -84144
35973 -84144 -615542 -1054730 -1419135 -1756383 -2095595 -2419856 -2674805 -2808511 -2811452 -2713564
35963 -2713564 -2538087 -2276988 -1936352 -1593977 -1366959 -1300127 -1311169 -1271593 -1132116 -956357
35953 -956357 -853646 -904805 -1137577 -1536164 -2060956 -2664521 -3282890 -3810273 -4114460 -4112666
35943 -4112666 -3828543 -3358744 -2802866 -2247023 -1775426 -1433251 -1184510 -971540 -828156
35934 -828156 -868729 -1127458 -1454331 -1621978 -1525994 -1256927 -993190 -842997 -767365 -632541
35924 -632541 -358141 -39691 93424 -128837 -669161 -1331303 -1924283 -2359161 -2626539 -2736413
35914 -2736413 -2683609 -2449901 -2051642 -1599010 -1265580 -1146373 -1164525 -1167026 -1089314 -960061
35904 -960061 -765577 -417543 104059 659599 1073701 1310407 1463571 1607346 1731887 1817245
35894 1817245 1886255 1948229 1941439 1783774 1472254 1102147 784432 553749 348728 65786
35884 65786 -365578 -939798 -1587386 -2220996 -2768891 -3172091 -3371601 -3326945 -3059692 -2662645
35874 -2662645 -2238707 -1824966 -1396680 -950938 -548565 -233086 71520 514774 1140571
35865 1140571 1793949 2250244 2419815 2384807 2250108 2022230 1659190 1189120 721272 340866
35855 340866 34115 -259980 -534387 -670063 -520767 -51605 605526 1242822 1724694 2036608
35845 2036608 2196729 2168685 1910613 1497761 1132622 995455 1106880 1364533 1688777 2084493
35835 2084493 2560777 3040516 3383071 3484268 3340712 3037299 2699194 2446414 2356076 2438384
35825 2438384 2640779 2877963 3070973 3184757 3252376 3360557 3589959 3954184 4391807 4809089
35815 4809089 5125623 5298317 5333662 5282666 5198704 5086678 4911857 4672320 4439947 4299709
35805 4299709 4250269 4181022 3940691 3417942 2589688 1556924 554023 -131713 -317911
35796 -317911 -30664 544396 1195821 1767948 2159016 2304580 2180174 1796494 1188288 430508
35786 430508 -341038 -969838 -1363966 -1526618 -1504281 -1348354 -1145072 -1024234 -1069004 -1222982
35776 -1222982 -1337844 -1319758 -1191368 -1010483 -785682 -506020 -212029 25794 210013 462560
35766 462560 937528 1677748 2550601 3315053 3754474 3775343 3432745 2909640 2469729 2365013
35756 2365013 2707082 3389508 4147252 4719529 4983291 4966944 4773741 4502560 4218484 3962639
35746 3962639 3758095 3590314 3398073 3121901 2773552 2427164 2128496 1857653 1614426
35737 1614426 1483200 1532029 1669190 1698359 1538993 1312217 1171913 1126954 1090232 1041862
35727 1041862 1059275 1207115 1468440 1778051 2063196 2252450 2304767 2248485 2156392 2073588
35717 2073588 1997761 1922008 1846604 1738181 1530863 1210055 879735 715455 841612 1249609
35707 1249609 1820622 2421106 2982519 3492742 3919850 4172300 4152422 3834610 3285027 2643910
35697 2643910 2113062 1897520 2066247 2463306 2820988 2980584 2966420 2857559 2666395 2369441
35687 2369441 1987687 1584524 1218445 927505 715538 517129 225661 -187435 -612450
35678 -612450 -916717 -1099517 -1277793 -1536698 -1858937 -2194227 -2514595 -2762327 -2804479 -2516365
35668 -2516365 -1920895 -1209786 -603451 -188653 109747 414961 773233 1132889 1411950
35659 1411950 1562134 1588847 1551372 1544633 1639013 1819063 2004168 2133918 2197652 2172677 1986598
35648 1986598 1577167 956365 187471 -654932 -1455746 -2040465 -2276133 -2202918 -2012821 -1886209
35638 -1886209 -1881047 -1967823 -2107912 -2278488 -2468969 -2680800 -2902540 -3073196 -3110036 -2997955
35628 -2997955 -2819947 -2666607 -2529337 -2304875 -1893740 -1278667 -524262 267542 989658
35619 989658 1531751 1783961 1685059 1293678 790319 371827 141444 109750 261368 561349
35609 561349 910905 1174525 1279198 1241007 1076571 745465 220921 -418402 -1004843 -1370784
35599 -1370784 -1415542 -1146112 -699426 -278146 1579 183349 348360 455659 381875 119281
35589 119281 -141665 -164949 122779 582322 978165 1129908 996033 661148 259475 -83615
35579 -83615 -243837 -91511 427100 1187437 1923697 2407349 2572118 2464366 2132635 1606959
35569 1606959 936932 181340 -627389 -1451011 -2181483 -2671066 -2851747 -2793841 -2636651 -2500669
35559 -2500669 -2479103 -2649208 -3019330 -3473634 -3833098 -4001352 -4030779 -4034930 -4060618 -4062475 -3981285
35548 -3981285 -3818266 -3631581 -3474985 -3345621 -3191743 -2973517 -2707685 -2433696 -2139521
35539 -2139521 -1757355 -1253715 -692530 -169734 298837 775757 1281319 1713505 1907509
35530 1907509 1754828 1260027 519336 -326602 -1139631 -1821813 -2320276 -2603577 -2661840 -2547687
35520 -2547687 -2390160 -2325499 -2399185 -2540064 -2626345 -2576616 -2398872 -2170113 -1956372 -1737848
35510 -1737848 -1430388 -1002986 -553001 -221982 -32848 153259 496724 1007241 1518464
35501 1518464 1821916 1825340 1608071 1356386 1255061 1416067 1857703 2498810 3165804 3655587
35491 3655587 3849513 3782548 3592298 3402315 3252227 3102959 2868370 2457457 1844327 1122815
35481 1122815 463492 -12524 -315679 -544921 -783985 -1047152 -1296929 -1482207 -1564695 -1540311
35471 -1540311 -1452592 -1371867 -1334474 -1290402 -1127680 -775718 -284512 229068 725642 1295640
35461 1295640 2022963 2805427 3358224 3419981 2950246 2136777 1246715 479024 -88035 -472002
35451 -472002 -737042 -948645 -1137719 -1284774 -1345045 -1306375 -1214857 -1116106 -977621 -720646
35441 -720646 -352137 -15182 142178 121589 49704 24639 48633 98635 183606 306495 425088
35430 425088 488014 487020 459794 461732 526725 612275 586782 332760 -112066 -550958 -770042
35419 -770042 -647213 -153148 637231 1487103 2054269 2116463 1739781 1200049 785315 691388
35409 691388 989326 1563706 2116478 2358097 2229162 1894811 1552500 1311322 1205758 1196367
35399 1196367 1150674 949584 659595 503539 604171 831302 954909 876277 648597 347772
35389 347772 17400 -302836 -598381 -926442 -1358942 -1863119 -2295823 -2530797 -2549279 -2405585
35379 -2405585 -2166020 -1905305 -1702800 -1582557 -1471375 -1262744 -933102 -578509 -336656
35370 -336656 -283584 -391204 -548308 -611831 -473377 -119163 367362 877101 1348342 1757139
35360 1757139 2055645 2169490 2074433 1840710 1572902 1324190 1083573 808479 434392 -107854
35350 -107854 -815901 -1557197 -2140815 -2466275 -2580911 -2605080 -2642883 -2747770 -2900717 -2999466
35340 -2999466 -2924902 -2651158 -2261343 -1851094 -1468955 -1155956 -957262 -844023 -695046 -432097
35330 -432097 -130723 77240 171160 214040 166917 -159440 -914753 -2018791 -3191861 -4138916
35320 -4138916 -4694232 -4859832 -4776176 -4637837 -4564076 -4508627 -4300524 -3790653 -2975906 -2002038
35310 -2002038 -1059638 -270002 351838 853334 1289289 1704130 2122934 2515549 2777891
35301 2777891 2795490 2548577 2136622 1685623 1247282 803702 356786 -10439 -169475 -46991
35291 -46991 297803 691018 954736 1024093 973829 945206 1052953 1339960 1775245 2267745
35281 2267745 2699677 2982597 3096074 3067948 2920948 2651414 2257127 1761865 1195624 564594
35271 564594 -128354 -819124 -1353789 -1552658 -1324301 -730289 48908 805506 1379929 1689707
35261 1689707 1733875 1598658 1449164 1465483 1725576 2123384 2423215 2430169 2122904 1627752
35251 1627752 1088012 579686 134986 -198092 -342754 -234038 123890 623826 1083014
35242 1083014 1333957 1308591 1040136 603008 71833 -485134 -1027864 -1574900 -2175077 -2827947
35232 -2827947 -3453002 -3945688 -4239011 -4311461 -4182296 -3920958 -3621061 -3336731 -3077113 -2886136
35222 -2886136 -2879121 -3148820 -3655038 -4242970 -4746300 -5043386 -5066368 -4838830 -4501290 -4230571
35212 -4230571 -4115485 -4148748 -4330742 -4708295 -5276705 -5886081 -6287792 -6274916 -5787270 -4920798
35202 -4920798 -3854413 -2742804 -1662048 -668492 104099 460530 290493 -317817 -1125052
35193 -1125052 -1883511 -2433406 -2714723 -2747159 -2603911 -2367755 -2088212 -1784164 -1492057 -1299416
35183 -1299416 -1307456 -1538923 -1879513 -2128158 -2122902 -1821938 -1274834 -550742 283483 1140775
35173 1140775 1909095 2476848 2765133 2768696 2589396 2390544 2263285 2145008 1905439 1492932
35163 1492932 952112 335229 -309770 -855334 -1099303 -923598 -418042 186797 679328
35154 679328 948705 982793 861080 732814 739168 933424 1275680 1675797 2020464 2198752
35144 2198752 2160619 1959365 1715156 1537849 1490413 1595563 1838324 2164772 2503724 2794987
35134 2794987 2997111 3088976 3073434 2952350 2686372 2224359 1612947 1042399 718322 676954
35124 676954 756676 746929 529805 81645 -600284 -1511254 -2565919 -3538668 -4127874 -4133869
35114 -4133869 -3595275 -2735984 -1777360 -829330 45236 740245 1146245 1254435 1166252 1010952
35104 1010952 895234 908882 1105870 1457129 1856798 2184161 2335847 2219783 1790345 1117038
35094 1117038 369862 -301622 -852640 -1290004 -1576144 -1633559 -1437730 -1073418 -695887 -449577
35084 -449577 -410744 -573583 -870656 -1208501 -1494177 -1644877 -1599874 -1348731 -955201 -543748
35074 -543748 -245603 -139351 -227493 -457696 -755879 -1038128 -1214395 -1217711 -1043536 -743752
35064 -743752 -375691 20478 388262 643071 739474 739713 776087 938536 1214773 1525721
35054 1525721 1784079 1922482 1911166 1777128 1593997 1434883 1327601 1244209 1128555 957176
35044 957176 795773 771924 952936 1264401 1574197 1845908 2148318 2507185 2821241 2968907
35034 2968907 2949470 2864663 2787373 2697372 2525184 2203994 1687231 978308 165402 -611101
35024 -611101 -1249148 -1724047 -2036424 -2168462 -2125268 -1988896 -1883546 -1890403 -2029278 -2312943
35014 -2312943 -2762946 -3345588 -3928676 -4339398 -4455000 -4226429 -3663583 -2864295 -2043894
35005 -2043894 -1446962 -1174622 -1124174 -1128415 -1129049 -1190037 -1381329 -1700891 -2093099 -2489755 -2831313
34994 -2831313 -3091111 -3287634 -3441880 -3523397 -3482067 -3347733 -3257187 -3347891 -3636305 -4015953
34984 -4015953 -4357521 -4592973 -4718720 -4746567 -4664147 -4448934 -4131809 -3840614 -3745091 -3924677
34974 -3924677 -4287131 -4628886 -4777500 -4678901 -4371921 -3915666 -3359925 -2771431 -2251879 -1892632
34964 -1892632 -1695092 -1546659 -1296425 -865655 -288489 341984 949842 1500285 1974602
34955 1974602 2355006 2651460 2928480 3264291 3655650 3982881 4107587 4000196 3732408
34946 3732408 3350854 2824182 2143222 1414272 799456 397979 228691 276206 466944 617237
34936 617237 510824 79025 -533950 -1110237 -1536415 -1841653 -2108431 -2370668 -2569969 -2593671
34926 -2593671 -2380213 -1999029 -1604231 -1304289 -1098320 -929359 -757982 -587526 -471176
34917 -471176 -505139 -761461 -1204914 -1716636 -2211941 -2686410 -3137526 -3513219 -3773174 -3930165
34907 -3930165 -3970765 -3789279 -3276729 -2456248 -1479286 -516509 295840 848407 1097956 1125077
34897 1125077 1078747 1033575 942481 741068 448989 147127 -97761 -250025 -284676 -207732
34887 -207732 -98856 -84296 -225594 -439435 -566298 -543090 -484079 -550979 -751164 -914187
34877 -914187 -879965 -666071 -432961 -335206 -435701 -704977 -1037889 -1301148 -1439676 -1542767
34867 -1542767 -1758455 -2135753 -2579553 -2947595 -3150840 -3172248 -3045387 -2827017 -2548465 -2178917
34857 -2178917 -1667445 -1031404 -377177 170607 535654 696454 679552 568808 484737 516716
34847 516716 674487 912770 1197255 1549575 2040576 2730608 3588819 4463072 5144734 5477959
34837 5477959 5429014 5095582 4672505 4361773 4248948 4262517 4285201 4288923 4318556 4367519 4342885
34826 4342885 4163160 3828838 3378159 2833551 2228577 1646432 1189212 918620 832315 866280
34816 866280 913791 890985 814651 786348 878560 1065126 1275529 1472544 1651532 1812143
34806 1812143 1974646 2190781 2492814 2853197 3229590 3616948 4001111 4278355 4284369 3922382
34796 3922382 3242153 2400895 1577306 911595 475765 270044 249443 349276 478192 515817
34786 515817 366875 33177 -383882 -753793 -980965 -1022055 -883388 -609938 -250427 174247
34776 174247 648781 1113267 1470032 1653526 1666552 1533541 1251394 821272 312985 -146314
34766 -146314 -462931 -639949 -747645 -857919 -1022858 -1282345 -1631821 -1962091 -2074694 -1815611
34756 -1815611 -1213003 -470889 175203 590213 754046 702557 490927 201589 -48863 -138810
34746 -138810 1568 342740 759399 1096061 1249761 1207585 1023722 767435 474818 133724
34736 133724 -268714 -665673 -905907 -875474 -618856 -299559 -48837 101475 158540 136850
34726 136850 119514 261796 647519 1167391 1602655 1824067 1882819 1946589 2194466 2723181
34716 2723181 3457680 4146400 4523913 4520480 4293572 4064556 3968815 4041164 4243106 4447487
34706 4447487 4455550 4114012 3436580 2599752 1828269 1283985 1021985 1004745 1148509 1369358
34696 1369358 1597356 1771945 1860490 1887518 1914906 1977783 2058693 2128274 2178158 2197958 2151464
34685 2151464 2001927 1743847 1397369 1003697 651722 472458 550355 833140 1156621 1364109
34675 1364109 1396176 1294326 1164307 1132389 1279356 1571889 1863409 1986643 1859163 1511624
34665 1511624 1037312 532846 79728 -250643 -413882 -432790 -403704 -431870 -551943 -723611
34655 -723611 -894400 -1029280 -1075163 -957081 -665321 -323898 -109937 -91798 -182005 -254584
34645 -254584 -266394 -248411 -227791 -208045 -211656 -295432 -507066 -838856 -1226268 -1580506 -1823289
34634 -1823289 -1905597 -1807082 -1530147 -1110686 -636986 -232499 12137 99641 112894 140754
34624 140754 214042 294410 307306 197581 -21061 -270467 -480369 -654976 -848079 -1079047
34614 -1079047 -1308526 -1502114 -1673193 -1833171 -1933859 -1907388 -1755124 -1554579 -1371684 -1196116
34604 -1196116 -970107 -655653 -269308 117014 396109 481389 378847 193728 35926 -83925
34594 -83925 -245142 -500182 -783611 -949662 -897054 -649709 -318590 -3806 247096 401178
34584 401178 421181 332606 283712 462114 913113 1468377 1881708 2018015 1900037 1620811
34574 1620811 1269671 929671 677418 544614 492138 439508 322670 138688 -37808 -83099
34564 -83099 90513 440781 781913 879321 579390 -119728 -1085653 -2122634 -3041498 -3694456
34554 -3694456 -3986054 -3897070 -3513962 -2998371 -2479209 -1969205 -1406399 -762178 -70716 638189
34544 638189 1379393 2168909 2984391 3787967 4536573 5130869 5406351 5255448 4760230 4146926
34534 4146926 3594230 3123739 2678696 2245593 1858663 1532129 1255323 1050083 976546 1062639
34524 1062639 1263485 1513243 1787339 2080351 2342361 2486528 2472701 2352535 2213193 2098978
34514 2098978 2010441 1958268 1974943 2063438 2163407 2194548 2133300 2033254 1958896 1894759 1726928
34503 1726928 1330855 684045 -117816 -951499 -1736970 -2400168 -2816858 -2871773 -2587496 -2140745
34493 -2140745 -1718965 -1389529 -1130805 -949532 -912157 -1058743 -1317408 -1516598 -1486816 -1181423
34483 -1181423 -730610 -368101 -271518 -460244 -843645 -1337640 -1902366 -2485943 -2984283 -3274453
34473 -3274453 -3267410 -2929867 -2292142 -1454787 -568032 213423 756362 956546 781849 339379
34463 339379 -139967 -442286 -511617 -445390 -372891 -368353 -463192 -681964 -1034210 -1493550 -2011288
34452 -2011288 -2542588 -3042920 -3447959 -3677583 -3666334 -3392338 -2890587 -2244499 -1542729 -823056
34442 -823056 -78405 647270 1185766 1332045 1037681 481945 -84520 -541570 -916690 -1247744
34432 -1247744 -1506119 -1652551 -1690512 -1636194 -1501175 -1350304 -1318646 -1493818 -1796314 -2041781
34422 -2041781 -2128413 -2122171 -2165745 -2358564 -2725158 -3225324 -3750865 -4157111 -4353552 -4355755
34412 -4355755 -4220783 -3950964 -3497477 -2846518 -2056485 -1196221 -272719 759944 1924327
34403 1924327 3155954 4303798 5181370 5621650 5511443 4823293 3657875 2254822 922477
34394 922477 -79731 -614907 -672599 -357127 131739 590321 955576 1341329 1874771 2493234
34384 2493234 2940070 2968796 2536588 1824177 1118844 667002 553676 657928 739013 613607
34374 613607 276479 -130854 -441407 -558687 -490324 -334537 -216781 -195241 -219403 -200762
34364 -200762 -124965 -76432 -153948 -385412 -733270 -1157259 -1636678 -2123303 -2503887 -2655910
34354 -2655910 -2560485 -2338109 -2146925 -2055005 -2028626 -2012126 -1960976 -1805832 -1471622 -986663
34344 -986663 -523530 -256581 -179005 -108682 119140 499341 895973 1190477 1370839 1499540
34334 1499540 1624840 1735694 1804782 1858147 1959908 2106253 2177466 2054086 1770269 1489180
34324 1489180 1311912 1165911 914731 535377 139056 -164650 -373059 -549839 -710829
34315 -710829 -776673 -642420 -287256 190129 638734 940434 1033477 902922 597987 235928
34305 235928 -83903 -390425 -811715 -1399627 -2016013 -2427064 -2491476 -2242765 -1837386 -1474375
34295 -1474375 -1333728 -1508847 -1954731 -2511327 -2994899 -3289312 -3393083 -3405285 -3435188 -3482838
34285 -3482838 -3416802 -3099182 -2522372 -1804659 -1088245 -486957 -94567 45290 -5175 -111268
34275 -111268 -176270 -181362 -124779 -817 132667 145633 -37294 -338870 -611678 -780699
34265 -780699 -842257 -758947 -454652 62934 640400 1079619 1278115 1262671 1128296 968136
34255 968136 823791 662326 414488 63730 -312855 -614346 -812351 -952005 -1074805 -1183539
34245 -1183539 -1280782 -1385734 -1479659 -1470489 -1262695 -861056 -371071 104911 539239 940958
34235 940958 1284127 1500200 1524949 1336754 972169 532973 165896 2375 106173 473004
34225 473004 1045409 1697792 2242695 2527929 2558770 2497890 2526918 2717985 3024587 3345381
34215 3345381 3579049 3661798 3586563 3364047 2949246 2251489 1262706 151058 -820840 -1462649
34205 -1462649 -1714364 -1583528 -1116418 -450316 186732 602953 766715 779107 743064 691219
34195 691219 623510 560892 538387 569518 643902 755927 919140 1149639 1442489 1762114
34185 1762114 2044000 2206848 2187676 1989484 1688827 1370941 1052899 696852 314692 35498
34175 35498 34966 391812 1020815 1731509 2329608 2681883 2749799 2612570 2447722 2439009 2662784
34164 2662784 3050852 3463925 3803295 4058744 4265904 4439325 4556771 4593150 4542171 4398326
34154 4398326 4143856 3781110 3373376 3026090 2808477 2690818 2560278 2305970 1911492
34145 1911492 1487437 1211484 1215467 1516549 2048531 2729697 3460848 4061315 4273098 3904490
34135 3904490 3000103 1856321 847388 211455 -39300 -59934 -57270 -201108 -574992 -1149577
34125 -1149577 -1782814 -2264518 -2401598 -2112990 -1490628 -779133 -250678 -33082 -31831 -38636
34115 -38636 66425 227164 319140 307653 277189 341702 576964 1027500 1709241 2565971
34105 2565971 3455189 4220905 4779234 5114452 5211337 5037014 4598930 3980175 3281652 2542118
34095 2542118 1749203 926624 166228 -454201 -956769 -1421065 -1854741 -2146111 -2166158 -1898655
34085 -1898655 -1459681 -1018243 -719102 -648577 -818935 -1171771 -1620224 -2096766 -2549552 -2904694
34075 -2904694 -3070092 -2995366 -2717330 -2342135 -1992716 -1762679 -1683425 -1716188 -1795386 -1901449
34065 -1901449 -2085433 -2410831 -2876512 -3400443 -3864274 -4163332 -4230803 -4046339 -3643938 -3115265
34055 -3115265 -2586845 -2153481 -1799519 -1394669 -808467 -49350 722347 1323105 1670197
34046 1670197 1786428 1735598 1591590 1440699 1352312 1323830 1274873 1115151 819728 440009
34036 440009 51093 -303698 -616651 -877724 -1062068 -1176700 -1297467 -1510364 -1805814 -2074276
34026 -2074276 -2232736 -2320796 -2436123 -2602248 -2747378 -2804325 -2783385 -2734430 -2665553 -2514039
34016 -2514039 -2192964 -1680043 -1082280 -596424 -362264 -340241 -346625 -202790 164264 731393
34006 731393 1416632 2092953 2626677 2951404 3089672 3081947 2919724 2575584 2078649 1525316
33996 1525316 1013499 579010 190995 -198185 -591381 -937164 -1203808 -1460251 -1839196
33987 -1839196 -2393140 -3015717 -3532061 -3839572 -3933531 -3835565 -3555595 -3114264 -2555715 -1945922
33977 -1945922 -1402400 -1106119 -1203666 -1665482 -2284216 -2835428 -3203044 -3346350 -3234691 -2892742
33967 -2892742 -2470640 -2178816 -2138256 -2338726 -2732874 -3293674 -3945976 -4503506 -4749135 -4592250
33957 -4592250 -4134753 -3595934 -3183979 -2997769 -2982118 -2952792 -2702487 -2130751 -1292570 -330953
33947 -330953 624428 1497002 2239261 2808249 3173587 3336995 3336078 3227370 3057580 2844928
33937 2844928 2598190 2363130 2230799 2266623 2427434 2575267 2583969 2414883 2091434 1648870
33927 1648870 1145342 687729 380047 227204 117780 -83529 -432161 -867376 -1229588
33918 -1229588 -1313344 -972394 -233220 701451 1591399 2301247 2806616 3107208 3188194 3059824
33908 3059824 2784973 2450246 2132077 1890555 1757556 1708034 1661726 1533843 1284117 925670
33898 925670 514292 132721 -150801 -329723 -437051 -451017 -254763 259278 1043423 1886912
33888 1886912 2559685 2944192 3041230 2906507 2618079 2279300 2008948 1913585 2062087 2451212
33878 2451212 2959143 3347732 3369894 2923484 2114635 1176182 331074 -284068 -619590 -694186
33868 -694186 -582170 -380358 -147174 137559 540837 1088799 1704315 2238836 2579924 2735483
33858 2735483 2810254 2895527 2980514 2967613 2766887 2376674 1885104 1400545 968313 538545
33848 538545 18532 -624672 -1301588 -1840216 -2091465 -2005515 -1636033 -1107477 -580773 -205673
33838 -205673 -54299 -82642 -166349 -185969 -91432 89450 279762 393131 374052 226731
33828 226731 14100 -174804 -268060 -241069 -122317 23472 120323 97658 -98271 -482041
33818 -482041 -1005499 -1570549 -2082423 -2486651 -2747846 -2814886 -2641797 -2245294 -1710977 -1123985
33808 -1123985 -505753 168949 902891 1634791 2257558 2669786 2824368 2749353 2525195 2228812
33798 2228812 1889192 1493848 1036386 558298 147243 -110604 -192958 -170055 -168720 -292948
33788 -292948 -559577 -888763 -1143599 -1193805 -979395 -542570 -2033 510148 893889 1088900
33778 1088900 1081353 929122 762906 725040 886199 1214828 1614923 1985807 2264702 2442146
33768 2442146 2541748 2568432 2476395 2214065 1818216 1448785 1302497 1476456 1909891 2446233
33758 2446233 2937164 3291555 3458755 3412939 3182957 2886117 2692322 2719372 2953084 3272995
33748 3272995 3553275 3735287 3818316 3813334 3728047 3589011 3453421 3380612 3386383 3426530 3432025
33737 3432025 3373534 3300603 3308276 3443198 3633553 3727440 3618648 3331753 2975028 2627107
33727 2627107 2299509 2002191 1794643 1739390 1827844 1984435 2133768 2239534 2295139 2317471
33717 2317471 2351686 2443910 2588639 2714688 2729458 2575824 2270840 1923185 1696853 1700925
33707 1700925 1895076 2132138 2296092 2358888 2306108 2082130 1651792 1065344 412505 -249205
33697 -249205 -872688 -1377958 -1715428 -1962064 -2273600 -2719080 -3210022 -3600591 -3804349 -3802208
33687 -3802208 -3605783 -3265487 -2882991 -2564384 -2360754 -2273769 -2304292 -2463864 -2731742 -3013731
33677 -3013731 -3155554 -3012824 -2529414 -1759677 -823689 135675 943826 1396723 1355635 869419
33667 869419 168883 -485187 -942048 -1174508 -1226635 -1191299 -1201711 -1380159 -1764080 -2272656
33657 -2272656 -2739076 -3002113 -3026569 -2958323 -3018016 -3299735 -3688097 -3986969 -4091803 -4007747
33647 -4007747 -3752079 -3317259 -2731156 -2093624 -1529300 -1131189 -956790 -1039217 -1367975 -1864305
33637 -1864305 -2396081 -2832244 -3099503 -3199037 -3163912 -2996105 -2663858 -2180021 -1667283 -1313486
33627 -1313486 -1254722 -1508749 -2001372 -2617315 -3220378 -3668075 -3854676 -3759390 -3453861 -3057624
33617 -3057624 -2671736 -2339887 -2070138 -1890040 -1857906 -1999465 -2245477 -2460861 -2542010 -2474446
33607 -2474446 -2304599 -2086280 -1865690 -1693605 -1621728 -1675386 -1827365 -1995779 -2074435 -1986287
33597 -1986287 -1729861 -1385026 -1068426 -861725 -760861 -695382 -613629 -545032 -551287 -612587
33587 -612587 -600231 -386885 41977 608887 1238356 1881958 2475538 2946302 3286787 3579037
33577 3579037 3915921 4316858 4730927 5091946 5348585 5464919 5423835 5231499 4913027 4515228
33567 4515228 4111579 3765908 3460483 3085647 2554242 1942678 1488270 1415905 1760552 2353670
33557 2353670 2955629 3378619 3511255 3307447 2815847 2197876 1639031 1206636 827377
33548 827377 422900 16884 -335947 -675966 -1101859 -1597703 -1971614 -2016638 -1714711 -1267080
$$ [...]
##END NTUPLES=NMR SPECTRUM
##END=
