##TITLE=31Pdec_DE-20HK
 D2O 
  24 sc
 24.10.2023
##JCAMPDX= 6.0         $$ Bruker NMR JCAMP-DX V2.0
##DATA TYPE= NMR SPECTRUM
##DATA CLASS= NTUPLES
##ORIGIN= UXNMR, Bruker Analytische Messtechnik GmbH
##OWNER= root
$$ XWIN-NMR		Version 3.5
$$ Tue Oct 24 16:30:59 2023 Russian Standard Time (UT+4h)  she@DPX200
##.OBSERVE FREQUENCY= 81.013821
##.OBSERVE NUCLEUS= ^31P
##.ACQUISITION MODE= SIMULTANEOUS
##.ACQUISITION SCHEME= undefined
##.AVERAGES= 24
##.DIGITISER RES= 16
##SPECTROMETER/DATA SYSTEM= spect
##.PULSE SEQUENCE= zgpg30
##.SOLVENT NAME= CDCl3
##.SHIFT REFERENCE= (INTERNAL, CDCl3, 0, 248.564)
##AUDIT TRAIL= $$ (NUMBER, WHEN, WHO, WHERE, WHAT)
$$ ##TITLE= Audit trail, XWIN-NMR		Version 3.5
$$ ##JCAMPDX= 5.01
$$ ##ORIGIN= Bruker BioSpin GmbH
$$ ##OWNER= she
$$ F:/spectra/data/she/nmr/P31/1/pdata/1/auditp.txt
$$ ##AUDIT TRAIL=  $$ (NUMBER, WHEN, WHO, WHERE, WHAT)
(   1,<2023-10-24 16:30:06.71 +0400>,<she>,<DPX200>,
      <created by zg, POWCHK disabled, PULCHK disabled
       configuration hash MD5:
       00 E9 B6 7A A2 85 ED C7 34 08 36 98 17 FE 4E 26
       data hash MD5: 32K
       94 90 30 43 3C BE FF 3F 8B 65 3F B6 25 69 95 F3>)
(   2,<2023-10-24 16:30:09.21 +0400>,<she>,<DPX200>,
      <Start of raw data processing
       efp BC_mod = 2 LB = 5 FT_mod = 6 PKNL = 1 PHC0 = -10677.62 PHC1 = 76.0864 SI = 64K 
       data hash MD5: 64K
       48 FA 01 7C 78 1B 41 0E F0 3C B5 B6 E2 EC 97 50>)
(   3,<2023-10-24 16:30:23.50 +0400>,<she>,<DPX200>,
      <pk PHC0 = 6.5765 PHC1 = 0 
       data hash MD5: 64K
       1B 52 F1 D5 E7 44 5A 3A AD FE D2 7E D5 01 50 A1>)
(   4,<2023-10-24 16:30:27.78 +0400>,<she>,<DPX200>,
      <abs ABSG = 5 
       data hash MD5: 64K
       4D 18 9B 54 73 02 D4 66 60 25 D4 8E 28 3C 06 A6>)
$$ ##END=
$$ 
$$ hash MD5
$$ D8 34 D6 DA 2E 80 45 DB E6 53 14 24 A8 48 23 6F
##$RELAX= 
##$RELAX= 
##$RELAX= 
##$RELAX= 
##$RELAX= 
##$RELAX= 
##$RELAX= 
##$RELAX= 
##$RELAX= 
$$ Bruker specific parameters
$$ --------------------------
##$DU= <F:/spectra>
##$EXPNO= 1
##$NAME= <P31>
##$PROCNO= 1
##$TYPE= <nmr>
##$USER= <she>
##$AMP= (0..31)
100 100 100 100 100 100 100 100 100 100 100 100 100 100 100 100 100 100 
100 100 100 100 100 100 100 100 100 100 100 100 100 100 
##$AQSEQ= 0
##$AQ_mod= 1
##$AUNM= <au_zg>
##$AUTOPOS= <>
##$BF1= 81.014009
##$BF2= 200.13
##$BF3= 200.13
##$BF4= 200.13
##$BF5= 200.13
##$BF6= 200.13
##$BF7= 200.13
##$BF8= 200.13
##$BYTORDA= 1
##$CFDGTYP= 0
##$CFRGTYP= 5
##$CHEMSTR= <none>
##$CNST= (0..31)
1 1 145 1 1 1 1 1 1 1 1 1 1 1 1 1 1 1 1 1 1 1 1 1 1 1 1 1 1 1 1 1 
##$CPDPRG= <waltz16>
##$CPDPRG1= <>
##$CPDPRG2= <waltz16>
##$CPDPRG3= <>
##$CPDPRG4= <mlev>
##$CPDPRG5= <mlev>
##$CPDPRG6= <mlev>
##$CPDPRG7= <mlev>
##$CPDPRG8= <mlev>
##$CPDPRGB= <>
##$CPDPRGT= <>
##$D= (0..31)
0 1 0 0 0 0 0 0 0 0 0 0.03 2e-05 3e-06 0 0 0 0 0 0 0 0 0 0 0 0 0 0 0 0 
0 0 
##$DATE= 1698150606
##$DBL= (0..7)
120 120 120 11 120 120 24 19 
##$DBP= (0..7)
150 150 150 150 150 150 150 150 
##$DBP07= 0
##$DBPNAM0= <>
##$DBPNAM1= <>
##$DBPNAM2= <>
$$ [...]
##$SUBNAM3= <"">
##$SUBNAM4= <"">
##$SUBNAM5= <"">
##$SUBNAM6= <"">
##$SUBNAM7= <"">
##$SUBNAM8= <"">
##$SUBNAM9= <"">
##$SW= 501.771253377433
##$SWIBOX= (0..15)
0 1 3 0 0 0 0 0 0 0 0 0 0 0 0 0 
##$SW_h= 40650.406504065
##$TD= 32768
##$TD0= 1
##$TE= 0
##$TE2= 300
##$TE3= 300
##$TEG= 300
##$TL= (0..7)
0 120 53 12 22 120 120 120 
##$TP= (0..7)
150 150 150 150 150 150 150 150 
##$TP07= 0
##$TPNAME0= <>
##$TPNAME1= <>
##$TPNAME2= <>
##$TPNAME3= <>
##$TPNAME4= <>
##$TPNAME5= <>
##$TPNAME6= <>
##$TPNAME7= <>
##$TPOAL= (0..7)
0.5 0.5 0.5 0.5 0.5 0.5 0.5 0.5 
##$TPOFFS= (0..7)
0 0 0 0 0 0 0 0 
##$TUNHIN= 0
##$TUNHOUT= 0
##$TUNXOUT= 0
##$USERA1= <user>
##$USERA2= <user>
##$USERA3= <user>
##$USERA4= <user>
##$USERA5= <user>
##$V9= 5
##$VALIST= <valist>
##$VCLIST= <CCCCCCCCCCCCCCC>
##$VD= 0
##$VDLIST= <DDDDDDDDDDDDDDD>
##$VPLIST= <PPPPPPPPPPPPPPP>
##$VTLIST= <TTTTTTTTTTTTTTT>
##$WBST= 1024
##$WBSW= 4
##$XGAIN= (0..3)
0 0 0 0 
##$XL= 0
##$YL= 0
##$YMAX_a= 1660
##$YMIN_a= -2032
##$ZGOPTNS= <>
##$ZL1= 120
##$ZL2= 120
##$ZL3= 120
##$ZL4= 120
##$ABSF1= 248.5645
##$ABSF2= -253.2056
##$ABSG= 5
##$ABSL= 3
##$ALPHA= 0
##$AQORDER= 0
##$ASSFAC= 0
##$ASSFACI= 0
##$ASSFACX= 0
##$ASSWID= 0
##$AUNMP= <proc_1d>
##$AZFE= 0.1
##$AZFW= 0.5
##$BCFW= 0
##$BC_mod= 2
##$BYTORDP= 0
##$COROFFS= 0
##$CY= -3
##$DATMOD= 1
##$DC= 0
##$DFILT= <>
##$DTYPP= 0
##$F1P= 0
##$F2P= 0
##$FCOR= 1
##$FTSIZE= 65536
##$FT_mod= 6
##$GAMMA= 0
##$GB= 0
##$INTBC= 1
##$INTSCL= 6.047779e-11
##$ISEN= 30
##$LB= 5
##$LEV0= 0
##$LPBIN= 0
##$MAXI= 10000
##$MC2= 0
##$MEAN= 0
##$ME_mod= 0
##$MI= 50
##$NCOEF= 0
##$NC_proc= -8
##$NLEV= 6
##$NOISF1= 182.463
##$NOISF2= 159.3651
##$NSP= 0
##$NTH_PI= 0
##$NZP= 0
##$OFFSET= 248.5645
##$PC= 4
##$PHC0= -10671.04
##$PHC1= 76.0864
##$PH_mod= 1
##$PKNL= yes
##$PPARMOD= 0
##$PSCAL= 0
##$PSIGN= 0
##$REVERSE= no
##$SF= 81.0140089999694
##$SI= 65536
##$SIGF1= 159.3651
##$SIGF2= -187.1042
##$SINO= 113.3802
##$SIOLD= 16384
##$SREGLST= <1H.CDCl3>
##$SSB= 0
##$STSI= 65536
##$STSR= 0
##$SW_p= 40650.406504065
##$SYMM= 0
##$S_DEV= 0
##$TDeff= 32768
##$TDoff= 0
##$TI= <>
##$TILT= no
##$TM1= 0
##$TM2= 0
##$TOPLEV= 0
##$USERP1= <user>
##$USERP2= <user>
##$USERP3= <user>
##$USERP4= <user>
##$USERP5= <user>
##$WDW= 1
##$XDIM= 65536
##$YMAX_p= 409610865
##$YMIN_p= -30914515
$$ End of Bruker specific parameters
$$ ---------------------------------
##NTUPLES= NMR SPECTRUM
##VAR_NAME=  FREQUENCY,     SPECTRUM/REAL,   SPECTRUM/IMAG
##SYMBOL=    X,             R,               I
##VAR_TYPE=  INDEPENDENT,   DEPENDENT,       DEPENDENT
##VAR_FORM=  AFFN,          ASDF,            ASDF
##VAR_DIM=   65536,         65536,           65536
##UNITS=     HZ,            ARBITRARY UNITS, ARBITRARY UNITS
##FACTOR=    0.620285442955139, 1,           1
##FIRST=     20137.2065510682, 0,            0
##LAST=      -20513.1999529968, 0,           0
##MIN=       -20513.1999529968, -30914515,   0
##MAX=       20137.2065510682, 409610865,    0
$$ Real data points
##PAGE= N=1
##DATA TABLE= (X++(R..R)), XYDATA
$$ [...]
40142G04744Q7412j70773l29709l69380l10997k04022j19305j10688j65084k10325
$$ 704744 792156 621383 291674 -77706 -388703 -592725 -712030 -822718 -987802 -1198127
40132a198127j90467j24978q1066r5647j37057j36433m6787J13249K54623K77487
$$ -1198127 -1388594 -1513572 -1594638 -1690285 -1827342 -1963775 -2010562 -1897313 -1642690 -1365203
40122a365203J76801Q1824J36989L28324M79542M52645L08348K22442K76199L82441
$$ -1365203 -1188402 -1106578 -969589 -641265 -161723 290922 599270 821712 1097911 1480352
40112A480352L98169K54600j1397k90428m56323m46783l20056k07397j92791k49388
$$ 1480352 1878521 2133121 2121724 1831296 1374973 928190 608134 400737 207946 -41442
40102d1442k82607k07344l05K73770M89931N70387N74353O33598P86281R20633
$$ -41442 -324049 -531393 -531698 -257928 232003 802390 1376743 2010341 2796622 3717255
40092C717255Q95468O67978K93213j33917m98355o89149o71007n15877l30225
$$ 3717255 4612723 5280701 5573914 5439997 4941642 4252493 3581486 3065609 2735384
40083B735384j75557q1341q0462j70727k69685k73507j61589o733J05347J32283
$$ 2735384 2559827 2478486 2398024 2227297 1957612 1684105 1522516 1515783 1621130 1753413
40073A753413P9098L062J411J28187L11011M01744L31033J77927P0103M6233L4223
$$ 1753413 1832511 1835573 1836984 1965171 2276182 2677926 3008959 3186886 3256989 3303222 3337445
40062C337445n9773k57412m83216o21208o15189n23033m53277m41487m16317l05424
$$ 3337445 3277672 3020260 2537044 1915836 1300647 777614 324337 -117150 -533467 -838891
40052h38891j49948p9104j70317l56097m77671m21827k03923O4083K64040L33023
$$ -838891 -988839 -1067943 -1238260 -1594357 -2072028 -2493855 -2697778 -2633695 -2369655 -2036632
40042b036632K73456J43832L8585L4131J21080J99286J65998J4165j64405k68721
$$ -2036632 -1763176 -1619344 -1580759 -1546628 -1425548 -1226262 -1060264 -1046099 -1210504 -1479225
40032a479225k71574k18922j63331j08920k6474P9799J40185P8197r9654k94115
$$ -1479225 -1750799 -1969721 -2133052 -2241972 -2268446 -2188647 -2048462 -1970265 -2069919 -2364034
40022b364034l94262l48722j68008R3458L39687M69238M61573M13849M51599O01421
$$ -2364034 -2758296 -3107018 -3275026 -3181568 -2841881 -2372643 -1911070 -1497221 -1045622 -444201
40012d44201P68714Q24915O96162L96889K7035k68497l89986l58894k88918k73570
$$ -444201 324513 1149428 1845590 2242479 2269514 2001017 1611031 1252137 963219 689649
40002F89649l12781l42764l12041k24238j27350o8985n1750l3864J5214O8294
$$ 689649 376868 34104 -277937 -502175 -629525 -698510 -750260 -784124 -768910 -700616
39992g00616O9158N065o7691p1113L2268K14241L96975M98213M82148L72473K14585
$$ -700616 -631458 -626393 -694084 -765197 -732929 -518688 -121713 376500 858648 1231121 1445706
39981A445706M0530j19612k21819k40345k06916j84829k04398k45617k73169k56837
$$ 1445706 1486236 1366624 1144805 904460 697544 512715 308317 62700 -210469 -467306
39971d67306j66655Q049K23262L93977M57971M12851K95003J51101L4901k39O9084
$$ -467306 -633961 -625912 -402650 -8673 449298 862149 1157152 1308253 1343154 1342915 1411999
39960A411999K12063L46459L68727K15188p2491l58093n23358n62498n39855m87772
$$ 1411999 1624062 1970521 2339248 2554436 2481945 2123852 1600494 1037996 498141 10369
39950A0369m10101l69656m77800p57475j074866j250423j200678r45875n41682
$$ 10369 -399732 -769388 -1247188 -2004663 -3079529 -4329952 -5530630 -6476505 -7018187
39941g018187o9274L43153N74585O07111N29345M33529L37413K14843P4549j3034
$$ -7018187 -7087461 -6744308 -6169723 -5562612 -5033267 -4599738 -4262325 -4047482 -3972933 -3985967
39931c985967L5443K42593N36375P84077Q65344P29638M15156L7487k57157l72815
$$ -3985967 -3950524 -3707931 -3171556 -2387479 -1522135 -792497 -377341 -339854 -597011 -969826
39921i69826l14214j39882J21353M56138P67858Q75906O81144K96494n4225k53080
$$ -969826 -1284040 -1423922 -1302569 -846431 -78573 797333 1478477 1774971 1720746 1467666
39911A467666l44468l94611l88129k96955j72350r0269l4556Q2143K65425L73150
$$ 1467666 1123198 728587 340458 43503 -128847 -219116 -253672 -171529 93896 467046
39901D67046K55532n8628l61788m57674l25402j01843N2951N9090n6547j77117
$$ 467046 722578 663950 302162 -155512 -480914 -582757 -529806 -470716 -527263 -704380
39891g04380j56653O9868M11861O85532P68072O81466N36039M26414L81320L67882
$$ -704380 -861033 -791165 -379304 306228 1074300 1755766 2291805 2718219 3099539 3467421
39881C467421L20103J88047k2480k70935n31183p73861r00665p74142l70649J31031
$$ 3467421 3787524 3975571 3953091 3682156 3150973 2377112 1476447 702305 331656 462687
39871D62687M68216M93705K42194j46412n08077o99904o66403m91410l32926k79031
$$ 462687 930903 1424608 1666802 1520390 1012313 312409 -353994 -845404 -1178330 -1457361
39861a457361k93100k98476k63980j86270m2166J86765M50082O26660O07135L88079
$$ -1457361 -1750461 -2048937 -2312917 -2499187 -2541353 -2354588 -1904506 -1277846 -670711 -282632
39851b82632R3370j08452j32976l1748R0884J89782K77100L38555L25943K45946
$$ -282632 -189262 -297714 -430690 -462438 -371554 -181772 95328 433883 759826 1005772
39841A005772J85816K10487K85626L44711L77723L93366L45941J93139Q122o6919
$$ 1005772 1191588 1402075 1687701 2032412 2410135 2803501 3149442 3342581 3350703 3283784
39831C283784M483J12225J64148K04342L07767M25241M15968K07373j37077m78333
$$ 3283784 3288267 3400492 3564640 3768982 4076749 4501990 4917958 5125331 4988254 4509921
39821D509921o71859o25644l88465j70986j77150l89257n92223o21565n02063
$$ 4509921 3838062 3212418 2823953 2652967 2475817 2086560 1494337 872772 370709
39812C70709l28835j34127N7748J49967O5891j25124k76341l27461l09832k27333
$$ 370709 41874 -92253 -34505 115462 181353 56229 -220112 -547573 -857405 -1084738
39802a084738m9824J82273L67114M78978N94905P51075Q68027Q65637P65275O15706
$$ -1084738 -1134562 -952289 -585175 -106197 488708 1239783 2107810 2973447 3738722 4354428
39792D354428L90160L5126m17640q49766j138867j202435j009114o12685j53824
$$ 4354428 4744588 4779714 4362074 3512308 2373441 1171006 161892 -450793 -604617
39783f04617K23973M52376N20092M34980K54151R8197N9266J14615J85848K50811
$$ -604617 -380644 71732 591824 1026804 1280955 1379152 1438418 1553033 1738881 1989692
39773A989692L30236L95873L79697K71151J31186R483q2484j20616p7897l836
$$ 1989692 2319928 2715801 3095498 3366649 3497835 3507318 3424834 3304218 3226321 3222485
39763C222485q475j21934k32690k16436q2152N5005J05366N9301n4783k02092
$$ 3222485 3214010 3092076 2859386 2642950 2560798 2615803 2721169 2780470 2725687 2523595
39753B523595l35935m14082m36661m40995m49321m43172m02430l55111l65902
$$ 2523595 2187660 1773578 1336917 895922 446601 3429 -399001 -754112 -1120014
39744a120014m63179n80974n91654m15896j04459J94423L47458L19185J71378
$$ -1120014 -1583193 -2164167 -2755821 -3171717 -3276176 -3081753 -2734295 -2415110 -2243732
39735b243732J4112m7045M0364K40422M38213N07107L98797J91085M0849N5625
$$ -2243732 -2229620 -2276665 -2236301 -1995879 -1557666 -1050559 -651762 -460677 -419828 -364203
39725c64203J90613K88462K37484P6679o6270j13569q7973m8862j7657L1952J28695
$$ -364203 -173590 114872 352356 429035 362765 249196 161223 112361 94704 126656 255351
39714B55351K46531K92106J81363n1819k58930l19741k49239j31934l003J41707
$$ 255351 501882 793988 975351 923532 664602 344861 95622 -36312 -39315 102392
39704A02392K60382K83538K14780J33215Q6322N2249K1849M2772J47712K91582
$$ 102392 362774 646312 861092 994307 1080629 1132878 1154727 1197499 1345211 1636793
39694A636793L90708L88235K75108J04086l834O2233K78122M84130N39472M37779
$$ 1636793 2027501 2415736 2690844 2794930 2791096 2853329 3131451 3615581 4155053 4592832
39684D592832K60367Q5154k7652l6854K9586P1589J5664j22093l04211n33957
$$ 4592832 4853199 4938353 4910701 4873847 4903433 4975022 4990686 4868593 4564382 4030425
39674D030425p85198r33072q51019n61996k24720J7198J21967J23875R7945J27819
$$ 4030425 3245227 2312155 1461136 899140 674420 691618 813585 937460 1035405 1163224
39664A163224K24074K75888J57926j10924l82340n51258o36771o80371o52620
$$ 1163224 1387298 1663186 1821112 1710188 1327848 776590 139819 -540552 -1193172
39655a193172n11039k94624j03650n341J0153M42J8252O5144Q0163k957j71815
$$ -1193172 -1704211 -1998835 -2102485 -2107826 -2097673 -2097231 -2078979 -2013835 -1933672 -1936629 -2108444
39644b108444l28083l73245k80543q2225J74106M37612O57137Q02689Q71528Q60176
$$ -2108444 -2436527 -2809772 -3090315 -3172540 -2998434 -2560822 -1903685 -1100996 -229468 630708
39634F30708P51665N46692K86778K6285k05866m02570n51726o31136o25278n39520
$$ 630708 1382373 1929065 2215843 2242128 2036262 1633692 1081966 450830 -174448 -713968
39624g13968m04623k68963j72165j18547q2426l8476K0408Q6596J44932J86391
$$ -713968 -1118591 -1387554 -1559719 -1678266 -1760692 -1799168 -1778760 -1692164 -1547232 -1360841
39614a360841K26902K88218L34387K66599M7006j89081k34700n4268J47844J52435
$$ -1360841 -1133939 -845721 -511334 -244735 -197729 -386810 -621510 -675778 -527934 -375499
39604c75499k9746j85388j21747J92088O47631J058894J217429J006862N26968
$$ -375499 -405245 -590633 -712380 -520292 127339 1186233 2403662 3410524 3937492
39595C937492N1334j98985k29968k05440k42017l14876l40494k88973k00009j32282
$$ 3937492 3988826 3789841 3559873 3354433 3112416 2797540 2457046 2168073 1968064 1835782
39585A835782j28536k04314l26941m05225l45542j53225L7184P2978o2794k28134
$$ 1835782 1707246 1502932 1175991 770766 425224 271999 309183 382161 319367 91233
39575I1233k62394j33860N3544J63303J11351j09891m23344o75885p18148n25139
$$ 91233 -171161 -305021 -251477 -88174 23177 -86714 -510058 -1185943 -1904091 -2429230
39565b429230k26215P878R6383O2264l8059j49527k09566j77932r2917m3944n7540
$$ -2429230 -2655445 -2647567 -2551184 -2488920 -2526979 -2676506 -2886072 -3064004 -3156921 -3200865 -3258405
39554c258405n0836O6105K75239M78769O13786O87129P14097O86334O07762N07534
$$ -3258405 -3309241 -3243136 -2967897 -2489128 -1875342 -1188213 -474116 212218 819980 1327514
39544A327514L97811K62787J12181M433j6032K2937N4711M4217K716m0330n2887
$$ 1327514 1725325 1988112 2100293 2104726 2088694 2111631 2166342 2210559 2213275 2172945 2120058
39533B120058j6919L3641J4473j23163l13394m20685l66450j89315O036J22713
$$ 2120058 2103139 2136780 2151253 2028090 1714696 1294011 927561 738246 744282 866995
39523H66995J02248o7366l45575o51562q92178r83976q80948o17884l15002r7624
$$ 866995 969243 901877 556302 -95260 -987438 -1971414 -2852362 -3470246 -3785248 -3882872
39513c882872m155N181l5726j26600k42396l01116k24475j4893K41362M34924
$$ -3882872 -3887027 -3881846 -3917572 -4044172 -4286568 -4587684 -4812159 -4827052 -4585690 -4150766
39503d150766N01286M58337L81509L17109K26325N4385j51065k55289j96191p3613
$$ -4150766 -3649480 -3191143 -2809634 -2492525 -2266200 -2211815 -2362880 -2618169 -2814360 -2887973
39493b887973l4500j03099j65311r1114J65581N46424R00908J041590Q75227N10928
$$ -2887973 -2922473 -3025572 -3190883 -3281997 -3116416 -2569992 -1669084 -627494 247733 758661
39483G58661J89843P1764J08307J34993N4698q6867j69273j03952J04211L54372
$$ 758661 948504 1020268 1128575 1263568 1318266 1231399 1062126 958174 1062385 1416757
39473A416757N03151M55090K26838p3290l25838m61964m73950m03296l17806k56849
$$ 1416757 1919908 2374998 2601836 2528546 2202708 1740744 1266794 863498 545692 288843
39463B88843j76428J4841L24272O04017O70411M97202K34336J9675j63794l99707
$$ 288843 112415 127256 451528 1055545 1725956 2223158 2457494 2477169 2313375 1913668
39453A913668o66343q35263q29084p04745n67155m64364l94175l55612l42423
$$ 1913668 1247325 412062 -417022 -1121767 -1688922 -2153286 -2547461 -2903073 -3245496
39444c245496l14714k29035r4026L7343J32269K08501K92410L64992L67949K67858
$$ -3245496 -3560210 -3789245 -3883271 -3845928 -3713659 -3505158 -3212748 -2847756 -2479807 -2211949
39434b211949J05642l3027r8221j05946q0916q830J14922K19903K11230Q7644
$$ -2211949 -2106307 -2139334 -2237555 -2343501 -2424417 -2433247 -2318325 -2098422 -1887192 -1799548
39424a799548n0114j17947j13847n2635Q0580K60865L81591L66778K88927K92480
$$ -1799548 -1849662 -1967609 -2081456 -2134091 -2053511 -1792646 -1411055 -1044277 -755350 -462870
39414d62870M17718N76612O85854P29012O81733M86697J61533j49537l18390l90766
$$ -462870 -45152 531460 1217314 1946326 2628059 3114756 3276289 3126752 2808362 2417596
39404B417596n16738p28387q63422p39409l60452Q0710L80506M75916M38886L65502
$$ 2417596 1900858 1172471 309049 -430360 -790812 -710102 -329596 146320 585206 950708
39394I50708K90689J96819P7282l2632r7409j41149k35758m07699n67623n66581
$$ 950708 1241397 1438216 1515498 1482866 1385457 1244308 1008550 600851 33228 -533353
39384e33353l39775K1199L56603N84844P33996Q35551Q35433O50411L03536m0712
$$ -533353 -873128 -851929 -495326 89518 823514 1659065 2494498 3144909 3448445 3407733
39374C407733k10150j92642j44953k16480l78630m60015l50301j27943L7001P0120
$$ 3407733 3197583 3004941 2859988 2643508 2264878 1804863 1454562 1326619 1363620 1433740
39364A433740M2149N6790J42863K50344K95868K03018m5473l62869n96248o34096
$$ 1433740 1475889 1532679 1675542 1925886 2221754 2424772 2379299 2016430 1420182 786086
39354G86086m63291j33412K74600O31271P90345P06347M90669K97054J69724M3891
$$ 786086 322795 189383 463983 1095254 1885599 2591946 3082615 3379669 3549393 3593284
39344C593284j34642l45510n30421o37877o39174n50589m38694l62590l14475
$$ 3593284 3458642 3113132 2582711 1944834 1305660 755071 316377 -46213 -360688
39335c60688k50978j63872p0177M9068K30686M45134N95191O20045N54345M69214
$$ -360688 -611666 -775538 -845715 -796647 -565961 -120827 474364 1094409 1648754 2117968
39325B117968M00366L46049K81423J52040r2308m17453o94732q10534p68432o63747
$$ 2117968 2518334 2864383 3145806 3297846 3205538 2788085 2093353 1282819 514387 -149360
39315a49360n84383n53253n29689m36805k18151R7645M04475O10412P01175P05418
$$ -149360 -733743 -1286996 -1816685 -2253490 -2471641 -2373996 -1969521 -1359109 -657934 47484
39305D7484O44720N49446M78245M66696M73671M19530K64878K6559k48911m81736
$$ 47484 692204 1241650 1719895 2186591 2660262 3079792 3344670 3371229 3122318 2640582
39295B640582n63433m40438k00234k0558j4632j50672l12542l92833l30895j26463
$$ 2640582 2077149 1636711 1436477 1415919 1401287 1250615 938073 545240 214345 87882
39285H7882J46066L67376M51697L94991K50877Q7036l5926q8814j03540j49880
$$ 87882 233948 601324 1053021 1448012 1698889 1785925 1749999 1661185 1557645 1407765
39275A407765k53998l56635l76627l06829k29683k42582l70748n34558n95614
$$ 1407765 1153767 797132 420505 113676 -116007 -358589 -729337 -1263895 -1859509
39266a859509m63643j81444J11683L16761M51492N67553O27741N27474K46068
$$ -1859509 -2323152 -2504596 -2392913 -2076152 -1624660 -1057107 -429366 98108 344176
39257C44176p4155k34556j53467P8766K94190L73522K98571J24499p4489k38853
$$ 344176 270021 35465 -118002 -39236 254954 628476 927047 1051546 977057 738204
39247G38204l25841l04671j74166J0308J52718J88677J43580J00256J06651J35074
$$ 738204 412363 107692 -66474 -56166 96552 285229 428809 529065 635716 770790
39237G70790J37499J13441R9282J06523J04631O9268K0009o638r374l0743j13164
$$ 770790 908289 1021730 1121012 1227535 1332166 1401434 1421443 1414805 1405431 1374688 1261524
39226A261524k50690l83528m42590m05227l03215j68628J3370K70125N63053P82084
$$ 1261524 1010834 627306 184716 -220511 -523726 -692354 -678984 -408859 154194 936278
39216I36278Q37374P29677N12384K22942j06925m04384n86659o44947o44075o25409
$$ 936278 1773652 2503329 3015713 3238655 3131730 2727346 2140687 1495740 851665 226256
39206B26256n62356m35884k99270k21178k02312k01318k13173k55656k92040k47017
$$ 226256 -336100 -771984 -1071254 -1292432 -1494744 -1696062 -1909235 -2164891 -2456931 -2703948
39196b703948j18486n435J5653o387L6141J76169L55161N13756O37993P17012
$$ -2703948 -2822434 -2827869 -2812216 -2818603 -2782462 -2606293 -2251132 -1737376 -1099383 -382371
39186c82371P11813N91474L78244J44881k3270p7774n0137l6370r6961j73181
$$ -382371 329442 920916 1299160 1444041 1420771 1342997 1292860 1256490 1159529 986348
39176I86348j52259k5812P4236L2207j04519j82373j15547M6051J97889K66426
$$ 986348 834089 808277 882513 914720 810201 627828 512281 558332 756221 1022647
39166A022647K17231M8514j86576l86810m70232m25699k83268o0219K26319N01426
$$ 1022647 1239878 1288392 1101816 715006 244774 -180925 -464193 -524412 -298093 203333
39156B03333O36502N48705K91936K4088j23811j34175o4858L3592J30309J75734
$$ 203333 839835 1388540 1680476 1704564 1580753 1446578 1381720 1415312 1545621 1721355
39146A721355J18716k1512j51405k05414k20715k76819l86689m84084n00347m19315
$$ 1721355 1840071 1818559 1667154 1461740 1241025 964206 577517 93433 -406914 -826229
39136h26229k73701j22773j7044N1641J46636K92308M06099L81049K21691L0874
$$ -826229 -1099930 -1222703 -1239747 -1188106 -1041470 -749162 -343063 37986 259677 290551
39126B90551j33660l06217m93041n88177m73229j63694J93398M43672N15862M30267
$$ 290551 156891 -149326 -642367 -1230544 -1703773 -1867467 -1674069 -1230397 -714535 -284268
39116b84268K74838J60570J52243K32181L37683M09674L93172K42560j8302k65994
$$ -284268 -9430 151140 303383 535564 873247 1282921 1676093 1918653 1900351 1634357
39106A634357l68936l13618k05421j50588j71436k23424k44615j84756l2420J67612
$$ 1634357 1265421 951803 746382 595794 424358 200934 -43681 -228437 -260857 -93245
39096i3245L47933M74771N50584N73158N33836M54761L78611L08596K05298O5040
$$ -93245 254688 729459 1280043 1853201 2387037 2841798 3220409 3529005 3734303 3799343
39086C799343m4289o4005l1168m0332j30043k44936l10833l18111l20787l66182
$$ 3799343 3755054 3691049 3659881 3619549 3489506 3244570 2933737 2615626 2294839 1928657
39076A928657m33508m44549l43550j66345j2742N4408N7620L9807j5033j57479
$$ 1928657 1495149 1050600 707050 540705 527963 582371 639991 679798 664765 507286
39066E07286l82378o03424p21118o88831n17669k59414J417J78677K42175K34465
$$ 507286 124908 -478516 -1199634 -1888465 -2406134 -2665548 -2664131 -2485454 -2243279 -2008814
39056b008814K17072K16180K26351K30861J94147P3941j12088k56641k56602j29639
$$ -2008814 -1791742 -1575562 -1349211 -1118350 -924203 -850262 -962350 -1218991 -1475593 -1605232
39046a605232J3946J05863J59970J78750J11923m6792j97474k40752k01253j73184
$$ -1605232 -1591286 -1485423 -1325453 -1146703 -1034780 -1081572 -1279046 -1519798 -1721051 -1894235
39036a894235j77827j55280p8984P165O9130J22388J75835K04700K02141J98530
$$ -1894235 -2072062 -2227342 -2306326 -2299161 -2230031 -2107643 -1931808 -1727108 -1524967 -1326437
39026a326437K07136K08802K13048K66802L61726L95557K87872R9048k4499r142
$$ -1326437 -1119301 -910499 -697451 -430649 -68923 326634 614506 713554 689055 679913
39016F79913Q0369J18030L1379j37859k62449k46621j39693j01164k27816m51595
$$ 679913 760282 878312 909691 771832 509383 262762 123069 21905 -205911 -657506
39006f57506o28693o72208n61085k95528O9908L88387N09446M08172J78337p3623
$$ -657506 -1286199 -1958407 -2519492 -2815020 -2745112 -2356725 -1847279 -1439107 -1260770 -1334393
38996a334393k66933l24820k20945m8317N0319M0474J7128O3121J61032K51190
$$ -1334393 -1601326 -1926146 -2147091 -2195408 -2145089 -2104615 -2087487 -2024366 -1863334 -1612144
38986a612144K87792K13275k9735m04013p55234r35792r15294p50596n12272k72311
$$ -1612144 -1324352 -1111077 -1140812 -1544825 -2300059 -3235851 -4151145 -4901741 -5414013 -5686324
38976e686324q7412O3434K62415N12007O71630O14188L99049J97882P6263m8672
$$ -5686324 -5773736 -5710302 -5447887 -4935880 -4264250 -3650062 -3251013 -3053131 -2976868 -3025540
38966c025540k31255l80610l67525j87574L3323J66169J69966P3126q6651k78183
$$ -3025540 -3256795 -3637405 -4004930 -4192504 -4159181 -3993012 -3823046 -3749920 -3836571 -4114754
38956d114754m45506n01354l92546j71376M0309J78029K90444M43470O10912P07734
$$ -4114754 -4560260 -5061614 -5454160 -5625536 -5585227 -5407198 -5116754 -4673284 -4062372 -3354638
38946c354638P00797O23509M93993K94214N0547j28624j44084r413J72233L19690
$$ -3354638 -2653841 -2030332 -1536339 -1242125 -1191578 -1320202 -1464286 -1473699 -1301466 -981776
38936i81776M31213N39896O45487P00459O48898M73955K18485l7268k33831l81615
$$ -981776 -550563 -10667 634820 1335279 1984177 2458132 2676617 2639349 2405518 2023903
38926B023903n42118p42823r19567r72397q79117p11781n19753k45765J81792
$$ 2023903 1481785 738962 -180605 -1153002 -2032119 -2743900 -3263653 -3509418 -3327626
38917c327626O91801J076909J176145J007296P05977L85096Q3261j91268m12092
$$ -3327626 -2635825 -1558916 -382771 624525 1330502 1715598 1798859 1607591 1195499
38908A195499n24451m75020k77355m9720O2522K8786m1685l9449K8308R0460J22910
$$ 1195499 671048 196028 -81327 -131047 -68525 -39739 -81424 -120873 -92565 -2105 120805
38897A20805J52127J91868K37555K89394L19067K48307L7958k19430l73599l79480
$$ 120805 272932 464800 702355 991749 1310816 1559123 1597081 1377651 1004052 624572
38887F24572l19680k73314k36338j68167l9072J67054M06059N23384L66129n225
$$ 624572 304892 31578 -204760 -372927 -411999 -244945 161114 684498 1050627 1045402
38877A045402l17487l70869k47203j56969j61390j62139j17310j21614k49086
$$ 1045402 727915 357046 109843 -47126 -208516 -370655 -487965 -609579 -858665
38868h58665m26203n15634m62659l13033j35455K3722J39561K14024K79287L66290
$$ -858665 -1284868 -1800502 -2263161 -2576194 -2711649 -2687927 -2548366 -2334342 -2055055 -1688765
38858a688765M67571N41432N45484M60439L00517J20647L818J4581J47548L16488
$$ -1688765 -1221194 -679762 -134278 326161 626678 747325 751143 765724 913272 1229760
38848A229760M00920L30048J51936J8000O2735K74073M93129N54725M20029J74481
$$ 1229760 1630680 1960728 2112664 2130664 2193399 2467472 2960601 3515326 3935355 4109836
38838D109836o4847k09718k03688l4139K30977M46578M65517K28642j97901o55022
$$ 4109836 4044989 3835271 3631583 3597444 3828421 4274999 4740516 4969158 4771257 4116235
38828D116235r79052j106340j106887j088227j061409r40914o86927l88054j60181
$$ 4116235 3137183 2030843 923956 -164271 -1225680 -2166594 -2853521 -3241575 -3401756
38819c401756j3339J16388K39039L01730K98993K96244L16245K88599J67883L6483
$$ -3401756 -3415095 -3298707 -3059668 -2757938 -2458945 -2162701 -1846456 -1557857 -1389974 -1353491
38809a353491J4482R9117J66279J24697J1526o8683n6405J9246P9558P3567L3160
$$ -1353491 -1339009 -1239892 -1073613 -948916 -937390 -1006073 -1062478 -1043232 -963674 -890107 -856947
38798h56947M3587J45107K84709L85195M28432M32939L83415K40560O400k72272
$$ -856947 -813360 -668253 -383544 1651 430083 863022 1246437 1486997 1493397 1221125
38788A221125n49051p69593q43472p15218m73614l00157k69179k69049j65968
$$ 1221125 672074 -97519 -940991 -1656209 -2129823 -2429980 -2699159 -2968208 -3134176
38779c134176K0992J68430K15227K00396J63449R5038m363q8436j24835j53472
$$ -3134176 -3113184 -2944754 -2729527 -2529131 -2365682 -2270644 -2275007 -2363443 -2488278 -2641750
38769b641750k42006l85922m81491m17281j88498J00618L53127N61037P36781
$$ -2641750 -2883756 -3269678 -3751169 -4168450 -4356948 -4256330 -3903203 -3342166 -2605385
38760b605385Q04351O45170K65406j60950m57018n92005o25488n76771m29242
$$ -2605385 -1801034 -1155864 -890458 -1051408 -1508426 -2100431 -2725919 -3302690 -3731932
38751c731932k18424j9958J38902K72905L49763L02057J53779N1677J15125K99298
$$ -3731932 -3950356 -3970314 -3831412 -3558507 -3208744 -2906687 -2752908 -2701231 -2586106 -2286808
38741b286808M52138M74134L82807K49885J23892R394j10904k41473l57147m29078
$$ -2286808 -1834670 -1360536 -977729 -727844 -603952 -594558 -705462 -946935 -1304082 -1733160
38731a733160m60270m62817l98898j97620J37947M83947P03822P77769P78226
$$ -1733160 -2193430 -2656247 -3055145 -3252765 -3114818 -2630871 -1927049 -1149280 -371054
38722c71054P42999O40158M59016K66968J43254R6736Q0933O1211L5134Q359j4082
$$ -371054 371945 1012103 1471119 1738087 1881341 1978077 2059010 2120221 2155355 2163714 2149632
38711B149632k1786j4443j9558o7813j48756k11390k11017j40003j8807J13856
$$ 2149632 2127846 2113403 2093845 2026032 1877276 1665886 1454869 1314866 1296059 1409915
38701A409915J96268J64642J2801j73282k67667k11573p7676k5582j69082m54589
$$ 1409915 1606183 1770825 1783626 1610344 1342677 1131104 1053428 1027846 858764 404175
38691D04175o72479o33103l62845j02862p6704k66282m46010m25795k18663K6678
$$ 404175 -268304 -901407 -1264252 -1367114 -1443818 -1710100 -2156110 -2581905 -2800568 -2773890
38681b773890J97472K88320L47667M14925N08345O23993P18443P12596N46729
$$ -2773890 -2576418 -2288098 -1940431 -1525506 -1017161 -393168 325275 1037871 1584600
38672A584600K48772n6088k23471k01934p6246J1465j0985j06615k12666l27082
$$ 1584600 1833372 1777284 1553813 1351879 1275633 1287098 1276113 1169498 956832 629750
38662F29750m82616o55407p47246o74934m54502j82440M9610K06213K89619K96606
$$ 629750 147134 -508273 -1255519 -1930453 -2384955 -2567395 -2517785 -2311572 -2021953 -1725347
38652a725347K02893j3405l31241o64868q88814r00514o72779k58966K34201O72508
$$ -1725347 -1522454 -1535859 -1867100 -2531968 -3420782 -4321296 -4994075 -5253041 -5018840 -4346332
38642d346332R25611R30326P50382N42872M21766L55834K31599J1339k13509l30464
$$ -4346332 -3420721 -2490395 -1740013 -1197141 -775375 -419541 -187942 -176603 -390112 -720576
38632g20576l13727j99289j2919K15180M02073M64253M19843L63656L24537K25465
$$ -720576 -1034303 -1233592 -1246511 -1031331 -629258 -165005 254838 618494 943031 1168496
38622A168496K4985j76807k48925k05750j90138k90530m51395n76425o48339p04647
$$ 1168496 1193481 1016674 767749 561999 371861 81331 -370064 -946489 -1594828 -2299475
38612b299475p37708o74304m57417j26848J87762L57589L53025K60100J97639
$$ -2299475 -3037183 -3711487 -4168904 -4295752 -4107990 -3750401 -3397376 -3137276 -2939637
38603b939637K26575L45023N33530P48611Q80419P99315M99291J57347j2212L7777
$$ -2939637 -2713062 -2368039 -1834509 -1085898 -205479 593836 1093127 1250474 1238262 1276039
38593A276039J63714K02485J21805j699j00217j74260k57529l59657m47035m65682
$$ 1276039 1439753 1642238 1764043 1762344 1662127 1487867 1230338 870681 423646 -42036
38583d2036l84279k25319n2173Q0248J56092J78499J41553M6726o3283j21258
$$ -42036 -426315 -651634 -703807 -623559 -467467 -288968 -147415 -100689 -163972 -285230
38573b85230r7388k5539M0838Q1468J11397J53676K23834L17564L93011L89133
$$ -285230 -382618 -408157 -367319 -285851 -174454 -20778 203056 520620 913631 1302764
38563A302764K92842J69258Q6915K7596p8448k29564l27917l03485k10569j58015
$$ 1302764 1595606 1764864 1851779 1879375 1800927 1571363 1243446 939961 729392 571377
38553E71377j79187k18544k19257j66291n5343J13362K94730M08416M24344M04942
$$ 571377 392190 173646 -45611 -211902 -267245 -153883 140847 549263 973607 1378549
38543A378549M24203M65157M40056L10002J43651L6337p281p9481k56771n05092
$$ 1378549 1802752 2267909 2707965 3017967 3161618 3197955 3190674 3111193 2854422 2349330
38533B349330p15134q19205q43503q38283p87693o22740l21258L2407L00959M00277
$$ 2349330 1634196 814991 -28512 -866795 -1654488 -2277228 -2598486 -2566079 -2265120 -1864843
38523a864843L50204K33790J20349K7743n6634j42175k32119l29917m12107l99857
$$ -1864843 -1514639 -1280849 -1160500 -1132757 -1189391 -1331566 -1563685 -1893602 -2305709 -2705566
38513b705566k11896J18362M10981M79246L09218P7707l367J56794M94341Q50118
$$ -2705566 -2917462 -2799100 -2388119 -1908873 -1599655 -1521948 -1525315 -1368521 -874180 -24062
38503b4062J058112J039950Q54547O31311M35593K33200M457j67364j85784q8699
$$ -24062 1034050 2074000 2928547 3559858 3995451 4228651 4233108 4065744 3879960 3791261
38493C791261k5330p8574j80985k32579k32736k39734k50215k00280p4023O8277
$$ 3791261 3765931 3687357 3506372 3273793 3041057 2801323 2551108 2350828 2276805 2345082
38483B345082J83030K89441L87339L99196K63914N0772r7268j23631r3353p4638
$$ 2345082 2528112 2817553 3204892 3604088 3868002 3918774 3821506 3697875 3604522 3529884
38473C529884o5751n4921o5984r5719p7377K1526J11653P3395q3965k29198k67699
$$ 3529884 3464133 3409212 3343228 3247509 3170132 3191658 3303311 3376706 3292741 3063543 2795844
38462B795844k21219j48303o3121M0534J47832K44170L34593M07993M20060L47948
$$ 2795844 2574625 2426322 2363201 2403735 2551567 2795737 3130330 3538323 3958383 4306331
38452D306331K31082J22555K7891o9730j49157j67294j32809j21451k02637l67858
$$ 4306331 4537413 4659968 4687859 4618129 4468972 4301678 4168869 4047418 3844781 3476923
38442C476923n38618o36101o41937n94816n28589m29063k78405j31239q7992j63069
$$ 3476923 2938305 2302204 1660267 1065451 536862 107799 -170606 -301845 -389837 -552906
38432e52906k28379j43359Q1174L00266L97221L68764K60860J05253m9482j18099
$$ -552906 -781285 -924644 -843470 -543204 -145983 222781 483641 588894 539412 421313
38422D21313n7678O3712J36282J30858R8890O7912J5665l3363L2509K85743O27649
$$ 421313 363635 427347 563629 694487 793377 861289 876954 843591 876100 1161843 1789492
38411A789492Q58097Q76104P48433N71473L41579J3108l67053o62889p89720p98867
$$ 1789492 2647589 3523693 4272126 4843599 5185178 5198286 4831233 4168344 3378624 2579757
38401B579757q06074q65385r27017r04028p77259o40363o16141o98075p06789
$$ 2579757 1773683 908298 -18719 -922747 -1700006 -2340369 -2956510 -3654585 -4361374
38392d361374m70858m8392L06741M25387M00741M40007N99031P35351O93074M61160
$$ -4361374 -4832232 -4880624 -4573883 -4148496 -3747755 -3307748 -2708717 -1973366 -1280292 -819132
38382h19132J60576n3572p2751J07519L72360N67677O27129N98163N31401L89653
$$ -819132 -658556 -712128 -784879 -677360 -305000 262677 889806 1487969 2019370 2409023
38372B409023J11263k55752n38855n88928m33706k64028k55744m06143n57334
$$ 2409023 2520286 2264534 1725679 1136751 703045 439017 183273 -222870 -780204
38363g80204n79930n05523m55142m65935m47021l19334j45530p1906j53952k82749
$$ -780204 -1360134 -1865657 -2320799 -2786734 -3233755 -3553089 -3698619 -3770525 -3924477 -4207226
38353d207226k95870j37283J07941L20529M60281N67469O78140P73682Q21110
$$ -4207226 -4503096 -4640379 -4532438 -4211909 -3751628 -3184159 -2506019 -1732337 -911227
38344i11227Q31381Q43734Q56200Q02896O17885L14809n823k32448l35646l94206
$$ -911227 -79846 763888 1620088 2422984 3040869 3355678 3349855 3117407 2781761 2387555
38334B387555n16500p17910q84348q80528o92863m43071k64921k00078k16874
$$ 2387555 1871055 1153145 268797 -611731 -1304594 -1747665 -2012586 -2212664 -2429538
38325b429538k79847l59156l96792l20238j09521J67076L93137M73368L75679
$$ -2429538 -2709385 -3068541 -3465333 -3785571 -3895092 -3728016 -3334879 -2861511 -2485832
38316b485832J40166j36096l45486m32984m20082l57980k64047j22228O0424K34148
$$ -2485832 -2345666 -2481762 -2827248 -3260232 -3680314 -4038294 -4302341 -4424569 -4364145 -4129997
38306d129997L62138M64065N64086O13472N24836K98532O1851n5112m8018n848
$$ -4129997 -3767859 -3303794 -2739708 -2126236 -1601400 -1302868 -1241017 -1296129 -1344147 -1349995
38296a349995J2653J6452K7749O7859J92700M53696P88008J014591R91880P42860
$$ -1349995 -1337342 -1320890 -1293141 -1225282 -1032582 -578886 209122 1223713 2215593 2958453
38286B958453L91254K7627l09292n73590p21733p66324p45143o43831m30345j73512
$$ 2958453 3349707 3377334 3068042 2494452 1772719 1006395 261252 -382579 -812924 -986436
38276i86436l4464r0776k31826k86520k12137r8351j8809M6318J41887K57487
$$ -986436 -1020900 -1111676 -1343502 -1630022 -1842159 -1940510 -1959319 -1913001 -1771114 -1513627
38266a513627L40371L53752L00592K08961J10058K1059n8768j31907j86617k05622
$$ -1513627 -1173256 -819504 -518912 -309951 -199893 -178834 -237602 -369509 -556126 -761748
38256g61748j84720j34323p3695l2172l2885n3001k5679P9467J93850K14130J21229
$$ -761748 -946468 -1080791 -1154486 -1186658 -1219543 -1272544 -1298223 -1218756 -1024906 -810776 -689547
38245f89547j7144j60385l41077n70860p66924q28583p48631n93609m04563j84342
$$ -689547 -706691 -867076 -1208153 -1779013 -2545937 -3374520 -4123151 -4716760 -5121323 -5305665
38235e305665L0139J61702J85369J75456K21557L21036L87285L55149K50414J48044
$$ -5305665 -5275526 -5113824 -4928455 -4752999 -4531442 -4210406 -3823121 -3467972 -3217558 -3069514
38225c069514P7248r190j56338l11971l51155k16761l256J38821J67192J75393
$$ -3069514 -2992266 -3001456 -3157794 -3469765 -3820920 -4037681 -4040937 -3902116 -3734924 -3559531
38215c559531K60671M09134N27808N61850N57060O07740P41260Q54628P92742
$$ -3559531 -3298860 -2889726 -2361918 -1800068 -1243008 -635268 105992 960620 1753362
38206A753362N13444J48809j31586k88910l99757n11384n99089o59119p37661
$$ 1753362 2266806 2415615 2284029 1995119 1595362 1083978 484889 -174230 -911891
38197i11891q27872q23206o35121l04272N3568L54848N48926N81013M45470K44276
$$ -911891 -1739763 -2562969 -3198090 -3502362 -3448794 -3093946 -2545020 -1964007 -1518537 -1274261
38187a274261J05022M8121J021p2714j32398j36248p5856O7828L15766O10136
$$ -1274261 -1169239 -1121118 -1120097 -1192811 -1325209 -1461457 -1537313 -1469485 -1153719 -543583
38177e43583Q13698Q31522O92561M93501L17346K26834K61493L80588M57101L98889
$$ -543583 270115 1101637 1794198 2287699 2605045 2831879 3093372 3473960 3931061 4329950
38167D329950K59617J75145K00130K59141K58580J93507J20840O3648j4492j37652
$$ 4329950 4589567 4764712 4964842 5223983 5482563 5676070 5796910 5860558 5846066 5708414
38157E708414k52769k68780j60404k496J13881J68011J84033J58403P6994q391
$$ 5708414 5455645 5186865 5026461 5023965 5137846 5305857 5489890 5648293 5725287 5716896
38147E716896j455J12584K21193K01644M0106j96076m45602o52172p20438n66216
$$ 5716896 5715441 5828025 6049218 6250862 6290968 6094892 5649290 4997118 4276680 3710464
38137C710464k30817J06615K63296J92360n808j87819k82829l25968l85446m58661
$$ 3710464 3479647 3586262 3849558 4041918 4036110 3848291 3565462 3239494 2854048 2395387
38127B395387m61275l32094j21705N2147J18384R0992J5266p7632j68318k51745
$$ 2395387 1934112 1602018 1480313 1532460 1650844 1741836 1757102 1679470 1511152 1259407
38117A259407l56141n20749p30709q96812r24736p99513n92568l93146k37008
$$ 1259407 903266 382517 -348192 -1245004 -2169740 -2969253 -3561821 -3954967 -4191975
38108d191975q9957J08115L74565O45796Q05895P67320N47236K77553J20454J39153
$$ -4191975 -4281932 -4173817 -3799252 -3153456 -2347561 -1580241 -1033005 -755452 -634998 -495845
38098d95845K47901L15359L14162L26504L97765M50220L85334K22067P2584J0075
$$ -495845 -247944 67415 381577 708081 1105846 1556066 1941400 2163467 2236051 2246126
38088B246126K1911O8561J14481J10214K7913o8511o4134N9347J70140J17384
$$ 2246126 2268037 2336598 2451079 2561293 2589206 2520695 2456561 2515908 2686048 2803432
38078B803432j20966m38580o94104p76036o42592l63512r0926P0092J48926K35288
$$ 2803432 2682466 2243886 1549782 773746 131154 -232358 -323284 -253192 -104266 131022
38068A31022L55901M76254N83682O86466P42154O76386M97299L23603K63883L16367
$$ 131022 486923 963177 1546859 2233325 2975479 3651865 4149164 4472767 4736650 5053017
38058E053017M17142N32995O59090P68852Q32039Q66866R13169R54538R27123
$$ 5053017 5470159 6003154 6662244 7431096 8263135 9130001 10043170 10997708 11924831
38049A1924831Q23558P36100P62594R09370J131889J438584J881561K436502K960843
$$ 11924831 12748389 13484489 14247083 15156453 16288342 17726926 19608487 22044989 25005832
38040B5005832L316728L496396L568980L517288L189072K432532J255697j49936
$$ 25005832 28322560 31818956 35387936 38905224 42094296 44526828 45782525 45632589
38032D5632589j508802k582750l252900l532611l499224l210475k714861k134360
$$ 45632589 44123787 41541037 38288137 34755526 31256302 28045827 25330966 23196606
38024B3196606j649255j334229j063990o79818k38849N212j00753m17885o73751
$$ 23196606 21547351 20213122 19149132 18469314 18230465 18235677 18134924 17717039 17043288
38015A7043288p41292o86713n99386m94517l95797m03726n97612q97558j091961
$$ 17043288 16301996 15615283 15015897 14521380 14125583 13721857 13124245 12226687 11134726
38006A1134726j020752p13406l47648r6854k5927j09001l03581n75621q60056
$$ 11134726 10113974 9400568 9052920 8956066 8930139 8821138 8517557 7941936 7081880
37997G081880j045152j045121q91539p13747o01799n06734l06323L5486M03129
$$ 7081880 6036728 4991607 4100068 3386321 2784522 2277788 1971465 2006951 2410080
37988B410080O27743O27218M44057J81331o5984k38107l23107l60842m04614m58157
$$ 2410080 3037823 3665041 4109098 4290429 4224445 3986338 3663231 3302389 2897775 2439618
37978B439618m69629m03567k94040k02521j50215j31373j70487l00672m73046
$$ 2439618 1969989 1566422 1272382 1069861 919646 788273 617786 317114 -155932
37969a55932n48388m23462j42833J41432K96636K77751J21012o6893j34990J4810
$$ -155932 -704320 -1127782 -1270615 -1129183 -832547 -554796 -433784 -500677 -635667 -620857
37959f20857L23976O09153P24764O74351N53311M21144K62159M8953j95206l99640
$$ -620857 -296881 312272 1037036 1711387 2264698 2685842 2948001 2996954 2801748 2402108
37949B402108m90700m31204k34026M8710L46912N92648P44243Q10714Q39735Q54956
$$ 2402108 1911408 1480204 1246178 1294888 1641800 2234448 2978691 3789405 4629140 5484096
37939E484096Q13601O60291M18647J83159Q917j40342l05903m43156m67265l64533
$$ 5484096 6297697 6957988 7376635 7559794 7568711 7428369 7122466 6679310 6212045 5847512
37929E847512k06136n8381P5067K17956L63527M62303M53876L19350J18999m2739
$$ 5847512 5641376 5582995 5658062 5876018 6239545 6701848 7155724 7475074 7594073 7551334
37919G551334j21197j83570l21020n26436p05250p92422p97319p32701n72590
$$ 7551334 7430137 7246567 6925547 6399111 5693861 4901439 4104120 3371419 2798829
37910B798829l16303m6533J21472J35741L9851o6147r2852l2084K1528m0726k08355
$$ 2798829 2482526 2435993 2557465 2693206 2733057 2666910 2574058 2541974 2563502 2522776 2314421
37899B314421l44168l35404k19158j34947j87149l70202n77673o54162m96813
$$ 2314421 1970253 1634849 1415691 1280744 1093595 723393 145720 -508442 -1005255
37890a005255j60953J70409L64899M45179M79164M48742L20565J84342J86414
$$ -1005255 -1166208 -995799 -630900 -185721 293443 742185 1062750 1247092 1433506
37881A433506L34467M90596N67191O03852O20744N35894L11246O8003o2971j41205
$$ 1433506 1767973 2258569 2825760 3429612 4050356 4586250 4897496 4965499 4902528 4761323
37871D761323l41304o96379j023893j115617r22553n47007j36083J85794L45107
$$ 4761323 4420019 3723640 2699747 1584130 661577 114570 -21513 164281 509388
37862E09388L37670K12982L1105j53622k87894l48361l72860m07613m15321k98626
$$ 509388 847058 1060040 1091145 937523 649629 301268 -71592 -479205 -894526 -1193152
37852a193152m1290K38013M24202N46846P06899Q84275R10735O68186K56034r1235
$$ -1193152 -1234442 -996429 -572227 -25381 681518 1565793 2476528 3144714 3400748 3309513
37842C309513k32225k22784k04521k39666k74631k33525j11207K4018R7313R3342
$$ 3309513 3077288 2854504 2649983 2410317 2135686 1902161 1790954 1814972 1912285 2005627
37832B005627P0137J07359K21804L28109L04394J16882j27508k70581k48477j42736
$$ 2005627 2075764 2183123 2404927 2733036 3037430 3154312 3026804 2756223 2507746 2365010
37822B365010q9312j44197k37465k52536j46602J0701J19362J55559J72112J94488
$$ 2365010 2275698 2131501 1894036 1641500 1494898 1505599 1624961 1780520 1952632 2147120
37812B147120J59422l550k44949m02351l60985j86469o6855j19037k71529l52969
$$ 2147120 2306542 2302992 2058043 1655692 1294707 1108238 1041383 922346 650817 297848
37802B97848k85764j61771j10907j24866o1579J71296M91463P36352Q44851Q89416
$$ 297848 12084 -149687 -260594 -385460 -447039 -275743 215720 952072 1796923 2686339
37792B686339R37631R41917P90704M39017l2121m67849p38409q07413p25218n60105
$$ 2686339 3623970 4565887 5356591 5795608 5763487 5295638 4557229 3749816 3024598 2464493
37782B464493l44512j00038J08427J96025J51792O9197N0128R7254J27582P6571
$$ 2464493 2119981 2019943 2128370 2324395 2476187 2545384 2595512 2692766 2820348 2896919
37772B896919l7340j38650j59756r3095p145J458r1267j85179j44904M7561K61392
$$ 2896919 2859579 2720929 2561173 2468078 2460933 2462391 2371124 2185945 2041041 2088602 2349994
37761B349994L55655L21201K62209K66316L32155M08108M47569M12314K68568
$$ 2349994 2705649 3026850 3289059 3555375 3887530 4295638 4743207 5155521 5424089
37752E424089K0772k62956m84732n70020m82133k28607R6333L05873K47440l1830
$$ 5424089 5444861 5181905 4697173 4127153 3645020 3416413 3512746 3818619 4066059 4034229
37742D034229l04845l91774l24893k51745k39147k52257k82280l73641n04950
$$ 4034229 3729384 3337610 3012717 2760972 2521825 2269568 1987288 1613647 1108697
37733A108697n48428m11995j62280N5833J80811K52115K94901K63818J16056j05382
$$ 1108697 560269 148274 -14006 41827 222638 474753 769654 1033472 1149528 1044146
37723A044146k86150l29145k32451r5612m2492j18002k56362l47737l18559j53716
$$ 1044146 757996 428851 196400 100788 58296 -59706 -316068 -663805 -982364 -1136080
37713a136080J06341L57008M64069L70830J65125k457n8802l2180L5394J28848
$$ -1136080 -1029739 -672731 -208662 162168 327293 324836 266034 233854 269248 398096
37703C98096K11117K09180Q8967r7864k77364m28940n57165o14254n09519k14610
$$ 398096 609213 818393 907360 809496 532132 103192 -453973 -1068227 -1577746 -1792356
37693a792356J67155M62564N64935N06785M03466L45301L58686M42943N80683
$$ -1792356 -1625201 -1162637 -597702 -90917 312549 657850 1016536 1459479 2040162
37684B040162O91978O43110L68642l3267l81615n77544o43594o28321n53956m58552
$$ 2040162 2732140 3375250 3743892 3710625 3329010 2751466 2107872 1479551 925595 467043
37674D67043l96896l59451k57968l9875K32711M60758O12685O97670O85459N33686
$$ 467043 70147 -289304 -547272 -587147 -354436 106322 719007 1416677 2102136 2635822
37664B635822K83566N7020n9535r4018j44917k81572m82466o48757o86125n92951
$$ 2635822 2919388 2976408 2916873 2822855 2677938 2396366 1913900 1265143 579018 -13933
37654a3933m55213l40773k31761r2896L3461O3430r626r6347j20582r6457q1859
$$ -13933 -469146 -809919 -1041680 -1134576 -1101115 -1037685 -1047311 -1143658 -1264240 -1360697 -1442556
37643a442556j01911j44478j95809k44924k66404k28644j24337J5456J39522K10509
$$ -1442556 -1544467 -1688945 -1884754 -2129678 -2396082 -2624726 -2749063 -2733607 -2594085 -2383576
37633b383576K25215K02292J57148J05765Q8209J47869K63295L35171K84787J52436
$$ -2383576 -2158361 -1956069 -1798921 -1693156 -1604947 -1457078 -1193783 -858612 -573825 -421389
37623d21389O0019Q4470K03030L51211M85631N80750O01932N05361K63912r2467
$$ -421389 -361370 -276900 -73870 277341 762972 1343722 1945654 2451015 2714927 2622460
37613B622460m49683o60330o68022n57934m31252k58940N4242M63311P46608P28106
$$ 2622460 2172777 1512447 844425 286491 -144761 -403701 -349459 113852 860460 1588566
37603A588566M69917J90406M5046M1778J12958J81554J76345P0728p4901j66429
$$ 1588566 2058483 2248889 2293935 2335713 2448671 2630225 2806570 2877298 2802397 2635968
37593B635968j89802k24297l18990l97781l27977p2800K49176M54684M39545K52578
$$ 2635968 2446166 2221869 1902879 1505098 1177121 1104321 1353497 1808181 2247726 2500304
37583B500304N0692k9697R991L1986r1550l14029m23283k55939J05820M00558
$$ 2500304 2550996 2521299 2531290 2563276 2471726 2157697 1734414 1478475 1584295 1984853
37573A984853M57738L47623K40401J87935J17808J380p6460l4337R0120J74352
$$ 1984853 2442591 2790214 3030615 3218550 3336358 3337738 3261278 3226941 3317061 3491413
37563C491413J17660j01525m21005p15892q66457q43735p12383n43776l65803
$$ 3491413 3609073 3507548 3086543 2370651 1504194 660459 -51924 -595700 -961503
37554i61503k02707r7106n6449l7132l2298j19901l49623o11613o96498m89296
$$ -961503 -1164210 -1261316 -1317765 -1354897 -1387195 -1507096 -1856719 -2468332 -3164830 -3654126
37544c654126n8746M26075Q02825R52991Q28305M94646J13525j63853k81920k61609
$$ -3654126 -3712872 -3286797 -2483972 -1530981 -702676 -208030 -94505 -258358 -540278 -801887
37534h01887j35387O9426L04466M98551N96848N92648N12449L75496J84806l3958
$$ -801887 -937274 -867848 -563382 -64831 532017 1124665 1637114 2012610 2197416 2163458
37524B163458k07388k62130j96093p0168O6920J97571K74901K17501J5882k05007
$$ 2163458 1956070 1693940 1497847 1427679 1494599 1692170 1967071 2184572 2200454 1995447
37514A995447k92214k06873j2651K27223M56432N63945M41749J39854j26177j77862
$$ 1995447 1703233 1496360 1483709 1710932 2167364 2731309 3173058 3312912 3186735 3008873
37504C008873l2816J68642L22212L89247L41495J80315o327j04313j15747j72090
$$ 3008873 2976057 3144699 3466911 3856158 4197653 4377968 4371641 4267328 4151581 3979491
37494C979491l67075o25833p89756q01905p47526p10856o54679m83250j94733
$$ 3979491 3612416 2986583 2196827 1394922 647396 -63460 -718139 -1201389 -1396122
37485a396122Q3385K15685J75703K9173j55319l39252m80149n17011m06487j58963
$$ -1396122 -1312737 -1097052 -921349 -892176 -1047495 -1386747 -1866896 -2383907 -2790394 -2949357
37475b949357J59205M43635N88623N49651L85310K15403J25409J23133J79012
$$ -2949357 -2790152 -2346517 -1757894 -1208243 -822933 -607530 -482121 -358988 -179976
37466a79976K67580L54809L87965L42808K69500K52648L20165M17249M75343M78104
$$ -179976 87604 442413 830378 1173186 1442686 1695334 2015499 2432748 2908091 3386195
37456C386195M42214L61240K12988K8084r0830n8077R4585K42148L00499L09004
$$ 3386195 3828409 4189649 4402637 4430721 4339891 4281814 4376399 4618547 4919046 5228050
37446E228050L60626M68900N32336M32294J52558j98745m75527n98834n82674
$$ 5228050 5588676 6057576 6589912 7022206 7174764 6976019 6500492 5901658 5318984
37437E318984m69948k70453J3900L17907N14974N14588L38743Q7073j52376l42354
$$ 5318984 4849036 4578583 4592483 4910390 5425364 5939952 6278695 6365768 6213392 5871038
37427E871038m75106n46294n46433m60930k85640n3495J68515L24190M01609M18908
$$ 5871038 5395932 4849638 4303205 3842275 3556635 3503140 3671655 3995845 4397454 4816362
37417D816362L98822L63790L24880K59927J36630j9747j18258r6812K650Q8338
$$ 4816362 5215184 5578974 5903854 6163781 6300411 6280664 6162406 6065594 6068244 6156582
37407F156582J20427J18377R1732J5946j24004k97356m31159m40865k97141r5926
$$ 6156582 6277009 6395386 6487118 6503064 6379060 6081704 5650545 5209680 4912539 4816613
37397D816613j5728j43488l67475n01265m87383m08515l21988j81587N8357L43483
$$ 4816613 4800885 4657397 4289922 3788657 3301274 2892759 2570771 2389184 2447541 2791024
37387B791024N64886O57448O30860N53997N34416O59739R11366J158622J274557
$$ 2791024 3355910 4013358 4644218 5198215 5732631 6392370 7303736 8462358 9736915
37378I736915J251903J190441J178471J189918J086061P27991J19234n52837j034126
$$ 9736915 10988818 12179259 13357730 14547648 15633709 16361700 16480934 15928097 14893971
37369A4893971j174405r99096o58320l34906j60397j50945k07242j96846m0322
$$ 14893971 13719566 12720470 12062150 11727244 11566847 11415902 11208660 11011814 10971492
37360A0971492K69366O75847J061601J303680J383039J400155J443239J499682
$$ 10971492 11240858 11916705 12978306 14281986 15665025 17065180 18508419 20008101
37352B0008101J544703J634039J825184K081457K356896K713972L249581L966136
$$ 20008101 21552804 23186843 25012027 27093484 29450380 32164352 35413933 39380069
37344C9380069M829781N886081P187364Q678729J0302150J2134555J4268109J6671216
$$ 39380069 44209850 50095931 57283295 65962024 76264174 88398729 102666838 119338054
37336A19338054J9378841K2685734K6852685L1687524L6615985M0777984M2382759
$$ 119338054 138716895 161402629 188255314 219942838 256558823 297336807 339719566
37329C39719566L8297486K5792850N800963j6049069l2780718m0846647m1546638
$$ 339719566 378017052 403809902 409610865 393561796 360781078 319934431 278387793
37322B78387793l8370571l3914158k9230737k4773677k0890165j7638976j4837418
$$ 278387793 240017222 206103064 176872327 152098650 131208485 113569509 98732091
37315I8732091j2397086j0361737q689443p259854o056156n132355m438405l853361
$$ 98732091 86335005 75973268 67283825 60023971 53967815 48835460 44397055 40543694
37307D0543694l357681l019780k835518k704058k538800k309908k021677j733258
$$ 40543694 37186013 34166233 31330715 28626657 26087857 23777949 21756272 20023014
37299B0023014j542036j455704j342208j096301p87575n47828l85707k28744q9856
$$ 20023014 18480978 17025274 15683066 14586765 13799190 13251362 12865655 12636911 12547055
37290A2547055o2495j72760l39982m71813n26457n12776m92994n34582n94945
$$ 12547055 12484560 12311800 11971818 11500005 10973548 10460772 9967778 9433196 8838251
37281H838251n29698l01202q9172p3015j84791k27214j69658j40625j53737n6271
$$ 8838251 8308553 8007351 7918179 7845164 7660373 7433159 7263501 7122876 6969139 6912868
37271F912868K01456M32441M49035L01951J72095J13763K3924j75267m28144o18213
$$ 6912868 7114324 7546765 7995800 8297751 8469846 8583609 8607533 8432266 8004122 7385909
37261G385909o81045o32032n19142l68066j76149L8679K05278K50267J76244N4360
$$ 7385909 6704864 6072832 5553690 5185624 5009475 5048154 5253432 5503699 5679943 5734303
37251E734303n7032j51470k43844l50162m92948o68402q00274p87415o23330m23002
$$ 5734303 5677271 5525801 5281957 4931795 4438847 3770445 2970171 2182756 1559426 1136424
37241A136424l05799k89921l21225l56729l80136l68765k94398j54409K1632J93754
$$ 1136424 830625 540704 219479 -137250 -517386 -886151 -1180549 -1334958 -1313326 -1119572
37231a119572L32263M31113N08401N74707N92834M96683K74303J8246j33013j07973
$$ -1119572 -787309 -356196 152205 726912 1319746 1816429 2090732 2108978 1975965 1867992
37221A867992M8274K26016L35803L45728K63705J16349m7673j65718k10812k29133
$$ 1867992 1916266 2142282 2478085 2823813 3087518 3203867 3156194 2990476 2779664 2550531
37211B550531k92444m05343m86536m44235k41727R6451M77784P34349P11889M25232
$$ 2550531 2258087 1852744 1366208 921973 680246 776697 1254481 1988830 2700719 3125951
37201C125951O9216j79099l13160l99902m19145l15677j59457j05727j85032k59952
$$ 3125951 3195167 3016068 2702908 2303006 1883861 1568184 1408727 1303000 1117968 858016
37191H58016k26877j49469j33950j64764j44503m2294P3553J28116J15632R9543
$$ 858016 631139 481670 347720 182956 38453 -3841 69712 197828 313460 413003
37181D13003J63451L34491N33425O31242N69267L88250J45217j23408l42583m04811
$$ 413003 576454 910945 1444370 2075612 2644879 3033129 3178346 3054938 2712355 2307544
37171B307544k98409j49604o1069J8857J73478L32514L36381J56318p9055k70760
$$ 2307544 2009135 1859531 1798462 1817319 1990797 2323311 2659692 2816010 2736955 2466195
37161B466195m24169n11968m14021q6562L12602N85402P24261Q65450J038534
$$ 2466195 2042026 1530058 1116037 1029475 1342077 1927479 2651740 3517190 4555724
37152D555724J089404Q84112M96649J36319o1709j23042j47954j97665k62212
$$ 4555724 5645128 6529240 7025889 7162208 7100499 6977457 6829503 6631838 6369626
37143F369626k99737k95259k91200l50592m74524n74420n59710m47503l49472
$$ 6369626 6069889 5774630 5483430 5132838 4658314 4083894 3524184 3076681 2727209
37134B727209l44368l95266m01403k98496r4107J57542L85307N34306O05960O46407
$$ 2727209 2382841 1987575 1586172 1287676 1193569 1351111 1736418 2270724 2876684 3523091
37124C523091O62478N75153L09560p6686m12676n75423n91056n66545n68586n89289
$$ 3523091 4185569 4760722 5070282 4993596 4580920 4005497 3414441 2847896 2279310 1690021
37114A690021n80909m86084k72840R316K28231K78797J99788J46337K36627M45003
$$ 1690021 1109112 623028 350188 359504 587735 866532 1066320 1212657 1449284 1894287
37104A894287O45061P34985P19634O91446P33054Q18839Q12356N87761J68425
$$ 1894287 2539348 3274333 3993967 4685413 5418467 6237306 7049662 7637423 7805848
37095G805848k65664n15226n03713l01156m7627J33246J84813J33556O3694M6277
$$ 7805848 7540184 7024958 6521245 6220089 6172462 6305708 6490521 6624077 6687771 6734048
37085F734048P0981N2926p9764l03791n11216o01803n61381m55577l65733l41348
$$ 6734048 6805029 6857955 6778191 6474400 5963184 5361381 4800000 4344423 3978690 3637342
37075C637342l94239m99914n90083n74451m12166j70598J1781M2227m9570j59408
$$ 3637342 3243103 2743189 2153106 1578655 1166489 995891 1007672 1049899 1000329 840921
37065H40921k22947k62618l21357l79166l63898k38180m4736J42970K84721L65697
$$ 840921 617974 355356 33999 -345167 -709065 -947245 -991981 -849011 -564290 -198593
37055a98593L54096K16322k2695k78261m85211o44681p63578p77991n87874j73874
$$ -198593 155503 371825 349130 70869 -414342 -1059023 -1822601 -2600592 -3188466 -3362340
37045c362340L47394P86194R79405Q53636M61721r048l19270l45472j80039k8392
$$ -3362340 -3014946 -2228752 -1249347 -395711 66010 56962 -262308 -607780 -787819 -816211
37035h16211J414k2328J5257J19437J91929J53898R203j98668m26712o12831o79057
$$ -816211 -814797 -837125 -821868 -702431 -510502 -356604 -347401 -546069 -972781 -1585612 -2264669
37024b264669o12094n20230n49635p26433r13475r43209p75019n06484k50956
$$ -2264669 -2876763 -3396993 -3946628 -4673061 -5586536 -6529745 -7304764 -7811248 -8062204
37015h062204l4808J85915M36831O73910Q16843Q21844P17532N71205M25418K77259
$$ -8062204 -8097012 -7911097 -7474266 -6800356 -5983513 -5161669 -4444137 -3872932 -3447514 -3170255
37005c170255J25592K3601N1127K15500L99854M47281L05387O6180j41394k67340
$$ -3170255 -3044663 -3021062 -2969935 -2754435 -2354581 -1907300 -1601913 -1535733 -1677127 -1944467
36995a944467l34532l60657l40610k96567k84953l29077l82050l85673l40359
$$ -1944467 -2278999 -2639656 -2980266 -3276833 -3561786 -3890863 -4272913 -4658586 -4998945
36986d998945k86283k37187j75741j13512j14884k35561m42992o08889n88054
$$ -4998945 -5285228 -5522415 -5698156 -5811668 -5926552 -6162113 -6605105 -7213994 -7802048
36977g802048l22433J10038N43879Q34636R34323Q79884P37350N71909M44459
$$ -7802048 -8124481 -8014443 -7470564 -6635928 -5701605 -4821721 -4084371 -3512462 -3068003
36968c068003L88917L76077L25809J84088r818j46071j39753j65J93058L65523
$$ -3068003 -2679086 -2303009 -1977200 -1793112 -1802930 -1949001 -2088754 -2088919 -1895861 -1530338
36958a530338M80691N08894M14844K17172L5695J2962J64675L48042M09993L40951
$$ -1530338 -1049647 -540753 -125909 91263 126958 139920 304595 652637 1062630 1403581
36948A403581K51265K18914K03497J11258q3765k92863l82582l03707j57806j09746
$$ 1403581 1654846 1873760 2077257 2188515 2104750 1811887 1429305 1125598 967792 858046
36938H58046k12476l41811l31507j50333Q4062K36215K51033J48482o833j21856
$$ 858046 645570 303759 -27748 -178081 -94019 142196 393229 541711 534878 413022
36928D13022j21949j3315J27904K38192L06251L28105K73476J25238p7134k55927
$$ 413022 291073 277758 405662 643854 950105 1278210 1551686 1676924 1599790 1343863
36918A343863l37835k77957q9325J27365K30056J61180J5368n0316L1983J92470
$$ 1343863 1006028 728071 638746 766111 996167 1157347 1172715 1122399 1154382 1346852
36908A346852L04466K91085J73508M4531j2684J836K0990N832o891K4461O4215
$$ 1346852 1651318 1942403 2115911 2160442 2147758 2149594 2170584 2176416 2169525 2193986 2258201
36897B258201L6757o6608j67921j96175j61487j20932j00457p4999j4268P3465
$$ 2258201 2294958 2228350 2060429 1864254 1702767 1581835 1481378 1406379 1392111 1465576
36887A465576J47636J77494J69240J47111J16255O0590k4322j18119k00080k60637
$$ 1465576 1613212 1790706 1959946 2107057 2223312 2283902 2259580 2141461 1941381 1680744
36877A680744k76823k09284n6440J06628J82055J42092M2929m9269j14929j63033
$$ 1680744 1403921 1194637 1138197 1244825 1426880 1568972 1611901 1562632 1447703 1284670
36867A284670j96698k23592k80674m10941o02355p66652q02774o89353n02556
$$ 1284670 1087972 864380 583706 172765 -429590 -1196242 -1999016 -2688369 -3190925
36858c190925l33887k06430r1716J0910O0650N3099O8095K00953M54913P21275
$$ -3190925 -3524812 -3731242 -3822958 -3812048 -3751398 -3698299 -3630204 -3429251 -2974338 -2253063
36848b253063Q57345P80012N17639K03063l510k7572O9853J60263J57770O2677
$$ -2253063 -1395718 -615706 -98067 104996 101486 73914 143767 304030 461800 524477
36838E24477o9156j74228k24339k51813l10564l84223l66029j76929J21199L87716
$$ 524477 455321 281093 56754 -195059 -505623 -889846 -1255875 -1432804 -1311605 -923889
36828i23889N62841O97189Q22905Q74810P75232N42713K73952N1224r8531j85137
$$ -923889 -361048 336141 1159046 2033856 2809088 3351801 3625753 3676977 3578446 3393309
36818C393309k36937k85140l33810l51768l09491k07563n7084J37392L47323M95970
$$ 3393309 3156372 2871232 2537422 2185654 1876163 1668600 1611516 1748908 2096231 2592201
36808B592201N02387L51005J06387j28712k66126k79900k30202k13429k54888
$$ 2592201 3094588 3445593 3551980 3423268 3157142 2877242 2647040 2433611 2178723
36799B178723k71391j75007N565J47148J62366O9065n4505j33838j24394l3520
$$ 2178723 1907332 1732325 1737890 1885038 2047404 2116469 2061964 1928126 1803732 1770212
36789A770212O7357R7957N7100K0627L8051P4115P4880M4987J9021q161p0007
$$ 1770212 1837569 1935526 1992626 2013253 2051304 2125419 2200299 2245286 2264307 2256146 2186139
36778B186139j63186k45011k95517l38298l91022m32623m35828m01752l39328
$$ 2186139 2022953 1777942 1482425 1144127 753105 320482 -115346 -517098 -856426
36769h56426k34078p1790J10590K32548K48824K05424J92022K42022L09899L54056
$$ -856426 -1090504 -1162294 -1051704 -819156 -570332 -364908 -172886 69136 379035 733091
36759G33091L97229M63197M87938L70611J23104j02192j70708r8437J1158R7258
$$ 733091 1130320 1593517 2081455 2452066 2575170 2472978 2302270 2203833 2214991 2312249
36749B312249J39752Q5529j09174l63869n04400m41103k44349j9666K06808M32110
$$ 2312249 2452001 2537530 2428356 2064487 1560087 1118984 874635 854969 1061777 1493887
36739A493887N91476O14362N22154L92513K53733Q6130r4718k37486l36045m35858
$$ 1493887 2085363 2699725 3221879 3614392 3868125 3954255 3859537 3622051 3286006 2850148
36729B850148n45908o08105n78622m92412m23988m20255m84532n83700o50549
$$ 2850148 2304240 1696135 1117513 625101 201113 -219142 -703674 -1287374 -1937923
36720a937923o17622m75919k78262p4870J21857K99240M15504M36060L68201K39465
$$ -1937923 -2555545 -3031464 -3309726 -3384596 -3262739 -2963499 -2547995 -2111935 -1743734 -1504269
36710a504269P6848o8585j19254m1047J01238J97423J94898J25709M8773l755
$$ -1504269 -1427421 -1496006 -1615260 -1656307 -1555069 -1357646 -1162748 -1037039 -988266 -992021
36700i92021l4803p1429j46604k68366m00054m75525m30452k29879R8257M44060
$$ -992021 -1026824 -1098253 -1244857 -1513223 -1913277 -2388802 -2819254 -3049133 -2950876 -2506816
36690b506816O68806P09278O11492M50435K60117O7940o5393j08505j22792j81342
$$ -2506816 -1838010 -1128732 -517240 -66805 193312 261252 195859 87354 -35438 -216780
36680b16780k43159j98408m2156R1175R6529J7587m7043p6716r8776r0007j652
$$ -216780 -459939 -658347 -700503 -609328 -512799 -495212 -542255 -618971 -717747 -807754 -809406
36669h09406J42800K60234L10932L13466K63232J26946o0034j78262j57336o2500
$$ -809406 -666606 -406372 -95440 218026 481258 608204 548170 369908 212572 150072
36659A50072O130M7341J27918K63404M07840N33038O29302O39802M98154K55483
$$ 150072 156202 203543 331461 594865 1002705 1535743 2165045 2804847 3303001 3558484
36649C558484P5878N3326R9871O4469j02179l54063o42240r09625j046938r65827
$$ 3558484 3634362 3687688 3787559 3852028 3749849 3395786 2753546 1843921 796983 -168844
36639a68844p06050l83926n5011K71859N07156N16998L29202J66584J82460K56939
$$ -168844 -874894 -1258820 -1313831 -1041972 -534816 -17818 311384 477968 660428 917367
36629I17367J62546j30049m24712n45810m98683l83715k52078q5843J34720L80107
$$ 917367 1079913 949864 525152 -20658 -519341 -903056 -1155134 -1240977 -1106257 -726150
36619g26150N67150O02763M60740K14344k9058k09212l04966k91306j75232n3663
$$ -726150 -159000 443763 904503 1118847 1089789 880577 575611 284305 109073 55410
36609E5410m4316j36555j80681n9666J81068M07947N51608O38429P07413P55100
$$ 55410 11094 -125461 -306142 -365808 -184740 223207 774815 1413244 2120657 2875757
36599B875757P59181P13483O24326M85575K66951o2440m77783q61497j052185
$$ 2875757 3634938 4348421 4972747 5458322 5725273 5662833 5185050 4323553 3271368
36590C271368r62976o56852k98958l6696P7012O6597k7330j73811l22762l86875
$$ 3271368 2308392 1651540 1352582 1315886 1392898 1459495 1432165 1258354 935592 548717
36580E48717k99611j00308Q0356J49694J38429J26249J19906O3189m9658j38126
$$ 548717 249106 148798 229154 378848 517277 643526 763432 826621 776963 638837
36570F38837j23885o670J58495L17533M40686N27749N96356O31993N63713L50547
$$ 638837 514952 508282 666777 984310 1424996 1952745 2549101 3181094 3744807 4095354
36560D095354Q7263o1162n8652n1582j74433l72490m83467m36955k93637j32213
$$ 4095354 4182617 4121455 4062803 4011221 3836788 3464298 2980831 2543876 2250239 2118026
36550B118026L706O2168p285j71280l12595l48395k99077k12880p8287J38755
$$ 2118026 2121732 2183900 2176615 2005335 1692740 1344345 1045268 832388 754101 892856
36540H92856M02774O09144O74744N96587M24904K11989m110j93573l38675m43400
$$ 892856 1295630 1904774 2579518 3176105 3601009 3812998 3808888 3615315 3276640 2833240
36530B833240n25965n94717o32601o07558m99644l23094j29801J1299N6310K2352
$$ 2833240 2307275 1712558 1079957 472399 -27245 -350339 -480140 -468841 -412531 -390179
36520c90179k6122l9450k1963L699N1481J56192L07874M40972M95941M57075L24813
$$ -390179 -416301 -455751 -477714 -474015 -422534 -266342 41532 482504 978445 1435520 1760333
36509A760333J02720j58231l48317l85086k97542j89119j30636j17667j05392
$$ 1760333 1863053 1704822 1356505 971419 673877 484758 354122 236455 131063
36500A31063m1084J09786L01668L81358K06324j75805n25645o33963n04556k81207
$$ 131063 89979 199765 501433 882791 1089115 913310 387665 -246298 -750854 -1032061
36490a032061n4369J77606L84530M56344L28054R0554q2471r0515N2965K93766
$$ -1032061 -1086430 -908824 -524294 -67950 260104 350658 268187 177672 230637 524403
36480E24403N69458P70415P62030N09795J47662j34406k61362k95917l15109l26491
$$ 524403 1093861 1864276 2626306 3136101 3283763 3149357 2887995 2592078 2276969 1950478
36470A950478l09989k75364k36835j69458m2734J12293K15607K28184J95490J76950
$$ 1950478 1640489 1365125 1128290 958832 916098 1028391 1243998 1472182 1667672 1844622
36460A844622J53178M7473j44652k85737k12430P0514L61969M62610L64605K02522
$$ 1844622 1997800 2045273 1900621 1614884 1402454 1472968 1834937 2297547 2662152 2864674
36450B864674N8991r6734k80942m06379l78308k25072o5785L2433J08354K18598
$$ 2864674 2923665 2826931 2545989 2139610 1761302 1536230 1470445 1502878 1611232 1829830
36440A829830L40063L78282K60586J5635k40862m11459n06433o04012p23028p80731
$$ 1829830 2169893 2548175 2808761 2824396 2583534 2172075 1665642 1061630 338602 -442129
36430d42129o96511m88348k28576M7743L29435N60094O66968O61482O35661O31906
$$ -442129 -1138640 -1626988 -1855564 -1807821 -1478386 -918292 -251324 410158 1045819 1677725
36420A677725N72970L58163n512l97739o80212p71668o65073m21009j41321Q4986
$$ 1677725 2250695 2608858 2603346 2205607 1525395 753727 88654 -332355 -473676 -388690
36410c88690K21944K73662K56433K08025J97159K62239L22809K04947j86205p23269
$$ -388690 -166746 106916 363349 571374 768533 1030772 1353581 1558528 1372323 649054
36400F49054j134453j243662j102868q71019o12470k76072J47543N35719P42078
$$ 649054 -485399 -1729061 -2831929 -3702948 -4315418 -4591490 -4443947 -3908228 -3166150
36391c166150P50018O74773O39157O86259P89509Q91787R26788Q40955O20815
$$ -3166150 -2416132 -1741359 -1102202 -415943 373566 1265353 2192141 3033096 3653911
36382C653911L06255o403j73721p3977K65915O19756P10131M50768K7313k77170
$$ 3653911 3960166 3953763 3780042 3706065 3971980 4591736 5301867 5752635 5779948 5502778
36372E502778l25268k02844r8463j30867k71194l98669m19882l36741k11177r5094
$$ 5502778 5177510 4974666 4876203 4745336 4474142 4075473 3655591 3318850 3107673 3012579
36362C012579j7353p940p6319j62708j71717q9424k7431j04611l04512m97424
$$ 3012579 2995226 2987286 2910967 2748259 2576542 2487118 2459687 2355076 2050564 1553140
36352A553140n99579o58435p55474q62488q49493o46828l59698j79635j85202
$$ 1553140 953561 295126 -460348 -1322836 -2172329 -2819157 -3178855 -3358490 -3543692
36343c543692k66999k60835j18688P8263K40275L49265M26094M72069M64700L85755
$$ -3543692 -3810691 -4071526 -4190214 -4111951 -3871676 -3522411 -3096317 -2624248 -2159548 -1773793
36333a773793K40881P0742n6021r2117o4663n2565j01329j85301k53403k64535
$$ -1773793 -1532912 -1462170 -1518191 -1610308 -1674971 -1727536 -1828865 -2014166 -2267569 -2532104
36323b532104j63139J11842N26458Q90114R75317P20212K73760j63564m94157
$$ -2532104 -2695243 -2583401 -2056943 -1166829 -191512 528700 802460 638896 144739
36314A44739p08496p89109p00909m63234j71023P0997K05085K14892J16745k0259
$$ 144739 -563757 -1352866 -2053775 -2517009 -2688032 -2617035 -2411950 -2197058 -2080313 -2100572
36304b100572r7725q3120n0113o3423m8722J30486M50663O82993O40301M03183
$$ -2100572 -2198297 -2281417 -2331530 -2394953 -2443675 -2313189 -1862526 -1179533 -539232 -136049
36294a36049K08148J46879Q6922j01399l47509m65127l65794j24480J24153K85390
$$ -136049 72099 218978 305900 204501 -143008 -608135 -973929 -1098409 -974256 -688866
36284f88866L20395K38311R8962r899k6579M8511J61951K42759K43888J74459
$$ -688866 -368471 -130160 -31198 -41097 -67676 -19165 142786 385545 629433 803892
36274H03892R3473N7419P2759J07494J39216J70091J93084J67672N1542j42442
$$ 803892 897365 954784 1027543 1135037 1274253 1444344 1637428 1805100 1856642 1714200
36264A714200l34158m31348l96758k60731q4530O5610J20633M1022j17040k02899
$$ 1714200 1380042 948694 551936 291205 206675 272285 392918 433940 316900 114001
36254A14001r7281J60278M05141N06827M62859L49696K39526J74417J63417J73397
$$ 114001 16720 176998 582139 1088966 1551825 1901521 2141047 2315464 2478881 2652278
36244B652278J58921J22072J03442R6694K7917j39070l22614m01825l48967k36960
$$ 2652278 2811199 2933271 3036713 3133407 3161324 3022254 2699640 2297815 1948848 1711888
36234A711888j37121n3811N7176K41331M88196O80771O47153L40451m7616k33229
$$ 1711888 1574767 1520956 1578132 1819463 2307659 2988430 3635583 3976034 3928418 3695189
36224C695189j13859J57233L63075M17129L61483K64171J69804R3629O923j40812
$$ 3695189 3581330 3738563 4101638 4518767 4880250 5144421 5314225 5407854 5414777 5273965
36214E273965l43007n09104n58697n20909n00751n60445o63449p18701o50701
$$ 5273965 4930958 4421854 3863157 3342248 2841497 2281052 1617603 898902 248201
36205B48201m43070j46979J55521M07299N79034O20161M70243J66213j11050j75957
$$ 248201 -194869 -341848 -186327 220972 800006 1420167 1890410 2056623 1945573 1769616
36195A769616k0627J94230L18616L25182K58227J60112P3707M0810M6425J3495
$$ 1769616 1748989 1943219 2261835 2587017 2845244 3005356 3079063 3119873 3166298 3179793
36185C179793r7272k20896k70484k50538k30966k36226k29618j97623j76825j86490
$$ 3179793 3082521 2861625 2591141 2340603 2109637 1873411 1643793 1446170 1269345 1082855
36175A082855k02225k22344k97475m47672n93441o24397n17335l43197j77031
$$ 1082855 880630 658286 360811 -86861 -680302 -1304699 -1822034 -2165231 -2342262
36166b342262m9544K6550M3598K4521J4122K6238L7028M7731J07832K36427L52890
$$ -2342262 -2391806 -2365256 -2321658 -2297137 -2283015 -2256777 -2219749 -2172018 -2064186 -1827759 -1474869
36155a474869L42851J95125L0465k3228L9439J13196J08484M5329K1551J03192
$$ -1474869 -1132018 -936893 -906428 -929656 -890217 -777021 -668537 -623208 -601657 -498465
36145d98465K58597L96836M51547M13454K99368J26843p3317k52425l72225m17490
$$ -498465 -239868 156968 608515 1021969 1321337 1448180 1374863 1122438 750213 332723
36135C32723l71028k20261k7915M6040j24267m62984p17910o90525m12507p6779
$$ 332723 -38305 -258566 -286481 -240441 -364708 -827692 -1545602 -2236127 -2648634 -2725413
36125b725413J61240K77743L23748L50278L93599M70379N45389N25246L26702
$$ -2725413 -2564173 -2286430 -1962682 -1612404 -1218805 -748426 -203037 322209 648911
36116F48911k8800l93269n84799n28647l18526j27541n3084o4502r9268j58967
$$ 648911 620111 226842 -357957 -886604 -1205130 -1332671 -1385755 -1450257 -1549525 -1708492
36106a708492k68202l76080l74416k24298o665J75895K97027L73639L85277K87894
$$ -1708492 -1976694 -2352774 -2727190 -2951488 -2958153 -2782258 -2485231 -2111592 -1726315 -1438421
36096a438421R2911j22881k91392l99057m55876m60125m10416l21233k03547n0729
$$ -1438421 -1345510 -1468391 -1759783 -2158840 -2614716 -3074841 -3485257 -3806490 -4010037 -4060766
36086d060766J31711K94275L68991L34095K43092J82435J98812K66974L28784
$$ -4060766 -3929055 -3634780 -3265789 -2931694 -2688602 -2506167 -2307355 -2040381 -1711597
36077a711597L59910L85143M22700M37066L79907K74549K19509K82634M08145
$$ -1711597 -1351687 -966544 -543844 -106778 273129 547678 767187 1049821 1457966
36068A457966M53139L15131J5937l25303n78918o68133n78442l39220j3845K99747
$$ 1457966 1911105 2226236 2242173 1916870 1337952 669819 91377 -247843 -261688 38059
36058C8059M90363M86933K96666j5986l72424o80398q20239p03922l80680l7434
$$ 38059 528422 1015355 1312021 1296035 923611 243213 -577026 -1280948 -1661628 -1699062
36048a699062J56301J88934J63157J44498J09060K8114o5362j19405j29242j31381
$$ -1699062 -1542761 -1353827 -1190670 -1046172 -937112 -908998 -974360 -1093765 -1223007 -1354388
36038a354388j55189j99699k37684k28732j53496n2930p715n2166j24804j30011
$$ -1354388 -1509577 -1709276 -1946960 -2175692 -2329188 -2382118 -2389833 -2441999 -2566803 -2696814
36028b696814l9941Q2533J49491J20304L1117j6178Q9365L73706P23029R46070
$$ -2696814 -2736755 -2654222 -2504731 -2384427 -2353310 -2369488 -2280123 -1906417 -1183388 -237318
36018b37318R11013O28253K24038j33433k97475k04789P2421L53092M71732L91902
$$ -237318 673695 1301948 1525986 1392553 1095078 890289 962710 1315802 1787534 2179436
36008B179436J92948l2663k33650l64333l60238j99532K7509J62797J19312l9313
$$ 2179436 2372384 2339721 2106071 1741738 1381500 1181968 1209477 1372274 1491586 1452273
35998A452273j73927k15777k22824k96961m64745o45686p23887o39742m22872
$$ 1452273 1278346 1062569 839745 542784 78039 -567647 -1291534 -1931276 -2354148
35989b354148j58331P0107K15953K69237K32893J09153q1702k72621l65349l05402
$$ -2354148 -2512479 -2442372 -2226419 -1957182 -1724289 -1615136 -1696838 -1969459 -2334808 -2640210
35979b640210j48801l4823p1248k38444m02959m22918k54364J5469K27195K67250
$$ -2640210 -2789011 -2823834 -2895082 -3133526 -3536485 -3959403 -4213767 -4198298 -3971103 -3703853
35969c703853J60491M8609O2409K14291M16159N76046O51302O31572N23713L64542
$$ -3703853 -3543362 -3494753 -3432344 -3218053 -2801894 -2225848 -1574546 -942974 -419261 -54719
35959e4719K08895Q4199k0098j08724j59187j61294j42515j24309q1224K0011
$$ -54719 154176 238375 218277 109553 -49634 -210928 -353443 -477752 -558976 -538965
35949e38965J61279K94312M09044N33746O63082P30091O71735M98904K83798R6680
$$ -538965 -377686 -83374 325670 859416 1522498 2252589 2924324 3423228 3707026 3803706
35939C803706k7390p9410p1467n1218r2710k32678m04789m68966l44110j09297
$$ 3803706 3776316 3696906 3625439 3574221 3481511 3248833 2844044 2375078 2030968 1921671
35929A921671N7726M6411j05330k84542m07253m40465l82486k64786j36623q741
$$ 1921671 1979397 2025808 1920478 1635936 1228683 788218 405732 140946 4323 -4418
35919d418J51060L25220L98494K77267L3192j55430k09448k22656l14307m77796
$$ -4418 146642 471862 870356 1147623 1180815 1025385 815937 593281 278974 -198822
35909a98822o10187o37709n68245m54810l52559k96038k79045k51052j50702M3569
$$ -198822 -809009 -1446718 -2014963 -2469773 -2822332 -3118370 -3397415 -3648467 -3799169 -3755600
35899c755600K82715M63871N06946M42622M01206M76943O25150P38926P98600
$$ -3755600 -3472885 -3009014 -2502068 -2059446 -1658240 -1181297 -556147 182779 981379
35890I81379Q70428R63391R73783Q01141M59819N3792k99732n04043n18594m10106
$$ 981379 1851807 2815198 3788981 4590122 5049941 5103733 4804001 4299958 3781364 3371258
35880C371258l14300l00160l12825k79672k12766j63196j36995j17315j19008
$$ 3371258 3056958 2756798 2443973 2164301 1951535 1788339 1651344 1534029 1415021
35871A415021j53918j80576j54874j00573o9234o2346n4144n2221n7106Q286K32713
$$ 1415021 1261103 1080527 925653 825080 755846 693500 639356 587135 530029 538315 771028
35860G71028N75150Q64301R52090Q16972N27694J80838j19615l00237l71125l97603
$$ 771028 1346178 2210479 3162569 3979541 4507235 4688073 4568458 4268221 3897096 3499493
35850C499493m04292l53029k24453o6666N5388J09972Q2311l4846k02751l35610
$$ 3499493 3095201 2742172 2517719 2451053 2506441 2616413 2698724 2663878 2461127 2125517
35840B125517l80132l70773l73895l97709l88299l05685j81177r6930j09180j84218
$$ 2125517 1745385 1374612 1000717 603008 214709 -90976 -272153 -369083 -478263 -662481
35830f62481k17258j30949M9285K27193L21848L05098J93916N5352j0047M0349
$$ -662481 -879739 -1010688 -961403 -734210 -412362 -107264 86652 142004 131957 172306
35820A72306J21339J08189k998r4415r8183q7509j55692k73333l29397k74174
$$ 172306 293645 401834 398836 304421 206238 118729 -36963 -310296 -639693 -913867
35810i13867j55596k8849J10329K90266M95407O57379P17639O95850O77401P10711
$$ -913867 -1069463 -1098312 -987983 -697717 -202310 455069 1172708 1868558 2545959 3256670
35800C256670P29811O14638L27128m6350l85412o27470p68736q24868q13775p50485
$$ 3256670 3986481 4601119 4928247 4881897 4496485 3869015 3100279 2275411 1461636 711151
35790G11151o49853n53558n31251n97818o41144n12798k11077R5035K48596K42243
$$ 711151 61298 -492260 -1023511 -1621329 -2262473 -2775271 -2986348 -2891313 -2642717 -2400474
35780b400474J47072r337k31761m85672p04411q30440q04831n72852j64561K74697
$$ -2400474 -2253402 -2262739 -2494500 -2980172 -3684583 -4515023 -5319854 -5892706 -6057267 -5782570
35770e782570N99761P76864Q32053P56488N51679L17806J82954J55296J42361
$$ -5782570 -5182809 -4405945 -3573892 -2817404 -2265725 -1947919 -1764965 -1609669 -1467308
35761a467308J09392J16741J92870K73814K98640K77034K27278J32338P053o4605
$$ -1467308 -1357916 -1241175 -1048305 -774491 -475851 -198817 28461 160799 167852 103247
35751A03247k1859R4023K07677L07492M13623M88069M52287K86976N9935j39476
$$ 103247 81388 175411 383088 690580 1104203 1592272 2044559 2331535 2391470 2251994
35741B251994k46590k15776l9860J96668L32668K54060J0212k12222k43226o2992
$$ 2251994 2005404 1789628 1749768 1946436 2279104 2533164 2543376 2331154 2087928 2024936
35731B024936K02798L97585M31131K84829k1584m21575p78933r42905q69971o72438
$$ 2024936 2227734 2625319 3056450 3341279 3319695 2898120 2119187 1176282 306311 -366127
35721c66127n13362m55247m28940l40338j80791l1126J8270n9919k16703l62584
$$ -366127 -879489 -1334736 -1763676 -2104014 -2284805 -2315931 -2297661 -2357580 -2574283 -2936867
35711b936867m22188l82426l03903k68670k88958k68592q6708K61070O22497Q11522
$$ -2936867 -3359055 -3741481 -4045384 -4314054 -4603012 -4871604 -4958312 -4697242 -4074745 -3263223
35701c263223P65768N71499L51176J53777m9541k90541n35062o81443o36317m08719
$$ -3263223 -2497455 -1925956 -1574780 -1421003 -1470544 -1761085 -2296147 -2977590 -3613907 -4022626
35691d022626j16616J25615L13924N12317P15524Q19939P60695O17676N15138
$$ -4022626 -4139242 -4013627 -3699703 -3187386 -2471862 -1651923 -891228 -273552 241586
35682B41586M38266K37973j46739n36183o57430m40063r9524J00891J21936J36160
$$ 241586 679852 917825 771086 234903 -422527 -862590 -962114 -861223 -739287 -603127
35672f03127K79064M87585N96211N26091L37117J39612J7247J9766J57478L68427
$$ -603127 -324063 163522 759733 1285824 1622941 1762553 1779800 1799566 1957044 2325471
35662B325471N23147N04305K96258j319k44526l37167k73094j09221Q5706K50177
$$ 2325471 2848618 3352923 3649181 3647862 3403336 3066169 2793075 2683854 2769560 3019737
35652C019737L25696K82416J62604N7985J3871j5577q6167j71915k03183j74680
$$ 3019737 3345433 3627849 3790453 3848438 3862309 3846732 3760565 3588650 3385467 3210787
35642C210787j54863j88409k45823k83662l07100l49954m27141n29097o37176
$$ 3210787 3055924 2867515 2621692 2338030 2030930 1680976 1253835 724738 87562
35633H7562p25327p64111p32070o06633l52990L4017M67530P95104R17516Q57185
$$ 87562 -637765 -1401876 -2133946 -2740579 -3093569 -3059552 -2592022 -1796918 -879402 -22217
35623b2217O95036M78303K18365n4995k79876l95413l72579k33726n8507N9907
$$ -22217 672819 1151122 1369487 1314492 1034616 639203 266624 32898 -25609 34298
35613C4298R4124R9784J37432K08685K88766L70550M29475L92349K17614j0698
$$ 34298 128422 228206 365638 574323 863089 1233639 1663114 2055463 2273077 2262379
35603B262379j46292j40886p1878k921R8359K60035L95617L76146J93878j5622
$$ 2262379 2116087 1975201 1903323 1900402 1998761 2258796 2654413 3030559 3224437 3208815
35593C208815j26029j46372j69877k28747k43786j28030Q8389K71721L22806K62615
$$ 3208815 3082786 2936414 2766537 2537790 2294004 2165974 2254363 2526084 2848890 3111505
35583C111505J57609N008k41380n39743p35080p07098m99645k62996j01870k0367
$$ 3111505 3269114 3274122 3032742 2492999 1757919 1050821 551176 288180 186310 165943
35573A65943K3599P5688J79383L36128M55286M05267J49851j98034m76266n89014
$$ 165943 189542 265230 444613 780741 1236027 1641294 1791145 1593111 1116845 527831
35563E27831n09203k38356J58669N02335N75992L05930j55715n49416o99264n91849
$$ 527831 18628 -219728 -61059 441276 1017268 1323198 1167483 618067 -81197 -673046
35553f73046l18384Q681K89910M52143M81238M43993M41574N13772N97602O01715
$$ -673046 -991430 -982749 -692839 -240696 240542 684535 1126109 1639881 2237483 2839198
35543B839198N14450M09557L45933L03927K42295J77149J55586J68915J51103
$$ 2839198 3353648 3763205 4109138 4413065 4655360 4832509 4988095 5157010 5308113
35534E308113P5992P816K0742R0367J02976k0759k27659l71535l58193k48637
$$ 5308113 5384105 5391921 5412663 5503030 5606006 5585247 5357588 4986053 4627860 4379223
35524D379223k01379l03598m78725n76566n26689l70244j72741K6645J80294K25683
$$ 4379223 4177844 3874246 3395521 2818955 2292266 1922022 1749281 1775926 1956220 2181903
35514B181903J59284P7228R7489K53058M75642O53359O86119N27743K16546j52619
$$ 2181903 2341187 2418415 2515904 2768962 3244604 3897963 4584082 5111825 5328371 5175752
35504E175752n07884q22058j038839j041737p66000l17344Q6539K92517K95736
$$ 5175752 4667868 3845810 2806971 1765234 999234 681890 768429 1060946 1356682
35495A356682J79662L9227n0252o6233o1863j08053k03032k83189l22073l58817
$$ 1356682 1536344 1575571 1525319 1459086 1397223 1289170 1086138 802949 480876 122059
35485A22059m17123m56992m31661l43148k19222q6115J0930J4409p9985k06070
$$ 122059 -295064 -752056 -1183717 -1526865 -1746087 -1832202 -1821272 -1806863 -1886848 -2092918
35475b092918l08116l94277m72165m82618l58499j23292J23011L00232L87735
$$ -2092918 -2401034 -2795311 -3267476 -3750094 -4108593 -4231885 -4108874 -3808642 -3420907
35466c420907L93388L39188K68284K14409J64314R0298J3831p962M1124J15287
$$ -3420907 -3027519 -2688331 -2420047 -2205638 -2041324 -1951026 -1937195 -1945157 -1904033 -1788746
35456a788746J64925J77786J61544J28183J03659J12500J39504J42168J13379
$$ -1788746 -1623821 -1446035 -1284491 -1156308 -1052649 -940149 -800645 -658477 -545098
35447e45098R3173R8942Q2577r559j56826k77149l08740k54884j58877o2171J3475
$$ -545098 -451925 -352983 -270406 -279965 -436791 -713940 -1022680 -1277564 -1436441 -1498612 -1485137
35436a485137O4285R2874R2726M7291m8369j70520k81385l58662m02954m17613
$$ -1485137 -1420852 -1327978 -1235252 -1187961 -1236330 -1406850 -1688235 -2046897 -2449851 -2867464
35426b867464l88896k91438j19643Q2384K35907K97861L17477L90340N34577O38991
$$ -2867464 -3256360 -3547798 -3667441 -3585057 -3349150 -3051289 -2733812 -2343472 -1808895 -1169904
35416a169904N74026L50766J33670Q7376K39699N00521P65825R61336J019043
$$ -1169904 -595878 -245112 -111442 -24066 215633 716154 1481979 2443315 3462358
35407C462358Q89703O05666K86066L9092j25021k59098l82526m63671m91962n15632
$$ 3462358 4352061 4957727 5243793 5282885 5157864 4898766 4516240 4052569 3560607 3044975
35397C044975n80749o58204o62600n42994l40333j52374m4619N258P1411J82313
$$ 3044975 2464226 1806022 1143422 600428 260095 107721 63102 68360 139771 322084
35387C22084K68046K25895M2964j63429k37772j15372J31035L51765M30844L68827
$$ 322084 590130 816025 858989 695560 457788 342416 473451 825216 1256060 1624887
35377A624887K68961K20683J93108P8632j44625l42241l61802k16418p3750o2292
$$ 1624887 1893848 2114531 2307639 2386271 2241646 1899405 1537603 1321185 1247435 1185143
35367A185143j37712j57153m8010J22086K20072J67723J826j60966k20711j71105
$$ 1185143 1047431 890278 842268 964354 1184426 1352149 1353975 1193009 972298 801193
35357H01193q5543l1480j5432j9551o4182j91916l83056n28171n28179m19440
$$ 801193 715650 684170 668738 649187 585005 393089 10033 -518138 -1046317 -1465757
35347a465757l59484m65021o82954q45058q34050o64720m15353j34153J63400
$$ -1465757 -1825241 -2290262 -2973216 -3818274 -4652324 -5317044 -5732397 -5866550 -5703150
35338e703150M44927O54685P54274P48258O73416N74697M77006L62135J89544
$$ -5703150 -5258223 -4603538 -3849264 -3101006 -2427590 -1852893 -1375887 -1013752 -824208
35329h24208l3316k12693k34666p6344J65343L51642L93420K89328J25771M3858
$$ -824208 -857524 -1070217 -1304883 -1381227 -1215884 -864242 -470822 -181494 -55723 -11865
35319a1865J43453L67906N06421L68081k6221m41740o25428m95947j58451K17170
$$ -11865 131588 499494 1005915 1373996 1347775 906035 280607 -215340 -373791 -156621
35309a56621N02656O34715O06808M72667L26357K31716J64244M4071j70369m37405
$$ -156621 346035 980750 1587558 2060225 2386582 2618298 2782542 2826613 2656244 2218839
35299B218839o74877q19150q39491p33993n40280l28212j46156K2855K24303M46173
$$ 2218839 1543962 724812 -114679 -848672 -1388952 -1717164 -1863320 -1840465 -1616162 -1169989
35289a169989N87881N27915K27273k22635o46423q92816r23129q09739o56602
$$ -1169989 -582108 -54193 173080 -49555 -695978 -1588794 -2511923 -3321662 -3978264
35280c978264n26022m25223l25387j79808M2034L05693N13671N86456N33395M23278
$$ -3978264 -4504286 -4929509 -5254896 -5434704 -5392670 -5086977 -4573306 -3986850 -3453455 -3030177
35270c030177L06413J99679J26861J16867J53719J74425J38687P4062L6634M9860
$$ -3030177 -2723764 -2524085 -2397224 -2280357 -2126638 -1952213 -1813526 -1739464 -1702830 -1652970
35260a652970R3486J28507J21293O7819O532j9529k8162r2751k42149l90730m09583
$$ -1652970 -1559484 -1430977 -1309684 -1241865 -1235333 -1254862 -1283024 -1375775 -1617924 -2008654 -2418237
35249b418237k64346n2195R7647J32462Q5189J3819l9342m3785K2468J45420K51965
$$ -2418237 -2682583 -2734778 -2637131 -2504669 -2419480 -2405661 -2445003 -2488788 -2466320 -2320900 -2068935
35238b068935K46645R9314j06129k34189k18796j08276J3629J20544K27793L07240
$$ -2068935 -1822290 -1722976 -1829105 -2063294 -2282090 -2390366 -2376737 -2256193 -2028400 -1721160
35228a721160K80622J28642l1351l4442J56686M01485N20785M56829K79324P6553
$$ -1721160 -1440538 -1311896 -1343247 -1377689 -1221003 -819518 -298733 158096 437420 513973
35218E13973j07057k43915l02764k78565k00975q9977N9362K20849L06628K40554
$$ 513973 406916 163001 -139763 -418328 -619303 -709280 -649918 -429069 -122441 118113
35208A18113M5010j85452l81647n28554o11697n96653m82602l36514k41423k16108
$$ 118113 163123 -22329 -403976 -932530 -1544227 -2140880 -2623482 -2959996 -3201419 -3417527
35198c417527j92486o7851K03596N38913P50932O91121L96402P9630m3466P8611
$$ -3417527 -3610013 -3677864 -3474268 -2935355 -2184423 -1493302 -1096900 -1017270 -1060736 -982125
35188i82125L16178M68727L93186Q1419l34305o55337p38937n86215l26868j11853
$$ -982125 -665947 -197220 195966 277385 -56920 -712257 -1451194 -2037409 -2364277 -2476130
35178b476130K210P8964K07658L81893M99308M92584M15096L53400K95400J62201
$$ -2476130 -2473920 -2394956 -2187298 -1805405 -1306097 -813513 -398417 -45017 250383 412584
35168D12584l8496j80050j72641q6999o9530j65489k69644k34907k46L66150P11933
$$ 412584 374088 194038 21397 -65602 -135132 -300621 -570265 -805172 -805418 -439268 272665
35157B72665Q95728Q72746P03953M86347K82161J05468n2629j93820k88009k83987
$$ 272665 1168393 2041139 2745092 3231439 3513600 3619068 3566439 3372619 3084610 2800623
35147B800623j77956o6406p7920k33316m14732m93227m48334l45742k48356j82256
$$ 2800623 2622667 2556261 2478341 2245025 1830293 1337066 888732 542990 294634 112378
35137A12378j46216j14533o0630m963K586k1330K8623K15586M46468N51816M58863
$$ 112378 -33838 -148371 -209001 -213964 -211378 -232708 -204085 11501 457969 1009785 1468648
35126A468648K37744Q260j40249j68043j01670k6138L028L7119J68185L93282
$$ 1468648 1706392 1714652 1574403 1406360 1304690 1278552 1281580 1318699 1486884 1880166
35116A880166O01355O84206N98899L41562m3197m11913n79899m86852k54255m3293
$$ 1880166 2481521 3165727 3764626 4106188 4062991 3651078 3071179 2584327 2330072 2286779
35106B286779Q9138J61579J73324J16286M2125L2680J01107J79492K12600K16734
$$ 2286779 2375917 2537496 2710820 2827106 2869231 2901911 3003018 3182510 3395110 3611844
35096C611844K28077K29474J61210m430k25581m36010o11960p71619r09062r61670
$$ 3611844 3839921 4069395 4230605 4226175 4000594 3564584 2952624 2181005 1271943 310273
35086C10273q71474o64696m37575k61790j25499L3332K54347N09334P06948P51420
$$ 310273 -561201 -1225897 -1663472 -1925262 -2050761 -2017429 -1763082 -1253748 -546800 204620
35076B04620O24062M03720J89648K5817p1046n2383J13376L34601M23027K67042
$$ 204620 828682 1232402 1422050 1447867 1376821 1324438 1437814 1772415 2195442 2462484
35066B462484o4805m15389o81925q36256q61018p36827m91566k21913m7162l1974
$$ 2462484 2397679 1982290 1300365 464109 -396909 -1133736 -1625302 -1847215 -1894377 -1926351
35056a926351j35497k40234k58947k10870j63991j23480m1093O8577J05769J0016
$$ -1926351 -2061848 -2302082 -2561029 -2771899 -2935890 -3059370 -3100463 -3031886 -2926117 -2916101
35046b916101j64464l35704m84096o03693o35376n27272l20479j06577O2958J64895
$$ -2916101 -3080565 -3416269 -3900365 -4504058 -5139434 -5666706 -5987185 -6093762 -6030804 -5865909
35036e865909J58909M8099m9938k711J63255K78967K37688J09090L9294J11431
$$ -5865909 -5707000 -5658901 -5708839 -5711550 -5548295 -5269328 -5031640 -4922550 -4883256 -4771825
35026d771825L16384N77630P70821P86970O21289L63412R0494j69744l63769l99110
$$ -4771825 -4455441 -3877811 -3106990 -2320020 -1698731 -1335319 -1244825 -1414569 -1778338 -2177448
35016b177448k65625r6306k8235m5383l3073M3505R6878M6774p9349j87808k09976
$$ -2177448 -2443073 -2539379 -2567614 -2612997 -2646070 -2602565 -2505687 -2458913 -2538262 -2726070 -2936046
35005b936046j37406n473J35910K48753L08854K81372J31027j02207k64154j94848
$$ -2936046 -3073452 -3078925 -2943015 -2694262 -2385408 -2104036 -1973009 -2075216 -2339370 -2534218
34995b534218J03738M51042O56005O65203N36284L31536R4996j04076j89738j60468
$$ -2534218 -2430480 -1979438 -1323433 -658230 -121946 209590 304586 200510 10772 -149696
34985a49696j00444q2830r7978j06379j22661j87138k61655k21735R875L53959
$$ -149696 -250140 -332970 -430948 -537327 -659988 -847126 -1108781 -1330516 -1320641 -966682
34975i66682O36779P45971O94107N49409L62274J75087N0729L4943R2604J21579
$$ -966682 -329903 416068 1110175 1659584 2021858 2196945 2247674 2282617 2375221 2496800
34965B496800N0323r1101k09566k45034k09962j45644q0695m9032j04331k59880
$$ 2496800 2547123 2456022 2246456 2001422 1791460 1645816 1565121 1516089 1411758 1151878
34955A151878m24677m63847l44197j71109n5951m69M5707O9928J5628j08934k22993
$$ 1151878 727201 263354 -80843 -251952 -307903 -308372 -262665 -192737 -177109 -286043 -509036
34944e09036k77315k98030l17002l21731k91387k26822j30511j6976M1050m7426
$$ -509036 -786351 -1084381 -1401383 -1723114 -2014501 -2241323 -2371834 -2388810 -2347760 -2395186
34934b395186k63820m56203m95699m05860k87591j73711k4125J85645M50486P67925
$$ -2395186 -2659006 -3115209 -3610908 -4016768 -4304359 -4478070 -4502195 -4316550 -3866064 -3098139
34924c098139J090668J273899J181477Q55987M90271K13326k212j95170k93579
$$ -3098139 -2007471 -733572 447905 1303892 1794163 2007489 2005277 1810107 1516528
34915A516528k17547k9235J18605J55270J32366J06167N7242o1962k52504m55320
$$ 1516528 1298981 1269746 1388351 1543621 1675987 1782154 1839396 1777434 1524930 1069610
34905A069610n81006n60790m12187k50243j81205j76372j02139J08445L65405
$$ 1069610 488604 -72186 -484373 -734616 -915821 -1092193 -1194332 -1085887 -720482
34896g20482N28821N53969M87729L70016K10362M3607p0624j21875j64461k34361
$$ -720482 -191661 362308 850037 1220053 1430415 1474022 1403398 1281523 1117062 882701
34886H82701l00355l27745l37619l52136l26160k09865o1699j0213q4016j58371
$$ 882701 582346 254601 -83018 -435154 -761314 -971179 -1032878 -1043091 -1127107 -1285478
34876a285478j16622k712N1819J0774l9088l4061k1098o5760j30345j00522P8659
$$ -1285478 -1402100 -1404812 -1352993 -1342219 -1381307 -1415368 -1436466 -1502226 -1632571 -1733093 -1654434
34865a654434L32811N29937O00146N70650M92064L60799J46759j08686k78462
$$ -1654434 -1321623 -791686 -191540 379110 871174 1231973 1378732 1270046 991584
34856I91584k75446j61083p2995n7878l9838M3816J50141K03087J89481J29041
$$ 991584 716138 555055 482060 424182 384344 428160 578301 781388 970869 1099910
34846A099910L776k04757m29402n46859n03608l61334k12726j03956m6951m5486
$$ 1099910 1103686 898929 469527 -77332 -580940 -942274 -1155000 -1258956 -1305907 -1351393
34836a351393p6833r2687p6012o6879j01441j57232j91599j97520j75404q6978
$$ -1351393 -1428226 -1520913 -1596925 -1663804 -1765245 -1922477 -2114076 -2311596 -2487000 -2573978
34826b573978R0332K75736L36624K52531J59416J87304L04610L74420L25355K05829
$$ -2573978 -2483646 -2207910 -1871286 -1618755 -1459339 -1272035 -967425 -593005 -267650 -61821
34816f1821R5911L8109N1378J38071K51105L09866K83722K22413J74828J17372
$$ -61821 34090 72199 123577 261648 512753 822619 1106341 1328754 1503582 1620954
34806A620954K103j54815k78058l10576k50925j35557k7963n805r9425k39763
$$ 1620954 1623057 1468242 1190184 879608 628683 493126 465163 459358 359933 120170
34796A20170l18010l06872k76587k79393k72059j85483k9845J14006J88862K08221
$$ 120170 -197840 -504712 -781299 -1060692 -1332751 -1518234 -1548079 -1434073 -1245211 -1036990
34786a036990K14598K18010J78381M3232j83258m04007m92508m15575k69021j66264
$$ -1036990 -822392 -604382 -426001 -382769 -566027 -970034 -1462542 -1878117 -2147138 -2313402
34776b313402j19870p1640j1743N79n2485p5249N3835L32095O00646O70952M81371
$$ -2313402 -2433272 -2504912 -2516655 -2516076 -2568561 -2643810 -2589975 -2257880 -1657234 -986282 -504911
34765e04911J39846j69097l14671k80373j37453J4075R9946J16699J32746K06379
$$ -504911 -365065 -534162 -848833 -1129206 -1266659 -1252584 -1152638 -1035939 -903193 -696814
34755f96814K92297K80332J53504M3483O3615J34721P3824j53037l69127m06243
$$ -696814 -404517 -124185 29319 72802 136417 271138 344962 191925 -177202 -583445
34745e83445k98411k06793k21790l04403l69284l45650j86597R0709L64454M77433
$$ -583445 -881856 -1088649 -1310439 -1614842 -1984126 -2329776 -2516373 -2425664 -2061210 -1583777
34735a583777L78983J68028j6177j17787j75447k43898l17865l18833j65724J16285
$$ -1583777 -1204794 -1036766 -1052943 -1170730 -1346177 -1590075 -1907940 -2226773 -2392497 -2276212
34725b276212L78112M89756M94380N55010P36057R10379R19351P53384N08414
$$ -2276212 -1898100 -1408344 -913964 -358954 377103 1287482 2206833 2960217 3468631
34716C468631K24749j24262m92163p18242o79663m32496j56243P900K7574o9104
$$ 3468631 3693380 3569118 3076955 2358713 1679050 1246554 1090311 1098211 1125785 1056681
34706A056681k41855m31406n55452n49055m10039k00100l641J22577J77357J99204
$$ 1056681 814826 383420 -172032 -721087 -1131126 -1331226 -1334867 -1212290 -1034933 -835729
34696h35729K16046K12680J59660P1160J0697K3672P5224P3333m6871k71494n28461
$$ -835729 -619683 -407003 -247343 -176183 -165486 -141814 -66590 6743 -40128 -311622 -840083
34685h40083p29144p85637o34574k98357Q3093L39662M20623M25911M62365N08183
$$ -840083 -1569227 -2354864 -2989438 -3287795 -3204702 -2865040 -2444417 -2018506 -1556141 -1047958
34675a047958M69199L38006K16619J71824J46873O1846n5395j03346m4717N3243
$$ -1047958 -578759 -240753 -24134 147690 294563 356409 301014 197668 152951 206194
34665B06194J09154J01780N0273k5853j05099j57328j61591j12786o103J54407
$$ 206194 315348 417128 467401 441548 336449 179121 17530 -95256 -101359 53048
34655E3048L20435M07836L69886K48965J36015Q4882P1048J8982j32415l65904
$$ 53048 373483 781319 1151205 1400170 1536185 1621067 1692115 1711097 1578682 1212778
34645A212778n76014o45931n47331l48553j30609O1458J79671J58095n913j93526
$$ 1212778 636764 -9167 -556498 -905051 -1035660 -974202 -794531 -636436 -642349 -835875
34635h35875k54112j47574M3093K18922L27044L32400K11049L332j78892k39647
$$ -835875 -1089987 -1237561 -1194468 -975546 -648502 -316102 -105053 -101721 -280613 -520260
34625e20260j74858m9009P0281J36563J22520L0304j10259k73064m45922n93862
$$ -520260 -695118 -744127 -673846 -537283 -414763 -384459 -494718 -767782 -1213704 -1807566
34615a807566o43271n36659k89864K8481L53907O31615P87319P48561N14797J82576
$$ -1807566 -2450837 -2987496 -3277360 -3248879 -2894972 -2263357 -1476038 -727477 -212680 -30104
34605c0104j15049k88713l22367k57550j68819j35867k01286l31013m21145l71130
$$ -30104 -145153 -433866 -756233 -1013783 -1182602 -1318469 -1519755 -1850768 -2271913 -2643043
34595b643043j74072O8836K41732L20650L70509M46217N34290N97893O32297O45011
$$ -2643043 -2817115 -2748279 -2506547 -2185897 -1815388 -1369171 -834881 -236988 395309 1040320
34585A040320O18656N40473M47835L92006L60015K83097J35510j4605p4267k4403
$$ 1040320 1658976 2199449 2647284 3039290 3399305 3682402 3817912 3803307 3729040 3704637
34575C704637O0599P1937n2736k66036m10862l27097n579L71021N72192N09277
$$ 3704637 3765236 3837173 3784437 3518401 3107539 2780442 2774863 3145884 3718076 4227353
34565D227353K76579K9448j42445k28675k36931j58075J0314K28956M20720N10721
$$ 4227353 4503932 4533380 4390935 4162260 3925329 3767254 3777568 4006524 4427244 4937965
34555D937965M59820K66452l7890l71799o02293o18677m44463k48805j98735k96542
$$ 4937965 5397785 5664237 5626347 5254548 4652255 4033578 3589115 3340310 3141575 2845033
34545B845033l96755l90647l37689l89987o09986q96442j083410j077044q88024
$$ 2845033 2448278 2057631 1719942 1329955 719969 -176473 -1259883 -2336927 -3224951
34536c224951n71997j86589J93380M66598N53735M54710K38974j5324k49721m02444
$$ -3224951 -3796948 -3983537 -3790157 -3323559 -2769824 -2315114 -2076140 -2091464 -2341185 -2743629
34526b743629m05699k40333K1520K56987L78852L81153L25575L03025L77818N23610
$$ -2743629 -3149328 -3389661 -3368141 -3111154 -2732302 -2351149 -2025574 -1722549 -1344731 -821121
34516h21121O23798N81582M28789K77642J66079K2870j83541l39391l06610j10578
$$ -821121 -197323 384259 813048 1090690 1256769 1279639 1096098 756707 450097 339519
34506C39519Q1514J63781J89531K53282L59575M50779M93641M72820L49174J09486
$$ 339519 421033 584814 774345 1027627 1387202 1837981 2331622 2804442 3153616 3263102
34496C263102j56782l11330l12165k45476j95898j45970l9982J05834K17198K63034
$$ 3263102 3106320 2794990 2482825 2237349 2041451 1895481 1855499 1961333 2178531 2441565
$$ [...]
##END NTUPLES=NMR SPECTRUM
##END=
