##TITLE=31Pdec_DE-20H2M_HCl
 D2O
  64 sc
 3.11.2023
##JCAMPDX= 6.0         $$ Bruker NMR JCAMP-DX V2.0
##DATA TYPE= NMR SPECTRUM
##DATA CLASS= NTUPLES
##ORIGIN= UXNMR, Bruker Analytische Messtechnik GmbH
##OWNER= root
$$ XWIN-NMR		Version 3.5
$$ Fri Nov  3 14:32:39 2023 Russian Standard Time (UT+4h)  she@DPX200
##.OBSERVE FREQUENCY= 81.013821
##.OBSERVE NUCLEUS= ^31P
##.ACQUISITION MODE= SIMULTANEOUS
##.ACQUISITION SCHEME= undefined
##.AVERAGES= 64
##.DIGITISER RES= 16
##SPECTROMETER/DATA SYSTEM= spect
##.PULSE SEQUENCE= zgpg30
##.SOLVENT NAME= CD2Cl2
##.SHIFT REFERENCE= (INTERNAL, CD2Cl2, 0, 248.564)
##AUDIT TRAIL= $$ (NUMBER, WHEN, WHO, WHERE, WHAT)
$$ ##TITLE= Audit trail, XWIN-NMR		Version 3.5
$$ ##JCAMPDX= 5.01
$$ ##ORIGIN= Bruker BioSpin GmbH
$$ ##OWNER= she
$$ F:/spectra/data/she/nmr/P31/1/pdata/1/auditp.txt
$$ ##AUDIT TRAIL=  $$ (NUMBER, WHEN, WHO, WHERE, WHAT)
(   1,<2023-11-03 14:31:35.76 +0400>,<she>,<DPX200>,
      <continue with go, POWCHK disabled, PULCHK disabled
       configuration hash MD5:
       00 E9 B6 7A A2 85 ED C7 34 08 36 98 17 FE 4E 26
       data hash MD5: 32K
       DB B7 C1 A8 67 EE B2 7A 43 8A 31 7A C1 37 75 CB>)
(   2,<2023-11-03 14:31:38.06 +0400>,<she>,<DPX200>,
      <Start of raw data processing
       efp BC_mod = 2 LB = 5 FT_mod = 6 PKNL = 1 PHC0 = -10821.93 PHC1 = 676.2902 SI = 64K 
       data hash MD5: 64K
       30 49 1E C5 7C 87 62 14 02 14 B9 E0 BF E7 A0 35>)
(   3,<2023-11-03 14:32:02.78 +0400>,<she>,<DPX200>,
      <pk PHC0 = -18.36582 PHC1 = 0 
       data hash MD5: 64K
       FE 97 BD 3A 45 C1 CB A1 DD 6E 2F DB 7E FB 81 94>)
(   4,<2023-11-03 14:32:07.09 +0400>,<she>,<DPX200>,
      <abs ABSG = 5 
       data hash MD5: 64K
       09 3C 58 3C 1D 14 09 25 38 0D F0 41 E1 D2 AD 47>)
$$ ##END=
$$ 
$$ hash MD5
$$ 59 AB 32 77 4D 34 67 22 EA 9A 51 18 28 43 C4 89
##$RELAX= 
##$RELAX= 
##$RELAX= 
##$RELAX= 
##$RELAX= 
##$RELAX= 
##$RELAX= 
##$RELAX= 
##$RELAX= 
$$ Bruker specific parameters
$$ --------------------------
##$DU= <F:/spectra>
##$EXPNO= 1
##$NAME= <P31>
##$PROCNO= 1
##$TYPE= <nmr>
##$USER= <she>
##$AMP= (0..31)
100 100 100 100 100 100 100 100 100 100 100 100 100 100 100 100 100 100 
100 100 100 100 100 100 100 100 100 100 100 100 100 100 
##$AQSEQ= 0
##$AQ_mod= 1
##$AUNM= <au_zg>
##$AUTOPOS= <>
##$BF1= 81.014009
##$BF2= 200.13
##$BF3= 200.13
##$BF4= 200.13
##$BF5= 200.13
##$BF6= 200.13
##$BF7= 200.13
##$BF8= 200.13
##$BYTORDA= 1
##$CFDGTYP= 0
##$CFRGTYP= 5
##$CHEMSTR= <none>
##$CNST= (0..31)
1 1 145 1 1 1 1 1 1 1 1 1 1 1 1 1 1 1 1 1 1 1 1 1 1 1 1 1 1 1 1 1 
##$CPDPRG= <waltz16>
##$CPDPRG1= <>
##$CPDPRG2= <waltz16>
##$CPDPRG3= <>
##$CPDPRG4= <mlev>
##$CPDPRG5= <mlev>
##$CPDPRG6= <mlev>
##$CPDPRG7= <mlev>
##$CPDPRG8= <mlev>
##$CPDPRGB= <>
##$CPDPRGT= <>
##$D= (0..31)
0 1 0 0 0 0 0 0 0 0 0 0.03 2e-05 3e-06 0 0 0 0 0 0 0 0 0 0 0 0 0 0 0 0 
0 0 
##$DATE= 1699007418
##$DBL= (0..7)
120 120 120 11 120 120 24 19 
##$DBP= (0..7)
150 150 150 150 150 150 150 150 
##$DBP07= 0
##$DBPNAM0= <>
##$DBPNAM1= <>
$$ [...]
##$SUBNAM3= <"">
##$SUBNAM4= <"">
##$SUBNAM5= <"">
##$SUBNAM6= <"">
##$SUBNAM7= <"">
##$SUBNAM8= <"">
##$SUBNAM9= <"">
##$SW= 501.771253377433
##$SWIBOX= (0..15)
0 1 3 0 0 0 0 0 0 0 0 0 0 0 0 0 
##$SW_h= 40650.406504065
##$TD= 32768
##$TD0= 1
##$TE= 0
##$TE2= 300
##$TE3= 300
##$TEG= 300
##$TL= (0..7)
0 120 53 12 22 120 120 120 
##$TP= (0..7)
150 150 150 150 150 150 150 150 
##$TP07= 0
##$TPNAME0= <>
##$TPNAME1= <>
##$TPNAME2= <>
##$TPNAME3= <>
##$TPNAME4= <>
##$TPNAME5= <>
##$TPNAME6= <>
##$TPNAME7= <>
##$TPOAL= (0..7)
0.5 0.5 0.5 0.5 0.5 0.5 0.5 0.5 
##$TPOFFS= (0..7)
0 0 0 0 0 0 0 0 
##$TUNHIN= 0
##$TUNHOUT= 0
##$TUNXOUT= 0
##$USERA1= <user>
##$USERA2= <user>
##$USERA3= <user>
##$USERA4= <user>
##$USERA5= <user>
##$V9= 5
##$VALIST= <valist>
##$VCLIST= <CCCCCCCCCCCCCCC>
##$VD= 0
##$VDLIST= <DDDDDDDDDDDDDDD>
##$VPLIST= <PPPPPPPPPPPPPPP>
##$VTLIST= <TTTTTTTTTTTTTTT>
##$WBST= 1024
##$WBSW= 4
##$XGAIN= (0..3)
0 0 0 0 
##$XL= 0
##$YL= 0
##$YMAX_a= 367
##$YMIN_a= -738
##$ZGOPTNS= <>
##$ZL1= 120
##$ZL2= 120
##$ZL3= 120
##$ZL4= 120
##$ABSF1= 248.5645
##$ABSF2= -253.2056
##$ABSG= 5
##$ABSL= 3
##$ALPHA= 0
##$AQORDER= 0
##$ASSFAC= 0
##$ASSFACI= 0
##$ASSFACX= 0
##$ASSWID= 0
##$AUNMP= <proc_1d>
##$AZFE= 0.1
##$AZFW= 0.5
##$BCFW= 0
##$BC_mod= 2
##$BYTORDP= 0
##$COROFFS= 0
##$CY= -3
##$DATMOD= 1
##$DC= 0
##$DFILT= <>
##$DTYPP= 0
##$F1P= 0
##$F2P= 0
##$FCOR= 1
##$FTSIZE= 65536
##$FT_mod= 6
##$GAMMA= 0
##$GB= 0
##$INTBC= 1
##$INTSCL= 6.047779e-11
##$ISEN= 30
##$LB= 5
##$LEV0= 0
##$LPBIN= 0
##$MAXI= 10000
##$MC2= 0
##$MEAN= 0
##$ME_mod= 0
##$MI= 50
##$NCOEF= 0
##$NC_proc= -14
##$NLEV= 6
##$NOISF1= 182.463
##$NOISF2= 159.3651
##$NSP= 0
##$NTH_PI= 0
##$NZP= 0
##$OFFSET= 248.5645
##$PC= 4
##$PHC0= -10840.3
##$PHC1= 676.2902
##$PH_mod= 1
##$PKNL= yes
##$PPARMOD= 0
##$PSCAL= 0
##$PSIGN= 0
##$REVERSE= no
##$SF= 81.0140089999694
##$SI= 65536
##$SIGF1= 159.3651
##$SIGF2= -187.1042
##$SINO= 113.3802
##$SIOLD= 16384
##$SREGLST= <1H.CDCl3>
##$SSB= 0
##$STSI= 65536
##$STSR= 0
##$SW_p= 40650.406504065
##$SYMM= 0
##$S_DEV= 0
##$TDeff= 32768
##$TDoff= 0
##$TI= <>
##$TILT= no
##$TM1= 0
##$TM2= 0
##$TOPLEV= 0
##$USERP1= <user>
##$USERP2= <user>
##$USERP3= <user>
##$USERP4= <user>
##$USERP5= <user>
##$WDW= 1
##$XDIM= 65536
##$YMAX_p= 407037004
##$YMIN_p= -115937272
$$ End of Bruker specific parameters
$$ ---------------------------------
##NTUPLES= NMR SPECTRUM
##VAR_NAME=  FREQUENCY,     SPECTRUM/REAL,   SPECTRUM/IMAG
##SYMBOL=    X,             R,               I
##VAR_TYPE=  INDEPENDENT,   DEPENDENT,       DEPENDENT
##VAR_FORM=  AFFN,          ASDF,            ASDF
##VAR_DIM=   65536,         65536,           65536
##UNITS=     HZ,            ARBITRARY UNITS, ARBITRARY UNITS
##FACTOR=    0.620285442955139, 1,           1
##FIRST=     20137.2065510682, 0,            0
##LAST=      -20513.1999529968, 0,           0
##MIN=       -20513.1999529968, -115937272,  0
##MAX=       20137.2065510682, 407037004,    0
$$ Real data points
##PAGE= N=1
##DATA TABLE= (X++(R..R)), XYDATA
$$ [...]
43851 22281394 22113758 20926224 20794872 21629845 22161711 21695928 20419400 18495040 15702435
43842 15702435 12052944 8130415 4451718 773552 -3566853 -8592302 -13156844 -15591768
43834 -15591768 -14936784 -11630892 -7089564 -2658180 1012256 3692380 5026929 4603640
43826 4603640 2607084 158072 -1217773 -533631 2116254 5686660 8690493 9741836
43818 9741836 7978512 3338986 -3296949 -10219829 -15529861 -18240728 -18962253 -19192364
43810 -19192364 -19672322 -19626785 -17842924 -14218696 -9845190 -5780199 -2352013 315885
43802 315885 1845814 2158328 2081180 2822994 4869033 7689414 10378683 12202501 12664095
43793 12664095 11658992 9886867 8847583 10049880 14040555 20071894 26589814 32148664
43785 32148664 36143994 38819117 40564431 41312782 40756877 39005410 36671067 34222647
43777 34222647 31477438 27841431 22914164 16843401 10311226 4264245 -556564 -4024185
43769 -4024185 -6578635 -8817576 -11268362 -14461263 -18791168 -23963432 -28639458 -30905646
43761 -30905646 -29354119 -23997294 -16381339 -8733606 -2613471 1891260 5693316 9535094
43753 9535094 13432592 17105963 20494288 23677618 26609739 29149191 31132621 32237244
43745 32237244 32014227 30280760 27244754 22956141 16834411 8165539 -2823946 -14534086
43737 -14534086 -24701087 -31650540 -35200805 -36625677 -37628905 -39086494 -40688468 -41717288
43729 -41717288 -41930222 -41631170 -41247624 -41113036 -41399801 -41909655 -42052899 -41323231 -39711867
43720 -39711867 -37502101 -34941042 -32419872 -30620272 -29858984 -29327979 -27567038 -23895320
43712 -23895320 -19100759 -14703536 -11887987 -11137040 -12375415 -15156695 -18927153 -23284748
43704 -23284748 -27852304 -31956004 -34839818 -36378365 -37295155 -38480804 -40239822 -42182124
43696 -42182124 -43477739 -43139401 -40570080 -36218526 -31433615 -27362411 -24234022 -22009094
43688 -22009094 -21361851 -23415003 -28492477 -35547627 -42896869 -49263700 -54190731 -57913826
43680 -57913826 -61041960 -64044248 -66744196 -68404902 -68507836 -67428480 -66240505 -65852108
43672 -65852108 -66308061 -66768679 -66050252 -63321431 -58544341 -52383622 -45664810 -38878318
43664 -38878318 -32198085 -25903719 -20593403 -16806286 -14424529 -12590765 -10366083 -7538800
43656 -7538800 -4814553 -3228466 -3306633 -4644650 -6206405 -7118102 -7329354 -7553147 -8518071
43647 -8518071 -10248277 -12031590 -12978402 -12556865 -10756938 -8035920 -5239890 -3414953
43639 -3414953 -3369416 -5149758 -7893681 -10388038 -11983374 -12928363 -13665847 -13977772 -13260401
43630 -13260401 -11677145 -10454007 -10598711 -11652803 -12196772 -11391766 -9540500 -7358833
43622 -7358833 -5439018 -4490473 -5294276 -7917804 -11393433 -14618441 -17287161 -19567303
43614 -19567303 -21207787 -21544607 -20289593 -17777084 -14360351 -9997837 -4618534 1389535
43606 1389535 7263456 12313461 16225658 19158724 21765829 25028419 29784367 36184641
43598 36184641 43459812 50126837 54492419 55255660 52045565 45706527 38131338 31583324
43590 31583324 27766045 27151342 28950998 31674461 33894357 34861396 34744465 34379045 34629420
43581 34629420 35727818 36939535 36715853 33432132 26556740 17376524 8234542 672344
43573 672344 -5536793 -11331053 -16773295 -21025434 -23525976 -24367189 -23585001 -21039935 -17321261
43564 -17321261 -13941084 -12027541 -11287144 -10697389 -9696099 -8156520 -5745984 -2121212
43556 -2121212 2448628 7287286 11893265 15657216 17332067 15829295 11723427 7141806
43548 7141806 3788434 1608526 -351910 -2380080 -3813855 -3885458 -2396943 195342
43540 195342 3041221 5470092 7574652 9975173 12729335 14733406 14541384 11632017
43532 11632017 6657346 752077 -4982887 -9531099 -12156829 -12888243 -12696323 -13052130
43524 -13052130 -15188008 -19472812 -25159525 -30747642 -34871923 -37020387 -37462444 -36665538
43516 -36665538 -34941909 -32501168 -29538598 -26247008 -22938482 -20114144 -18088322 -16401183
43508 -16401183 -13882300 -9675442 -4324260 251565 1981251 6678 -4878042 -10826811
43500 -10826811 -15922082 -18908513 -19498878 -18284589 -16279518 -14322262 -12817110 -12013127
43492 -12013127 -12340952 -14220991 -17500490 -21225457 -24039162 -24831552 -23244209 -19914990
43484 -19914990 -16281836 -13776297 -12844572 -12668299 -11818942 -9130236 -4154763 2664651
43476 2664651 9913125 15581269 18122609 17463982 14984567 12483990 11122128 11096405 11953789
43467 11953789 12995008 13443512 12480228 9446499 4266644 -2306921 -8985135 -14514590
43459 -14514590 -18018043 -19140309 -18335711 -16955069 -16426551 -16965933 -17354185 -16256638 -13541832
43450 -13541832 -10157266 -7175708 -5361443 -5143323 -6135565 -6712663 -4904961 -136169
43442 -136169 6274993 12519293 17818007 22436619 26814895 31208811 35849248 40796355
43434 40796355 45573963 49326166 51412368 51600821 49695331 45378081 38714780 30694936
43426 30694936 22957720 16761561 12166228 8296837 4484585 1065200 -1116142 -1938317
43418 -1938317 -2422869 -3717685 -5820401 -7541703 -7716596 -6373981 -4871757 -5072833 -8201218
43409 -8201218 -14030360 -20904311 -26639569 -29673892 -29651448 -27221685 -23421541 -19068961
43401 -19068961 -14489267 -9810870 -5584538 -2890404 -2530042 -4214843 -6930690 -10126005
43393 -10126005 -14159585 -19471905 -25708653 -31876795 -37009370 -40429226 -41871749 -42041551
43385 -42041551 -42889100 -46428699 -52702015 -59125391 -62253770 -60275703 -53867262 -45082662
43377 -45082662 -35915882 -27827409 -21932396 -18929480 -18655722 -19986548 -21523385 -22531937
43369 -22531937 -23193163 -23980930 -24989020 -25986159 -26932007 -28085654 -29491907 -30535656 -30148724
43360 -30148724 -27472350 -22473053 -16247672 -10795871 -8021941 -8387343 -10457923 -12089351
43352 -12089351 -12248780 -11623428 -11496115 -12284551 -13311814 -13815085 -13932288 -14676482 -17029284
43343 -17029284 -21012826 -25496228 -28863517 -30014976 -28938139 -26451686 -23418576 -20172253
43335 -20172253 -16679865 -13178467 -10393767 -8834403 -7886118 -6014618 -2229334 2733278
43327 2733278 6951577 9010471 8931573 7548868 5484869 3032994 704635 -691533
43319 -691533 -735675 19760 388833 -411587 -2021673 -3215292 -2905240 -882416 2297119
43310 2297119 5830121 8887092 10652855 10734040 9653816 8509030 7855752 7190940 5768484
43301 5768484 3641678 1576086 175711 -497786 -624504 -481279 -606762 -1575021 -3353589
43292 -3353589 -5193799 -6396327 -7014728 -7682034 -8965414 -11034122 -13724727 -16702710
43284 -16702710 -19667705 -22535413 -25298127 -27637131 -28896082 -28590269 -26771928 -23843282
43276 -23843282 -20393863 -17445766 -16318488 -17492519 -19595267 -20121805 -17463119 -12057149
43268 -12057149 -5625030 230558 4560627 6867826 7035735 5456782 2939232 484588
43260 484588 -794137 97651 3381128 8030044 12274927 14776764 15385220 15059643 15382036
43251 15382036 17880756 23051811 29625260 35134321 37696129 37305703 35329744 32994231
43243 32994231 30646081 28250307 26023420 24311122 23047858 21582559 19097528 15264040
43235 15264040 10612273 6234491 2950600 700569 -1180616 -3157062 -5106305 -6592074
43227 -6592074 -7146679 -6269806 -3681813 -2965 3051472 3639995 1056392 -4103956 -10817654
43218 -10817654 -18220447 -25311783 -30627287 -32717585 -31062512 -26498700 -20824412 -15911112
43210 -15911112 -12843816 -11612787 -11611804 -12467939 -14285198 -17069389 -20174368 -22577540 -23728677
43201 -23728677 -24118011 -25140664 -28394935 -34706154 -43347147 -52118027 -58455498 -60765480
43193 -60765480 -58957742 -54026838 -47285307 -39751317 -31856376 -23592406 -15024419 -6668511
43185 -6668511 657659 6224255 9570713 10612077 9894646 8535106 7413831 6419389
43177 6419389 4937245 3171112 2510205 4317569 8615887 14092720 19011774 21937531
43169 21937531 22154030 20027241 16802976 13499128 9996777 5625134 564788 -3870544
43161 -3870544 -6458666 -7089238 -6332883 -4418115 -1053365 3864636 9639495 14796131
43153 14796131 17580466 16712042 12107370 5036415 -2525194 -8773013 -12469811 -12958877
43145 -12958877 -10316665 -5511976 68082 5612094 11295322 17470951 23553222 28020970
43137 28020970 29623062 28384355 25333789 21500461 17445211 13587471 10449082 8271147
43129 8271147 6583460 4462420 1282303 -2774174 -6732235 -9212404 -9149466 -6683566
43121 -6683566 -3439652 -1526990 -1988370 -4331565 -7545156 -11091740 -14558878 -16769914
43113 -16769914 -16098373 -12007088 -5884770 66277 4671217 8225728 11265115 13475810
43105 13475810 14156112 13410276 12290351 11613764 10987205 9225473 5556234 287127 -5408843
43096 -5408843 -10051618 -12461908 -12415765 -10918134 -9573900 -9466775 -10609824 -12289527 -13647129
43087 -13647129 -14059071 -13494578 -12704452 -12658787 -13503193 -14332750 -14234650 -13236120 -11881074
43078 -11881074 -10184775 -7577559 -3882084 126329 3338946 5324698 6658226 8321998
43070 8321998 10667489 12771982 12945755 10146829 4845559 -1656579 -8429255 -14941012
43062 -14941012 -20163641 -22605282 -21683814 -18561469 -15134396 -12452799 -10424953 -8600563
43054 -8600563 -6598067 -3958502 -339201 3931584 7964652 11233090 14070114 16996542
43046 16996542 19805345 21627210 21812426 20512902 18446820 16299570 14333442 12359917
43038 12359917 10002268 7088104 3844740 663943 -2274758 -4966235 -7142078 -8153146
43030 -8153146 -7562968 -5747769 -3568994 -1400415 1202487 4720324 8889809 13004819
43022 13004819 16694932 19868419 21987687 22183172 20551183 18881507 19374730 22542730
43014 22542730 26738029 29763674 30539832 29163053 26045262 21709200 17284785 14381493
43006 14381493 13881724 14965221 15721122 14866644 12761704 10750128 9732364 9502232 9249929
42997 9249929 8363753 6687370 4276034 1149559 -2743844 -7444631 -12836254 -18487873
42989 -18487873 -23700020 -27865213 -30813602 -32709177 -33622422 -33366768 -31804018 -29145659
42981 -29145659 -25853818 -22419240 -19416655 -17593759 -17492478 -18832592 -20506881 -21418953
42973 -21418953 -21295640 -20608654 -19829400 -18882927 -17187867 -14037267 -9066491 -2662388 4039315
42964 4039315 9809795 14109175 17096132 18848439 18855126 16520465 12064660 6668476 1638190
42955 1638190 -2525264 -6244744 -10134654 -14174017 -17586241 -19493321 -19587229 -18115533
42947 -18115533 -15416420 -11771218 -7688655 -3971307 -1292272 161985 564014 170128
42939 170128 -746816 -1945191 -3344442 -4901000 -6279223 -6995077 -7081951 -7224670 -7885589
42930 -7885589 -8608190 -8573121 -7553366 -5894590 -3898020 -1836406 -307844 268510 563606
42921 563606 1987872 5184601 9429077 13704610 17768552 21866973 25942509 29466967
42913 29466967 31609146 31343115 28061666 22618269 17272609 13956461 12755668 12390652
42905 12390652 11726764 10368393 8366629 6177637 4650595 4247340 4325026 3796576 2313252
42896 2313252 84622 -3216304 -8268915 -14586035 -20096927 -22751470 -22020832 -18586690
42888 -18586690 -13337725 -7222115 -1414785 3255888 6951466 10394354 13923989 17355885
42880 17355885 20539692 23544474 26349654 28757260 30590390 31680600 31749797 30629633
42872 30629633 28521687 25730179 22256947 18075050 13782152 10528771 9120459 9430326
42864 9430326 10771758 12562951 14458905 16020841 16463715 14778640 10244112 3077737
42856 3077737 -5375094 -13328725 -19589190 -23926284 -26630789 -28059998 -28616498 -28708144 -28404142
42847 -28404142 -27338665 -25274563 -22700634 -20614537 -19675772 -19676574 -19804150 -19326330 -18131088
42838 -18131088 -16793027 -16087156 -16256262 -16734820 -16724886 -16038695 -15223883 -14860696 -14937052 -15003825
42828 -15003825 -14796155 -14595287 -15090395 -16952529 -20311114 -24324510 -27246503 -27244299 -23540347
42819 -23540347 -16995087 -9652685 -3620792 -100394 865076 -27768 -1882012 -3777745
42811 -3777745 -4706660 -3794753 -900608 3058847 6554742 8242652 7399564 4025993 -985014
42802 -985014 -5892705 -8969820 -9697019 -8909643 -7631299 -6108374 -4243197 -2552599 -2074239
42793 -2074239 -3289301 -5515087 -7420093 -7882997 -6428927 -3318701 550010 4137694
42785 4137694 7022065 9697962 13066450 17693676 23514507 29920097 35863056 40038596
42777 40038596 41395014 39776661 36128213 31973153 28519586 26117779 24513874 23529941
42769 23529941 23282302 23666112 23968758 23412893 21991839 20297448 18442926 15671435 11398086
42760 11398086 6344840 2186263 70634 -297676 -233263 -1020608 -3161806 -6159881 -8758077
42751 -8758077 -9585835 -7933698 -4112342 886706 6095028 10983765 15224381 18115311
42743 18115311 18500610 15610826 10089864 3948136 -712177 -2888759 -2695437 -691350
42735 -691350 2391455 5531532 7734965 8813081 9665373 11580406 15215404 20112106
42727 20112106 24951723 28331343 29702881 29814789 30098927 31475674 33844157 36700324
42719 36700324 39838683 43118876 45785875 46537275 44450313 39727523 33566021 27494849
42711 27494849 22757757 19875189 18419455 17257140 15284723 12105971 8058117 3667464
42703 3667464 -817815 -5335586 -9516484 -12419874 -12994824 -11021713 -7589810 -4440963
42695 -4440963 -2737531 -2548716 -3476081 -5400489 -8314824 -11618170 -14019288 -14290429 -11999256
42686 -11999256 -7575320 -1976612 3628115 8200587 11233776 12884058 13661005 14021109
42678 14021109 14220886 14372056 14562738 15031962 16153988 17931150 19480106 19529346 17805200
42669 17805200 15639321 14794547 15864830 18198299 21132500 24666641 28853251 33044104
42661 33044104 35946352 36177656 32860001 26260109 18069038 10549416 4963725 940061
42653 940061 -2584949 -6216523 -10020322 -13939414 -17699147 -20573536 -21806770 -21198787
42645 -21198787 -18933517 -15087517 -9878654 -4308767 113757 2567450 3543005 4190112
42637 4190112 5348295 7229649 9539504 11587427 12592739 12300080 11290470 10508047
42629 10508047 10495718 11120629 11835518 11993579 11005166 8482936 4461797 -405468 -4863850
42620 -4863850 -7486632 -7466951 -5205549 -2095816 306883 929102 -701085 -4448120 -9466133
42611 -9466133 -14431400 -18269380 -20660745 -21715652 -21344595 -19271642 -15630900 -11198141
42603 -11198141 -6857609 -2986740 526852 3840604 6970604 10035059 13431334 17520151
42595 17520151 22048828 25968913 27989323 27464870 24836534 21255758 17826506 15213762
42587 15213762 13836315 14104728 16129166 19136243 21496655 21759475 19820315 16926705
42579 16926705 14415143 12541166 10632156 8194167 5568977 3470016 2114526 980738
42571 980738 -673490 -3212246 -6504884 -10178768 -13780014 -16697467 -18196417 -17839200
42563 -17839200 -15933323 -13355871 -10770217 -8095308 -4864848 -1006190 2932787 6323334
42555 6323334 9046092 11478369 13990682 16510267 18502523 19287782 18370639 15546079
42547 15546079 10850945 4595842 -2493243 -9257079 -14347584 -16636009 -15707543 -12364825
42539 -12364825 -8692697 -7150544 -9063005 -13827329 -19592817 -24606210 -27978740 -29716465
42531 -29716465 -30574801 -31762888 -34195476 -37736564 -41267448 -43460186 -43334109 -40326141
42523 -40326141 -34411747 -26303078 -17092732 -7476789 2353422 11902968 19934737 25275220
42515 25275220 27818952 28301907 27223494 24483201 20126713 14988285 10295636 6798108
42507 6798108 4494638 3117495 2609242 3002066 3964272 4724749 4611662 3639960 2478156
42498 2478156 1856465 2056865 2863063 3812443 4510799 4886106 5167010 5496790 5645052
42489 5645052 5340704 4839520 4776164 5292716 5610756 4715221 2311729 -1036822 -4481016
42480 -4481016 -7330587 -9110279 -9552209 -8659910 -6703253 -4098026 -1166664 2206928
42472 2206928 6638120 12536723 19133475 24580145 27401016 27682279 26570270 24877565
42464 24877565 22583420 19449653 15518171 10960744 5936824 798499 -3812219 -7151231
42456 -7151231 -8529827 -7531495 -4580497 -1256557 558168 89732 -2096830 -5281288
42448 -5281288 -9377444 -14258686 -18922927 -21962091 -22668053 -21293935 -18540534 -15311301
42440 -15311301 -12738466 -11755020 -12504957 -14541187 -17554488 -21412134 -25458510 -28413868
42432 -28413868 -29347584 -28471353 -26737731 -24928019 -23314030 -21816839 -20101088 -17774007
42424 -17774007 -14984435 -12763748 -12296674 -13678436 -15602540 -16367583 -15087426 -12039381
42416 -12039381 -8234087 -4837080 -2762574 -2492852 -4123598 -7423067 -11654507 -15452565
42408 -15452565 -17374941 -16965596 -15159678 -13330949 -11934766 -10310909 -7828214 -4949160
42400 -4949160 -2983635 -2901192 -4559939 -7061598 -9604329 -11764857 -13044635 -12591819 -9802796
42391 -9802796 -5180569 -209882 3857097 6968679 9923647 13233002 16488877 18705852
42383 18705852 19083728 17545515 14763483 11662414 8777115 6094667 3448412 737325
42375 737325 -2359521 -6378720 -11237429 -15626713 -17886620 -17577368 -15777116 -13869095
42367 -13869095 -12552902 -11977270 -11982452 -11809147 -10285066 -7044512 -3327364 -1036663 -1154359
42358 -1154359 -3408853 -7026441 -11009654 -13790099 -13560826 -9531161 -2688520 4829479
42350 4829479 10970354 14564755 15585200 15032261 14266128 13979008 13743180 12672640 10448386
42341 10448386 7555528 4583144 1495660 -2274149 -7001815 -12027271 -16055447 -18101487
42333 -18101487 -18009799 -16110811 -12796434 -8713183 -4988007 -2623955 -1589377 -916689
42325 -916689 161997 1471074 2354823 2523743 2226760 1842289 1600286 1668187 2306515
42316 2306515 3778430 5927994 7767081 7759986 4935220 -252464 -6382952 -12224534 -17003855
42307 -17003855 -19718720 -19071362 -14589756 -7379582 748540 8693208 16249721 23180488
42299 23180488 28663816 31716233 31865119 29420171 25334904 20775570 16602407 13256180
42291 13256180 11170843 10974266 12944333 16453836 20356080 23850548 26611945 28177930
42283 28177930 27742751 24707505 19063062 11078955 991432 -10701267 -22812561 -33569771
42275 -33569771 -41102689 -43915202 -41405686 -34445215 -25364191 -16833806 -10350003 -5718049
42267 -5718049 -1976953 1314895 3772774 4966624 5163505 5065582 4888203 3974661 1473514
42258 1473514 -2717206 -7788843 -12648583 -16491457 -18824178 -19225321 -17269343 -12694597
42250 -12694597 -5698770 2810711 11298319 18175285 22535354 24465198 24734608 24184509
42242 24184509 23223000 21719790 19443877 16730595 14568493 13753590 14018581 14315642 13970982
42233 13970982 13215333 12505479 11753522 10506078 8554027 5974257 2797711 -830991
42225 -830991 -4140320 -5901918 -5475753 -3555780 -1647826 -823484 -1050562 -1583930 -1767193
42216 -1767193 -1450257 -879119 -389076 -160931 -98788 90183 526894 744642 -208504 -2950749
42206 -2950749 -6923999 -10482521 -11937693 -10552998 -6689569 -1358612 4170233 8643346
42198 8643346 11275651 12185171 12246784 12372919 12943268 13861680 14909539 15890902 16610740
42189 16610740 16993069 17272742 17934608 19396848 21775619 24879344 28254448 31210072
42181 31210072 33015982 33293034 32196555 30087692 27033336 22786582 17356859 11525533
42173 11525533 6634769 3701544 2594461 2018473 405908 -2965872 -7546642 -12071634
42165 -12071634 -15469337 -17265118 -17369257 -15842067 -12994461 -9493574 -6078180 -3075662
42157 -3075662 -223529 3040940 7081420 11686470 16054619 19225010 20694177 20690077 19882193
42148 19882193 18939174 18428510 18960873 21102993 24922890 29535775 33103038 33495544 29433009
42139 29433009 21369593 11250059 1163900 -7849255 -15727671 -22496735 -27891364 -31821487
42131 -31821487 -34736771 -37281918 -39804094 -42355502 -44936168 -47479567 -49727809 -51362979
42123 -51362979 -52217672 -52186289 -50996049 -48291063 -44016353 -38651660 -33057584 -28091603
42115 -28091603 -24217503 -21272491 -18572745 -15390145 -11497174 -7361265 -3823188 -1443028
42107 -1443028 34252 1574649 4042548 7399537 10726504 12877368 12851417 9728395
42099 9728395 2984670 -6670434 -17164356 -26344067 -33333812 -38292928 -41104037 -40982354
42091 -40982354 -37480346 -31305621 -23864725 -16368742 -9603676 -4120926 -156491 2514382
42083 2514382 4293182 5390557 5979261 6557918 7770236 9805458 12239776 14539859
42075 14539859 16495313 18047698 18911477 18634825 17100960 14879275 12959298 12034473
42067 12034473 12022824 12348972 12677858 13195634 14069797 14839242 14642838 13066392 10522206
42058 10522206 7704649 4891233 1989358 -817438 -2721607 -2714677 -363230 3748053
42050 3748053 8158994 11089887 11183502 8199427 3245893 -1804548 -5420368 -7131741
42042 -7131741 -7325472 -6600887 -5474718 -4427797 -3746923 -3215239 -2289729 -748872 1087875
42033 1087875 2909500 4808953 6797763 8232477 8295373 7093256 5841958 5753332 6939986
42024 6939986 8491261 9355281 9005091 7537601 5476607 3473246 1959571 923760
42016 923760 -65625 -1661958 -4424438 -8383935 -12795260 -16545542 -19025427 -20474662
42008 -20474662 -21258869 -20941999 -18468617 -13457798 -7159609 -1897242 539749 25910
42000 25910 -2164038 -4509201 -6110675 -6708158 -6267655 -4796114 -2488174 143247 2395502
41991 2395502 3724505 4119066 4146170 4348163 4362961 2863905 -1224635 -7484667 -14338944
41982 -14338944 -20600038 -26195920 -31226058 -34912441 -36069001 -34442089 -31130499 -27705562
41974 -27705562 -25205775 -23856481 -23306780 -23010139 -22642132 -22294197 -22190191 -22296551 -22425394
41965 -22425394 -22677589 -23535727 -25471287 -28539719 -32186435 -35225668 -36285911 -34829002
41957 -34829002 -31764283 -28600218 -25911251 -23085744 -19648670 -16207060 -13741898 -12495857
41949 -12495857 -12114106 -12594044 -14508019 -18305000 -23732865 -29847302 -35274439 -38661053
41941 -38661053 -39370861 -37802013 -34774879 -30771951 -26184414 -22095456 -20062560 -20828931
41933 -20828931 -23634252 -26960052 -29542426 -30518574 -29240071 -25602080 -20427511 -15083520
41925 -15083520 -10722637 -8071475 -7640174 -9572968 -13230188 -17306002 -20541121 -22244784
41917 -22244784 -22303674 -21110238 -19537321 -18549037 -18547058 -19245181 -20262469 -21525855 -22886051
41908 -22886051 -23701741 -23295816 -21770989 -19943189 -18359054 -16709760 -14409313 -11504731
41900 -11504731 -8727963 -6734537 -5568042 -4928737 -4754537 -5335469 -6858763 -9022791
41892 -9022791 -11331365 -13854348 -17473644 -22989364 -29852064 -36059755 -39614240 -40053699
41884 -40053699 -38433180 -35985151 -33073940 -29290911 -24078591 -17164694 -8849564 -184746
41876 -184746 7403129 13013267 16705456 18868337 19410075 17914265 14422028 9633702
41868 9633702 4377020 -716467 -5001509 -7788999 -8810381 -8489684 -7566748 -6599395 -5861525
41859 -5861525 -5358503 -4696308 -3248190 -875863 1575478 2859748 2524428 1384470 744829
41850 744829 1202719 2206727 2759559 2583071 2551819 3815008 6461625 9255943 10774494
41841 10774494 10601997 9368167 8015315 7324182 7774947 9279331 11065446 12285212
41833 12285212 12825196 13211728 13734752 14095833 14023499 13782191 13771761 13890605 13603075 12531304
41823 12531304 10827712 9157031 8520216 9891911 13631532 19074954 24730471 28948125
41815 28948125 30640778 29763864 27262847 24299905 21303166 17896420 13853294 9821435
41807 9821435 6824127 5260385 4756678 4912080 5819225 7792543 10807717 14242204 17024770
41798 17024770 18125565 17170218 14646078 11434338 8244036 5591321 3982525 3625053
41790 3625053 4010765 4241559 3835566 2865537 1355125 -862988 -3458131 -5320565 -5481988
41781 -5481988 -4170709 -2703641 -2552728 -4677767 -9261567 -15474354 -21649671 -26309761
41773 -26309761 -29146009 -30673225 -31019395 -29634001 -26356998 -22247170 -18933213 -17357091
41765 -17357091 -17447946 -18792554 -21149632 -24210342 -27151499 -28722990 -27949087 -24877496
41757 -24877496 -20645423 -16613615 -13278079 -10141041 -6792539 -3914348 -2791610 -3705258
41749 -3705258 -5146546 -4999345 -2499925 1186929 4304819 6119340 7141222 8184638
41741 8184638 9664094 11669397 14126690 16641566 18604972 19858528 21031138 22776742
41733 22776742 24761345 25873546 25542701 24464331 23780805 23749737 23451320 21761328 18555354
41724 18555354 15075937 13129093 13685832 16142291 19093969 21844734 24833054 28461209
41716 28461209 31996285 34139700 34492971 33919722 33466376 33450848 33738366 34337027 35271913
41707 35271913 36199333 36729308 37133384 38242376 40399957 42771426 43972089 43340341 41456119
41698 41456119 39489324 38216004 37616402 37151615 36255861 34660403 32426376 29728435
41690 29728435 26605762 22964206 18808082 14317486 9603293 4552329 -862521 -6190217
41682 -6190217 -10686000 -13942199 -16164903 -17826017 -19269535 -20656343 -21908807 -22474032
41674 -22474032 -21434506 -18240998 -13308913 -7700521 -2349101 2167486 5294235 6468030
41666 6468030 5632919 3582251 1608149 772522 1329599 2566061 3229125 2443775 362971
41657 362971 -2179398 -4531660 -6385130 -7135053 -5731809 -1662055 4108565 9554994
41649 9554994 12988993 14043236 13661827 13461647 14789776 17768878 21084911 22979605
41641 22979605 22572816 20171034 16583822 12671211 9556171 8576844 10408844 14239512
41633 14239512 18081317 20029467 19387614 16949691 14390872 13097557 13177395 13532898 12993651
41624 12993651 11288804 8851194 6005109 2781713 -568497 -3439362 -5485638 -7023616
41616 -7023616 -8506804 -9882315 -10942435 -12224725 -14909364 -19389044 -24217988 -27055060
41608 -27055060 -26850666 -24900301 -23622815 -24416345 -26661702 -28425668 -27879151 -24365142
41600 -24365142 -18670308 -12433245 -7065377 -3130557 -785468 -517749 -2929155 -7754530
41592 -7754530 -13634489 -19152439 -23740919 -27291761 -29321032 -29113275 -26607039 -22688919
41584 -22688919 -18625329 -15555432 -14457866 -16074375 -20566294 -27337930 -35210555 -42709228
41576 -42709228 -48488510 -51929290 -53219114 -52428782 -48736995 -41332004 -31149315 -20879746
41568 -20879746 -12869556 -7658690 -4920610 -4867392 -7706276 -12160881 -15691090 -16361237
41560 -16361237 -13943771 -9403265 -4210691 -217117 874828 -1361858 -5755450 -10550599
41552 -10550599 -14358534 -16118102 -15061169 -11420731 -6717237 -2650229 111614 1586622
41544 1586622 1334812 -1477380 -6734605 -12696785 -17031038 -18430621 -17299026 -15222342
41536 -15222342 -13877611 -14094458 -15596709 -17529739 -19235471 -20603058 -21909391 -23460842
41528 -23460842 -25168967 -26204467 -25212707 -21254305 -14666353 -6930395 229586 5574298
41520 5574298 8561622 9325456 8400473 6065624 1956058 -4237352 -11553458 -17686211
41512 -17686211 -20557807 -20012178 -17885778 -16454741 -16751676 -18134475 -19279943 -19540954
41504 -19540954 -19314581 -19201078 -19212061 -19104810 -19148477 -19936171 -21447105 -22880540 -23568858
41495 -23568858 -23514714 -22776240 -20894686 -17463791 -12980400 -8626572 -5332294 -3424587
41487 -3424587 -2970052 -3835615 -5291544 -6063167 -5203251 -2935298 -580221 323906 -1032628
41478 -1032628 -4318416 -8359955 -11886529 -14138131 -14955542 -14557683 -13377238 -11904273
41470 -11904273 -10337648 -8319678 -5248824 -1031369 3531238 7217277 9277166 9854091
41462 9854091 9567403 8794861 7504601 5801951 4400395 4267398 5810317 8605402 11862318
41453 11862318 14829427 16726964 16759572 14567749 10550232 5610851 834234 -2492610
41445 -2492610 -3111297 -704301 3519328 7700090 10898479 13507916 16218938 19096360
41437 19096360 21775283 24043596 25910480 27417059 28707044 30100216 31819405 33758045
41429 33758045 35704590 37608147 39335719 40294434 39699570 37373922 34110667 31109812
41421 31109812 29116383 28161388 28011355 28636352 30104504 32103005 33806011 34406991 33776115
41412 33776115 32484505 31156655 29862917 28178651 25830355 23286406 21652015 21813799
41404 21813799 23604130 25949393 27959708 29711967 31779551 34185618 36182190 37056770
41396 37056770 36832502 36077298 35241192 34224269 32344645 28693055 22908301 15914717
41388 15914717 9738724 6280456 6149052 8621224 12481907 16736625 20710882 23812856
41380 23812856 25356918 24645272 21337264 15853592 9352511 3153109 -1917429 -5720491
41372 -5720491 -8525899 -10598553 -11983408 -12703134 -13280924 -14977640 -19142291 -26057701
41364 -26057701 -34448810 -42134230 -47026945 -47674627 -43555707 -35535862 -25979347 -17781120
41356 -17781120 -12727040 -10504839 -9121564 -6278671 -712415 7271137 16256497 24639166
41348 24639166 31165180 34907462 35328996 32747972 28491224 24133433 20510594 17595478
41340 17595478 15138736 13124566 11757310 11432903 12720715 15968859 20823565 26410068
41332 26410068 31983000 37043747 40865975 42562724 42033616 40483607 39529317 39869999
41324 39869999 41034689 42094549 42117127 40076562 35046724 26948337 17011841 7313044
41316 7313044 -189330 -4355302 -5090978 -3235771 -147322 2900167 5127306 6239372
41308 6239372 6228019 5274941 3650442 1423272 -1742451 -6261582 -11968590 -17928739 -23076233
41299 -23076233 -26980374 -29840239 -31810150 -32583738 -31696377 -29029750 -24939560 -20140897
41291 -20140897 -15673798 -12735635 -12091958 -13532074 -16137360 -19187343 -22592527 -26297930
41283 -26297930 -29492792 -30769648 -29181118 -25038976 -19647536 -14407535 -10289144 -7945611
41275 -7945611 -7786228 -9534025 -11928569 -13493295 -13874796 -14071709 -15025252 -16297541 -16587781
41266 -16587781 -15324433 -13146795 -10850326 -8538131 -6059259 -3713353 -2082568 -1494491
41258 -1494491 -2015870 -3647900 -6079763 -8491734 -10110206 -10876241 -11178064 -11088583 -10368718
41249 -10368718 -9102270 -7653653 -5853946 -2859330 1783587 7287958 12195879 15559414
41241 15559414 17289785 17637148 16756937 14713739 11597043 7665878 3593244 435069
41233 435069 -998958 -807373 161344 1138674 1954209 2812466 3876809 5203436 6888922
41224 6888922 9064305 11694061 14403654 16569859 17740335 18063576 18163626 18408933 18400079
41215 18400079 17404700 15267157 12684194 10627123 9740601 10250786 12005805 14309549
41207 14309549 15948961 15823981 13753254 10609234 7516527 4738488 1281479 -4183644
41199 -4183644 -11700116 -19365436 -24635016 -26391878 -25498844 -23339098 -20323851 -16119831
41191 -16119831 -10879192 -5638271 -1555680 816456 1513548 827155 -880589 -3304221
41183 -3304221 -6293269 -9730236 -13318860 -16615043 -19167237 -20426832 -19701004 -16635801
41175 -16635801 -11800840 -6428849 -1454314 2927047 6771924 9988912 12676606 15406585
41167 15406585 18693216 22327678 25560392 27808251 28919537 28968338 28214712 27195640
41159 27195640 26422385 25882729 25078513 23566337 21233085 18120763 14410116 10744884
41151 10744884 8249701 7877156 9666182 12648965 15469570 17263093 18224197 19350809
41143 19350809 21404854 24080760 26396707 27882636 29039505 30498317 32035882 32652428
41135 32652428 31442678 28242746 23669580 18764985 14397745 10711505 7238342 3754089
41127 3754089 863975 -521633 -133157 1589092 4259475 7874526 12215096 16346167
41119 16346167 19169924 20539630 21678889 24382291 29632415 36750868 43788060 48834121
41111 48834121 51074504 50721179 48272819 44226352 39419714 35056359 31922368 29665030
41103 29665030 27147915 23599122 19390169 15834379 14345081 15560621 18867384 22607389
41095 22607389 24942731 24828528 22418817 18723814 14858335 11361383 8034725 4525634
41087 4525634 1191172 -784907 -404221 2056764 5187485 7620062 8829917 8901610 8040224
41078 8040224 6583030 5149885 4356495 4393445 5063909 6102257 7204441 7852618 7470464
41069 7470464 5867306 3363849 452335 -2461859 -4927925 -6351157 -6365908 -5394512 -4705950
41060 -4705950 -5708598 -8931965 -13491057 -17508472 -19183603 -17640960 -13031712 -6224992
41052 -6224992 1372481 8007207 12231236 13721437 13349462 12285550 11061600 9469588
41044 9469588 7123908 4006192 688710 -1796362 -2551555 -1643723 -333260 -192763 -1868653
41035 -1868653 -4755421 -7785421 -10304435 -12154935 -13165769 -12812802 -10483035 -6148617
41027 -6148617 -816135 3856911 6662335 7650946 7789583 7900640 8129810 8351579 8648324
41018 8648324 9120243 9460316 9090870 7760125 5819422 3891631 2426206 1616566 1564475
41009 1564475 2313092 3669972 5112318 6048755 6301410 6306590 6720134 7768923 9016436
41000 9016436 9722934 9324515 7617837 4776668 1410118 -1538250 -3278174 -3708713 -3396226
40991 -3396226 -2941737 -2360562 -1065246 1546863 5396048 9504000 12527901 13666328
40983 13666328 13113495 11660180 10008184 8607389 7930792 8398169 9797510 11083272
40975 11083272 11127057 9636175 7082008 3789229 -508597 -6023237 -12094373 -17354206
40967 -17354206 -20730026 -22169088 -22479200 -22701931 -23622618 -25516407 -28013338 -30199086
40959 -30199086 -31105387 -30374715 -28601233 -27011807 -26603412 -27306149 -27896070 -26906297 -23853341
40950 -23853341 -19683836 -16107633 -14570389 -15686798 -19150988 -23811513 -28037499 -30557899
40942 -30557899 -31232825 -30950870 -30755319 -31153439 -32114840 -33294667 -33987058 -33052779 -29304984
40933 -29304984 -22298826 -12954343 -3430584 3897805 7742065 8336934 6582588 3012087
40925 3012087 -2048547 -7587019 -12037532 -14664870 -16201435 -17538578 -18212728 -16932114
40917 -16932114 -13454778 -9161401 -5608884 -3156785 -1369687 -312105 -906060 -4004651
40909 -4004651 -9294393 -15094866 -19277358 -20668183 -19779584 -18201532 -17417976 -18384879 -21879646
40900 -21879646 -28377828 -37173028 -46111592 -52762089 -55812715 -55271418 -51865388 -46773564
40892 -46773564 -41532998 -37338628 -34243476 -31456983 -28470438 -25493860 -22797748 -20138952
40884 -20138952 -17021375 -13202768 -8892869 -4857996 -2372675 -2464851 -4840795 -7919782
40876 -7919782 -10255966 -11618042 -12432425 -12703476 -12104753 -10850533 -9694629 -8901647 -7690432
40867 -7690432 -4929054 -197448 5838426 11843866 16638292 19972145 22609611 25439452
40859 25439452 28500356 31090435 32678703 33245493 32769358 31034019 28227352 25197477
40851 25197477 22661293 20495629 18232683 15901062 13783096 11563023 8527663 4868722
40843 4868722 2254046 2659166 6717398 13320747 20582924 26992003 31892767 35322483
40835 35322483 37605856 39051953 39878934 40218850 40019594 38987027 36839149 33692059
40827 33692059 30040359 26253894 22203650 17494116 12002930 6112432 462969 -4457285
40819 -4457285 -8522352 -11817775 -14246617 -15291670 -14282340 -10975712 -5850494 149214
40811 149214 6043988 10998294 14305630 15453459 14306939 11260406 7220622 3288321
40803 3288321 142782 -2411096 -5117220 -8321321 -11464802 -13688608 -14799466 -15352995
40795 -15352995 -15812770 -15984172 -15476482 -14507530 -13929018 -14399272 -15683017 -16841245 -17044047
40786 -17044047 -16190363 -14897314 -14044716 -14245573 -15478760 -17064914 -18086341 -17978082 -16731218
40777 -16731218 -14554919 -11553380 -7908889 -4221253 -1345701 168805 333280 -530009
40769 -530009 -2028630 -3680279 -4954335 -5456382 -4858455 -2629145 1694569 7570766 13034284
40760 13034284 15773685 14853064 11281681 6920787 2973572 -583032 -4479988 -9312125
40752 -9312125 -15089217 -21359241 -27550234 -33081718 -37287096 -39592830 -39956910 -38914509
40744 -38914509 -36998827 -34354338 -31216615 -28551276 -27711540 -29340665 -32845496 -36968777
40736 -36968777 -40673638 -43584450 -45997573 -48572365 -51663335 -54762731 -56800593 -57073056
40728 -57073056 -55641879 -52839360 -48858569 -44040819 -39042461 -34174438 -28831313 -22238621
40720 -22238621 -14893861 -8790691 -5859017 -6258292 -8340587 -10204793 -11181358 -11922910
40712 -11922910 -13361707 -15844778 -19238903 -23454272 -28419571 -33581173 -37890604 -40540210
40704 -40540210 -41478365 -40982456 -38945368 -34881854 -28559830 -20443697 -11671065 -3794027
40696 -3794027 1748339 4443966 5109167 5184303 5536909 6124964 6691122 7261380 7768214
40687 7768214 7670288 6489702 4686089 3586507 4228896 6349809 8639475 10053247 10861238
40678 10861238 12293202 15034939 18187314 19983681 19578897 17857558 16346824 15611027
40670 15611027 14948188 13365596 10373721 5900903 52424 -6670976 -13215890 -18510330
40662 -18510330 -22207206 -24678646 -26302005 -27052518 -26897557 -26282156 -25901965 -26049843 -26431070
40653 -26431070 -26623386 -26462621 -25866387 -24515860 -22028259 -18529871 -14932170 -12462692
40645 -12462692 -11744200 -12205189 -12434935 -11303102 -8857700 -6155203 -4345259 -4116929 -5878017
40636 -5878017 -9877442 -15770369 -22405480 -28590280 -34019401 -39007650 -43354003 -46068339
40628 -46068339 -46476802 -45148689 -43344993 -41817002 -40522520 -39310088 -38371921 -37907726
40620 -37907726 -37568154 -36310316 -32815779 -26392831 -17898998 -9684943 -4111384 -1863595
40612 -1863595 -1844150 -2642886 -3722253 -5112013 -6489154 -7011250 -5890151 -2842647 1823095
40603 1823095 7200280 11979732 15109533 16442560 16627652 16430622 16365076 16828815 18093063
40594 18093063 19924886 21492360 21923497 20923205 18809500 16175653 13685507 11997191
40586 11997191 11590355 12633219 15072001 18689699 22889101 26545588 28375861 27567175
40578 27567175 24047118 18340223 11433293 4664456 -766874 -4553999 -7483792 -10640687
40570 -10640687 -14285752 -17496913 -18903939 -17856125 -15050788 -12132341 -10610596 -10992701
40562 -10992701 -12747302 -14887658 -16547042 -17297687 -17328579 -17360228 -18041283 -19210065 -19940209
40553 -19940209 -19562804 -18573471 -18304584 -19648917 -22159878 -24328661 -24624563 -22385774 -18035923
40544 -18035923 -12679932 -7470422 -3183099 -191997 1334392 1316939 -188925 -2937007
40536 -2937007 -6563089 -10761205 -15385531 -20285529 -24938591 -28318567 -29371545 -27787929
40528 -27787929 -24278355 -20070760 -16253759 -13619589 -12799599 -14066425 -16831928 -19596031
40520 -19596031 -20796096 -19990146 -18273665 -17400529 -18276425 -20195602 -21555938 -21279173 -19463920
40511 -19463920 -16847997 -14104611 -11850756 -10836973 -11403100 -12625492 -12540546 -9715324
40503 -9715324 -4647511 526556 3737295 4446164 3656343 2718161 2141008 1431230 -39420
40494 -39420 -2092262 -3710341 -3918393 -2617266 -533319 1569857 3560986 5871142 8837546
40485 8837546 12128318 14776084 15764554 14652541 11793858 8123452 4708386 2221626
40477 2221626 551698 -1096814 -3523902 -6830921 -10397996 -13500706 -15812673 -17353541
40469 -17353541 -18273747 -18945574 -20094396 -22411907 -25836258 -29386985 -31928373 -33062516
40461 -33062516 -33153511 -32620438 -31552107 -30079511 -28710417 -27870885 -27200063 -25701479 -22724106
40452 -22724106 -18581540 -14131064 -9979943 -6219163 -2681289 769518 4064567 6852092
40444 6852092 8724944 9749652 10664330 12251746 14424681 16042241 15693820 12738313
40436 12738313 7822472 2597924 -1183142 -2603606 -1840532 315313 2937350 4956110
40428 4956110 5165279 2770093 -2009230 -8031678 -13817906 -17967257 -19495163 -18400800
40420 -18400800 -15838758 -13170162 -10741276 -7955725 -4444552 -544976 3430484 7613155
40412 7613155 11832325 15053480 16243329 15604503 14442236 13885297 14090969 14543572 14651181
40403 14651181 14013157 12504185 10343765 8067830 6410566 6075466 7231321 9055075
40395 9055075 10183746 10048053 9520594 9777651 10694828 10947693 9723702 7807374 6828533
40386 6828533 7857450 10838913 14824375 18314137 19708917 18046569 13509306 7168544
40378 7168544 362533 -5589455 -9457786 -10557265 -9437606 -7904654 -7995948 -10705678
40370 -10705678 -15541968 -21132154 -26177300 -29996074 -32459723 -33573760 -33060686 -30281105
40362 -30281105 -24706726 -16666894 -7552289 1000100 8197235 14178083 19011953 21977784
40354 21977784 22093436 19119601 13728492 6866351 -623116 -7758333 -13253795 -15857003
40346 -15857003 -14790334 -9965665 -2170216 6809257 14704973 20023847 22966809 24901231
40338 24901231 26792644 28245961 28159417 26184631 23326829 21055945 19979691 19515380
40330 19515380 18741971 17330688 15633445 14155436 13164457 12672422 12484722 12155605 11061446
40321 11061446 8787681 5638980 2728206 1243985 1346551 1916985 1725234 774865 103810
40312 103810 339425 1122537 2213458 4471011 9060429 15972318 23876118 31159608 36470958
40303 36470958 38502608 36286774 30190386 22190155 14772674 9594683 7016688 6357625
40295 6357625 6441541 6390134 6191202 6264882 6462935 6005483 4572981 2865049 1653138
40286 1653138 714153 -781838 -3082368 -5534529 -7301263 -7970437 -7584245 -6559764 -5671431
40277 -5671431 -5782090 -7363330 -10198067 -13388596 -15648031 -16000884 -14598367 -12714634
40269 -12714634 -11611534 -11437398 -11389848 -10735402 -9393267 -7773468 -6495063 -6167645 -6971583
40260 -6971583 -8353650 -9414207 -9630924 -9033634 -7882982 -6637556 -6155483 -7285451 -9931917
40251 -9931917 -12832603 -14548022 -14581378 -13531584 -12474516 -12282056 -13100600 -14128538 -14113198
40242 -14113198 -12396764 -9387673 -5845964 -2025165 2020419 5437554 6574610 4360730
40234 4360730 -564222 -6366983 -11436083 -14942295 -16248289 -14546274 -9573757 -2441107
40226 -2441107 4728280 10061775 12763431 13043815 11824610 10500841 10270206 11163086 11913558
40217 11913558 11085330 8214550 3818341 -1185906 -5633673 -8157342 -7921843 -5466704
40209 -5466704 -2381470 -40878 1103737 1219518 745651 425683 993545 2406132 3729814
40200 3729814 4091091 3446146 2190929 450893 -1789601 -4150892 -6041238 -7384649
40192 -7384649 -8726882 -10462564 -12165684 -12789098 -11475642 -8290362 -4361497 -1224348
40184 -1224348 275862 566691 784779 1681552 3226454 5210925 7935717 12107531 18096745
40175 18096745 25343658 32440934 37810934 40477113 40386675 38109186 34253869 29122220
40167 29122220 22812252 15602623 8270935 2016358 -2112787 -3926730 -4310474 -4697479
40159 -4697479 -6219219 -9133590 -12778196 -15986708 -17792683 -18019609 -17236543 -16069057
40151 -16069057 -14594600 -12465882 -9500035 -5986032 -2488184 441682 2345099 2882428
40143 2882428 1984244 14519 -2269317 -4010896 -4662252 -4240376 -3206770 -2030563 -776612
40134 -776612 1027079 4247005 9716935 17474678 26087750 32977392 35985638 34921313
40126 34921313 31447626 27326708 22850261 16989742 8827376 -1356315 -12199198 -22058726
40118 -22058726 -29634885 -34174533 -35477624 -33829961 -29876603 -24571855 -19240461 -15366496
40110 -15366496 -13789122 -13894286 -13946496 -12643217 -10323273 -8407421 -7739344 -7760377 -7179619
40101 -7179619 -4978471 -778316 5032783 11007702 14921369 15184324 12223185 8145397
40093 8145397 4897070 2911087 1500097 152286 -840317 -882927 73741 1286684 1815695
40084 1815695 1349637 383652 -444511 -1082793 -2086574 -4132221 -7696660 -12968023 -19611888
40075 -19611888 -26568559 -32460715 -36454214 -38655083 -39678463 -40043660 -39979745 -39466689 -38274609
40066 -38274609 -36178136 -33275786 -29862938 -25851795 -20672536 -14121708 -7123436 -1229459
40058 -1229459 2630717 4608670 5209976 4499924 2118285 -2253290 -8590931 -16373842
40050 -16373842 -24445983 -31223858 -35405880 -36572015 -35062764 -31480682 -26555442 -21287370
40042 -21287370 -16666724 -13027493 -10018929 -7508194 -6212278 -6913867 -9036295 -10492995
40034 -10492995 -9302778 -5301857 -232854 3615140 4797844 3256757 76267 -3232935
40026 -3232935 -5549405 -6458584 -5850749 -3507191 601819 5814101 11114013 16090372
40018 16090372 21144656 26539103 31551191 34810281 35271702 32760823 27958702 22181270
40010 22181270 16857631 12735354 9634727 7264911 6116140 7120369 10438897 14938087
40002 14938087 18884302 20883138 20274484 17208698 12607829 7659011 2911142 -2117949
39994 -2117949 -8297686 -15897855 -24224692 -31983536 -37881158 -41141659 -41769592 -40392223
39986 -40392223 -37816900 -34725684 -31593877 -28552410 -25307040 -21557974 -17591818 -14016042
39978 -14016042 -10676831 -6366492 -192996 6952695 12829385 15692899 15333115 12558245
39970 12558245 8498828 4624658 2599497 3269917 5818286 8332064 9277507 8331479
39962 8331479 6065489 3273922 620338 -1485574 -2984959 -4141474 -5304808 -6601690
39954 -6601690 -7744309 -8151220 -7513255 -6476670 -6626154 -9407131 -14868990 -21526963 -27470432
39945 -27470432 -31541085 -33595385 -34042809 -33370129 -31924444 -29875994 -27396297 -24996534
39937 -24996534 -23552896 -23669168 -24915759 -25929830 -25469244 -23324880 -20175814 -16815682
39929 -16815682 -13798696 -11661189 -10956917 -11826504 -13802490 -16289259 -19013350 -21701365
39921 -21701365 -23567422 -23723977 -22262893 -20497570 -19819440 -20536209 -22080369 -24066065
39913 -24066065 -26639875 -29780859 -32717347 -34341396 -34094979 -32298390 -29714505 -26997122
39905 -26997122 -24587422 -22927451 -22439850 -23061380 -23853775 -23391614 -20797441 -16406331 -11383301
39896 -11383301 -6846079 -3465512 -1607010 -1333100 -2127321 -2989385 -3170084 -2795387 -2566825
39887 -2566825 -2784187 -2731508 -1101455 2874642 8580511 14220675 17902199 18592837 16194417
39878 16194417 11054551 3756117 -4697458 -12950526 -19853293 -24879200 -27906080 -28771520
39870 -28771520 -27253897 -23459820 -18125196 -12539934 -8095281 -5599317 -4816274 -4791956
39862 -4791956 -4788862 -4800841 -5076231 -5436914 -5399959 -4792447 -3790574 -2324785 116028 3862107
39852 3862107 8489498 13083535 16929618 19785779 21642370 22479455 22285317 21193016
39844 21193016 19567912 17953517 16815404 16252117 16036786 15999199 16214460 16664871 16860513
39835 16860513 16096119 14167654 11660171 9391358 7623316 5912121 3716200 1074385
39827 1074385 -1360535 -2936948 -3573259 -3649640 -3402426 -2598223 -836380 2049043 6039609
39818 6039609 11133564 17113495 23170581 28246110 31992254 35068533 38137043 40771109
39810 40771109 41795247 40649382 37937262 34509607 30490789 25559101 19826334 13887096
39802 13887096 8085579 2333755 -3108289 -7119049 -8484551 -7182186 -4640325 -2696448
39794 -2696448 -2471705 -4228111 -7932725 -13529453 -20553732 -27739251 -33367899 -36212112
39786 -36212112 -36161959 -33996623 -30759485 -27449360 -24962423 -23736093 -23236913 -22158883
39778 -22158883 -19515084 -15502129 -11144467 -7303304 -4368929 -2745090 -2975858 -5039704
39770 -5039704 -7891344 -10272417 -12037061 -14278879 -17906919 -22309178 -25757116 -27164209
39762 -27164209 -27220921 -27679617 -29640456 -32588990 -34845031 -34662180 -31099212 -24473607 -16356644
39753 -16356644 -8821143 -3128844 1034791 4893087 9126117 13165531 15776496 16018229
39745 16018229 13647519 9053892 3216754 -2356380 -6075803 -7037746 -5548276 -2904721
39737 -2904721 -494522 1107823 2215371 3172972 3552209 2432569 -531134 -4604598
39729 -4604598 -8617841 -11815358 -13876602 -14412742 -12934830 -9445181 -4877215 -851341
39721 -851341 1028763 -114776 -4012888 -9337874 -14342113 -17655550 -18707754 -17659358
39713 -17659358 -15108558 -11766187 -8191407 -4784714 -2056630 -703603 -1115363 -2789559
39705 -2789559 -4467971 -4924428 -3519539 -170765 4689513 9891651 13709924 14865568
39697 14865568 13472441 10796375 8098186 5879692 4078581 2462680 573602 -2344468
39689 -2344468 -6801110 -12310751 -17478305 -21093060 -23113523 -24444927 -25797532 -26965343
39681 -26965343 -27283757 -26557168 -25244219 -23740437 -21788388 -18838624 -14930095 -11009725
39673 -11009725 -8293910 -7329867 -7645751 -8225213 -8290303 -7682069 -6593793 -5100570 -3106896
39664 -3106896 -721682 1578386 3369296 4785105 6425267 8793770 11979836 15799587
39656 15799587 19940671 23869339 26860000 28377361 28432217 27527786 26353360 25472143 24910628
39647 24910628 23758249 20468099 14159308 5851741 -1827298 -6387784 -7012386 -4645515
39639 -4645515 -1038468 2194074 4071882 4331889 3060178 138612 -4709554 -11017378
39631 -11017378 -16897118 -19801120 -18262196 -12870965 -5634864 1397929 7046829 11211029
39623 11211029 14682813 18592417 23562798 29161550 34146796 37184932 37354678 34289160
39615 34289160 28254918 20208527 11595163 3903084 -1761433 -4969018 -6107107 -6144611
39607 -6144611 -5965266 -5833228 -5575016 -5112098 -4451731 -3158182 -343833 4423201 10390570
39598 10390570 16175770 21050633 25438265 30150265 35384980 40517797 44610363 46972427
39590 46972427 47444600 46464944 44956658 43992803 44329128 46044525 48514352 50800809 52291483
39581 52291483 53149529 54191684 56301562 59919997 65004969 71336600 78791530 87383684
39573 87383684 97122615 107879495 119492832 132157196 146698806 164213870 185218766
39566 185218766 209257345 235567234 264033310 295030845 327970825 360039491 386619156
39559 386619156 403168839 407037004 398120404 378496572 351604471 321247122 290618553
39552 290618553 261775482 235721667 212650451 191938410 172285503 152579618 132992017
39545 132992017 115004617 100061027 88235324 78340299 69145918 60258170 52032902
39538 52032902 45115349 40109260 37214826 35871897 34976761 33722270 32103354 30428172
39530 30428172 28597240 26268713 23652867 21660643 21046032 21627785 22538960 23096674 23297284
39521 23297284 23648944 24749993 26907351 29809896 32419004 33365039 31754519 27810281
39513 27810281 22850274 18678837 16873905 18357771 23287697 31112506 40717110 50681122
39505 50681122 59614149 66427634 70471333 71596895 70170962 66948361 62811547 58554965
39497 58554965 54790868 51844364 49651477 47940713 46686603 46247614 46840759 48008359
39489 48008359 48929613 49240603 49182819 48851456 47701772 45115650 41240479 36913982 32801287
39480 32801287 28870224 24743112 20406504 16561462 14311091 14280374 15745691 16720538
39472 16720538 15300389 11106043 5268532 -996847 -7495134 -14632085 -22279266 -29481357
39464 -29481357 -35228688 -39147134 -41320216 -41736227 -40201002 -36729689 -31771638 -25973200
39456 -25973200 -19869101 -13900583 -8574253 -4325710 -1099209 1866022 5691038 11126295
39448 11126295 17927183 24801099 30112229 32964108 33752692 33609430 33343554 33089224 32865254
39439 32865254 32984110 33612238 34213858 33826880 31829112 28209263 23309108 17770541 12700684
39430 12700684 9296775 7900823 7545685 6636421 4059662 -301914 -5775582 -11333584
39422 -11333584 -15968812 -18957893 -19931122 -18813466 -15868100 -11771550 -7343634 -3006083
39414 -3006083 1353885 5847542 10058011 13166549 14409933 13263637 9483815 3418044
39406 3418044 -3747987 -10461745 -15719851 -19402353 -21738121 -22762195 -22433887 -20967982
39398 -20967982 -18701071 -15732840 -12059987 -8138074 -4983175 -3409291 -3214794 -3371852
39390 -3371852 -3095770 -2566294 -2493400 -3129776 -3919993 -4087564 -3378962 -2226913 -1390046
39381 -1390046 -1486372 -2596109 -4013483 -4435414 -2742567 1105085 5885158 9926671 12246400
39372 12246400 12981353 12787189 11968790 10390208 8211372 6357950 5924113 7179632 9438659
39363 9438659 11841647 13909954 15356676 15952884 16007475 16626870 18852082 22415247 25700683
39354 25700683 27087828 26132774 23378513 19360438 14179795 8046883 1907183 -2816408
39346 -2816408 -5258099 -5847745 -5919597 -6581833 -8011943 -9708299 -11096762 -11821079 -11872453
39337 -11872453 -11871852 -13062176 -16473595 -21876848 -27794993 -32691228 -35973640 -37795541 -38261680
39328 -38261680 -37232297 -34818963 -31665000 -28539789 -25788796 -23298187 -20864991 -18392668
39320 -18392668 -15737729 -12624004 -8928741 -5002333 -1513779 1041861 2541835 3009641
39312 3009641 2578766 1919393 2353407 4924901 9161106 13103069 14903840 14382408 12916065
39303 12916065 11963092 11899196 12200133 12411215 12707753 13558636 14993616 16261286 16202308
39294 16202308 14021873 9860777 4766424 105304 -3206331 -5216809 -6926151 -9726355
39286 -9726355 -14535645 -21105128 -28034514 -33638716 -37054842 -38637414 -39366225 -40008772
39278 -40008772 -40814383 -41594773 -41680058 -39988757 -35814937 -29881198 -24279832 -20951659 -20191907
39269 -20191907 -20690076 -20783609 -19515236 -16872436 -13596835 -10839741 -9568364 -9945607 -11231374
39260 -11231374 -12329082 -12521753 -11907618 -11273118 -11378559 -12146115 -12623170 -11909030 -10022362
39251 -10022362 -7755201 -5959315 -5279680 -6282876 -9227238 -13636721 -18574069 -23488098
39243 -23488098 -28392080 -32986410 -35959496 -35568571 -30983262 -23085344 -14132648 -6629066
39235 -6629066 -2133774 -764189 -1671460 -3867901 -6551638 -8968895 -10462388 -10696088
39227 -10696088 -9521850 -6741596 -2536527 1876023 4753724 5362906 4464757 2877702
39219 2877702 143171 -4685016 -11237529 -17580115 -21782968 -23243458 -22562838 -20821130
39211 -20821130 -19183594 -18611274 -19364618 -20754304 -21556450 -20795546 -18386625 -15332446 -13189594
39202 -13189594 -12836929 -13509211 -13283491 -10769877 -6253074 -1105057 3675104 8063450
39194 8063450 12289905 15974135 18333210 19204665 19498876 20340281 21866845 23208192 23665786
39185 23665786 23539889 23615134 24162743 24757063 24875097 24375444 23515997 22740193 22286598
39176 22286598 21794169 20565844 18555260 16769679 16138625 16145282 15215884 12492524 8665057
39167 8665057 5033515 2424581 1205656 1588524 3339958 5615845 7653936 9412073
39159 9412073 11046433 11951267 10911951 7403022 2550557 -1269708 -1867755 1321417
39151 1321417 6818908 12172324 15726030 17413493 17901731 17365068 15354475 11495215
39143 11495215 5859623 -1099756 -8432711 -14616316 -18258296 -19138349 -18261661 -16785145
39135 -16785145 -15163819 -13316608 -11095912 -8305118 -4618979 73267 5246050 9800834
39127 9800834 12514932 12503757 9647193 4896091 43192 -3141184 -3782758 -2173520 510808
39118 510808 2786433 3688260 3515212 3696836 5592840 9321113 13795862 17763505 20657940
39109 20657940 22647868 24164431 25358903 25806351 24783172 22023807 18092065 13736987
39101 13736987 9007738 3439957 -2821833 -8514019 -12098129 -12879999 -11176359 -7763749
39093 -7763749 -3527247 573469 3687302 5384362 5700489 4941089 3534679 1841554
39085 1841554 -211021 -3161345 -7249435 -11588731 -14535047 -15121163 -13913782 -12330241
39077 -12330241 -11413511 -11492965 -12661291 -14979184 -18099842 -21071910 -22817345 -22825870 -21402364
39068 -21402364 -19367986 -17518511 -16139356 -14850461 -12978426 -10243199 -7124789 -4500013
39060 -4500013 -2912767 -2252522 -2127623 -2413687 -3315243 -4944140 -7012156 -9004801 -10542516
39051 -10542516 -11508698 -12011507 -12444418 -13471891 -15568943 -18377337 -20694543 -21337904 -20076582
39042 -20076582 -17757420 -15679448 -14873132 -15692913 -17782244 -20411994 -22995198 -25301725
39034 -25301725 -27208518 -28487675 -29036128 -29120695 -29086720 -28914433 -28418392 -27909375 -28300405
39025 -28300405 -30374720 -34116992 -38812530 -43516286 -47281777 -49278672 -49119078 -47092092
39017 -47092092 -43878301 -40058005 -36067379 -32530677 -30234910 -29490857 -29564675 -28935021 -26254496
39008 -26254496 -21183991 -14486009 -7519840 -1681100 1948531 2860862 1301325 -1908166
39000 -1908166 -5914357 -10167992 -14138415 -16949541 -17748574 -16539438 -14336553 -12295881
38992 -12295881 -10847374 -9736800 -8585325 -7155946 -5362924 -3467493 -2214385 -2348279
38984 -2348279 -3830431 -5748558 -7137870 -7775609 -8126111 -8699580 -9608446 -10629780 -11504643
38975 -11504643 -12157262 -12759261 -13703357 -15499952 -18503075 -22475008 -26381976 -28935375
38967 -28935375 -29699774 -29694801 -30663211 -33589307 -37916797 -42102344 -44740003 -45196154 -43520720
38958 -43520720 -40098885 -35465461 -30320079 -25501210 -21674102 -18850477 -16276227 -13021345
38950 -13021345 -8809897 -4284790 -557510 1382819 971300 -1851712 -6705927 -13036889
38942 -13036889 -20312646 -27751240 -33915610 -37079290 -36397882 -32640622 -27587726 -22831495
38934 -22831495 -19246045 -17207470 -16772912 -17625864 -19255119 -21346019 -23791420 -26261152
38926 -26261152 -28009829 -28270407 -26764321 -23829070 -20206243 -16692039 -13736153 -11244671
38918 -11244671 -8891496 -6659839 -4896121 -3752632 -2758903 -1094982 1735911 5452474
38910 5452474 9032745 11280198 11743880 11264020 11347250 12777266 14977135 16800828 17609065
38901 17609065 17359561 16085069 13842243 11047444 8324108 5926997 3649685 1310863
38893 1310863 -1023758 -3288984 -5392209 -6756216 -6359187 -3657600 679109 5232241
38885 5232241 8919054 11434058 12874519 13414086 13441335 13622228 14376052 15158295 14486672
38876 14486672 11077453 5214546 -1116126 -5729598 -7946188 -8734378 -9382560 -10460076
38868 -10460076 -12068576 -14451568 -17789314 -21551440 -24551268 -25802849 -25205201 -23416787
38860 -23416787 -21209351 -18890640 -16165241 -12522098 -7843496 -2641070 2310868 6497395
38852 6497395 9882062 12895069 16302147 20709547 25786626 30038996 31667151 29789786
38844 29789786 24949457 18800750 13500802 10884867 11453994 13990563 16505723 17677121
38836 17677121 17258008 15427923 12422053 8891203 5988633 4638631 4826481 5643243
38828 5643243 5715070 3643378 -1229061 -7916958 -13946221 -16949542 -16158085 -12260653 -6287748
38819 -6287748 780441 7535711 12123689 13174908 10624545 5506985 -885410 -7605991
38811 -7605991 -14099943 -19877262 -24172472 -26050071 -25090836 -21987231 -18205460 -14953226
38803 -14953226 -12628613 -11245393 -10998415 -12154863 -14646947 -18094575 -22064262 -25951953
38795 -25951953 -28771801 -29663243 -28834400 -27562201 -26843092 -26228958 -24341937 -20374110 -14684664
38786 -14684664 -8085188 -1168536 5526677 11355477 16111227 20432415 25091632 29859700
38778 29859700 33445165 34678538 33662677 31861147 31177998 32653026 35621203 38176369
38770 38176369 38765387 37311450 34645365 31256129 27226454 23185948 20387850 19479474
38762 19479474 19796315 20291676 20718160 21449341 22470002 22992100 21866872 18084347 11265971
38753 11265971 2257451 -6880661 -14032582 -18361780 -20401405 -21076120 -21026422 -20719121 -20610386
38744 -20610386 -20946287 -21631577 -22427742 -23166588 -23793454 -24384675 -25101675 -25936715 -26506296
38735 -26506296 -26248576 -24831674 -22356530 -19381899 -16880838 -15790418 -16106716 -16486509
38727 -16486509 -15148978 -11224476 -5038183 2662689 11193308 19656782 26838429 31796891
38719 31796891 34437322 35435617 35842992 36741198 38731755 41309946 42892694 41895474 38055138
38710 38055138 32841326 28631867 27243280 28779392 31626594 33642330 33515242 31186061
38702 31186061 27378865 23067157 19128327 15921637 13109816 10276884 7705660 6021452
38694 6021452 4973044 3183872 -537339 -6072941 -12489620 -19128658 -25647019 -31339551
38686 -31339551 -35210790 -36862444 -36861697 -36020235 -34483968 -31611162 -26670837 -19748805 -12111203
38677 -12111203 -5543314 -1082299 1605441 3532587 5255479 6535207 6794618 5556777
38669 5556777 2692578 -1177264 -4457222 -5270507 -2777550 2172036 7655024 11807646
38661 11807646 13587407 13035615 11113293 8957872 6854942 3925362 -932999 -7736087
38653 -7736087 -15142494 -21453667 -25734821 -27980244 -28510478 -27578831 -25582832 -23240549
38645 -23240549 -21109453 -18932454 -15844899 -11436642 -6368266 -1671089 2389856 6390317
38637 6390317 10706732 14810935 17845724 19706474 21262818 23520690 26765964 30524580
38629 30524580 34048111 36593442 37450848 36246961 33494314 30556697 28665367 27933532
38621 27933532 27458563 26198090 23493327 19094449 13458122 8204028 5570358 6784753
38613 6784753 11103604 16753653 22583755 28471244 34410726 39761910 43400635 44252508
38605 44252508 41740714 36158284 28728541 21023469 14194933 8849702 5466761 4479637
38597 4479637 5834591 8750171 12025332 14443497 15034709 13506092 10733692 8545101
38589 8545101 8552259 10960124 14415182 16971123 17383313 15780606 13165689 10162389 6366731
38580 6366731 1167230 -4954030 -10412903 -13911780 -15472329 -15987048 -16168153 -16180294 -15943582
38571 -15943582 -15420737 -14755207 -14377005 -14805188 -16081229 -17490930 -18023863 -17005714 -14238018
38562 -14238018 -9902615 -4692592 175135 3526912 4885967 4453346 2658089 30107
38554 30107 -2666922 -4647270 -5554150 -5524100 -4926402 -4355585 -4733162 -6840251 -10515509
38545 -10515509 -14628835 -18061524 -20516897 -22272815 -23474775 -23988148 -23821150 -23402279
38537 -23402279 -23359291 -24035906 -25137947 -25820259 -25251407 -23180442 -19918705 -15871441 -11349126
38528 -11349126 -6848357 -3157765 -938951 -341845 -1139491 -2989962 -5364675 -7488567
38520 -7488567 -8739141 -9104417 -9074975 -9185427 -9809702 -11142234 -12977415 -14577358 -15134022
38511 -15134022 -14387736 -12552829 -9826714 -6519261 -3664622 -2789291 -4640289 -8515870
38503 -8515870 -13196049 -18100952 -22999399 -26925747 -28242433 -26037778 -21084279 -15267169
38495 -15267169 -10323774 -7102737 -5555945 -5211848 -5956139 -8505004 -13728781 -21235083
38487 -21235083 -28989622 -34796365 -38033507 -39644439 -40717708 -41644601 -42551571 -43747012
38479 -43747012 -45278615 -46432892 -46181001 -44059809 -40331662 -35412359 -29534847 -22985753
38471 -22985753 -16256400 -9725825 -3442236 2471679 7275901 9794739 9296335 6169702
38463 6169702 1823374 -1874144 -3121339 -685649 5541079 14349440 23783574 32043727
38455 32043727 37863532 40292094 38672599 33179757 25218258 16966610 10375669 6429663
38447 6429663 4928506 4608657 3674879 817690 -3942917 -9513773 -14922689 -20116287
38439 -20116287 -25498079 -30937099 -35566144 -38565298 -39888240 -40109204 -39769746 -39126818
38431 -39126818 -38455546 -38183174 -38399386 -38345166 -36755501 -32868713 -26961353 -19868953 -12305316
38422 -12305316 -4908226 1327456 5247001 6424653 5677923 4500649 3973270 4170000
38414 4170000 4399589 3864625 2210273 -290142 -2880311 -4610657 -4651551 -2660745 887123
38405 887123 4792463 7826423 9490494 10083630 10122547 9908666 9635227 9553182 9733606
38396 9733606 9746796 8822354 6428017 2701339 -1594032 -5443018 -8006368 -8930449 -8450950
38387 -8450950 -7248065 -6075715 -5292255 -4589061 -3242603 -797865 2462115 5762904
38379 5762904 8463641 10337159 11397891 11742819 11537776 10870700 9601716 7697108 5803890
38370 5803890 5073831 6062444 7967989 9236614 8816026 6648809 3227616 -856034 -4924435
38361 -4924435 -8220709 -10177129 -10621549 -9700619 -7718846 -5024473 -1850084 1790127
38353 1790127 5892470 10105943 13750906 16323823 17922495 19068184 20084855 20671467
38345 20671467 20147004 18252610 15781761 14267827 14808966 17099840 19619325 20743277
38337 20743277 19772623 17256000 14671870 13701531 15376569 19662041 25881269 33537115
38329 33537115 42614759 53134315 64636166 76241209 87211016 97483702 107666126
38322 107666126 118263053 128634558 136822979 140817005 140164575 136193111 130615883 124154858
38314 124154858 116615529 108045147 99509495 92593363 88027461 84757789 80628391 74384261
38306 74384261 67052188 61103297 58258144 58300252 59736954 60900508 60303365 56768452
38298 56768452 49937768 40486625 29531832 18162190 7824768 488219 -2538558 -1951599
38290 -1951599 50670 1743459 2955152 4321618 6202827 8546026 11183111 13794272
38282 13794272 15849469 16911070 16867039 15808649 14014128 12127662 10790516 9685327
38274 9685327 7375298 2729737 -3544698 -9268145 -12763372 -14219387 -15148538 -16857912
38266 -16857912 -19541151 -22531270 -25112492 -27031452 -28332230 -28912126 -28530728 -27347931
38258 -27347931 -26157146 -25731598 -25948003 -25783458 -24212086 -20997591 -16699578 -12132863
38250 -12132863 -7808062 -3652934 833516 6062480 11954096 18097084 24212158 30272580
38242 30272580 36177264 41479952 45473183 47443940 46945881 44103462 39733156 34964796
38234 34964796 30597974 26868201 23780175 21392073 19601224 17806353 15061311 10737247
38226 10737247 5131657 -534052 -4838914 -7115726 -7820669 -7987560 -8380843 -9161586 -10048408
38217 -10048408 -10426151 -9418021 -6376734 -1529167 4130063 9730309 15056194 20099345
38209 20099345 24492933 27722427 29638924 30410805 30159128 29022416 27442176 25928286
38201 25928286 24518300 22855651 20908612 19325796 18983587 20408738 23641724 28239427
38193 28239427 33128688 36709375 37534594 35109387 30153011 24243521 19106947 15751690
38185 15751690 13861428 12097586 9289535 5385365 1181677 -2638587 -5829267 -8048055
38177 -8048055 -8630073 -7371331 -5361983 -4518883 -6040570 -9441833 -13188055 -16107185
38169 -16107185 -18063990 -19493005 -20647396 -21363176 -21281596 -20096370 -17638862 -13815714
38161 -13815714 -8473819 -1462468 6874789 15197667 21502304 24317222 23589408 20359798
38153 20359798 15850517 11098830 7088246 4524355 3308248 2661772 2013831 1510444
38145 1510444 1512702 1922650 2263620 2177545 1546422 293879 -1632640 -4193567 -7441428
38136 -7441428 -11626713 -16709614 -21723985 -25013342 -25388164 -23048411 -19394441 -16100246
38128 -16100246 -14340908 -14544458 -16520856 -19787777 -23920488 -28637326 -33486864 -37477497
38120 -37477497 -39223686 -37760577 -33411880 -27794274 -22742417 -19108306 -16633252 -14853064
38112 -14853064 -13747175 -13367676 -13314473 -13182194 -13484118 -15564139 -20330212 -27342766 -35258791
38103 -35258791 -42738771 -48609333 -51634189 -50980807 -47159209 -42042896 -37562820 -34429833
38095 -34429833 -32230522 -30527349 -29543564 -29804630 -31422006 -33899287 -36497616 -38567277
38087 -38567277 -39517750 -38737087 -35872933 -31293322 -26087344 -21404407 -17782230 -15158460
38079 -15158460 -13360104 -12340862 -12063860 -12591693 -14428156 -18331596 -24355835 -31230172
38071 -31230172 -37112380 -40978884 -43012577 -43769416 -43524702 -42574427 -41544276 -40792534 -39677384
38062 -39677384 -36953447 -31986582 -25301752 -17969119 -10837129 -4440743 803874 4725210
38054 4725210 7605437 9938038 11882067 13026823 12683773 10391497 6287269 1180696
38046 1180696 -3743158 -7475461 -9616211 -10408190 -10513341 -10808195 -12161133 -15018837 -19008370
38037 -19008370 -23045543 -26033810 -27572894 -28046473 -28090912 -27990290 -27473556 -25976314 -23139643
38028 -23139643 -19211885 -15013903 -11393578 -8645657 -6574885 -5182736 -5065720 -6864790
38020 -6864790 -10384959 -14523424 -18062732 -20297095 -20969738 -20118767 -18275657 -16493147
38012 -16493147 -15792402 -16644636 -19092754 -23016602 -27914544 -32719062 -36367539 -38507933
38004 -38507933 -39261858 -38473912 -35781098 -31396998 -26175855 -20740838 -15141253 -9593307
37996 -9593307 -4874535 -1436040 1444911 4978672 9437993 13874292 17213500 19307936
37988 19307936 20962635 23208480 26511075 30476325 34339756 37739120 40704777 42816050
37980 42816050 42963449 40487400 36214468 31744269 27895932 24505842 21626583 20042476
37972 20042476 20251668 21498648 22250859 21401670 18857173 15386375 12258261 10673031
37964 10673031 10961861 12240224 13094937 12702278 11193185 8976971 5942693 1562434
37956 1562434 -4145984 -9969268 -14195065 -16096594 -16432280 -16280819 -15786614 -14530981 -12855194
37947 -12855194 -12096859 -13409157 -16822709 -21501471 -26345236 -30191682 -32081658 -31831864
37939 -31831864 -30130324 -27837611 -25434559 -23190117 -21286215 -19421311 -16787978 -12966677
37931 -12966677 -8554455 -4452111 -806315 2836737 6565117 9921182 12693019 15354517
37923 15354517 18519281 22164717 25408044 26907618 25735301 22317141 18487896 16142374
37915 16142374 15598220 15408469 13795890 10183069 5540858 1578080 -557480 -1260491
37907 -1260491 -2233547 -4902596 -8915221 -12376974 -13493192 -11699394 -7430733 -1553027
37899 -1553027 4704331 9890328 13069476 14377024 14577806 14223815 13496933 12655409 12150238
37890 12150238 12171638 12338597 12045425 11109268 10020161 9532015 9988665 11047070 12047275
37881 12047275 12552044 12423279 11467387 9247907 5375415 -20033 -6043498 -11210362
37873 -11210362 -14095677 -14215323 -12448541 -10505004 -9888007 -11243240 -14297815 -18027473
37865 -18027473 -21074392 -22577427 -22706504 -21979635 -20036960 -15706240 -8585194 -51563
37857 -51563 7712950 13289049 16189029 16056374 12717375 7147470 1613894 -1629978 -1623855
37848 -1623855 1334544 6473850 12919449 19566863 25104209 28393332 28913038 27003474
37840 27003474 23741054 20338812 17390691 14639913 11496602 7723132 3677289 146308
37832 146308 -1960641 -2060153 -374084 2080913 4203415 5499444 5972526 5555518 4062167
37823 4062167 1717889 -689877 -2433350 -3370560 -3639339 -3128269 -1686365 226830 1578675
37814 1578675 1619372 417937 -1588068 -4233791 -7476065 -10739253 -12774430 -12296332 -8756942
37805 -8756942 -2715203 4247954 10047784 12961384 12327813 8536471 2533808 -4446129
37797 -4446129 -10891355 -15390841 -17367859 -17220715 -15516739 -12321866 -7652735 -2324425
37789 -2324425 2222448 5026631 6163859 6142169 5205847 3499170 1505849 -173359 -1338339
37780 -1338339 -2002743 -1702184 462808 4799862 10369508 15722163 20149717 23902902
37772 23902902 27305182 30076215 31593397 31449397 29565338 26068896 21427490 16645863
37764 16645863 12998465 11331264 11536123 12653597 13534009 13595060 13107946 12774684 13039884
37755 13039884 13830033 14755881 15202526 14228081 10951234 5567510 -116518 -3587225 -3273608
37746 -3273608 582817 6336937 11921230 15705847 16993267 15965950 13171890 9187927
37738 9187927 4785026 887634 -2182414 -5170242 -8955333 -13237749 -16835441 -19328503
37730 -19328503 -21637663 -24672793 -28065390 -30650157 -31617386 -30682613 -27696187 -22924003
37722 -22924003 -17598206 -13504499 -11832942 -12585437 -14824570 -17061504 -17691541 -15887290
37714 -15887290 -12449436 -9523177 -9199800 -12218439 -17618632 -23263230 -26914660 -27397653
37706 -27397653 -24974964 -20585921 -14982653 -8836847 -3182851 1038083 3830393 5856884
37698 5856884 7260324 7503228 6570818 5531818 5370032 5805507 5886274 5350724 4649776
37689 4649776 3715764 1472092 -3093373 -9682717 -16793164 -22968972 -27800556 -31732651
37681 -31732651 -35061545 -37323618 -37783495 -36378322 -33892998 -31187684 -28555678 -25952500
37673 -25952500 -23529335 -21668618 -20690106 -20797561 -22154694 -24645423 -27520885 -29546095
37665 -29546095 -29668183 -27588926 -23813341 -19265645 -14756145 -10599627 -6653646 -2691970
37657 -2691970 1375934 5667834 10434099 15699265 20830554 24718166 26515895 26192251
37649 26192251 24395122 21847527 18830824 15172749 10747652 5974917 1681639 -1604251
37641 -1604251 -4083273 -6313109 -8598633 -10932787 -13319460 -15743126 -17784052 -18648947
37633 -18648947 -17862074 -15812556 -13401863 -11161242 -8867702 -6039094 -2614446 1024098
37625 1024098 4603340 8210397 11809236 14718822 15943031 15083955 12679021 9546801
37617 9546801 6068295 2315466 -1343640 -4170966 -5705363 -6317526 -6945787 -8179440
37609 -8179440 -9540794 -9720254 -7686731 -3679250 901486 4554627 6597515 7238095
37601 7238095 7129233 6977279 7307215 8341488 10103557 12603979 15712468 18862736 21294034
37592 21294034 22836681 24178268 26031540 28168188 29483148 28832605 25625773 19932773
37584 19932773 12477016 4420406 -3289655 -10456200 -17337536 -23911370 -29685829 -34124005
37576 -34124005 -36923334 -37922089 -37060489 -34473957 -30461786 -25525507 -20700179 -17514165
37568 -17514165 -16920715 -18159672 -19212557 -18613839 -16462573 -13557226 -10093868 -5653181
37560 -5653181 -198490 5372581 9703281 11855562 11785508 10087821 7308410 3612239
37552 3612239 -769229 -5027905 -8167129 -9873415 -10553331 -10469729 -9363429 -7094216 -4112212
37543 -4112212 -961489 2247117 5497062 8391043 10440609 11513804 11572451 10311545
37535 10311545 7643715 4364274 1728923 346743 -109221 -218507 -383963 -1014171 -2387543
37526 -2387543 -3995834 -4530145 -3054809 -124017 2542392 3493802 2625201 1053842 153779
37517 153779 607247 2098107 3709685 4574305 4294590 3073877 1670986 1058215 1748121
37508 1748121 3331257 4807797 5394334 4899732 3437191 1135482 -1712689 -4462981
37500 -4462981 -6380846 -7175595 -7258979 -7466478 -8434902 -10095024 -11711154 -12484403 -12223054
37491 -12223054 -11571705 -11725512 -13774915 -17852288 -22652824 -26154917 -27325561 -27090594
37483 -27090594 -27305887 -28885189 -31310610 -33765145 -35998831 -37875271 -38737324 -37778804
37475 -37778804 -34824855 -30441601 -25576287 -21422839 -19221148 -19451712 -21134676 -22397213
37467 -22397213 -21946237 -19828517 -16867565 -13841680 -11328928 -9787162 -9225639 -8914766
37459 -8914766 -7910916 -6032887 -4083198 -2945288 -2586335 -2056249 -329484 2986599
37451 2986599 7563866 12562878 16840654 19336697 19693118 18579449 17256988 16756645
37443 16756645 17453841 19211015 21604838 23976989 25569964 25904923 25094427 23772031
37435 23772031 22713071 22423404 22924692 23901162 25150655 26891272 29511301 33012660
37427 33012660 36795168 39933997 41522137 40866256 37744576 32673540 26746235 21026004
37419 21026004 16097568 12091637 8832041 5907229 2973801 216326 -1770142 -2774871
37411 -2774871 -3312261 -3807721 -3759539 -2310788 364770 2791292 3459994 1980569 -1139520
37402 -1139520 -5317874 -10035127 -14433185 -17416201 -18411988 -17871761 -16900259 -16474072 -17016450
37393 -17016450 -18446678 -20247668 -21334758 -20146187 -15409050 -7193622 2797094 12135068
37385 12135068 18899049 22131863 21590070 17627396 11334196 4242391 -2476280 -8395150
37377 -8395150 -13374996 -17137298 -19596987 -21235658 -22558313 -23238954 -22340571 -19492192
37369 -19492192 -15402245 -11034515 -6726643 -2452670 1420917 4171959 5442020 5526988
37361 5526988 4985382 4339333 4189606 5216182 7845096 12064485 17553792 23658676 29215846
37352 29215846 32981939 34690582 35393802 36251555 37067349 36434609 33266021 27745146 20827569
37343 20827569 13434034 6402394 689433 -2996432 -4736037 -5254464 -5249830 -5057170 -4850232
37334 -4850232 -4834986 -5176914 -5952197 -7235665 -9034716 -10989913 -12248882 -11865818 -9532301
37325 -9532301 -6064433 -3183300 -2621920 -5155788 -10265715 -16548692 -22346645 -26211478
37317 -26211478 -27396433 -26421169 -25024124 -24962710 -26480321 -28025445 -27621806 -24488832 -19375434
37308 -19375434 -13640347 -8318438 -3981994 -1040031 278163 364717 459587 2091706 6022687
37299 6022687 11656133 17499055 22199101 25212103 26778877 27617102 28599501 30232062
37291 30232062 32021102 32481260 30241584 25392472 19604201 14747755 11436053 8943022
37283 8943022 6317176 3304251 293056 -2213330 -3883416 -4629269 -4755485 -4962428 -5883614
37274 -5883614 -7557038 -9522629 -11399993 -13105625 -14504727 -15219389 -14949660 -13673928
37266 -13673928 -11315278 -7590624 -2687746 2064151 4845293 4979298 3689295 3030858
37258 3030858 4209986 7011067 10536074 14121460 17592382 21023929 24525560 28197032
37250 28197032 32083990 36038776 39618404 42187460 43185983 42350502 39796172 36066376
37242 36066376 32136382 29114216 27617249 27371488 27539456 27449626 26923254 26014681 24752597
37233 24752597 23241895 21760656 20511869 19368362 18094072 16857557 16368434 17332269
37225 17332269 19664137 22239518 23573135 22931664 20805090 18248809 15950944 14202947
37217 14202947 13559608 14818671 17991862 21776454 24662481 26457754 28213942 30681933
37209 30681933 33390288 35366301 36199009 36039595 35000152 33119849 30790683 28675400
37201 28675400 27059022 25549992 23508977 20582750 16817668 12541400 8271322 4550915
37193 4550915 1738492 66956 -58339 1921677 6177138 12032199 18185903 23375313
37185 23375313 26871438 28605080 29001130 28506312 27025500 23901360 18653563 11677895
37177 11677895 4103137 -2807663 -7867296 -9976650 -8700586 -5000073 -801770 2563993
37169 2563993 5228905 7892885 10524159 12423749 13284134 13544748 13664253 13534105 12760284
37160 12760284 11139488 8617253 5011682 57648 -6258799 -13411238 -20265519 -25368039
37152 -25368039 -27632841 -26961129 -24098729 -19827959 -14488834 -8409655 -2550887 1662027
37144 1662027 3284238 2583470 841437 -551154 -962476 -763294 -832845 -1701021 -2975681
37135 -2975681 -3532553 -2362993 596192 4377035 7732113 9997974 11246638 11776807
37127 11776807 11776401 11546778 11651069 12400173 13244704 13023852 10877236 6710311 863198
37118 863198 -6214027 -13778966 -20706471 -26051839 -29734173 -32471306 -35008552 -37441307
37110 -37441307 -39167510 -39376390 -37668431 -34353029 -30189533 -25891710 -21973743 -18915669
37102 -18915669 -17024426 -15922709 -14547417 -12114750 -9044682 -6624686 -5792993 -6535529
37094 -6535529 -8404374 -11142314 -14531421 -17904843 -20205343 -20601504 -18947702 -15709414
37086 -15709414 -11642591 -7567839 -4172588 -1675707 418987 3023317 6640911 10756508
37078 10756508 14114877 15648688 15191785 13519544 11924216 11564658 12690535 14221332
37070 14221332 14338028 11822859 6886319 790070 -4982336 -9116201 -10684818 -9696783
37062 -9696783 -7336433 -5041665 -3152619 -803346 2794250 7398060 12262495 17210849
37054 17210849 22781711 29425723 36841721 44080152 50136545 54511667 57387350 59300313
37046 59300313 60599194 61236742 61028974 59852633 57396737 52899175 45513625 35169819
37038 35169819 23102949 11508412 2561112 -2528596 -3856281 -2410914 726081 4908438
37030 4908438 9780915 14727496 18608139 20247551 19383306 17122829 15181297 14413496
37022 14413496 14179916 13365065 11894426 10886505 11269756 12605569 13452676 12651667 10111749
37013 10111749 6652132 3396412 1170956 136278 -90788 107035 715749 1935345
37005 1935345 3916306 6730115 10197003 13428291 14948905 13927296 11260433 8899182
36997 8899182 7970128 7900425 7344125 5431172 2050273 -2345166 -6704779 -9651292 -10494080
36988 -10494080 -9925304 -9268517 -9082889 -8878145 -8121785 -7062835 -6478784 -6982240 -8721201
36979 -8721201 -11458962 -14702734 -17817579 -20104566 -20821346 -19418295 -16122379 -12170063
36971 -12170063 -8934453 -6661196 -4472847 -1804639 642283 1775148 1584653 1217547
36963 1217547 1703944 3065007 4558047 5212384 4054814 494918 -4977460 -10694735
36955 -10694735 -14846086 -16666470 -16561936 -15384268 -13926138 -12865797 -12537064 -12488247 -11613090
36946 -11613090 -9043916 -4824934 411390 6166614 12150445 17775175 22035343 24089417
36938 24089417 23793553 21581056 18034867 13726830 9259755 5164708 1730187 -970139
36930 -970139 -2978993 -4533928 -6090252 -7937304 -9743463 -10730150 -10410098 -9028175 -7282864
36921 -7282864 -5847958 -5183468 -5431091 -6215863 -6776679 -6654537 -6257425 -6577035 -8410333
36912 -8410333 -11974063 -17038482 -23037376 -29054593 -34100918 -37636821 -39726350 -40627142
36904 -40627142 -40361999 -38713261 -35489519 -30814481 -25372113 -20368501 -16913185 -15201045
36896 -15201045 -14419183 -13584250 -12351875 -10957288 -9660150 -8545803 -7749035 -7528521 -8001615
36887 -8001615 -8884730 -9458786 -8695826 -5610064 49783 7159492 13452794 16896709 17240509
36878 17240509 16229190 16016992 17173385 18358190 18115215 16794053 16311112 17991330
36870 17991330 21072223 23566065 24229137 23254509 21237684 18109653 13387198 7183862
36862 7183862 603744 -4915069 -8565809 -10573778 -11824055 -13109245 -14527296 -15369492
36854 -15369492 -14569105 -11494584 -6566441 -1133388 3392735 6362781 7924046 8487527
36846 8487527 8453075 8342140 8678926 9448598 9959831 9614525 8734692 8349379 9184236 11046025
36836 11046025 13118553 14624487 15240596 15127708 14607049 13669904 11878128 9001693 5739646
36827 5739646 3480429 3154686 4427203 6088518 7132802 7442877 7614566 8218786 9129240
36818 9129240 9516365 8626007 6647176 4755838 4303838 6026614 9874067 15206150 20965110
36809 20965110 25921130 29106879 30133251 29139658 26620946 23366303 20286524 17959749
36801 17959749 16307463 14858489 13340128 11916891 10862624 10085982 9012250 6999559
36793 6999559 4040920 1098040 -503609 -253767 1028521 2005798 2036796 1427120 714656
36784 714656 161810 -41152 401373 1524361 2825630 3711035 4092363 4230526 4082403
36775 4082403 3173729 1135791 -1981183 -5988454 -10739552 -15806661 -20347992 -23708466
36767 -23708466 -25993532 -27676344 -28762999 -28805731 -27765382 -26387556 -25489589 -25141971 -24731071
36758 -24731071 -23581596 -21344123 -18047860 -14051850 -9780306 -5260606 -62512 6074478
36750 6074478 12693505 18940952 24309822 28825892 32641903 35736978 37876272 38494181
36742 38494181 36703461 31927380 24734161 16778390 9703258 4143176 -266914 -4157352
36734 -4157352 -7704858 -10348196 -11133111 -9563229 -6128217 -1709280 3508518 10009374
36726 10009374 17543784 24172351 27298158 25762280 20745172 14637717 9189302 4665085
36718 4665085 462105 -3765078 -7703888 -10953596 -13582827 -15781393 -17165739 -17003668
36710 -17003668 -15270797 -12991042 -11200337 -9917469 -8507568 -6767004 -5179081 -4278753
36702 -4278753 -4316971 -5561792 -8374362 -12705950 -17822648 -22834658 -27397349 -31662947
36694 -31662947 -35515510 -37965059 -37442136 -32931221 -25066378 -16129396 -8750056 -4381815
36686 -4381815 -2858375 -3134316 -4158456 -5104845 -5270835 -4281796 -2546269 -1303651 -1915133
36677 -1915133 -4882932 -9487807 -14405030 -18676123 -22080520 -24722841 -26568240 -27521120
36669 -27521120 -27747354 -27642178 -27484574 -27307807 -27153856 -27316582 -28202951 -29899324 -31867166
36660 -31867166 -33162271 -33134415 -31959875 -30324914 -28489996 -25827215 -21459849 -15315669
36652 -15315669 -8470542 -2547864 1186875 2434873 1954771 1108069 1125708 2662051 5841292
36643 5841292 10297013 14897741 17816085 17587888 14393526 10037571 6430318 4124475
36635 4124475 2289831 -191127 -3785955 -8201598 -12798051 -16991669 -20427834 -22954262
36627 -22954262 -24457126 -24626239 -22854715 -18586553 -12074610 -4802967 1206186 4782863
36619 4782863 6219198 6428786 5829768 4375315 2389807 742672 42301 56293 161305
36610 161305 127653 237134 762771 1524515 1922002 1343733 -340672 -2574706 -4448535
36601 -4448535 -5347793 -5346327 -5057136 -5163079 -5966644 -7178011 -8094558 -8069384 -6784976 -4077969
36591 -4077969 162284 5503483 10509349 13419696 13721672 12881308 13190027 15791445 19783756
36582 19783756 23046359 23859830 21981710 18483773 14658536 11043676 7396286 3327112
36574 3327112 -1351404 -6779415 -13006993 -19498551 -24972293 -28141207 -28659771 -27251864
36566 -27251864 -25051740 -22991028 -21675908 -21540097 -22964104 -26186110 -30938681 -36113373
36558 -36113373 -40050397 -41491381 -40295813 -37169398 -32889418 -28051105 -23408578 -19958722
36550 -19958722 -18408092 -18703682 -20290191 -22778934 -26191538 -30484100 -34899235 -37909016
36542 -37909016 -37962174 -34478277 -28239204 -20821124 -13568587 -7011384 -1152099 3843203
36534 3843203 7414124 9097533 9029579 7680050 5165460 1269322 -3663266 -8313218
36526 -8313218 -11439438 -13276204 -15391619 -19041163 -23954864 -28724057 -31924636 -32770273
36518 -32770273 -31248909 -28074674 -24242688 -20230806 -15773377 -10706618 -5824293 -2449976
36510 -2449976 -1117625 -926396 -242550 2045765 5771410 9641502 12140629 12561520 11311056
36501 11311056 9265428 6990097 4627857 2169550 -572865 -4098734 -8801086 -14225788
36493 -14225788 -18968121 -21480234 -21040960 -18178925 -14449688 -11688680 -11011419 -12245744
36485 -12245744 -14324686 -16153419 -16991265 -16286237 -13720290 -9618592 -4974850 -780188
36477 -780188 2587763 5202002 6953576 7230991 5247803 789008 -5173868 -10640483
36469 -10640483 -13631659 -13260524 -9815373 -4070876 3068786 10360797 16392793 20484965
36461 20484965 23233662 25810136 28831623 32173341 35666462 39453354 43481540 46948386
36453 46948386 48581787 47593736 44392221 40382903 37030472 34983927 33913603 32944079
36445 32944079 31141450 27885460 23292377 18431124 14745012 12880878 12113391 11069358
36437 11069358 8962171 6094962 3404516 1666429 865950 64499 -1865522 -4952176
36429 -4952176 -7688024 -8380214 -7034089 -5527296 -5818403 -8363979 -12425991 -17372025
36421 -17372025 -23097234 -29365608 -35415003 -40484651 -44396818 -47276979 -48790790 -47958644
36413 -47958644 -43858009 -36483222 -26971590 -17152913 -8874629 -3374724 -746973 209221
36405 209221 1289046 3543255 6475713 8711434 9479131 9241786 8854290 8454543 7484556
36396 7484556 5638693 3414810 1673935 900172 935000 1125031 514637 -1864911 -6459795
36387 -6459795 -12773141 -19584284 -25669441 -30307876 -33232164 -34442201 -34334501 -33923618
36379 -33923618 -34601605 -37387651 -42268850 -48195651 -53660472 -57309156 -58187872 -55753342
36371 -55753342 -50021353 -41882222 -33114863 -25727112 -20978686 -18921692 -18835046 -20038323
36363 -20038323 -22297672 -25587978 -29602227 -33517279 -36251070 -37072089 -36100861 -34230326
36355 -34230326 -32468608 -31261257 -30330192 -29042606 -26971473 -24338256 -22069624 -21265076
36347 -21265076 -22338044 -24608891 -26810273 -27999846 -28061665 -27657370 -27941568 -29994339 -33877448
36338 -33877448 -38077203 -40353037 -39559029 -36589720 -33460817 -31682706 -31593481 -32778661
36330 -32778661 -34588816 -36345557 -37577104 -38297946 -38921524 -39841260 -41165386 -42694927
36322 -42694927 -43852262 -43708443 -41562227 -37769806 -33814835 -31316851 -30933645 -32125095
36314 -32125095 -33687296 -34442026 -33777862 -31871379 -29300156 -26241389 -22162117 -16503653
36306 -16503653 -9587811 -2678057 2751837 5714351 6058750 4648070 3079578 2576452
36298 2576452 2854568 2441081 403218 -2494787 -4596872 -5006151 -4076010 -2561759 -926844
36289 -926844 439163 911501 -274 -2074797 -4393369 -5906014 -6000266 -4841426 -3453076
36280 -3453076 -3299402 -5336931 -9220446 -13465553 -16455026 -17363902 -16362311 -14257269
36272 -14257269 -11997845 -10219026 -8920444 -7512756 -5325830 -2243907 1057560 3492640
36264 3492640 4278323 3411623 1503847 -874359 -3678333 -7201400 -11472667 -15961646
36256 -15961646 -19852460 -22424598 -23124981 -21574194 -17881712 -12975017 -8291700 -4895871
36248 -4895871 -2919930 -1884317 -1301376 -694390 776814 4076142 9222999 14593524
36240 14593524 17726512 17064390 12888499 6636121 -402770 -7606959 -14623605 -20953655
36232 -20953655 -26037567 -29461552 -30899899 -30060743 -26974505 -22293547 -17014308 -11779251
36224 -11779251 -6637152 -1652451 2415738 4342474 3384227 -181694 -5417122 -11238084
36216 -11238084 -16398986 -19465742 -19567887 -17377214 -14884009 -13811195 -14327412 -15432214
36208 -15432214 -16334821 -17172649 -18576597 -20914125 -23913553 -26687995 -28120094 -27566071
36200 -27566071 -25273505 -21853034 -17351501 -11292184 -3796848 3858733 10331261 15632141
36192 15632141 20905389 26769026 32363042 36210397 37620608 36954569 34814686 31449464
36184 31449464 26962879 21718205 16294653 11182292 6739523 3412839 1704057 1670623
36176 1670623 2525477 3048052 2590156 1555608 730015 304083 -136814 -734475 -929293
36167 -929293 -129673 1495641 3216188 4576827 5727562 7033499 8744138 11052948
36159 11052948 14010512 17070228 18979778 18577236 15851286 12119602 9095341 7723610
36151 7723610 7733467 8087899 7824154 6594390 4548949 1859796 -1431658 -5009597 -7932743
36142 -7932743 -9003560 -7581494 -3914362 1313765 7475600 13832412 19089460 21641358
36134 21641358 20648334 16860076 12117232 7870301 4232108 532801 -3357146 -6479625
36126 -6479625 -7534806 -5974720 -2377976 1963734 5731708 8228982 9755766 11281775
36118 11281775 13448057 15885119 17695865 18459437 18369896 17430499 15083063 10966730 5705378
36109 5705378 517996 -3846413 -7483063 -10793648 -14025896 -17415294 -21350758 -26035778
36101 -26035778 -31045545 -35432531 -38314434 -39337057 -38694969 -36901242 -34538115 -32006585
36093 -32006585 -29344112 -26358540 -23087068 -20056966 -17879169 -16574942 -15541228 -14239079
36085 -14239079 -12611121 -10650814 -7943140 -4078496 673692 5638421 10655849 16166492
36077 16166492 22209045 27798322 31551364 32582344 30627176 25860550 19121601 12023788
36069 12023788 6242574 2622716 1159669 1608075 3744096 7218685 11567483 16280993
36061 16280993 20586407 23451560 24343509 23870203 23143536 22566178 21781783 20758982 20225807
36052 20225807 20839811 22502905 24755834 27336458 29985669 32054492 32683040 31316155
36044 31316155 28124886 24298902 21741230 21558830 22468078 21480569 16902517 10298176
36036 10298176 4961845 2868347 3659680 5988515 8769104 11237374 12905509 13892454
36028 13892454 14739962 15650081 16360547 16880264 17751544 19329977 21342193 23478845 25911966
36019 25911966 28752391 31347157 32656942 32228784 30421974 27779977 24587139 21110691
36011 21110691 18001084 16229591 16488485 18480844 20838048 22106227 22075674 21963477 23074499
36002 23074499 25446837 27994391 29708969 30375318 30321167 29982768 29735815 29650079 29148096
35993 29148096 27181672 23032385 16897096 9670675 2421442 -3778370 -7889147 -9328558
35985 -9328558 -8466927 -6384594 -3959281 -1367606 1393183 3784108 4952496 4716671
35977 4716671 3935149 3578752 3542651 2680647 80505 -3895679 -7944819 -11027723 -13054659
35968 -13054659 -14451293 -15342607 -15393816 -14411852 -12853540 -11545598 -10950984 -10878827 -10887840
35959 -10887840 -10686098 -9958395 -8072379 -4446398 607067 5634154 8902806 9593300
35951 9593300 8209902 6041451 4365200 3970646 5007495 7000969 9099041 10592107
35943 10592107 11330015 11497046 10836566 8268092 2638573 -6026262 -16223076 -25972998
35935 -25972998 -33806215 -38643369 -39341087 -35230610 -27245822 -17930593 -9923946 -4523777
35927 -4523777 -1662158 -740684 -1153118 -2362952 -3988197 -5829786 -7632810 -8940308
35919 -8940308 -9338784 -8634125 -6602404 -2925272 2194584 7583238 11811742 14366605
35911 14366605 15701925 16196375 15603062 13633374 10548165 6887805 2991841 -915969
35903 -915969 -4436894 -7061608 -8337816 -7839799 -5309726 -1105420 3753893 8263582
35895 8263582 11923172 14359226 14944013 13396971 10608779 8252867 7444210 8069864 9345192
35886 9345192 10565167 11303731 11417242 11110883 10718052 10281022 9633193 8941351 8693452
35877 8693452 8858452 8394655 5969578 1060205 -5828871 -13776855 -21950432 -29633304
35869 -29633304 -36114686 -40688177 -42796104 -42326383 -39788313 -35941744 -31161025 -25452555
35861 -25452555 -19189241 -13357963 -8740983 -5247445 -2501492 -698140 -177572 -320351
35853 -320351 273882 2212397 4440314 5264635 3899353 743971 -3491575 -8484268 -14169700
35844 -14169700 -20172177 -25413143 -28329827 -27761318 -23886684 -18293836 -12992837 -9186230
35836 -9186230 -6696179 -4343911 -1070661 2917821 6152146 7475054 7697525 9237983
35828 9237983 13871114 21092831 28781305 34995037 38861474 40260075 39379966 36690881
35820 36690881 33021063 29488894 27213122 26703656 27322697 27677632 26911842 25477590 24447561
35811 24447561 24338501 24840694 25294268 25009650 23542185 21335133 19860783 20269433 21731039
35802 21731039 21743834 18359668 11760587 3710295 -3763817 -8842718 -9995986 -6718029
35794 -6718029 -338189 6432444 11073861 12463333 10895265 7447120 3419620 -52386
35786 -52386 -2340371 -3465159 -3850768 -3860920 -3581836 -3088071 -2814476 -3419638 -5181661
35777 -5181661 -7728093 -10506024 -13270682 -15850841 -17724641 -18356747 -17913265 -17127435 -16400066
35768 -16400066 -15583228 -14821164 -14928852 -16351914 -18085021 -18283474 -16002993 -12017312 -8016610
35759 -8016610 -5389878 -4694548 -5696235 -7570525 -9328184 -10415931 -10936751 -11176079 -10971334
35750 -10971334 -9676476 -6735314 -2201629 3278048 8847521 13723387 17218084 18739654
35742 18739654 17951699 14939673 10192258 4510298 -996049 -5015750 -6519253 -5369097
35734 -5369097 -2467875 731630 2951258 3628024 3096385 2288443 2034994 2555799 3663844
35725 3663844 5267277 7299140 9171424 9792886 8455638 5543455 2197084 -554247
35717 -554247 -2261250 -3011961 -3200491 -3110470 -2467464 -649931 2306875 5094738 5924798
35708 5924798 3912147 -554820 -6531668 -12967894 -18422163 -21147383 -20221521 -16593526
35700 -16593526 -12556190 -9895133 -8513110 -6827549 -3404639 1856015 8047836 14476675
35692 14476675 21227862 28441181 35334699 40345674 42306236 41289351 38279815 34276535
35684 34276535 29883814 25576236 21975830 19640519 18606303 18280355 17874956 16921106
35676 16921106 15328000 13084105 10158258 6750239 3382839 517225 -1819180 -3784497
35668 -3784497 -5111539 -4993255 -2779072 1163912 5295147 7688784 7206393 4158522
35660 4158522 -43761 -3869333 -6391819 -7320273 -6709129 -4856164 -2385023 -217519
35652 -217519 695877 -151995 -2348944 -4597613 -5642989 -5452172 -5302735 -6484258 -9053246
35643 -9053246 -12033699 -14597924 -16726563 -18860092 -21304414 -24020256 -26734523 -29211358
35635 -29211358 -31566653 -34239467 -37415265 -40519414 -42528872 -42788096 -41354794 -38665312
35627 -38665312 -35136266 -30969826 -25945456 -19425665 -11048235 -1585158 7266590 14219512
35619 14219512 19320966 23392341 26804466 29050279 29358016 27471628 23904556 19660094
35611 19660094 15754616 12911743 11567246 11891099 13527993 15421495 16341539 15840588
35603 15840588 14582571 13704647 14061911 16023090 19439861 23409174 26345841 26824196
35595 26824196 24530073 20369736 15808322 12177398 10198714 9595738 9129528 7505503
35587 7505503 4612708 1816170 835647 2233523 4924397 7096251 7667994 7010782 6360934
35578 6360934 6538981 7184754 7130245 5437427 2193673 -1429277 -3799025 -3764355 -1355859
35569 -1355859 2239833 5387444 6868670 6485182 5234672 4815083 6408811 9621685
35561 9621685 12818849 14704452 15362802 15610921 15742895 15364632 14241731 12755904 11503855
35552 11503855 10879905 11095858 12126720 13407362 13956700 13167549 11371357 9440501 7980437
35543 7980437 7081550 6650723 6651590 7045305 7776710 8886566 10443320 12281716 13958648
35534 13958648 15052760 15358254 14648117 12394834 8024640 1556595 -6162926 -14014103
35526 -14014103 -21361836 -28184616 -34518150 -39934006 -43641651 -45082816 -44453762 -42715152
35518 -42715152 -41023635 -39919048 -38893738 -36825358 -33044033 -28127890 -23678638 -21270991
35510 -21270991 -21532404 -24082217 -28092626 -32633449 -36498179 -38222014 -36953328 -33473005
35502 -33473005 -29885447 -27873866 -27338058 -26873270 -25231249 -21963943 -17077899 -10896951
35494 -10896951 -4362007 1230035 5149321 7541333 8670307 8403739 6804606 4711099
35486 4711099 3084124 1925112 331085 -2428755 -6255963 -10537501 -14698179 -18422358
35478 -18422358 -21654287 -24439761 -26575619 -27469416 -26598385 -24128019 -20962734 -18288246
35470 -18288246 -17119253 -17884712 -20012176 -22150429 -23374701 -24198898 -25989393 -29381745
35462 -29381745 -33629414 -37353145 -39335988 -38659363 -35008761 -29436706 -24313782 -21726931
35454 -21726931 -21714539 -22172037 -20430157 -15063920 -6789536 1904267 8225879 10723292
35446 10723292 9717475 6269321 1132354 -5072677 -11204192 -15943013 -18987350 -21521365
35438 -21521365 -25213849 -30737090 -37168558 -42651669 -45707497 -46207480 -45247779 -44073668
35430 -44073668 -43164275 -42375003 -41703181 -41541027 -42161324 -43293789 -44411053 -45265155 -45919320
35421 -45919320 -46308195 -46019028 -44629336 -42107015 -38654203 -34213757 -28492687 -21678687
35413 -21678687 -14838419 -9217215 -5283620 -2895158 -2277680 -4131569 -8498959 -14125090
35405 -14125090 -19481280 -24131427 -28617148 -33218284 -37319106 -39855992 -39910791 -37013085
35397 -37013085 -31514256 -24801532 -18608105 -13796291 -10035630 -6724966 -3815169 -1532540
35389 -1532540 280868 2118790 4197456 6124902 7114754 6438156 3891334 88728
35381 88728 -3733971 -6361677 -7109300 -5861718 -2972962 714366 4047536 6133079 6804525
35372 6804525 6527858 6016194 5979701 6906404 8731071 10776244 12253286 12862753 12946587
35363 12946587 13331446 15118474 19136110 25049318 31143499 35516203 37562258 37986040
35355 37986040 37487026 36017146 33445272 30330219 27573943 25566521 24007027 22365244
35347 22365244 20252150 17616484 14997393 13420118 13524603 14695027 15397831 14572906
35339 14572906 12597972 10899077 10743569 12232187 14033219 14026287 10674073 4211713 -3470884
35330 -3470884 -10225166 -14968910 -17861417 -19622348 -20852521 -21691647 -21826136 -20954330 -19399516
35321 -19399516 -18002021 -17133442 -16107567 -14038936 -11153742 -8695212 -7459256 -6954703
35313 -6954703 -6276337 -5405232 -5251353 -6570284 -9120483 -11786118 -13349672 -13337888 -12397345
35304 -12397345 -11758487 -12108485 -13070235 -13924597 -14551596 -15249640 -15821135 -15490444 -13932765
35295 -13932765 -11914706 -10560409 -10222816 -10356145 -10256944 -9566783 -8208680 -6313779 -4325747
35286 -4325747 -2857979 -2245411 -2349106 -2850936 -3545255 -4249148 -4670352 -4618253 -4249880
35277 -4249880 -3854866 -3405578 -2562363 -1198762 297461 1428078 2180491 3003917 4147625
35268 4147625 5136233 5006382 3175520 277707 -1751402 -689397 4319269 11755080
35260 11755080 18447848 21631512 20597095 16641915 11718474 7178648 3457403 516363
35252 516363 -1564976 -2398305 -1740882 -185596 832098 20971 -2766852 -6623738 -10425388
$$ [...]
##END NTUPLES=NMR SPECTRUM
##END=
