##TITLE=31Pdec_DE-20H2K3_HCl
 D2O 
  24 sc
 30.10.2023
##JCAMPDX= 6.0         $$ Bruker NMR JCAMP-DX V2.0
##DATA TYPE= NMR SPECTRUM
##DATA CLASS= NTUPLES
##ORIGIN= UXNMR, Bruker Analytische Messtechnik GmbH
##OWNER= root
$$ XWIN-NMR		Version 3.5
$$ Mon Oct 30 16:23:51 2023 Russian Standard Time (UT+4h)  she@DPX200
##.OBSERVE FREQUENCY= 81.013821
##.OBSERVE NUCLEUS= ^31P
##.ACQUISITION MODE= SIMULTANEOUS
##.ACQUISITION SCHEME= undefined
##.AVERAGES= 24
##.DIGITISER RES= 16
##SPECTROMETER/DATA SYSTEM= spect
##.PULSE SEQUENCE= zgpg30
##.SOLVENT NAME= CDCl3
##.SHIFT REFERENCE= (INTERNAL, CDCl3, 0, 248.564)
##AUDIT TRAIL= $$ (NUMBER, WHEN, WHO, WHERE, WHAT)
$$ ##TITLE= Audit trail, XWIN-NMR		Version 3.5
$$ ##JCAMPDX= 5.01
$$ ##ORIGIN= Bruker BioSpin GmbH
$$ ##OWNER= she
$$ F:/spectra/data/she/nmr/P31/1/pdata/1/auditp.txt
$$ ##AUDIT TRAIL=  $$ (NUMBER, WHEN, WHO, WHERE, WHAT)
(   1,<2023-10-30 16:22:56.15 +0400>,<she>,<DPX200>,
      <created by zg, POWCHK disabled, PULCHK disabled
       configuration hash MD5:
       00 E9 B6 7A A2 85 ED C7 34 08 36 98 17 FE 4E 26
       data hash MD5: 32K
       75 00 86 FD 62 55 B4 40 D8 A6 5D CD 95 8C BE 4D>)
(   2,<2023-10-30 16:22:58.62 +0400>,<she>,<DPX200>,
      <Start of raw data processing
       efp BC_mod = 2 LB = 5 FT_mod = 6 PKNL = 1 PHC0 = -10730.68 PHC1 = 206.89 SI = 64K 
       data hash MD5: 64K
       EC FF 34 D1 9E 0E F2 D5 8E FE C6 6B 09 D3 24 57>)
(   3,<2023-10-30 16:23:10.78 +0400>,<she>,<DPX200>,
      <pk PHC0 = 1.164559 PHC1 = 0 
       data hash MD5: 64K
       15 09 F3 A2 B3 1D F4 8E 84 EF 67 78 FB F8 6F E1>)
$$ ##END=
$$ 
$$ hash MD5
$$ A7 2A BA B5 21 72 7F 71 7B A1 CF E1 E3 27 DF 51
##$RELAX= 
##$RELAX= 
##$RELAX= 
##$RELAX= 
##$RELAX= 
##$RELAX= 
##$RELAX= 
##$RELAX= 
##$RELAX= 
$$ Bruker specific parameters
$$ --------------------------
##$DU= <F:/spectra>
##$EXPNO= 1
##$NAME= <P31>
##$PROCNO= 1
##$TYPE= <nmr>
##$USER= <she>
##$AMP= (0..31)
100 100 100 100 100 100 100 100 100 100 100 100 100 100 100 100 100 100 
100 100 100 100 100 100 100 100 100 100 100 100 100 100 
##$AQSEQ= 0
##$AQ_mod= 1
##$AUNM= <au_zg>
##$AUTOPOS= <>
##$BF1= 81.014009
##$BF2= 200.13
##$BF3= 200.13
##$BF4= 200.13
##$BF5= 200.13
##$BF6= 200.13
##$BF7= 200.13
##$BF8= 200.13
##$BYTORDA= 1
##$CFDGTYP= 0
##$CFRGTYP= 5
##$CHEMSTR= <none>
##$CNST= (0..31)
1 1 145 1 1 1 1 1 1 1 1 1 1 1 1 1 1 1 1 1 1 1 1 1 1 1 1 1 1 1 1 1 
##$CPDPRG= <waltz16>
##$CPDPRG1= <>
##$CPDPRG2= <waltz16>
##$CPDPRG3= <>
##$CPDPRG4= <mlev>
##$CPDPRG5= <mlev>
##$CPDPRG6= <mlev>
##$CPDPRG7= <mlev>
##$CPDPRG8= <mlev>
##$CPDPRGB= <>
##$CPDPRGT= <>
##$D= (0..31)
0 1 0 0 0 0 0 0 0 0 0 0.03 2e-05 3e-06 0 0 0 0 0 0 0 0 0 0 0 0 0 0 0 0 
0 0 
##$DATE= 1698668575
##$DBL= (0..7)
120 120 120 11 120 120 24 19 
##$DBP= (0..7)
150 150 150 150 150 150 150 150 
##$DBP07= 0
##$DBPNAM0= <>
##$DBPNAM1= <>
##$DBPNAM2= <>
##$DBPNAM3= <>
##$DBPNAM4= <>
##$DBPNAM5= <>
##$DBPNAM6= <>
##$DBPNAM7= <>
##$DBPOAL= (0..7)
0.5 0.5 0.5 0.5 0.5 0.5 0.5 0.5 
##$DBPOFFS= (0..7)
$$ [...]
##$SUBNAM2= <"">
##$SUBNAM3= <"">
##$SUBNAM4= <"">
##$SUBNAM5= <"">
##$SUBNAM6= <"">
##$SUBNAM7= <"">
##$SUBNAM8= <"">
##$SUBNAM9= <"">
##$SW= 501.771253377433
##$SWIBOX= (0..15)
0 1 3 0 0 0 0 0 0 0 0 0 0 0 0 0 
##$SW_h= 40650.406504065
##$TD= 32768
##$TD0= 1
##$TE= 0
##$TE2= 300
##$TE3= 300
##$TEG= 300
##$TL= (0..7)
0 120 53 12 22 120 120 120 
##$TP= (0..7)
150 150 150 150 150 150 150 150 
##$TP07= 0
##$TPNAME0= <>
##$TPNAME1= <>
##$TPNAME2= <>
##$TPNAME3= <>
##$TPNAME4= <>
##$TPNAME5= <>
##$TPNAME6= <>
##$TPNAME7= <>
##$TPOAL= (0..7)
0.5 0.5 0.5 0.5 0.5 0.5 0.5 0.5 
##$TPOFFS= (0..7)
0 0 0 0 0 0 0 0 
##$TUNHIN= 0
##$TUNHOUT= 0
##$TUNXOUT= 0
##$USERA1= <user>
##$USERA2= <user>
##$USERA3= <user>
##$USERA4= <user>
##$USERA5= <user>
##$V9= 5
##$VALIST= <valist>
##$VCLIST= <CCCCCCCCCCCCCCC>
##$VD= 0
##$VDLIST= <DDDDDDDDDDDDDDD>
##$VPLIST= <PPPPPPPPPPPPPPP>
##$VTLIST= <TTTTTTTTTTTTTTT>
##$WBST= 1024
##$WBSW= 4
##$XGAIN= (0..3)
0 0 0 0 
##$XL= 0
##$YL= 0
##$YMAX_a= 1856
##$YMIN_a= -1716
##$ZGOPTNS= <>
##$ZL1= 120
##$ZL2= 120
##$ZL3= 120
##$ZL4= 120
##$ABSF1= 0
##$ABSF2= 0
##$ABSG= 0
##$ABSL= 0
##$ALPHA= 0
##$AQORDER= 0
##$ASSFAC= 0
##$ASSFACI= 0
##$ASSFACX= 0
##$ASSWID= 0
##$AUNMP= <proc_1d>
##$AZFE= 0.1
##$AZFW= 0.5
##$BCFW= 0
##$BC_mod= 2
##$BYTORDP= 0
##$COROFFS= 0
##$CY= -3
##$DATMOD= 1
##$DC= 0
##$DFILT= <>
##$DTYPP= 0
##$F1P= 0
##$F2P= 0
##$FCOR= 1
##$FTSIZE= 65536
##$FT_mod= 6
##$GAMMA= 0
##$GB= 0
##$INTBC= 1
##$INTSCL= 6.047779e-11
##$ISEN= 30
##$LB= 5
##$LEV0= 0
##$LPBIN= 0
##$MAXI= 10000
##$MC2= 0
##$MEAN= 0
##$ME_mod= 0
##$MI= 50
##$NCOEF= 0
##$NC_proc= -8
##$NLEV= 6
##$NOISF1= 182.463
##$NOISF2= 159.3651
##$NSP= 0
##$NTH_PI= 0
##$NZP= 0
##$OFFSET= 248.5645
##$PC= 4
##$PHC0= -10729.51
##$PHC1= 206.89
##$PH_mod= 1
##$PKNL= yes
##$PPARMOD= 0
##$PSCAL= 0
##$PSIGN= 0
##$REVERSE= no
##$SF= 81.0140089999694
##$SI= 65536
##$SIGF1= 159.3651
##$SIGF2= -187.1042
##$SINO= 113.3802
##$SIOLD= 16384
##$SREGLST= <1H.CDCl3>
##$SSB= 0
##$STSI= 65536
##$STSR= 0
##$SW_p= 40650.406504065
##$SYMM= 0
##$S_DEV= 0
##$TDeff= 32768
##$TDoff= 0
##$TI= <>
##$TILT= no
##$TM1= 0
##$TM2= 0
##$TOPLEV= 0
##$USERP1= <user>
##$USERP2= <user>
##$USERP3= <user>
##$USERP4= <user>
##$USERP5= <user>
##$WDW= 1
##$XDIM= 65536
##$YMAX_p= 320848073
##$YMIN_p= -31280272
$$ End of Bruker specific parameters
$$ ---------------------------------
##NTUPLES= NMR SPECTRUM
##VAR_NAME=  FREQUENCY,     SPECTRUM/REAL,   SPECTRUM/IMAG
##SYMBOL=    X,             R,               I
##VAR_TYPE=  INDEPENDENT,   DEPENDENT,       DEPENDENT
##VAR_FORM=  AFFN,          ASDF,            ASDF
##VAR_DIM=   65536,         65536,           65536
##UNITS=     HZ,            ARBITRARY UNITS, ARBITRARY UNITS
##FACTOR=    0.620285442955139, 1,           1
##FIRST=     20137.2065510682, 0,            0
##LAST=      -20513.1999529968, 0,           0
##MIN=       -20513.1999529968, -31280272,   0
##MAX=       20137.2065510682, 320848073,    0
$$ Real data points
##PAGE= N=1
##DATA TABLE= (X++(R..R)), XYDATA
$$ [...]
42044a205775M68566M21236L31025K37302J46435K7855j24996k70475l78927m73225
42034h20979n74359o49228o63092o50821o68763o84854n85395l09155P4149M37930
42024e094567P04095Q45281Q30571O37069L20732K4939j22664j21427q6040j17673
42014b179684k03401k58669k47804k13694j76881o4950J94794N31553P54269P42913
42004a121554N68501L93121K93514K27382J40709M2698k6751m7290j7104N2818
41994E06044J15933J04451J3518n5317M303J59222K54236J94730N9867l072M5445
41983A399360J17047J20078M0431r0920k39210l56031l85455l14868j89143n5490
41973D5799O7979J49237J20973m4340k59521l72720k97920q3421J28141J92348
$$ y = [-1205775, -737209, -315973, 15052, 252354, 398789, 426644, 301648, 31173, -347754, -820979, -1395338, -2044566, -2707658, -3358479, -4027242, -4712096, -5297491, -5606646, -5532497, -5094567, -4390472, -3545191, -2714620, -2077551, -1756819, -1731880, -1854544, -1975971, -2062011, -2179684, -2383085, -2641754, -2889558, -3103252, -3280133, -3345083, -3150289, -2618736, -1864467, -1121554, -553053, -159932, 133582, 360964, 501673, 544371, 517620, 470330, 453226, 506044, 621977, 726428, 739946, 684629, 688932, 848154, 1102390, 1297120, 1356987, 1353915, 1399360, 1516407, 1636485, 1676916, 1585996, 1346786, 990755, 605300, 290432, 101289, 45799, 113778, 263015, 383988, 339648, 80127, -292593, -590513, -673934, -545793, -353445]
41963c53445N9009j73884l21515k78698j24071k5939n6531j35346j37979j0217
41953a558616K18231M75808O90630Q27252Q91628Q77056P25169L94885l3723l86414
41943C121906n42793n15086l81192k05748m4322M9810P5725J00640J83456L10221
41933B152617M25061M77545M16882K09998p7933k80148k82562j50547l7362m547
41923B849004j2211n1896j77829l96188o18873p58016p94056p27570n47398k90703
41913a525736n7119J03074K57724M75542O81680P19730N52637L26708K18912K69465
41903B022617L76473M10475L19865J65858P5620J28721K68260L50952L03601J99867
41893D622309J57774J93815K20004J65792M9308p6932j99090l28957m48225n11154
$$ y = [-353445, -294436, -468320, -789835, -1068533, -1192604, -1218543, -1275074, -1410420, -1548399, -1558616, -1340385, -864577, -173947, 653305, 1544933, 2421989, 3147158, 3542043, 3508320, 3121906, 2579113, 2064027, 1682835, 1477087, 1432765, 1482575, 1558300, 1658940, 1842396, 2152617, 2577678, 3055223, 3472105, 3682103, 3604170, 3324022, 3041460, 2890913, 2853551, 2849004, 2836793, 2784897, 2607068, 2210880, 1592007, 833991, 39935, -687635, -1235033, -1525736, -1582855, -1479781, -1222057, -746515, -64835, 654895, 1207532, 1534240, 1753152, 2022617, 2399090, 2809565, 3129430, 3295288, 3370908, 3499629, 3767889, 4118841, 4422442, 4622309, 4780083, 4973898, 5193902, 5359694, 5409002, 5332070, 5132980, 4804023, 4355798, 3844644]
41883C844644n04839m74063m67042m69795m15183k58310k8177K02328L83947N11627
41873B325137N84806N76436M59339K50601J1214j93720l23578l68292l57722l65016
41863B599205m66450o76956r35461j157128j279655j257929j059820p10669l27962
41854e272825o6590r985j17835k69018l40227k63628n5130J91927L58922L75083
41844e469306K59049J03350J4022L5147J13541J57811J48549J59365K42607L39173
41834c896692L62469L42083L95657N48205O63976O00304L71429J15603n1737j02278
41824f50981n6341N1707J77748K83539L47072L38608K20069J3456j57064j57672
41814D10141J0112J95489K36271Q7390j70793m00853m81331l69403j33383Q8537
$$ y = [3844644, 3339805, 2865742, 2398700, 1928905, 1513722, 1255412, 1227235, 1429563, 1813510, 2325137, 2909943, 3486379, 3945718, 4196319, 4207533, 4013813, 3690235, 3321943, 2964221, 2599205, 2132755, 1455799, 520338, -636790, -1916445, -3174374, -4234194, -4944863, -5272825, -5339415, -5349400, -5467235, -5736253, -6076480, -6340108, -6395238, -6203311, -5844389, -5469306, -5210257, -5106907, -5092885, -5057738, -4944197, -4786386, -4637837, -4478472, -4235865, -3896692, -3534223, -3192140, -2796483, -2248278, -1584302, -983998, -612569, -496966, -548703, -650981, -707322, -655615, -477867, -194328, 152744, 491352, 711421, 724877, 567813, 410141, 420253, 615742, 852013, 939403, 768610, 367757, -113574, -482977, -616360, -527823]
41804e27823J86952J47947L1316j03003k44786m14519n93624o88757o04631l61982
41794c172910r6922Q4394K00866L04469L54843K73020R0782n8788j12434j46771
41784b279451k43907l64361m03800l20972j57928K6352J92300L15870L90345M17358
41774b428194L76378K35907K2394j57085j98045q5516J16584L18980M23087L44205
41764a031305Q7761k16176m05269m02570k22928P8670L95746N54058M22795P1432
41754f67786k54448l53138k32790n4461L7041O443r2726j83800k24638k25404
41744b245707k09460j62506m2425J62072M06700O22269P47971P52624O66165N78030
41734A275733N48143N21280L95531J86506M6866Q3775K21641K98867K47003J10176
$$ y = [-527823, -340871, -192924, -161608, -264611, -509397, -923916, -1517540, -2206297, -2810928, -3172910, -3269832, -3185438, -2984572, -2680103, -2325260, -2052240, -1961458, -2020246, -2132680, -2279451, -2523358, -2887719, -3291519, -3612491, -3770419, -3744067, -3551767, -3235897, -2845552, -2428194, -2051816, -1815909, -1793515, -1950600, -2148645, -2234161, -2117577, -1798597, -1375510, -1031305, -943544, -1159720, -1564989, -1967559, -2190487, -2111817, -1716071, -1162013, -739218, -667786, -922234, -1275372, -1508162, -1562623, -1525582, -1519139, -1611865, -1795665, -2020303, -2245707, -2455167, -2617673, -2660098, -2498026, -2091326, -1469057, -721086, 31538, 697703, 1275733, 1823876, 2345156, 2740687, 2927193, 2974059, 3057834, 3279475, 3578342, 3825345, 3935521]
41724C935521o7677k86254n23567p01651p43374o32885m17993j85370k6986J5007
41714C64771j7030m3766l4963k4205m6043r6052j51699j90842j84463j16670k6595
41703e67557J5782L490K3085J52203L51934N03605N40107M97909M38937L63626
41693B323121K22560q334k86919n29896o60704o40836m84289k59479o1226M9723
41683c36279Q7943J08599J29471J13879M3781k3829j1156Q3901J84809K27572
41673F08691K19040K01827J96300J85445J27102k3609k67516n25741o88197p15501
41663f82159o59600n69295m21209j76192J35074M24284O16467O73180N79360L61693
41653B81603J07668q0791j54010j19371j6134P5251M6363j37651l63937m74519
$$ y = [3935521, 3867844, 3581590, 3058023, 2356372, 1612998, 980113, 562120, 376750, 349764, 364771, 347741, 303975, 269012, 244807, 198764, 102712, -48987, -239829, -424292, -540962, -567557, -551775, -548285, -525200, -372997, -21063, 482542, 1022649, 1520558, 1959495, 2323121, 2545681, 2537347, 2250428, 1720532, 1059828, 418992, -65297, -324776, -386002, -336279, -248336, -139737, -10266, 103613, 147394, 123565, 112409, 196310, 381119, 608691, 827731, 1029558, 1225858, 1411303, 1538405, 1514796, 1247280, 721539, 33342, -682159, -1341759, -1911054, -2332263, -2508455, -2373381, -1949097, -1332630, -659450, -80090, 281603, 389271, 308480, 154470, 35099, 18965, 94216, 140579, 2928, -361009, -835528]
41643h35528m40484l63933l14022k52149j33403J6003J61716L09703M34179M41680
41633i76238K86223N6015j38948l08833n13181o89472o75431m10074j5651L38263
41623c047327N69929O70919O53284N61547M69706M07708L26822J76092k1718j99615
41613E67347l10765l32272k50466q7644Q7998K21018L12330L72641L72435K90199
41603A242821J80895J31455J51536J61562R6557j7156r6859q7354p362O6103O4184
41592A886382l369n7442n0003k7141n3935j09649j23483r9558j24455k35831l59846
41581F41670m13720m06438l95778m06140m43112n29829o49060o87834n38599k56424
41571d085264k9271L0072n661M542J17784L08815N40972P56801Q50214P51457
$$ y = [-835528, -1276012, -1639945, -1953967, -2206116, -2339519, -2323516, -2161800, -1852097, -1417918, -976238, -690015, -634000, -772948, -1081781, -1594962, -2284434, -2959865, -3369939, -3385590, -3047327, -2477398, -1806479, -1153195, -591648, -121942, 285766, 612588, 788680, 766962, 567347, 256582, -75690, -326156, -413800, -325802, -104784, 207546, 580187, 952622, 1242821, 1423716, 1555171, 1706707, 1868269, 1964826, 1947670, 1850811, 1763457, 1756095, 1822198, 1886382, 1883013, 1825571, 1775568, 1748427, 1694492, 1584843, 1461360, 1361802, 1237347, 1001516, 641670, 227950, -178488, -574266, -980406, -1423518, -1953347, -2602407, -3290241, -3828840, -4085264, -4114535, -4084463, -4090124, -4085582, -3967798, -3658983, -3118011, -2361210, -1510996, -759539]
41561g59539N39617L86884L69354L96250L48558K21445Q9179r535q6270j43553
41551A352390j81300k50446m13253o25224p30700o33945m35748l35108m02904
41542b656238n08972m83610l01897p8845P9916J69139K31892K75378K76669K46259
41532b750309K36694K81965L65258M61804N78049P18331Q41681Q98328Q98764
41523B530565Q94539Q81237P70348M89311Q3009l11069n69333o45894n65959m02389
41513C154365k48825j69506j59765j71156j70113j49103r4521N157J02378Q8200
41503B187111j03543l95250o07283o18564m75039l30037k84883k98112k48066
41494a173666p1616J66559L34356L50097K44168J20232O1819O6788O7296J9687
$$ y = [-759539, -219922, 166962, 536316, 932566, 1281124, 1502569, 1591748, 1582213, 1495943, 1352390, 1171090, 920644, 507391, -117833, -848533, -1482478, -1918226, -2253334, -2656238, -3165210, -3648820, -3950717, -4029562, -3949646, -3780507, -3548615, -3273237, -2996568, -2750309, -2513615, -2231650, -1866392, -1404588, -826539, -108208, 733473, 1631801, 2530565, 3425104, 4306341, 5076689, 5566000, 5649009, 5337940, 4768607, 4122713, 3556754, 3154365, 2905540, 2736034, 2576269, 2405113, 2235000, 2085897, 1991376, 1996533, 2098911, 2187111, 2083568, 1688318, 1081035, 462471, -12568, -342605, -627488, -925600, -1173666, -1245282, -1078723, -744367, -394270, -150102, -29870, 31949, 98737, 166033, 185720]
41484A85720l0102Q122J54199L19260M05001M16284M38779N18410O07594O33376
41474C656643N73169M42862K47434j9524l39227o57679r08385j031852r91096
41465I72345q02107n51641l54911k74089k82054l10239l18838l07753k73388j90704
41455b693379n8924N4540N5699p5718k49351l45272l15763j89251o55K33324M66964
41444c117786O05617N75635M08682K33318J73962K50875L64009L76667K41836
41435A12815O0053r087Q7855K35634K70081J44676m0317j49576j14244O2556L33508
41424I93954N99928P12810N52209J43416l20077o03287o00749l89019j24340Q4382
41414A049227J96310J86000M5767j46150k30407j08442J32976K95470K77280J68324
$$ y = [185720, 155618, 163740, 317939, 637199, 1042200, 1458484, 1897263, 2415673, 3023267, 3656643, 4229812, 4672674, 4920108, 4900584, 4561357, 3903678, 2995293, 1963441, 972345, 170238, -381403, -736314, -1010403, -1292457, -1602696, -1921534, -2229287, -2502675, -2693379, -2752303, -2697763, -2642064, -2717782, -2967133, -3312405, -3628168, -3817419, -3818074, -3584750, -3117786, -2512169, -1936534, -1527852, -1294534, -1120572, -869697, -505688, -129021, 112815, 172868, 163781, 251636, 487270, 757351, 902027, 861710, 712134, 597890, 660446, 993954, 1593882, 2306692, 2858901, 3002317, 2682240, 2078953, 1478204, 1089185, 964845, 1049227, 1245537, 1431537, 1477304, 1331154, 1100747, 992305, 1125281, 1420751, 1698031, 1866355]
41404A866355J26383K01813L15945L80839L87965L75262L51998K91770J88879
41395D487209Q1717n253j26658l77898p62166j115260j211109r68292n41945j97252
41385g36907r3234j83387k95319k80055j00917J72990M28360N77130O02943N60520
41375F52124N20498M95678M19152K12449j13202m35636o19308o31162n47620m59381
41365e06408l99617l63692l50879l52934l33924k76702k46023l44621n72239p63969
41355d511008p20144m00931L3728L74444N23852N14338M21925L08851K31297K41402
41345b982246L43775M61730M77612L27163O3566j69515k38968j17893J03309K97890
41335a433577L96266M04886L52525K45523Q3722j00744k44627k97138k55289j55386
$$ y = [1866355, 1992738, 2194551, 2510496, 2891335, 3279300, 3654562, 4006560, 4298330, 4487209, 4568926, 4563673, 4437015, 4059117, 3296951, 2181691, 970582, 2290, -539655, -736907, -830141, -1013528, -1308847, -1588902, -1689819, -1516829, -1088469, -511339, 91604, 652124, 1172622, 1668300, 2087452, 2299901, 2186699, 1751063, 1131755, 500593, -47027, -506408, -906025, -1269717, -1620596, -1973530, -2307454, -2584156, -2830179, -3174800, -3747039, -4511008, -5231152, -5632083, -5598355, -5223911, -4700059, -4185721, -3763796, -3454945, -3223648, -2982246, -2638471, -2176741, -1699129, -1371966, -1308400, -1477915, -1716883, -1834776, -1731467, -1433577, -1037311, -632425, -279900, -34377, 49345, -51399, -296026, -593164, -848453, -1003839]
41325a003839l5096Q9491K02809K51594J57802j00335m31400o92830q12343q12227
41315c186374p16747n02463j75133J66532M11909N50525O36211O68844N97612
41306a549084M31666K47622O8408j63786m45151o33739n96468l75297j29592L9678
41296c105743J30766J60131J51527J85447L38836N53182O59808N74583L94082
41287D2619K66334K39477K77022L47536M37106N18606N59053N23674L51496j230
41277C561693m44964p63598q20915p06374n89532m86357k88780K957K21327K34230
41267h0313R0810q6969k63275m66212o68946p71362o84873m04117k8141K69549
41257c093849L55558K73824K20723L26841N07128N92068N61660N53536O49595
$$ y = [-1003839, -1038935, -949444, -746635, -495041, -337239, -437574, -868974, -1561804, -2374147, -3186374, -3903121, -4405584, -4580717, -4414185, -4002276, -3451751, -2815540, -2146696, -1549084, -1117418, -869796, -801388, -965174, -1410325, -2044064, -2640532, -3015829, -3145421, -3105743, -2974977, -2814846, -2663319, -2477872, -2139036, -1585854, -926046, -351463, 42619, 308953, 548430, 825452, 1172988, 1610094, 2128700, 2687753, 3211427, 3562923, 3561693, 3116729, 2353131, 1532216, 825842, 236310, -250047, -538827, -535870, -314543, -80313, 10497, -76472, -339747, -805959, -1474905, -2246267, -2931140, -3335257, -3363398, -3093849, -2738291, -2464467, -2243744, -1916903, -1409775, -817707, -256047, 297489, 947084]
41248I47084P57063P36443N75367L82804K50759J75953J07590K8129l0400l7565
41238C893227j3339j0379m7449q5588q9310q6006j24973j88948j99104j23007
41228B925124l3980l1214j25663k38568l00403l17440l39418l89413m37691m30367
41218B80967l36336j83134o0459o8253k24141m15590m76000l31008n4639K27508
41208a641085M51322O01064O39071N36401L65524K65280K77507K95133K20429
41199B010646R9668K7674j8325j45691l69445n69261o32258n58840m13224k47079
41189h16135j02462k4719k7450p7232j33222j64707j21759N0408L32834O11211
41179d73233P66982P61804O20666L88023J34715m7281j17664j34378j85443k90765
$$ y = [947084, 1704147, 2440590, 3015957, 3398761, 3649520, 3825473, 3933063, 3961192, 3930792, 3893227, 3879888, 3869509, 3822060, 3736472, 3647162, 3561156, 3436183, 3247235, 3048131, 2925124, 2891144, 2859930, 2734267, 2495699, 2195296, 1877856, 1538438, 1149025, 711334, 280967, -55369, -238503, -298962, -367215, -591356, -1006946, -1482946, -1813954, -1868593, -1641085, -1189763, -588699, 50372, 586773, 952297, 1217577, 1495084, 1790217, 2010646, 2110314, 2137988, 2119663, 1973972, 1604527, 1035266, 403008, -155832, -569056, -816135, -918597, -943316, -970766, -1047998, -1181220, -1345927, -1467686, -1417278, -1084444, -473233, 293749, 1055553, 1676219, 2064242, 2198957, 2151676, 2034012, 1899634, 1714191, 1423426]
41169A423426l98786m50485m11665k73547p0698J12031J87170J20719n9307k70747
41159i1889l81369k75005K1635L16200M24919L56356K70692K82433L66537M32836
41149A723345M06230K37441o4716l74016n02435l86201j82618j21409k65467m56146
41139A4008m93873l44884j61782j13643k10126l02203k50144o4142J31884K38343
41129a556562K44351J85106R9351L3732L5042J13708K39451L75198M80050M81002
41119G30429L00128n5622m57545p30149p52876n07693r4174K79283L93609J90535
41109g04075j57506l93507l93965k25774k4983J17267J57654P8841p4919j79123
41099a800090j23304O2780K34276L13793L93739N88530Q17954Q44829N56204J10547
$$ y = [1423426, 1024640, 574155, 162490, -111057, -181755, -69724, 117446, 238165, 178858, -91889, -473258, -748263, -726628, -410428, 14491, 370847, 641539, 923972, 1290509, 1723345, 2129575, 2367016, 2302300, 1928284, 1425849, 1039648, 857030, 735621, 470154, 14008, -479865, -824749, -986531, -1100174, -1310300, -1612503, -1862647, -1926789, -1794905, -1556562, -1312211, -1127105, -1027754, -994022, -958980, -845272, -605821, -230623, 249427, 730429, 1030557, 974935, 517390, -212759, -965635, -1473328, -1567502, -1288219, -894610, -704075, -861581, -1255088, -1649053, -1874827, -1899810, -1782543, -1624889, -1546048, -1620967, -1800090, -1923394, -1860614, -1626338, -1312545, -918806, -330276, 487678, 1332507, 1888711, 1999258]
41089A999258k58719m99579o97442q39095p79550m69240q5314J35998J26131j2248
41079a379800j57572k49026k55402j47890Q2834M01996P09074Q44555O88736L04195
41069H41700o5620j98721p7760J51936L47999M38765L89169K05126l1606k15449
41059A785539l19171l91303m53729m65114l94792k73750j56611q4273r5768k14911
41049a063883l90757m97724m41957k55362o3682K4675o021q0227q9488J8806J81320
41038b664300K63730J92517L8293m7238K2959J91143L14342L04305K13663J76668
41028i93918K61035M00934M90733N06759M91763M49394L27116J08662j40944l39794
41018A561740m42179m13823k32669L4249K19954K07695P2615L319Q6634K32724
$$ y = [1999258, 1740539, 1240960, 543518, -295577, -1075127, -1544367, -1629681, -1493683, -1367552, -1379800, -1537372, -1786398, -2041800, -2189690, -2106856, -1704860, -995786, -151231, 537505, 841700, 776080, 577359, 499599, 651535, 999534, 1438299, 1827468, 2032594, 2000988, 1785539, 1466368, 1075065, 621336, 156222, -238570, -512320, -668931, -753204, -848972, -1063883, -1454640, -1952364, -2394321, -2649683, -2713365, -2688690, -2694711, -2774938, -2864426, -2845620, -2664300, -2400570, -2208053, -2169760, -2216998, -2194039, -2002896, -1688554, -1384249, -1170586, -993918, -732883, -331949, 158784, 665543, 1157306, 1606700, 1933816, 2042478, 1901534, 1561740, 1119561, 705738, 473069, 507318, 727272, 934967, 1007582, 1010901, 1097535, 1330259]
41008A330259L13513K99967K30121J08336q9030l23104m79400m73899l36770j61846
40998D18147k632J38423K37797K41194J53706P9354J08724J95369K14858J44583
40988A929523J10512K24606M31068N61685N14878L36324J41417O987n7211p1994
40978D127795n4374j6938J6168J4878j8696k9447L9122J60935K22737J26544j13620
40967D475104l86418n74484o19461n28198l54141j70763l5271L3501M1084o393
40957A874560r9417k09332k93556l16883k62792j36356K7182J60254J87312O7047
40947I98019j75801m51554o49384p04079o28380m76819k93676j15906n94N945
40937b492229o8098j35985j47662j27747j07405p1602J752J03976K29208L89719
$$ y = [1330259, 1643772, 1943739, 2173860, 2282196, 2193166, 1870062, 1390662, 916763, 579993, 418147, 415515, 553938, 791735, 1032929, 1186635, 1265989, 1374713, 1570082, 1784940, 1929523, 2040035, 2264641, 2695709, 3257394, 3772272, 4108596, 4250013, 4257000, 4199789, 4127795, 4073421, 4056483, 4072651, 4087529, 4068833, 4039386, 4078508, 4239443, 4462180, 4588724, 4475104, 4088686, 3514202, 2894741, 2366543, 2012402, 1841639, 1806368, 1839869, 1880953, 1874560, 1775143, 1565811, 1272255, 955372, 692580, 556224, 583406, 743660, 930972, 998019, 822218, 370664, -278720, -982799, -1611179, -2087998, -2381674, -2497580, -2498174, -2492229, -2560327, -2696312, -2843974, -2971721, -3079126, -3150728, -3148976, -3045000, -2815792, -2426073]
40927b426073N55911O42178O12694N44514N09445M47853K64653K0134r8066r39
40917A072304K16450M35952O40097Q17213Q59157O67486L12872j2149j87291k42139
40907D579952k58694k73536k80867k66529k15087j20522n917R3182J70870K48077
40897C670929L19082L27701K17297J620k18208l11327k14757j824J46071O1525
40887C998109k85813p60377j138275j238637j037151o78520l48723j12276J01316
40878a500347L44054N42746N92358N05572L92796L12896K26009J00389j6635p3074
40868A426764r9107j63792k66652l17210k28185j8461J75799K06481O1874r0644
40858F86867m9783K16674N39164P15728O73418M65388J85057p3033k29271k71138
$$ y = [-2426073, -1870162, -1227984, -615290, -70776, 438669, 886522, 1151175, 1171309, 1073243, 1072304, 1288754, 1724706, 2364803, 3182016, 4041173, 4708659, 5021531, 5009382, 4822091, 4579952, 4321258, 4047722, 3766855, 3500326, 3285239, 3164717, 3158800, 3251982, 3422852, 3670929, 3990011, 4317712, 4535009, 4536629, 4318421, 4007094, 3792337, 3790513, 3936584, 3998109, 3712296, 2951919, 1813644, 575007, -462144, -1140664, -1489387, -1601663, -1500347, -1156293, -613547, -21189, 484383, 877179, 1190075, 1416084, 1516473, 1499838, 1426764, 1327657, 1163865, 897213, 580003, 351818, 333357, 509156, 715637, 777511, 686867, 637084, 853758, 1392922, 2108650, 2782068, 3247456, 3432513, 3359480, 3130209, 2859071]
40848B859071k70647k94470l13252k54178j27467l4268m4679j27372k14107k78338
40838I00293l23949l42738l20178k56837j56613j9444J26988K15808K02658J31816
40828A57804J05929J81904L09711L70347K63408k4469m00222p02704p89304o21239
40818a148835k82274Q4650L69238N42260O33146O71965O57703N77266M36767K59407
40808B801293O2293j43709l32581m63331n08065m67754l62288k23777r7038j9871
40798B45172K542j8054q7262k02544k88392k21676L1124L41060N34348N60469
40788H96787M97854M26929L72191L57504M23382N50575O30175N62680L57399J00549
40778E176025j40679l43320m90901n65100n70805n33493m74998m16473l89094
$$ y = [2859071, 2588424, 2293954, 1980702, 1726524, 1599057, 1564789, 1520110, 1392738, 1178631, 900293, 576344, 233606, -86572, -343409, -500022, -519466, -392478, -176670, 25988, 157804, 263733, 445637, 755348, 1125695, 1389103, 1364634, 964412, 261708, -527596, -1148835, -1431109, -1346459, -977221, -434961, 198185, 870150, 1527853, 2105119, 2541886, 2801293, 2863586, 2719877, 2387296, 1923965, 1415900, 948146, 585858, 362081, 265043, 245172, 247714, 229660, 142398, -60146, -348538, -570214, -539090, -198030, 336318, 896787, 1394641, 1821570, 2193761, 2551265, 2974647, 3525222, 4155397, 4718077, 5075476, 5176025, 5035346, 4692026, 4201125, 3636025, 3065220, 2531727, 2056729, 1640256, 1251162]
40769A251162m03320m13981l57027k27091q7210K807L5852L1833N027j9417R495
40758a71870J25524K91050M13892M26096L39243K26550J59822J57224J78366J67516
40748B313413J04328R510r4106k03650l08889l70019l56948l02532k77070k97723
40738B16314k93390j81330L8815K86025M75397N69145N61364M46740K22050q3596
40728B257534l81763n41455m75639k42971l2645Q813o8766r4960j1902M3326o9320
40717C90252k83424l84500k51280L4851L11254M81581N18634L97229J00253l11519
40707A003331o79972q31450p01680l99663j37396o0592j33892k00755j41117N7131
40697b226055L50908O83951R55103J025106Q32518M88049K00434J01772J63131
$$ y = [1251162, 847842, 433861, 76834, -150257, -237467, -234660, -198808, -166975, -161948, -181365, -171870, -46346, 244704, 658596, 1084692, 1423935, 1650485, 1810307, 1967531, 2145897, 2313413, 2417741, 2427251, 2333145, 2129495, 1820606, 1450587, 1093639, 791107, 514037, 216314, -77076, -258406, -219591, 66434, 541831, 1110976, 1672340, 2119080, 2341130, 2257534, 1875771, 1334316, 858677, 615706, 583061, 591874, 523108, 428148, 416246, 459572, 390252, 106828, -277672, -528952, -494101, -182847, 298734, 817368, 1214597, 1314850, 1003331, 323359, -508091, -1209771, -1609434, -1746830, -1807422, -1941314, -2142069, -2283186, -2226055, -1875147, -1191196, -236093, 789013, 1621531, 2109580, 2310014, 2411786, 2574917]
40688B574917K61777K96825K48428J60946Q1483J0745p8541j78642k37202k27047
40678B913689j87774j67023j57753j40800j60190k90179n24567p48099q30297
40669b92993p22142m69493j71855P5923K46001L87635N39637O39163N71314L18868
40659A122058Q940k12219l06456l22405k95034k10190m5974J86526M33665O12368
40649I71279O53641N56220L84183J99798J9355j56796l05525l93618l99194l02947
40639A226396j01502J35423K65678J94882j4705k01250k59305k00467q4484M2754
40629A003420J45014K04368K61261L85363N62478O53827N24133J95877j65532
40620C770209m07784m92299m55441l38105j83945o0791k6856p4622j39904j71867
$$ y = [2574917, 2836694, 3133519, 3381947, 3542893, 3624376, 3635121, 3556580, 3377938, 3140736, 2913689, 2725915, 2558892, 2401139, 2260339, 2100149, 1809970, 1285403, 537304, -292993, -1015135, -1484628, -1656483, -1580560, -1334559, -946924, -407287, 231876, 803190, 1122058, 1130998, 918779, 612323, 289918, -5116, -215306, -261280, -74754, 358911, 971279, 1624920, 2181140, 2565323, 2765121, 2784476, 2627680, 2322155, 1928537, 1529343, 1226396, 1124894, 1260317, 1525995, 1720877, 1706172, 1504922, 1245617, 1045150, 960666, 1003420, 1148434, 1352802, 1614063, 1999426, 2561904, 3215731, 3739864, 3935741, 3770209, 3362425, 2870126, 2414685, 2076580, 1892635, 1831844, 1804988, 1730366, 1590462, 1418595]
40610A418595j73144j70463j73098j69490j38649n1022J10037K95561L83240K73392
40600A604959K583k68307l90031l36011j94600r4193j31310l05634m87437m94296
40590a094277k56700J01225L75811M59403L76423J92791l0770k03950k25254r4527
40580c99825M1772K5245j45392l29425m19788m41892m58587m41930l10398p9253
40570b959473J05700J25261L4922J710J07100K64725L36009K76341J49038M3099
40560a515568J4199P2583J76867K43741K04400O6373r0329j77395j57697o5944
40550a228770R472j1468j22280k21786k10748q8919O4231J81570K41397K28983
40540a158318J29136k7604j58996j98333j42146j9126J51667L46947N14439N97730
$$ y = [1418595, 1245451, 1074988, 901890, 732400, 593751, 542729, 652766, 948327, 1331567, 1604959, 1607542, 1339235, 949204, 613193, 418593, 324400, 193090, -112544, -599981, -1094277, -1350977, -1249752, -873941, -414538, -38115, 154676, 123906, -80044, -305298, -399825, -358053, -332808, -478200, -807625, -1227413, -1669305, -2127892, -2569822, -2880220, -2959473, -2853773, -2728512, -2693590, -2691880, -2584780, -2320055, -1984046, -1707705, -1558667, -1515568, -1501369, -1428786, -1251919, -1008178, -803778, -737405, -827734, -1005129, -1162826, -1228770, -1219298, -1230766, -1353046, -1574832, -1785580, -1874499, -1810268, -1628698, -1387301, -1158318, -1029182, -1056786, -1215782, -1414115, -1556261, -1575387, -1423720, -1076773, -562334, 35396]
40530C5396N77310M68582K96884J01537m7221p4932L0209J81383K40497J22086
40520A931731j34401l98730n67640o44684o92994p26130o80402m99363k15979
40511b628592O1836K30143K51995J69703O6626j198m1409q0580j00597o4907n486
40500b142466j9791j51703l25993m39152m70101m54541l94546k63485q3019P2475
40490d672322J52159J63591J38135J11367J27383J94955K30164J13355j59488
40481c600701m27033n00329l25180K933L34861N52240O17255O00398O30586P60837
40471a354133Q98794R17546Q11631O78728N59486L81004Q6576k51121n02290o22020
40461A604201o55885o23269m68525j53319K44638N62840O78510N90584L95485
$$ y = [35396, 612706, 1081288, 1378172, 1479709, 1432488, 1357556, 1387765, 1569148, 1809645, 1931731, 1797330, 1398600, 830960, 186276, -506718, -1232848, -1913250, -2412613, -2628592, -2566756, -2336613, -2084618, -1914915, -1848289, -1849487, -1890896, -1971476, -2072073, -2136980, -2142466, -2162257, -2313960, -2639953, -3079105, -3549206, -4003747, -4398293, -4661778, -4744797, -4672322, -4520163, -4356572, -4218437, -4107070, -3979687, -3784732, -3554568, -3441213, -3600701, -4027734, -4528063, -4853243, -4850310, -4515449, -3963209, -3345954, -2745556, -2114970, -1354133, -455339, 462207, 1273838, 1952566, 2512052, 2893056, 2979632, 2728511, 2226221, 1604201, 948316, 325047, -143478, -296797, -52159, 510681, 1189191, 1779775, 2175260]
40452B175260K06327Q9597M5945K5907k9430j37204k48439k85486k17383r4638
40442A530456k531R869n3879j64937k73933l02338j96976k6342L2435j27972l92143
40431C1709n10993l55161l5416K30450L07354J82797r2887m17957o25864n68441
40421a854409k56310J23230L57324L64191K10563K5638q5031r2550o0675r2337
40411a360366k21644l60167l72753k06983N8228K74631L22279J75130q9606l44700
40401b125951m95691n15019m01116j47751K06173N26744O56042N53428L28367
40392a414774J19480k1913j16157j75715j83998j25353O944K15805M71358O89286
40382e35037P87810P69523P01540O08177M39973J79997p1891j81696j28131j0306
$$ y = [2175260, 2381587, 2471184, 2517129, 2543036, 2513606, 2376402, 2127963, 1842477, 1625094, 1530456, 1527925, 1537794, 1483915, 1318978, 1045045, 742707, 545731, 519389, 551824, 423852, 31709, -479284, -834445, -869861, -639411, -332057, -149260, -242147, -660104, -1285968, -1854409, -2110719, -1987489, -1630165, -1265974, -1055411, -1029773, -1114804, -1207354, -1268029, -1360366, -1582010, -1942177, -2314930, -2521913, -2463685, -2189054, -1866775, -1691645, -1781251, -2125951, -2621642, -3136661, -3537777, -3685528, -3479355, -2952611, -2296569, -1743141, -1414774, -1295294, -1317207, -1433364, -1609079, -1793077, -1918430, -1911486, -1695681, -1224323, -535037, 252773, 1022296, 1723836, 2332013, 2771986, 2951983, 2880092, 2698396, 2570265, 2559959]
40372B559959P8473J14679P8419p9904l36363n17222m36136j19465J86781K71396
40362A800617J62941M0972r23l2647j50182l37075m82489m92718l64966j82978
40352c9448n7958m3605q2627n2856J11164L48039N28891N71352M85713L35384
40342B104049J84044P3125J4698r821l0705n8136p5070o8919o4475j10446k21300
40331A737044l35366l50577k18958J647K05145L33410L86406L51442J88702p6260
40321B222635k95126l04005r2089J79806L31656K97446J17018j29308l38409l97817
40311A591807k65460m0253J03146P5449n3772j51833j63257j37948j45747j94648
40301F17484k31871k05742j21314m1721l2395r4206j50024j04175P7918L39188
$$ y = [2559959, 2638432, 2753111, 2831530, 2751626, 2415263, 1898041, 1461905, 1342440, 1529221, 1800617, 1963558, 2004530, 2003607, 1970960, 1820778, 1483703, 1001214, 508496, 143530, -39448, -97406, -141011, -223638, -276494, -165330, 182709, 711600, 1282952, 1768665, 2104049, 2288093, 2361218, 2375916, 2366095, 2335390, 2277254, 2202184, 2133265, 2068790, 1958344, 1737044, 1401678, 1051101, 832143, 833790, 1038935, 1372345, 1758751, 2110193, 2298895, 2222635, 1927509, 1623504, 1531415, 1711221, 2042877, 2340323, 2457341, 2328033, 1989624, 1591807, 1326347, 1286094, 1389240, 1464689, 1410917, 1259084, 1095827, 957879, 812132, 617484, 385613, 179871, 58557, 16836, -15559, -109765, -259789, -363964, -286046, 53142]
40291E3142N66780O61902O03252M66442L69998L72278M14959L84049K27041p626
40281D112217k39112m22853n39923n64089m83867l42380k17940j68045k10195
40272I23813l27661m47789m43004k38219O3705K37164J58739p1700k67982l48029
40262g60963l27759k03011L6827K92062L83869K54518N0090n7202o6484j05714
40252e03767k43574m18976n32330n36061m40781k90948j40105j0704J20040K64434
40242b732772L77043M14268M23069M98874O46666P50382P06695N39095L55197
40233A978517K39999K18066K65905L14450K79161J42570j2110r1483r5190q7458
40223C152427r0640o5166R166Q5997R7838J4603j43738l15013m15710m00502l14467
$$ y = [53142, 619922, 1281824, 1885076, 2351518, 2721516, 3093794, 3508753, 3892802, 4119843, 4112217, 3873105, 3450252, 2910329, 2346240, 1862373, 1519993, 1302053, 1134008, 923813, 596152, 148363, -294641, -532860, -469155, -231991, -73252, -144952, -412934, -760963, -1088722, -1291733, -1254906, -962844, -578975, -324457, -274367, -331569, -398053, -503767, -747341, -1166317, -1698647, -2234708, -2675489, -2966437, -3106542, -3117246, -2997206, -2732772, -2355729, -1941461, -1518392, -1019518, -372852, 377530, 1084225, 1623320, 1978517, 2218516, 2436582, 2702487, 3016937, 3296098, 3438668, 3426558, 3335075, 3239885, 3152427, 3061787, 2996621, 3005787, 3091784, 3189622, 3204225, 3060487, 2745474, 2329764, 1929262, 1614795]
40212A614795k49577k40913k47866k43573k54842k72456j88054R0861M75146P25460
40202A208981O76165L82593L3838k21239l31391l01264j84852j07611j99235m55652
40192E00333p09857p84083o53210m33969k46724j31461p2381l5526L0929J80067
40182b355882M16465O84035R16872J076964J134882J058641Q57475O09732M05215
40173D804399K63922J36876j8003j79931k78347k50310r9632Q8284K08555K25526
40163D901339J78035R5267m0128k19134l61693m08263m08655m38307m59057l64106
40153B475298j53978M4038J55311K45114L70329M44045L41413Q1910j88213l63198
40143C452069m42834m56570m17389l50266k78722j67078M5129L22963N22803N44118
$$ y = [1614795, 1365218, 1124305, 876439, 632866, 378024, 105568, -82486, 8375, 483521, 1208981, 1885146, 2267739, 2301577, 2080338, 1748947, 1447683, 1262831, 1155220, 955985, 500333, -209524, -993607, -1646817, -2080786, -2327510, -2458971, -2531352, -2566878, -2535949, -2355882, -1939417, -1255382, -338510, 738454, 1873336, 2931977, 3789452, 4399184, 4804399, 5068321, 5205197, 5187194, 5007263, 4728916, 4478606, 4378974, 4467258, 4675813, 4901339, 5079374, 5174641, 5134513, 4915379, 4553686, 4145423, 3736768, 3298461, 2839404, 2475298, 2321320, 2365358, 2520669, 2765783, 3136112, 3580157, 3921570, 4003480, 3815267, 3452069, 3009235, 2552665, 2135276, 1785010, 1506288, 1339210, 1384339, 1707302, 2230105, 2774223]
40133B774223M39735L26827K38149J24064l7170k17937m25617p12899j055089
40124A454286j282661j221883q97047n21492k63973q0099J79438N35143Q25680
40115a272608Q88003P26131M76765K59168R9422l3941j73550l22633m39157m56762
40105b49162l60551k36044j94963k43754k72050j92708n0894M1417M6052K2148
40095a690509K1732K3107r404m6845k8230L7239M9175q0463l23764n55188o58750
40084c261900o00583m17191j73827N6041K02624K26067J43047K7600k2964M9877
40074c771209K11063L47829L70671L00250K29245K03625J82464J22311N2638L7605
40064a713508R6899J97981L00085L69606L73208K98808J80440P4820J7682J7631
$$ y = [2774223, 3213958, 3540785, 3778934, 3902998, 3865828, 3647891, 3222274, 2509375, 1454286, 171625, -1050258, -1947305, -2468797, -2732770, -2812869, -2633431, -2098288, -1272608, -384605, 341526, 818291, 1077459, 1176881, 1142940, 969390, 646757, 207600, -249162, -609713, -845757, -1040720, -1284474, -1556524, -1749232, -1800126, -1758709, -1712657, -1690509, -1668777, -1645670, -1655074, -1701919, -1730149, -1692910, -1643735, -1724198, -2047962, -2603150, -3261900, -3862483, -4279674, -4453501, -4397460, -4194836, -3968769, -3825722, -3798122, -3821086, -3771209, -3560146, -3212317, -2841646, -2541396, -2312151, -2108526, -1926062, -1803751, -1751113, -1713508, -1616609, -1418628, -1118543, -748937, -375729, -76921, 103519, 178339, 196021, 213652]
40054B13652O7445J29827J36728N0490q0062j62724j55485q4162J4989J17248
40044B47946J80608J58372N6157p6881k31350m49580p10611q55770p07437k68088
40034b656634K43780N71870O18895M72048K73399R5340o5928k11260k88446k32893
40024a179829m7445J71752K92856K40193N0250j53921k61132k57865k04615j32199
40014a481955q910J66342K99633L02884K32886K45543M01937N88108O47779N37394
40004A931641L29673J25617j954l1334n850O126n678J0734O6255Q4158J0385q1934
39992B437839p2586M9938J88284K75066L28638L63876L30527J82613l7089k22161
39982C824945k92321k41819j26913k6186Q268j9667p7573j58673k80216m23762
$$ y = [213652, 281097, 410924, 547652, 598142, 518080, 355356, 199871, 115709, 130698, 247946, 428554, 586926, 643083, 566202, 334852, -114728, -825339, -1681109, -2388546, -2656634, -2412854, -1840984, -1222089, -750041, -476642, -381302, -447230, -658490, -946936, -1179829, -1227274, -1055522, -762666, -522473, -472223, -626144, -887276, -1145141, -1349756, -1481955, -1490865, -1324523, -1024890, -722006, -489120, -243577, 158360, 746468, 1394247, 1931641, 2261314, 2386931, 2384977, 2353643, 2347793, 2353919, 2348241, 2358975, 2425230, 2509388, 2519773, 2437839, 2365253, 2415191, 2603475, 2878541, 3207179, 3571055, 3901582, 4084195, 4047106, 3824945, 3532624, 3290805, 3163892, 3137706, 3145974, 3126307, 3048734, 2890061, 2609845, 2186083]
39972B186083n15126m87510l44551j48242K9862J34195J42115Q8627M7861N4805
39962A188119O6065L2619j6758j9067J3065j306q1950j39943j03356l2276m3552
39951H61660j53732k67263l07588k87405k44947j87028j27133j18941k02666l49809
39941a384852m94427n84687n74290m15654j22046J95936M24505N66959P12810
39932a675746Q97352J052481J092023R80516P15503L19157j19949m55442n80613
39923B225282m97958k83114k1523K07712L43012L74301L33776K32797N4359j62851
39913B805793k88599k10448L5822K82791L70050K57302L8717j27799j43882o1248
39903B958499k6726j18692k75563l97739m49823m24537k95055r1772M0054j7854
$$ y = [2186083, 1670957, 1183447, 838896, 690654, 720516, 854711, 996826, 1085453, 1133314, 1188119, 1254184, 1286803, 1270045, 1250978, 1264043, 1262737, 1180787, 1040844, 937488, 905212, 861660, 707928, 440665, 133077, -154328, -399275, -586303, -713436, -832377, -1035043, -1384852, -1879279, -2463966, -3038256, -3453910, -3575956, -3380020, -2955515, -2388556, -1675746, -778394, 274087, 1366110, 2346626, 3062129, 3381286, 3261337, 2805895, 2225282, 1727324, 1444210, 1422687, 1630399, 1973411, 2347712, 2681488, 2914285, 2968644, 2805793, 2517194, 2306746, 2342568, 2625359, 2995409, 3252711, 3291428, 3163629, 3019747, 2958499, 2931773, 2813081, 2537518, 2139779, 1689956, 1265419, 970364, 878592, 918646, 900792]
39893I00792j75922k17841p9380N8687j270k34411m39668m70627l56933k18940
39883a235513j19967k1069J32830L05420L80180K93181J17493k2541q7521j21447
39873c78954j49695j59489j67335k08117k40185j58385M9105K33699K43927J05877
39863h29552j1499K2701K06176M51289O56805P38015O49651M09734R0136k21511
39853B161945m54501n77009o06616n86074n37660m58276l59527k71770j90124
39844a879612n9660J50902L93022N92041P26751Q13357Q38278P63713N93979L87238
39834C320009J96804L7351q9872j78675k36396k90526l61955m47750n32881n97986
39824H18123o14740n61470m54225l41405k56611j94135j39256r9223q5325q2272
$$ y = [900792, 724870, 507029, 427649, 486336, 485066, 250655, -189013, -659640, -1016573, -1235513, -1355480, -1376549, -1243719, -938299, -558119, -264938, -147445, -169986, -257507, -378954, -528649, -688138, -855473, -1063590, -1303775, -1462160, -1413055, -1179356, -935429, -829552, -841051, -818350, -612174, -160885, 495920, 1233935, 1883586, 2293320, 2383456, 2161945, 1707444, 1130435, 523819, -62255, -599915, -1058191, -1417718, -1689488, -1879612, -1939272, -1788370, -1395348, -803307, -76556, 736801, 1575079, 2338792, 2932771, 3320009, 3516813, 3554164, 3464292, 3285617, 3049221, 2758695, 2396740, 1948990, 1416109, 818123, 203383, -358087, -812312, -1153717, -1410328, -1604463, -1743719, -1842942, -1928267, -2010539]
39814b010539o1873j8774L7076J22016K70273M57019N65434M92984L00200J97164
39804C50980L35396O31363Q34751P65012M52105O0331k74238n14516o70575p20589
39794A250020o04443l09828M0818K36539J57180j08337l60815m84487m90441m01125
39784a074919j98680Q2226L03398L39798K11063M7585l9870j3562J22681L38772
39774A18492N73756P68645R02660R67752R31013P67541N14420K45002r2k11509
39764E577680l52588l58187k03237N9373L27652M88838M53046K14701j08054l50871
39754E748353m50970m91545n87509p59585r32474j015423r57338p57544m66988
39745f71023j73681M5402J71510K41882L04276L74210M26975M27332L72558L02513
$$ y = [-2010539, -2072412, -2091186, -2054110, -1932094, -1661821, -1204802, -639368, -146384, 153816, 350980, 686376, 1317739, 2152490, 2917502, 3369607, 3429938, 3155700, 2641184, 1970609, 1250020, 645577, 335749, 376567, 613106, 770286, 661949, 301134, -183353, -673794, -1074919, -1273599, -1191373, -887975, -548177, -337114, -289529, -329399, -342961, -220280, 118492, 692248, 1460893, 2363553, 3331305, 4262318, 5029859, 5544279, 5789281, 5789189, 5577680, 5225092, 4866905, 4663668, 4723041, 5050693, 5539531, 5992577, 6207278, 6099224, 5748353, 5297383, 4805838, 4218329, 3458744, 2526270, 1510847, 553509, -204035, -671023, -844704, -799302, -627792, -385910, -81634, 292576, 719551, 1146883, 1519441, 1821954]
39735A821954K56218K25430J71453Q5300O077k3869O154R5548K52600M57910O20921
39724C975696O21298M21436J22320j21092k42719l02451l76866m49449m46382
39715C201791l60917k82807k88162l48757l83350l61345l11833k57229j94715
39706D12676j37674j16416j16888o1873J06525L35288M82624M45160K55554M1463
39696A646439j10840k29122l77489n40113o34999o31416n79424n03456l47657
39687b308077q1733K08592M17096N50846O69533P27392O07706L33927J22744J56159
39677A404185L72076N46106N29998L51964J32078k5903q0424o2153m8443r2231
39667C027253j73595k36437k50531k12666j20305P651J01110Q3325m9286k24499
$$ y = [1821954, 2078172, 2303602, 2475055, 2560355, 2566432, 2542563, 2548717, 2644265, 2896865, 3354775, 3975696, 4596994, 5018430, 5140750, 5019658, 4776939, 4474488, 4097622, 3648173, 3201791, 2840874, 2558067, 2269905, 1921148, 1537798, 1176453, 864620, 607391, 412676, 275002, 158586, 41698, -20175, 86350, 421638, 904262, 1349422, 1604976, 1646439, 1535599, 1306477, 928988, 388875, -246124, -877540, -1456964, -1960420, -2308077, -2389810, -2181218, -1764122, -1213276, -543743, 183649, 791355, 1125282, 1248026, 1404185, 1776261, 2322367, 2852365, 3204329, 3336407, 3310504, 3230080, 3167927, 3119484, 3027253, 2853658, 2617221, 2366690, 2154024, 2033719, 2041370, 2142480, 2225805, 2176519, 1952020]
39657A952020l70169m63170n10275n19880m97754m39449l23395j44283M0285J33900
39647a142170R6626j589m4593J4344J03464R3345q2954l46043n08551m31312j57971
39636b407404J25431K72017K86259K47599J80943O4522o1029q3359M3338K06369
39626a125314K42181J23628n622J5698K11479M63071O17608N88926L89461J00016
39616A621132j91353m33703o06284o90982o82714o20110n59633m99659l64509
39607c027815r0381K93777O85599R77910J092925J002017P65268N22501L83720
39598B605521L31663K73333J72206P6510K5928n908o3384j53623k52795l22880
39588B686571l11843j91050j8007Q5389N4175m9879j19323j23523j19410j65484
$$ y = [1952020, 1581851, 1118681, 608406, 88526, -409228, -848677, -1172072, -1316355, -1276070, -1142170, -1045544, -1047133, -1091726, -1077382, -973918, -880573, -963527, -1309570, -1818121, -2249433, -2407404, -2281973, -2009956, -1723697, -1476098, -1295155, -1230633, -1291662, -1375021, -1331683, -1125314, -883133, -759505, -765127, -749429, -537950, -74879, 542729, 1131655, 1521116, 1621132, 1429779, 996076, 389792, -301190, -983904, -1604014, -2163647, -2663306, -3027815, -3118196, -2824419, -2138820, -1160910, -67985, 934032, 1699300, 2221801, 2605521, 2937184, 3210517, 3382723, 3459233, 3485161, 3479253, 3415869, 3262246, 3009451, 2686571, 2374728, 2183678, 2165671, 2251060, 2305235, 2255356, 2136033, 2012510, 1893100, 1727616]
39578A727616k62381l67627m36771m47795m01492l02577j45355O7086K92061M58812
39568A81577N14523M40847K37585o4649l70157n51647n54323m42420l22239k47852
39558a178755k19165k27791k58911k66635j91809j4753K14479L89608M01586K19955
39548a132191o3267l02529m25964m68096m83577m86976m83156m73216l92173j30197
39538d841342L04205P03046Q34846O75245L92064J45465m101l3072N8026J70180
39528a595438J37224j01173m13900o01841n57247k92363R6810M41703N60451M06684
39518a919090J45688J8189J26933L83149O27967P49583P00512M79317J37599k16814
39508A233033m57745n03357l63031j36097M7398J07452N1318n3493j26561j06564
$$ y = [1727616, 1465235, 1097608, 660837, 213042, -188450, -491027, -636382, -569296, -277235, 181577, 696100, 1136947, 1374532, 1309883, 939726, 388079, -166244, -608664, -930903, -1178755, -1397920, -1625711, -1884622, -2151257, -2343066, -2357819, -2143340, -1753732, -1352146, -1132191, -1195458, -1497987, -1923951, -2392047, -2875624, -3362600, -3845756, -4318972, -4711145, -4841342, -4537137, -3834091, -2999245, -2324000, -1931936, -1786471, -1790572, -1823644, -1765618, -1595438, -1458214, -1559387, -1973287, -2575128, -3132375, -3424738, -3327928, -2886225, -2325774, -1919090, -1773402, -1755213, -1628280, -1245131, -617164, 132419, 832931, 1312248, 1449847, 1233033, 775288, 271931, -91100, -227197, -179799, -72347, -21029, -74522, -201083, -307647]
39498c07647K2200K09475L58400L84918K63245K6273k54435m92168o22074o28643
39488a040456n22769l02952K2135L77785O49496P88382Q42660Q58734Q05697O42580
39478C121292M12848K11111Q4213K3191K5714R2648J69917J72226Q5835j0614
39468D388381n2971o8474j13188j75847j91839j37202o9359p0213j62814k82187
39458C064287l26463k54048j37887j00509j75214k45735j47696J67130N72063
39449B415928Q62238R07206P27945M47505J74870o0313k62119l88298l61282j68376
39439D295304Q8465K72970L26989K83409J92911P2522q5036k84945n11101p09340
39429C942148p99486p36249n54792l25429p0389K30874N49274P71061P88081O00789
$$ y = [-307647, -285447, -75972, 282428, 667346, 930591, 956864, 702429, 210261, -411813, -1040456, -1563225, -1866177, -1844042, -1466257, -816761, -28379, 814281, 1673015, 2478712, 3121292, 3534140, 3745251, 3829464, 3852655, 3878369, 3971017, 4140934, 4313160, 4398995, 4388381, 4335410, 4266936, 4153748, 3977901, 3786062, 3648860, 3579501, 3509288, 3346474, 3064287, 2737824, 2483776, 2345889, 2245380, 2070166, 1824431, 1676735, 1843865, 2415928, 3278166, 4185372, 4913317, 5360822, 5535692, 5475379, 5213260, 4824962, 4463680, 4295304, 4383769, 4656739, 4983728, 5267137, 5460048, 5532570, 5447534, 5162589, 4651488, 3942148, 3142662, 2406413, 1851621, 1526192, 1455803, 1686677, 2235951, 3007012, 3795093, 4395882]
39419D395882L14888O3486n5563j6472J10564J97911J75841J03076Q3318J26181
39409E499112J41852O3386r3760l02005n65757q39975r69969q12649m23375n0527
39399A646333R0072M777j28404j60997r4129k7706m2159j40023k68675l67120
39389E11969l89886l08366j14360J64093M53416O56778P03001N84469L53633Q9628
39379B704375j29720k38854j99203k6886J97457L67269M12847L31825J72632P732
39369C599474q5042n6721O7153J91717K33697J94318J33194Q3598K7804m6940
39359D342252j12212j39188j46583j78555k46024l13642l42332l26790k86463
39350B250463k28053j26180M8715K78867M90280O13565O43233O12375N22263L41997
$$ y = [4395882, 4710770, 4774256, 4718693, 4702221, 4812785, 5010696, 5186537, 5289613, 5372931, 5499112, 5640964, 5704350, 5610590, 5308585, 4742828, 3902853, 2932884, 2120235, 1696860, 1646333, 1736405, 1741182, 1612778, 1451781, 1357652, 1329946, 1287787, 1147764, 879089, 511969, 122083, -186283, -300643, -136550, 316866, 973644, 1676645, 2261114, 2614747, 2704375, 2574655, 2335801, 2136598, 2109712, 2307169, 2674438, 3087285, 3419110, 3591742, 3599474, 3514432, 3457711, 3524864, 3716581, 3950278, 4144596, 4277790, 4361388, 4389192, 4342252, 4230040, 4090852, 3944269, 3765714, 3519690, 3206048, 2863716, 2536926, 2250463, 2022410, 1896230, 1944945, 2223812, 2714092, 3327657, 3970890, 4583265, 5105528, 5447525]
39340E447525Q1859j85945m06647n98024p85068r15661q99919p24242m75076k47008
39330B91794p0842O2607J57508K18504K67425L19256L54544L46993L20024L50310
39320B618123M91381O86069P67797N81886J35885l71007o91005p14296n18704
39311B986129k56729k6082J51580K76298L42393L57651L48426L30128K97376K61866
39301E069036K74779L71616M97067N29223M02900J83532m373r5961j04880n8022
39291G064917L1015J31999K01440K27998K29922K01984J19312P781n0885j4693
39281H150790P2716J65379K82357M38811N65975N75470M77085L68189L26901L71810
39271A1795483M95916O66754Q12386Q85916R37206J047441J202266J313436J362399
$$ y = [5447525, 5529384, 5343439, 4936792, 4338768, 3553700, 2638039, 1738120, 1013878, 538802, 291794, 220952, 283559, 441067, 659571, 926996, 1246252, 1600796, 1947789, 2267813, 2618123, 3109504, 3795573, 4563370, 5145256, 5281141, 4910134, 4219129, 3504833, 2986129, 2729400, 2703318, 2854898, 3131196, 3473589, 3831240, 4179666, 4509794, 4807170, 5069036, 5343815, 5715431, 6212498, 6741721, 7144621, 7328153, 7323780, 7227819, 7122939, 7064917, 7095932, 7227931, 7429371, 7657369, 7887291, 8089275, 8208587, 8216368, 8165483, 8150790, 8223506, 8388885, 8671242, 9110053, 9676028, 10251498, 10728583, 11096772, 11423673, 11795483, 12291399, 12958153, 13770539, 14656455, 15593661, 16641102, 17843368, 19156804, 20519203]
39262B0519203J421875J513404J543571J430057J211151R77992P72034O11744
39254C0001031N54153O49453Q70236J149246J451331J747239J961609K035521
39246D0419819K029032K085496K292997K640783L102896L686348M380188N125871
39238F5763430N874170O631239P427211Q285053R250439J0408508J1820719J3456695
39230A38917464J5220544J7032144J8844349K0565735K1964833K2628027K1999198
39223B77172294J9527066J4921954Q413558Q13201o725477j3124874j7722565
39216B83275157k0366981k1302592k0971546j9826996j8216263j6373162j4485848
39209A51731769j2728268j1204263r903147q764353p772396o941779o231067n550997
$$ y = [20519203, 21941078, 23454482, 24998053, 26428110, 27639261, 28617253, 29389287, 30001031, 30555184, 31204637, 32074873, 33224119, 34675450, 36422689, 38384298, 40419819, 42448851, 44534347, 46827344, 49468127, 52571023, 56257371, 60637559, 65763430, 71637600, 78268839, 85696050, 93981103, 103231542, 113640050, 125460769, 138917464, 154138008, 171170152, 190014501, 210580236, 232545069, 255173096, 277172294, 296699360, 311621314, 320034872, 320848073, 314122596, 300997722, 283275157, 262908176, 241605584, 220634038, 200807042, 182590779, 166217617, 151731769, 139003501, 127799238, 117896091, 109131738, 101359342, 94417563, 88186496, 82635499]
39201H2635499m872734m259656l762372l343042k942156k561486k226488j915234
39193E6752331j594452j298508j100659j012626r71456r19068q33476o84567m34933
39184D7902586j11665J82848L71983M75779N43516N57919M65842K87833J32120
39175E0808761Q1888J11143J36859J18961O6620l8383k67968o71411j197619j718563
39165D7430288k117798k341512k391328k312700k191017k115194k114998k138220
39157B9707521k095390j926113j639900j319535j078101r79736r93735j040473
39149A8634538j070798j076888j053083j004426r86227j063031j206589j292727
39141I880769j226328j019862p32268m05018j03124N7333Q455j71240l24219l59533
$$ y = [82635499, 77762765, 73503109, 69740737, 66397695, 63455539, 60894053, 58667565, 56752331, 55157879, 53859371, 52758712, 51746086, 50774630, 49855562, 49022086, 48337519, 47902586, 47790921, 47973769, 48345752, 48821531, 49365047, 49922966, 50388808, 50676641, 50808761, 50890649, 51001792, 51138651, 51257612, 51324232, 51285849, 51017881, 50346470, 49148851, 47430288, 45312490, 42970978, 40579650, 38266950, 36075933, 33960739, 31845741, 29707521, 27612131, 25686018, 24046118, 22726583, 21648482, 20668746, 19675011, 18634538, 17563740, 16486852, 15433769, 14429343, 13443116, 12380085, 11173496, 9880769, 8654441, 7634579, 6902311, 6497293, 6394169, 6451502, 6459957, 6288717, 5964498, 5604965]
39131E604965k80620j07173J47798M25452O13529O10434L76460m8041n22050q30838
39121E989916q20478n30380j53528J35987K84043L18776K91013K54211K27474
39112E997034J53982m7132l63334o69701q45954q67500p68411n76760l25134p7671
39102A609419J07194K27670L20511M00850M41408M07822L05160J87672J08241
39093D115947M5982q7894l35705o07665p61858p57276o69970n64678m22312k10129
39083b55558M1297K60541L88734L93249K79785J11521l4935j54877l06340m96746
39073B26671o38939o50696n41782l70518j74357J7043J61356K46247L00267L18603
39063a106105K45229Q6817l2829k3296K8645j8732j30247j18474Q8282L29072
$$ y = [5604965, 5324345, 5217172, 5364970, 5790422, 6403951, 7014385, 7390845, 7342804, 6820754, 5989916, 5169438, 4639058, 4485530, 4621517, 4905560, 5224336, 5515349, 5769560, 5997034, 6151016, 6103884, 5740550, 5070849, 4224895, 3357395, 2588984, 2012224, 1687090, 1609419, 1716613, 1944283, 2264794, 2665644, 3107052, 3514874, 3820034, 4007706, 4115947, 4161929, 4074035, 3738330, 3130665, 2368807, 1611531, 941561, 376883, -45429, -255558, -214261, 46280, 435014, 828263, 1108048, 1219569, 1184634, 1029757, 723417, 226671, -412268, -1062964, -1604746, -1975264, -2149621, -2132578, -1971222, -1724975, -1424708, -1106105, -860876, -774059, -806888, -830184, -801539, -820271, -950518, -1068992, -980710, -651638]
39053f51638M15653L60853L25439L92518M78486M58248L16026J53196P3510P9102
39043B401393P6831k0988k07718l89377m65348m02757k58778j45234j43828k27841
39033B16355k83840k34719j22339m6799n6259j32898k48081l64582m02650k88814
39023a964626o2705J26317J68974J09276P5855J22234J66020Q5420j31759l34495
39013a639489l21686l9253L40834N72499N68808M56185M06651M65029N46439N46148
39003A902165M20850K04332j5841j58403k18489k68373l72744n20727o51037p11412
38993c89679o72264n20521k84055m5783J08014J57293J53816J74036K77692M71491
38983e69960O71398P34314N92201L46890J66717Q2974m2609l22507o81374r35783
$$ y = [-651638, -235985, 124868, 450307, 842825, 1321311, 1779559, 2095585, 2248781, 2322291, 2401393, 2478224, 2457236, 2249518, 1860141, 1394793, 992036, 733258, 588024, 444196, 216355, -67485, -302204, -424543, -471342, -527601, -660499, -908580, -1273162, -1675812, -1964626, -2027331, -1901014, -1732040, -1622764, -1546909, -1424675, -1258655, -1173235, -1304994, -1639489, -1961175, -2000428, -1659594, -1087095, -518287, -62102, 344549, 809578, 1356017, 1902165, 2323015, 2527347, 2511506, 2353103, 2134614, 1866241, 1493497, 972770, 321733, -389679, -1061943, -1582464, -1866519, -1912302, -1804288, -1646995, -1493179, -1319143, -1041451, -569960, 101438, 835752, 1427953, 1774843, 1941560, 2024534, 1981925, 1659418, 978044, 42261]
38973D2261r81850q40271n59624j75697K22270M77931M88841L18373J46164J13736
38963g47866K30480L98526M94193M44456K68831N7864j01135j72372j47790j8968
38953G06219J87903L78693M52734L98430K85472J67505M2492r2403k08816k86434
38943B031795l29009l21663k31581q1142M1790R4095J44120K68562M23639M84443
38933B525049L85673J64744r9999l17219l77427k28316K0845J55271O5390j40638
38923B153373k64151k15144o1928O7022Q6563r342j65789l16860m31999n09863
38913C31882n33810m66346k98252p3577J48621L30695M43839M56319L64553K16704
38903I20628P8470j7641p7016j12343j26565j22914j22777j65604k70143l83379
$$ y = [42261, -939589, -1779860, -2339484, -2515181, -2292911, -1814980, -1326139, -1007766, -861602, -747866, -517386, -118860, 375333, 819789, 1088620, 1146484, 1045349, 872977, 725187, 706219, 894122, 1272815, 1725549, 2123979, 2409451, 2576956, 2619448, 2527045, 2318229, 2031795, 1702786, 1381123, 1149542, 1068400, 1110190, 1204285, 1348405, 1616967, 2040606, 2525049, 2910722, 3075466, 2975467, 2658248, 2280821, 2052505, 2073350, 2228621, 2294011, 2153373, 1889222, 1674078, 1612150, 1679172, 1765735, 1756393, 1590604, 1273744, 841745, 331882, -201928, -668274, -966526, -1040103, -891482, -560787, -116948, 339371, 703924, 920628, 999098, 981457, 904441, 792098, 665533, 542619, 419842, 254238, -15905, -399284]
38893c99284l99458k67049n5820J26017K48075L24749L01676R5950k28522m47061
38883g00727m08803k04818l1264L7193N2146M8381K1066R888P5829J90147K56456
38872f54506K59678K90584L91221M70508M23189K59278O2864j16813k77834m16349
38862F91820n17719n62114n01501k81879N4750L33133L84134K12262k7573k02989
38852d17676k93615l20561k68120j11981J17525L38720M72578M80409L71228J96307
38842E64814K9570o6063o5161J3133J10225J50480R2920j8070o8183L0095K40402
38831A014162M09695L92200J81605p7824k12683j48203P5765L71326O39252P58714
38821C404009O19925K19178k98445p23266r03178p90434m32691K9555L98682N36570
$$ y = [-399284, -798742, -1065791, -1121611, -995594, -747519, -422770, -121094, -25144, -253666, -700727, -1109530, -1314348, -1345612, -1308419, -1256273, -1207892, -1186826, -1176938, -1101109, -910962, -654506, -394828, -104244, 286977, 757485, 1180674, 1439952, 1502816, 1386003, 1108169, 691820, 174101, -388013, -889514, -1171393, -1116643, -783510, -399376, -187114, -214687, -417676, -711291, -1031852, -1299972, -1411953, -1294428, -955708, -483130, -2721, 368507, 564814, 594384, 528321, 463160, 476293, 586518, 736998, 829918, 811848, 743665, 773760, 1014162, 1423857, 1816057, 1997662, 1919838, 1707155, 1558952, 1634717, 2006043, 2645295, 3404009, 4023934, 4243112, 3944667, 3221401, 2318223, 1527789, 1095098, 1124653, 1523335, 2059905]
38811B059905M62774L04237J61136O5856M1031J00009J72591J28951n9724k49964
38801C186802k87792j95796j18426j12127q8585K8583J87886K94291L38794L78002
38791C611632M18625L89873K34253j4650k55597m02121m42544m37931m62459n31387
38781B107694n87218n64821m59804l17610j73161l8554N3736N2330k9679o7237
38771b4324P5961L85895O79444P71984O38141L88236J29265r5142k50574k86004
38761B412882j99793p3573J6378Q7506J86739K60561J81318o7390l08798l48895
38751B146935k08090j09915k35155n37795q16797r20013q41691o53625m04392
38742b580538j07936K01848M50678N77110N96243N88591O12183O31107N46414
$$ y = [2059905, 2522679, 2826916, 2988052, 3053908, 3094939, 3194948, 3367539, 3496490, 3436766, 3186802, 2899010, 2703214, 2584788, 2472661, 2384076, 2412659, 2600545, 2894836, 3233630, 3611632, 4030257, 4420130, 4654383, 4639733, 4384136, 3982015, 3539471, 3101540, 2639081, 2107694, 1520476, 955655, 495851, 178241, 5080, -33474, 20262, 72592, 42913, -24324, 51637, 437532, 1116976, 1888960, 2527101, 2915337, 3044602, 2949460, 2698886, 2412882, 2213089, 2139516, 2155894, 2243400, 2430139, 2690700, 2872018, 2804628, 2495830, 2146935, 1938845, 1828930, 1593775, 1055980, 239183, -680830, -1522521, -2176146, -2580538, -2688474, -2486626, -2035948, -1458838, -862595, -274004, 338179, 969286, 1515700]
38733A515700L03518l8394l47154n20257n47240m90929m27321l94122l68143k84011
38723a598353r9261J39777L11428L19356J73071m5256k70864m74367o02359n67282
38713b714110l37969j0640K55685L74208L81566L67067L75176L67669K58900K553
38703f79895l26552n52587n48164l72222k22648k37921l71719m69421m31648k83248
38693d496025j14591R681R1868J73718K69236L27311K83241J54812N8855J06469
38683c135425K88266M73849N17363L67613J04032j21753k03243j57816q1440l1928
38673a980482R093O0134Q6649N9003J6308J8917O0389P5616K4216p4558j74870
38662a819585k28549j89154m5515J38880K54732K28398O8643j44066k89034k62504
$$ y = [1515700, 1819218, 1780824, 1433670, 913413, 366173, -124756, -552077, -946199, -1314342, -1598353, -1697614, -1557837, -1246409, -927053, -753982, -799238, -1070102, -1544469, -2146828, -2714110, -3052079, -3062719, -2807034, -2432826, -2051260, -1684193, -1309017, -941348, -682448, -679895, -1006447, -1559034, -2107198, -2479420, -2702068, -2939989, -3311708, -3781129, -4212777, -4496025, -4610616, -4600935, -4509067, -4335349, -4066113, -3738802, -3455561, -3300749, -3241894, -3135425, -2847159, -2373310, -1855947, -1488334, -1384302, -1506055, -1709298, -1867114, -1948554, -1980482, -1971389, -1911255, -1824606, -1765603, -1749295, -1730378, -1669989, -1594373, -1570157, -1644715, -1819585, -2048134, -2237288, -2282803, -2143923, -1889191, -1660793, -1592150, -1736216, -2025250, -2287754]
38652b287754o4071J79718L27874L58147L47389L41864L16869K58138J96641J39121
38642A13936M2849r9524k17106k54804k56058k94990l71171m33664m71637n07790
38632b749959n20754m48829k74622m8537J74697L66521M87356M88304L84479K75457
38622a865887K43051K54213K12205R1592k7701o9311n9583q7403j88546l08484
38612a805854l74658l63060k80600j28906O8298K24040K32653O8230j91397m35886
38602b987140n76514n37895k77946J31110M89172O07359M65163K05373q48m7385
38592b529551J02829M12563P46843R25029Q55749O11126L46417J61793N5434k0278
38582A667954r7720j83674k70163l32857l30228k29145m8073J25836J80941O6432
$$ y = [-2287754, -2351825, -2172107, -1844233, -1486086, -1138697, -796833, -479964, -221826, -25185, 113936, 156785, 57261, -159845, -414649, -670707, -965697, -1336868, -1770532, -2242169, -2749959, -3270713, -3719542, -3994164, -4042701, -3868004, -3501483, -3014127, -2525823, -2141344, -1865887, -1622836, -1368623, -1156418, -1064826, -1092527, -1161838, -1221421, -1308824, -1497370, -1805854, -2180512, -2543572, -2824172, -2953078, -2884780, -2660740, -2428087, -2359857, -2551254, -2987140, -3563654, -4101549, -4379495, -4248385, -3759213, -3151854, -2686691, -2481318, -2482166, -2529551, -2426722, -2014159, -1267316, -342287, 513462, 1124588, 1471005, 1632798, 1688232, 1667954, 1570234, 1386560, 1116397, 783540, 453312, 224167, 176094, 301930, 482871, 549303]
38572E49303j54165l39481l74629k56618q9680M479j3614p7384q5417P191J69610
38561f60405L47259N01405N98250O03667N20796M08688L25883K64463J74119M6581
38551C130706o1864r9348p7806n0946o0779j22021k30226l52122m17782l57359
38541A300453j60844J06429L51347N11964N76871N67716N14525M37555L37470
38532D543486K04424M8386q3418j40570j28745j13502j45558j96976j96472j18812
38522C672243r481P6050J22178J35298J13668N9481j286l5881l1060J0371P9313
38511D190894J46072J54085N8435j27170l34704m91361n62138n58924n20298m73894
38501A480997m15059l36547k72689k74014l23413l19491j76315Q7433L83539O36917
$$ y = [549303, 395138, 55657, -318972, -575590, -665270, -660791, -674405, -751789, -837206, -830015, -660405, -313146, 188259, 786509, 1390176, 1910972, 2319660, 2645543, 2910006, 3084125, 3130706, 3068842, 2969494, 2891688, 2840742, 2779963, 2657942, 2427716, 2075594, 1657812, 1300453, 1139609, 1246038, 1597385, 2109349, 2686220, 3253936, 3768461, 4206016, 4543486, 4747910, 4796296, 4712878, 4572308, 4443563, 4330061, 4184503, 3987527, 3791055, 3672243, 3662762, 3738812, 3860990, 3996288, 4109956, 4169437, 4168151, 4132270, 4101210, 4111581, 4190894, 4336966, 4491051, 4549486, 4422316, 4087612, 3596251, 3034113, 2475189, 1954891, 1480997, 1065938, 729391, 456702, 182688, -140725, -460216, -636531, -549098, -165559, 471358]
38491D71358P92139P85799N93755L00463M8995r4162j72648k32403k50099k07491
38481B035706j81860k93605n63604q58819r89697q54745n00528o1805L45629O71577
38471a251751Q86118R30785P60286M29394R1156j17586j70564j22683k1841J10993
38461A524307K25708K22195L1866k78991n26127n63634m18045k40898j41993j17072
38451b82684j32068j91022k72705k77242j31737P6707J64350N1225j67877l47993
38441a511046m15347l63233k15930l3245J08527J74077J71330J00214k8830j18747
38431b132230k8796K53823N59458P10259O88091N80579M38216K64097Q6146n3497
38421A366146j53863k30890k74044k94343l61445m93851n49954l51742P7416N02632
$$ y = [471358, 1263497, 2049296, 2643051, 2943514, 2992509, 2898347, 2725699, 2493296, 2243197, 2035706, 1853846, 1560241, 996637, 137818, -851879, -1706624, -2207152, -2268957, -1923328, -1251751, -365633, 565152, 1325438, 1754832, 1845988, 1728402, 1557838, 1435155, 1413314, 1524307, 1750015, 1972210, 2004076, 1725085, 1198958, 635324, 217279, -23619, -165612, -282684, -414752, -605774, -878479, -1155721, -1287458, -1210751, -1046401, -995176, -1163053, -1511046, -1926393, -2289626, -2505556, -2538801, -2430274, -2256197, -2084867, -1984653, -2013483, -2132230, -2161026, -1907203, -1347745, -637486, 50605, 631184, 1069400, 1333497, 1419643, 1366146, 1212283, 981393, 707349, 413006, 51561, -442290, -992244, -1343986, -1266570, -763938]
38411g63938P21943P29269O19389M41203K05212l9205k07902k40617j33547M0387
38401A372194J26829k0930l90385p83938r86873r33840o93360l55229R786L27505
38391b328241N34321O08593N53656L79865J46748j8562j9519J01344K12825K50046
38381D21076K61045L01351L51479L61875L23310K56638J70697O9009k2736p1582
38371B422162p7416q2802j44203k88044m72790n97002n84590m77118m00626m11257
38361a113686m13102k76220q581K49259L89260M28234M29560M09366L59123K96460
38351G49673K27824J00041j32260l99223n47493m92214k85969l4145J91835L42422
38341b79509L74559L05013K21860J75713R9854q6854l25536m55617m11561k99369
$$ y = [-763938, -41995, 687274, 1306663, 1747866, 1953078, 1913873, 1705971, 1465354, 1331807, 1372194, 1499023, 1478093, 1087708, 303770, -683103, -1616943, -2310303, -2665532, -2655746, -2328241, -1793920, -1185327, -631671, -251806, -105058, -123620, -143139, -41795, 171030, 421076, 682121, 983472, 1334951, 1696826, 2020136, 2276774, 2447471, 2516480, 2493744, 2422162, 2344746, 2261944, 2117741, 1829697, 1356907, 759905, 175315, -301803, -702429, -1113686, -1526788, -1803008, -1811589, -1562330, -1173070, -744836, -315276, 94090, 453213, 749673, 977497, 1077538, 945278, 546055, -1438, -493652, -779621, -813766, -621931, -279509, 95050, 400063, 621923, 797636, 897490, 810636, 485100, 29483, -382078, -681447]
38331f81447k51379k74121k81692k26174j39014o8742k7004J0643Q3477K18907
38321a636546L97421N43447N75273M78200L29162K43580K76632L53683L14630
38312A875482P3672k56966m47306l76385j45316N1784J19357Q7593Q102r3395
38302H96622j71158j51078n873J99054L64133M41868M52741M38529M15477L57751
38292C238066K18213j5413k75124m46460m69849l98877l39196l32646l17604k08309
38282F52801n385J80409K18306P1237j81221m23435n86995o53452o14233m71535
38272a813503k72757r8770L336N4121R1450J06208N4854o7186j88711k15722j22604
38261b469284J7246J03547J15455J31782K31977L90959M99010M84828L90953L17427
$$ y = [-681447, -932826, -1206947, -1488639, -1714813, -1853827, -1922569, -1949573, -1938930, -1855453, -1636546, -1239125, -695678, -120405, 357795, 686957, 930537, 1207169, 1560852, 1875482, 1949154, 1692188, 1244882, 868497, 723181, 774965, 894322, 981915, 990017, 896622, 725464, 574386, 568513, 767567, 1131700, 1573568, 2026309, 2464838, 2880315, 3238066, 3456279, 3440866, 3165742, 2719282, 2249433, 1850556, 1511360, 1178714, 861110, 652801, 647416, 827825, 1046131, 1117368, 936147, 512712, -74283, -727735, -1341968, -1813503, -2086260, -2185030, -2181694, -2127573, -2036123, -1929915, -1875061, -1942247, -2130958, -2346680, -2469284, -2452038, -2348491, -2233036, -2101254, -1869277, -1478318, -979308, -494480, -103527, 213900]
38251B13900L11270L22422K52081L6537k93267o16055p99674q00527o84555n45472
38241b603340m18182k83042j29021K1300J43035K33545K99768L42641L61648L58549
38231a673099L28077K56201J37341q335j36321j98369j72769q1170L4392J53863
38221a360189K74304L51604K93233O5325k11878l47850k77405j16327l762M3286
38211a289659P7835R8938O5965K039j4758L1711P3824Q1734J29562K87393M97677
38200D2261O23069O00716N00167M29354M14771L78406K22951m8315k89706l21853
38190B551821j10640J78995L29548K53767K2537k37545m23576m72489l84145k48025
38180A460248j93965k81882m49381n65844n22316k95530K2589K63239L10237K13743
$$ y = [213900, 525170, 847592, 1099673, 1136210, 842943, 226888, -572786, -1373313, -2057868, -2603340, -3021522, -3304564, -3433585, -3412285, -3269250, -3035705, -2735937, -2393296, -2031648, -1673099, -1345022, -1088821, -951480, -959815, -1096136, -1294505, -1467274, -1548444, -1514052, -1360189, -1085885, -734281, -441048, -375723, -587601, -935451, -1212856, -1329183, -1332945, -1289659, -1211824, -1112886, -1046921, -1044882, -1059640, -1027929, -954105, -872371, -742809, -455416, 42261, 665330, 1266046, 1766213, 2195567, 2610338, 2988744, 3211695, 3163380, 2873674, 2551821, 2441181, 2620176, 2949724, 3203491, 3226028, 2988483, 2564907, 2092418, 1708273, 1460248, 1266283, 984401, 535020, -30824, -553140, -848670, -826081, -562842, -252605, -38862]
38170c8862J36511J75659K80927L57683L87899M12469M44462M52878M07414K96672
38160C313712J21830q8126k68742l63309l68126l16673k40709j71883j53440k07832
38150A256702l00774l65553l51463k29875J2812L40271O40096P86526P43299N86037
38140C118078M29864L50183L46057L42028K42405K5893k18696l77652m14663l61941
38130C481556k51157j11180l766J6750k2571m4616k6526j1015k0436l4488n5250
38119B917301j11077j80493j96861j53846j18263j00932q497K12442M60214N80472
38109C300460N25179L45826R8017j63570l59595m64422n75567p96175j061957
38100H48196j186900j078466q10192m80526j11663K79928O15543Q20989R00214
$$ y = [-38862, 97649, 273308, 554235, 911918, 1299817, 1712286, 2156748, 2609626, 3017040, 3313712, 3435542, 3347416, 3078674, 2715365, 2347239, 2030566, 1789857, 1617974, 1464534, 1256702, 955928, 590375, 238912, 9037, 21849, 362120, 1002216, 1788742, 2532041, 3118078, 3547942, 3898125, 4244182, 4586210, 4828615, 4854508, 4635812, 4258160, 3843497, 3481556, 3230399, 3119219, 3115453, 3132203, 3109632, 3065016, 3038490, 3027475, 3007039, 2972551, 2917301, 2806224, 2625731, 2428870, 2275024, 2156761, 2055829, 2047332, 2259774, 2719988, 3300460, 3825639, 4171465, 4269482, 4105912, 3746317, 3281895, 2706328, 1910153, 848196, -338704, -1417170, -2227362, -2707888, -2819551, -2539623, -1924080, -1103091, -202877]
38091b02877Q90212P90513N82430K76876r6371n03999q69484j058799r68152o24196
38081a783847j70254K32124M70607M94628L24668N9055j63305k34859j31802Q1354
38071h21631K90561L98567L79336K75912J55036P5433P8579J64173K65897K88730
38061A550593J89245K937j99097l40278l34731j26096K35795O05949Q65270R88566
38051C438153R71451P68196L76262o7401l72238m73949m56027l94861k70420o3817
38041C455349J31250J71155K6793j67247k49016j99912j62263k82949n48516p86327
38031A388317q21384o12583k46674J50137M69810O41521O57414N82968N06005
38022B715531M63289M22320L20614J12984j89439m99813p03411p60926p41755
$$ y = [-202877, 687335, 1477848, 2060278, 2337154, 2240783, 1736784, 867300, -191499, -1159651, -1783847, -1954101, -1721977, -1251370, -756742, -432074, -373019, -536324, -771183, -902985, -821631, -531070, -132503, 246833, 522745, 677781, 753214, 831793, 995966, 1261863, 1550593, 1739838, 1742775, 1543678, 1203400, 868669, 742573, 978368, 1584317, 2449587, 3438153, 4409604, 5177800, 5554062, 5486661, 5114423, 4640474, 4184447, 3789586, 3519166, 3455349, 3586599, 3757754, 3784547, 3617300, 3368284, 3168372, 3006109, 2723160, 2174644, 1388317, 566933, -45650, -292324, -142187, 327623, 969144, 1626558, 2209526, 2715531, 3178820, 3601140, 3921754, 4034738, 3845299, 3345486, 2642075, 1881149, 1139394]
38013A139394p20362o71879n21145k67497L409K15795L43800L71219L02147K23070
38003D17951K55724L95206M64911K99785o0059m04702n47353m42853j68191J37943
37993C48362L34271L53705K46021J17427K9333k1132m7806n8562q4954j63881
37983A052784k65537k86734j54914Q1331K95502M05527M27822M16725L81164K77767
37973B631437P7924j73657l74349m36551l45494j53975O4193K48704L54389L43433
37963B236054J96389o0060l40925n35881n74813m71898l08494j74955j21142j38553
37953b94278j72065j63367j09567p6846j32318k59040l57104l31480j64794Q7035
37943a973824L38321N06844N37666M22474J98160o9962k97406l97808l33181j50892
$$ y = [1139394, 419032, -252847, -773992, -1041489, -1038080, -822285, -478485, -107266, 194881, 417951, 673675, 1068881, 1533792, 1833577, 1773518, 1368816, 821463, 378610, 210419, 348362, 682633, 1036338, 1282359, 1399786, 1429119, 1407987, 1360181, 1301619, 1216665, 1052784, 787247, 500513, 345599, 426930, 722432, 1127959, 1555781, 1972506, 2353670, 2631437, 2709361, 2535704, 2161355, 1724804, 1379310, 1225335, 1289528, 1538232, 1892621, 2236054, 2432443, 2372383, 2031458, 1495577, 920764, 448866, 140372, -34583, -155725, -294278, -466343, -629710, -739277, -816123, -948441, -1207481, -1564585, -1896065, -2060859, -1973824, -1635503, -1128659, -590993, -168519, 29641, -40321, -337727, -735535, -1068716, -1219608]
37933a219608N8622K40746L87292M88175N29689N37430N50278N36829M16605K03375
37923B729433M9056P6418K23757L31358L37519L00439K54282J50320m2645k63668
37913D146269m24032m99275n30141n64143o10490o25336n38571l25784n4209J68599
37903A42887K79760K70615J55455k742o9389N7110L09439N09740N79644N97447
37893B829966O19721N61175L27812j7476l18200m99884n94022o31998o14754n67249
37883A095091n26095m71162l50740j83908o6489o0062j32984k20584k84323l01274
37873a502530k59878j90501j46670j31919r4127j4324N2151N4002J4576j3868
37863b233088k7425o4797j56057l06126m88972o23138n99161l85588p9631J93888
$$ y = [-1219608, -1160986, -920240, -532948, -44773, 484916, 1022346, 1572624, 2109453, 2526058, 2729433, 2778489, 2854907, 3078664, 3410022, 3747541, 4047980, 4302262, 4452582, 4409937, 4146269, 3722237, 3222962, 2692821, 2128678, 1518188, 892852, 354281, 28497, -25712, 142887, 422647, 693262, 848717, 845975, 776586, 833696, 1143135, 1652875, 2232519, 2829966, 3449687, 4010862, 4338674, 4321198, 4002998, 3503114, 2909092, 2277094, 1662340, 1095091, 568996, 97834, -252906, -436814, -503303, -563365, -696349, -916933, -1201256, -1502530, -1762408, -1952909, -2099579, -2231498, -2325625, -2339949, -2287798, -2233796, -2219220, -2233088, -2260513, -2325310, -2481367, -2787493, -3276465, -3899603, -4498764, -4884352, -4963983, -4770095]
37853d770095M00726N64697O66436O64951O02298N84792O40665O81045O30612
37844F66127N13999L72374J86034m1964j98572j70952k1222N8335k1166j44806
37834A198187j55193l5988J10868K05637K40106K18461J20355o6739l13098n57251
37824I65345p43799q57126r19491r38144q60562o28449k90353j893J29551J51530
37814c993391J61856J48368K6286j80882l04904k12109N1111L26323M96176N35313
37804b945853M73138L62946K48681J14214r4839l49001m83566l51949j6251K93028
37794b749452M11823L68910K71809J54860m813j80107k88944k97072k63004k50965
37784b826955k34246j30392O9424K52089K98442K28244J82830K58010L99270M83737
$$ y = [-4770095, -4369369, -3804672, -3138236, -2473285, -1870987, -1286195, -645530, 35515, 666127, 1180126, 1552500, 1738534, 1696570, 1497998, 1327046, 1305824, 1364159, 1342993, 1198187, 1042994, 1007006, 1117874, 1323511, 1563617, 1782078, 1902433, 1835694, 1522596, 965345, 221546, -635580, -1555071, -2493215, -3353777, -3982226, -4272579, -4274472, -4144921, -3993391, -3831535, -3683167, -3656881, -3837763, -4142667, -4354776, -4303665, -3977342, -3481166, -2945853, -2472715, -2109769, -1861088, -1746874, -1841713, -2190714, -2674280, -3026229, -3042480, -2749452, -2337629, -1968719, -1696910, -1542050, -1546863, -1726970, -2015914, -2312986, -2575990, -2826955, -3061201, -3191593, -3122169, -2870080, -2571638, -2343394, -2160564, -1902554, -1503284, -1019547]
37774a019547M62311L82987L09919K71834K67895K64380J93136J7428j91168l00775
37764F58400k66470j79892j44825j51397j15600r645R7668J22464N2561m7607
37754A5657j02503j03920j32526k79558n29071p37233p47538n13590j08523L39943
37744b898862O98108Q68189Q54455P76027P53679P79538P41750N72972L22467
37735C468323Q0677j05867k27307k82860l04169l60612m82847n95443n72798l64628
37725B52469m2928K62696M44877M48468K75008j4480l16526n24207n58479l86151
37715a59253m4589L44542O21526O84324N45805K96929K9411j97039l39171l66936
37705A415549k90038j62795l7894P6983J95151K90034K94201J79846J6299q9646
$$ y = [-1019547, -557236, -174249, 135670, 407504, 675399, 939779, 1132915, 1150343, 959175, 658400, 391930, 212038, 67213, -84184, -199784, -209429, -111761, 10703, 63264, 15657, -86846, -190766, -323292, -602850, -1131921, -1869154, -2616692, -3130282, -3238805, -2898862, -2200754, -1332565, -478110, 297917, 1051596, 1831134, 2572884, 3145856, 3468323, 3549000, 3443133, 3215826, 2932966, 2628797, 2268185, 1785338, 1189895, 617097, 252469, 209541, 472237, 917114, 1365582, 1640590, 1626110, 1309584, 785377, 226898, -159253, -203842, 140700, 762226, 1446550, 1992355, 2289284, 2318695, 2121656, 1782485, 1415549, 1125511, 962716, 924822, 1001805, 1196956, 1486990, 1781191, 1961037, 1977336, 1887690]
37695A887690j10735j25924k19777l78911n02871m97449l41022q3730J83502L66153
37685A76926M11713L36362J95688K9275j46930k97730l57370k87437j29991J8907
37675e0587Q0065K6140j22875k97166l82481k89252n0049J81542K68356K19301
37665d17006J56505J64195K05845J91307Q4100p7429k30501l25754l39395k93399
37655h81532k56861k76411k90864j62048J69463N77593Q35127Q04629N32953J79583
37645A231632j10088k68414k98263k42146j52092o7057m246M2917J07737K32339
37635D72319M15243N77812O14907M90890K65951K6093j82299l43584m46340m99916
37625A391076n46788o14938o69440o48510n42760m06640k94954k21200j80189
$$ y = [1887690, 1776955, 1651031, 1431254, 1052343, 549472, 52023, -288999, -372729, -189227, 176926, 588639, 925001, 1120689, 1149964, 1003034, 705304, 347934, 60497, -69494, -50587, 29478, 55618, -67257, -364423, -746904, -1036156, -1086205, -904663, -636307, -417006, -260501, -96306, 109539, 300846, 384946, 307517, 77016, -248738, -588133, -881532, -1138393, -1414804, -1705668, -1867716, -1698253, -1120660, -285533, 519096, 1052049, 1231632, 1121544, 853130, 554867, 312721, 160629, 93572, 89326, 132243, 239980, 472319, 887562, 1465374, 2080281, 2571171, 2837122, 2863215, 2680916, 2337332, 1890992, 1391076, 844288, 229350, -440090, -1088600, -1631360, -2038000, -2332954, -2554154, -2734343]
37616b734343j77159k17891k84744l30407k90800j18501J71588M93997P52291
37607b735969R01262R31682Q21212N57218K10039p5912j94269j50647j4765J53509
37597D03360L04425L75158L23442J76451J5963p8707o5858M3682J78347K45727
37587A921990K19106J63131J47370J72101K15322K96066M14327M65116L17245
37578D331774j2185l47821n43694o07585o16378n93921n24997m20842l03499j72737
37568A88115n1558j7146j05632k11882j70856N6621L41452N27592N51969M29590
37558A538265K11965J382o6358P0630L22633N18820N47878M13519J88956l4215
37548C713475j68255j63168m7085Q9130J71243K05902K61484L86711N46818O36782
$$ y = [-2734343, -2911502, -3129393, -3414137, -3744544, -4035344, -4153845, -3982257, -3488260, -2735969, -1834707, -903025, -81813, 475405, 685444, 609532, 415263, 264616, 249851, 403360, 707785, 1082943, 1406385, 1582836, 1598799, 1520092, 1454234, 1497916, 1676263, 1921990, 2141096, 2304227, 2451597, 2623698, 2839020, 3135086, 3549413, 4014529, 4331774, 4319589, 3971768, 3428074, 2820489, 2204111, 1610190, 1085193, 664351, 360852, 188115, 136557, 119411, 13779, -198103, -368959, -312338, 29114, 556706, 1108675, 1538265, 1750230, 1751612, 1685254, 1755884, 2078517, 2597337, 3145215, 3558734, 3747690, 3713475, 3545220, 3382052, 3334967, 3424097, 3595340, 3801242, 4062726, 4449437, 4996255, 5633037]
37538E633037N62440L16875j9928l51782o25802q23567r19650q78188o95061m29140
37528A769234j81371l9060k9425j09886j95360k05550j09043N7933K14404K93461
37518A465337K90613K44869J66904J4037k31554m80144n89392n22471m09909m19109
37508d70819n80891p66115q06713o13471k14684K55359O06265O95509N30087K60890
37498a104583O2596J4420P8054J60973J99693K04610K26351K66876K48109J11231
37488D68330o8728j37282n0388N1313K307j94497l81458m21093l02045r0547J55329
37477i68759M05589O34984Q08245Q84036Q39069P04011N60800M72337M18698L32370
37467E091380J91152M0889p1747j45065j88229j82553j07882J0128J05296J24780
$$ y = [5633037, 6195477, 6512352, 6492424, 6140642, 5514840, 4691273, 3771623, 2893435, 2198374, 1769234, 1587863, 1548803, 1519378, 1409492, 1214132, 1008582, 899539, 957472, 1171876, 1465337, 1755950, 2000819, 2167723, 2181760, 1950206, 1470062, 880670, 358199, -51710, -470819, -1051710, -1817825, -2624538, -3238009, -3452693, -3197334, -2591069, -1895560, -1365473, -1104583, -1041987, -1027567, -949513, -788540, -588847, -384237, -157886, 108990, 357099, 468330, 399602, 262320, 211932, 263245, 265552, 71055, -310403, -731496, -1033541, -1124088, -968759, -563170, 71814, 880059, 1764095, 2603164, 3307175, 3867975, 4340312, 4759010, 5091380, 5282532, 5323421, 5251674, 5106609, 4918380, 4735827, 4627945, 4638073, 4743369, 4868149]
37457D868149P4776J5447l730k1486j52231m45804p66440q81859p07231m12103
37447A567488k40796k59905l31096l08194j98831j22276j49607k10975j56436
37438d10628R1763M45778P26009Q34708Q29915Q14113P95859P09953N42530L61402
37428E741402K15250O9919j18775l10707m08828l74259k82272k54808l46226m98471
37418C432225o04779o11144n47358m63481l62313k10728N218K65048N39982Q03972
37408B246642J029374J206529J362969J527329J676786J761582J786660J824054
37400A4421925J926415K068341K202430K346043K579376K964744L480174M013035
37392C6002483M396946M462727M075754L153475J705010q9052j859676l213379
$$ y = [4868149, 4942925, 4958372, 4954642, 4933156, 4780925, 4335121, 3568681, 2686822, 1979591, 1567488, 1326692, 1066787, 735691, 427497, 228666, 106390, -43217, -254192, -410628, -318865, 126913, 852922, 1687630, 2517545, 3331658, 4127517, 4837470, 5380000, 5741402, 5956652, 6026571, 5907796, 5597089, 5188261, 4814002, 4531730, 4276922, 3930696, 3432225, 2827446, 2216302, 1668944, 1205463, 843150, 632422, 637640, 902688, 1442670, 2246642, 3276016, 4482545, 5845514, 7372843, 9049629, 10811211, 12597871, 14421925, 16348340, 18416681, 20619111, 22965154, 25544530, 28509274, 31989448, 36002483, 40399429, 44862156, 48937910, 52091385, 53796395, 53707343, 51847667, 48634288]
37384D8634288l981316m287907m355172m284120m054046l664344l190432k716622
37376A8100329k286159j919629j624003j375057j140243r29680p82290o95140
37368G348128o15126n15995m35091m06378l97931l51341k53805j34458j3773R8301
37358D322531J65485J40484L6427n1014k5911J09388K59460L38629L46699L33777
37348E975955L15401K55947J32091k7433j85432l48981n43786p49899r01894r56998
37338B964971r34388q78491q06470p04180n58262l79037j97577m5345O7398J53543
37328a317838K30130L10797M23375O04693Q37830J001586R33877N80799P7506
37319C682755l33187m71277l33546p2828J28805J89837J53836R9549N4589J3415
$$ y = [48634288, 44652972, 40365065, 36009893, 31725773, 27671727, 24007383, 20816951, 18100329, 15814170, 13894541, 12270538, 10895481, 9755238, 8825558, 8043268, 7348128, 6733002, 6217007, 5781916, 5375538, 4977607, 4626266, 4372461, 4238003, 4224230, 4322531, 4488016, 4628500, 4664927, 4613913, 4588002, 4697390, 4956850, 5295479, 5642178, 5975955, 6291356, 6547303, 6679394, 6651961, 6466529, 6117548, 5573762, 4823863, 3921969, 2964971, 2030583, 1152092, 345622, -358558, -916820, -1295857, -1493434, -1538779, -1471381, -1317838, -1087708, -776911, -353536, 251157, 1088987, 2090573, 3024450, 3605249, 3682755, 3349568, 2878291, 2544745, 2471917, 2600722, 2790559, 2944395, 3043944, 3098533, 3111948]
37309C111948o40M7380J27231J41699K4143j91009l98212m85466l80007j01612
37299A895455K04504L54795K98201J62427R4899J07012J21432J13044J18825J35667
37289C606261J01205j3952j65413l06024m43965o08245p96932r76157j093903
37280f97125j082842q92823n47891j46698K11912M85795O69590P52899P17577
37271e29606N57877K95748k292k24208k67417j17241J42157L92950N37398N09556
37261A294922L05939L1742j39624j04761Q5827K97102M27518M42377L52556K20781
37251C214379J54890K20644L54919M10854K98828O0861j80913l15623l02121j93166
37241C723552j12799j67683l55296n68606o88502o57937m89561k48898l0510R8234
$$ y = [3111948, 3111308, 3158688, 3285919, 3427618, 3451761, 3260752, 2862540, 2377074, 1997067, 1895455, 2099959, 2454754, 2752955, 2915382, 3010281, 3117293, 3238725, 3351769, 3470594, 3606261, 3707466, 3693514, 3528101, 3222077, 2778112, 2169867, 1372935, 396778, -697125, -1779967, -2672790, -3220681, -3367379, -3155467, -2669672, -2000082, -1247183, -529606, 28271, 324019, 321727, 97519, -169898, -287139, -144982, 247968, 785366, 1294922, 1600861, 1632603, 1492979, 1388218, 1474045, 1771147, 2198665, 2641042, 2993598, 3214379, 3369269, 3589913, 3944832, 4355686, 4654514, 4715375, 4534462, 4218839, 3916718, 3723552, 3610753, 3443070, 3087774, 2519168, 1830666, 1172729, 683168, 434270, 403760, 501994]
37231E01994J51231J95521K60179L04227K86402K31666K03899K32265K81956K81323
37221B930663J68533o3414l48891n91722p36176p81761p32786n78641l46268j26772
37211a207235J955O5873J64570L49754N64924P06899P20228O29482N06996M18686
37201B922132L79642L45741K53625P6436j55645l76951n18224n34402m31288k70906
37191A690160j32994o2777n8896r7373j41285j33696k6258J54733K90717K58593
37181A740924N0106k07324l56697l34807j91674o625J87412L86969N52627O02963
37171B423874M86630K34596p4982l74667o02654o76598n44526k76784m8634J3795
37161E60050n1356j08847q1678k412O3251Q3938N4865j2591o4364j7265J48375
$$ y = [501994, 653225, 848746, 1108925, 1413152, 1699554, 1931220, 2135119, 2367384, 2649340, 2930663, 3099196, 3035782, 2686891, 2095169, 1358993, 577232, -155554, -734195, -1080463, -1207235, -1205280, -1139407, -974837, -625083, -60159, 646740, 1366968, 1996450, 2503446, 2922132, 3301774, 3647515, 3901140, 3977576, 3821931, 3444980, 2926756, 2392354, 1961066, 1690160, 1557166, 1494389, 1435493, 1338120, 1196835, 1063139, 1036881, 1191614, 1482331, 1740924, 1791030, 1583706, 1227009, 892202, 700528, 693903, 881315, 1268284, 1820911, 2423874, 2910504, 3145100, 3070118, 2695451, 2092797, 1416199, 871673, 594889, 546255, 560050, 508694, 399847, 318169, 315757, 379008, 462946, 517811, 505220, 440856, 423591, 571966]
37150E71966L27801L71834K32152O88j90036k75298k74949k48244k45756k68101
37140B057k50569j21185R9040K83253L21730K38360J50920J38128J90882K73589
37130A326205L63241M17193L71954K19332M8175l2052N381R7577J59488J32467
37120C108961L224j74638k92070k68414j33070J970N0656J6427l4620l0043O5323
37109B313706K15348L17376K78305R8015j40734l54072m96514n40943m87677m06385
37099G96425m02368m98979n93423n70384m32131k79646j89887j50728r9337J5578
37089b404880K00747M08229N53128N65999M40506K37225O0234K1772J70256M11781
37079F64997N43931M29067J26474j86048l97671n16860n62724m92944k68121O9268
$$ y = [571966, 899767, 1271601, 1503753, 1504441, 1314405, 1039107, 764158, 515914, 270158, 2057, -248512, -369697, -270657, 12596, 334326, 572686, 723606, 861734, 1052616, 1326205, 1689446, 2106639, 2478593, 2697925, 2746100, 2714048, 2719429, 2817006, 2976494, 3108961, 3112185, 2937547, 2645477, 2377063, 2243993, 2245963, 2296619, 2313046, 2278426, 2248383, 2313706, 2529054, 2846430, 3124735, 3222750, 3082016, 2727944, 2231430, 1690487, 1202810, 796425, 394057, -104922, -698345, -1268729, -1700860, -1980506, -2170393, -2321121, -2420458, -2404880, -2204133, -1795904, -1242776, -676777, -236271, 954, 61188, 82960, 253216, 664997, 1208928, 1637995, 1764469, 1578421, 1180750, 663890, 101166, -391778, -659899, -590631]
37069e90631M12174O47944O86956M93812J36995k27320m67083n56518n31041m09507
37059d04219k10620m836J31552K15454L40861N41615P24000P68348O56326M59531
37049C218012K38634J1795j90112l07555l22730l02686l24911l75054l65015k54971
37039A025407j11881k7508j9692n1859j15809k31048l62698m06909k97038r3308
37029f92343O8909J05168L3692p4231j57168j86771j71731j53937j79696k58862
37019a666970l54095m08220l79121k64266j11282M935M0372J6596j9422n7388
37009c198861j11661j51823r7700Q3223L00119M02931L27338J57296L9217M3964
36999b205957J15281J46147R6903K8486J6621N4160O7546K3825k1211R68Q4678
$$ y = [-590631, -178457, 469487, 1156443, 1650255, 1787250, 1559930, 1092847, 536329, 5288, -404219, -614839, -619675, -488123, -272669, 68192, 609807, 1333807, 2102155, 2758481, 3218012, 3456646, 3468441, 3278329, 2970774, 2648044, 2345358, 2020447, 1645393, 1280378, 1025407, 913526, 886018, 866326, 814467, 698658, 467610, 104912, -301997, -599035, -692343, -623434, -518266, -484574, -558805, -715973, -902744, -1074475, -1228412, -1408108, -1666970, -2021065, -2429285, -2808406, -3072672, -3183954, -3179019, -3138647, -3122051, -3141473, -3198861, -3310522, -3462345, -3560045, -3476822, -3176703, -2773772, -2446434, -2289138, -2249921, -2205957, -2090676, -1944529, -1847626, -1819140, -1802519, -1748359, -1680813, -1656988, -1678199, -1677231, -1592553]
36988a592553J72250K35264K86266L19666K95191J95666N9838o9518k02758l77513
36978f78201n89974p79419q72179q16789n90662k18033K05532N46444P29263P90960
36968b273058Q13162Q10857P27605N47546L62741K81823K87076K38080L6767k49456
36958A583143m60893n15969m67226m02682l52024l11134l03803l57010m26308
36949b013906m08729k56975m4255J20880K23014L37303M99512O32120O35554N22946
36939B47464M11237L76314L64760K72583P3342j73937m22181o81851r55144j172457
36929a659870j233512j095588p93866l94687K8295L76697N46709N12161L74373
36920c339288K87640L19801M00834M18143L50974K96281L61615N41739P07597
$$ y = [-1592553, -1420303, -1185039, -898773, -579107, -283916, -88250, -28412, -97930, -300688, -678201, -1268175, -2047594, -2919773, -3736562, -4327224, -4545257, -4339725, -3793281, -3064018, -2273058, -1459896, -649039, 78566, 626112, 988853, 1270676, 1557752, 1795832, 1832599, 1583143, 1122250, 606281, 139055, -263627, -615651, -926785, -1230588, -1587598, -2013906, -2422635, -2679610, -2723865, -2602985, -2379971, -2042668, -1543156, -911036, -275482, 247464, 658701, 1035015, 1399775, 1672358, 1745700, 1571763, 1149582, 467731, -487413, -1659870, -2893382, -3988970, -4782836, -5177523, -5149228, -4772531, -4225822, -3713661, -3339288, -3051648, -2731847, -2331013, -1912870, -1561896, -1265615, -904000, -362261, 345336]
36911C45336P17177N34986K46241l1011k30864l44464l77543l35860k44865j49489
36901A29644q3156n8421r4296k17175m04704n55090n60850m14808k07529k0802
36891b487187J32029K54741L20624L17735K95660L08084L32738L09593K45197
36882B9214K09096K21479K17394J50070O5090K7870L0764K7681J9470L8237P2125
36871A108490P9588P3268J14679K05428K44886J34451j06361l52471m78845m45357
36861E77756l17027k24251k67495m24228n62843n68324m38212k46484n2573J21334
36851b402347K55815L27665L33103K86220K03091J13806P0146R9378J62617K09708
36841c40798K75706M65125Q12888J196250J413618J333362R58538L92339k14587
$$ y = [345336, 1062513, 1597499, 1843740, 1812729, 1581865, 1237401, 859858, 523998, 279133, 129644, 46488, -11933, -106229, -323404, -728108, -1283198, -1844048, -2258856, -2466385, -2487187, -2355158, -2100417, -1779793, -1462058, -1166398, -858314, -525576, -215983, 29214, 238310, 459789, 677183, 827253, 892343, 920213, 950977, 978658, 998128, 1036365, 1108490, 1188078, 1261346, 1376025, 1581453, 1826339, 1960790, 1854429, 1501958, 1023113, 577756, 260729, 36478, -231017, -655245, -1218088, -1786412, -2224624, -2471108, -2523681, -2402347, -2146532, -1818867, -1485764, -1199544, -996453, -882647, -812501, -713123, -550506, -340798, -65092, 400033, 1212921, 2409171, 3822789, 5156151, 6114689, 6507028, 6292441]
36832F292441p04936r67271r85902q39571o44997m92684m13193l81694l56413
36823E05780l24387l03624k89111k14893q068L09271O03228P41503P12911O10596
36813B343206N09600M04445K78399J81452J82728K59514K97749K23028Q1307m4857
36803D716571j55950l13752n20521o86678p30217o59833n44503m45669l99418
36794B60030m15757m52352m19819k64540m0726J35403K01241J93770J94153K61665
36784c46932M11079O02879P39103P11593M92138J65792j42536l61683m81458m95112
36774A294863l83758j70808M5740J59654J60462J41454J84058K54374K47263J25351
36764B058653k9574j16020j17778p6129M29J34335K97405M00786L89364K98806
$$ y = [6292441, 5587505, 4620234, 3634332, 2794761, 2149764, 1657080, 1243887, 862193, 505780, 181393, -122231, -411342, -626235, -634303, -325032, 278196, 1019699, 1732610, 2343206, 2852806, 3257251, 3535650, 3717102, 3899830, 4159344, 4457093, 4680121, 4761428, 4716571, 4560621, 4246869, 3726348, 3039670, 2309453, 1649620, 1105117, 659448, 260030, -155727, -608079, -1027898, -1292438, -1333164, -1197761, -996520, -802750, -608597, -346932, 64147, 667026, 1406129, 2117722, 2609860, 2775652, 2633116, 2271433, 1789975, 1294863, 911105, 740297, 786037, 945691, 1106153, 1247607, 1431665, 1686039, 1933302, 2058653, 2029079, 1913059, 1795281, 1719152, 1719581, 1853916, 2151321, 2552107, 2941471, 3240277]
36754C240277J93513R1899j3360j03593j54974j87105k34779k79735k67065j95683
36744B089395j38488j51366k07438k53128k92719l72997n00191o13562o39080
36735a079574n38376l08931K3847L96953P15729Q92952Q84662O95883L77433K6620
36725B087198k38854l44965l06090j94645p1639L5502R4848N2000j15160l33526
36715F64669m66720m36162l02514k07922k37752l53887m61735n13983n27325n17038
36705c360369m57535l22049j34367M5991J81284K72930L22673L06956K10293O9338
36695b864855m2510p5778l1236P5035K41258M49180O24640O76651N91609M57814
36685A01808L71339L37039K89192J89988O5073n3431j66030k66636l09882k62788
$$ y = [3240277, 3433790, 3525689, 3512329, 3408736, 3253762, 3066657, 2831878, 2552143, 2285078, 2089395, 1950907, 1799541, 1592103, 1338975, 1046256, 673259, 173068, -440494, -1079574, -1617950, -1926881, -1903034, -1506081, -790352, 102600, 987262, 1683145, 2060578, 2087198, 1848344, 1503379, 1197289, 1002644, 931005, 966507, 1061355, 1113355, 998195, 664669, 197949, -238213, -540727, -748649, -986401, -1340288, -1802023, -2316006, -2843331, -3360369, -3817904, -4139953, -4274320, -4228329, -4047045, -3774115, -3451442, -3144486, -2934193, -2864855, -2907365, -2983143, -3014379, -2939344, -2698086, -2248906, -1624266, -947615, -356006, 101808, 473147, 810186, 1099378, 1289366, 1354439, 1301008, 1134978, 868342, 558460, 295672]
36675B95672j67990j04788q4448k7715J33116L57063N25663N61722M97154M24999
36665B410448L99580L89985L27758J92125L4752q8629j94406l45794n46312o98063
36655A881444p00251n69142m17729l21773k55566j74284j06716j19380k16799
36646a000196l34581m28647n17679o23129p13577p33922o52555m53348j26252
36637e583886K82519O38839Q04781P59586N95951M03047K05410J5539j22325j69723
36627b170262j26133R03K04233M22468N36039M76094L02180J21599k8713j62653
36617d24245k55299k60716j96426j16321o871J85753M10916N09701M10285K35932
36607D92709J47648J54535J62717J45395J51547J74778J35490J3769r5129j00826
$$ y = [295672, 127682, 22894, -61554, -89269, 43847, 400910, 926573, 1488295, 1985449, 2410448, 2810028, 3200013, 3527771, 3719896, 3754648, 3666019, 3471613, 3125819, 2579507, 1881444, 1181193, 612051, 194322, -127451, -383017, -557301, -664017, -783397, -1000196, -1334777, -1763424, -2281103, -2904232, -3617809, -4351731, -5004286, -5457634, -5583886, -5301367, -4662528, -3857747, -3098161, -2502210, -2099163, -1893753, -1878214, -2000539, -2170262, -2296395, -2295492, -2091259, -1668791, -1132752, -656658, -354478, -232879, -261592, -424245, -679544, -940260, -1136686, -1253007, -1259878, -1074125, -663209, -153508, 256777, 492709, 640357, 794892, 957609, 1103004, 1254551, 1429329, 1564819, 1578588, 1483459, 1382633]
36597A382633k8493L6572O7637J05314J67891K04569J53111K6187q0650q5256
36587A949515k5170l7917k08760m63365o52849p23038p37818p43387o95261n53452
36577b891502l73855k36334j24527M6631K97779N49264P20099P96018P80796O46980
36567B11349L87845Q3502j46113k55560l00923l48918m00634m23489m15726l89677
36557a998344l06184r1924K43579N45675O25009M38449J32581r9500j83310j83848
36547h77817j94966k30993k14573n4723K52880N90048P95185Q01435O92780O07215
36537B166471N93028N83386N03909L64127K24167J04644k8015j91792l48647m58678
36527C512600n51172p02128r31111j143694j198319j030834p06393l53626n7803
$$ y = [1382633, 1354140, 1390712, 1458349, 1563663, 1731554, 1936123, 2089234, 2115421, 2034771, 1949515, 1924345, 1886428, 1677668, 1214303, 561454, -161584, -899402, -1642789, -2338050, -2891502, -3265357, -3501691, -3626218, -3579587, -3281808, -2732544, -2012445, -1216427, -435631, 211349, 599194, 682696, 536583, 281023, -19900, -368818, -769452, -1192941, -1608667, -1998344, -2304528, -2396452, -2152873, -1607198, -982189, -543740, -411159, -510659, -693969, -877817, -1072783, -1303776, -1518349, -1573072, -1320192, -730144, 65041, 866476, 1559256, 2166471, 2759499, 3342885, 3846794, 4210921, 4435088, 4539732, 4511717, 4319925, 3971278, 3512600, 2961428, 2259300, 1328189, 184495, -1013824, -2044658, -2751051, -3104677, -3162480]
36518c162480J81336L96361N68924O13900M61308J52249j68837l70335m27751
36509a755325l94496l11028j80796j9685J25527K24260K88909L30309L15383K00417
36499a176525n276k29452l79639l87150k42782k3959J38252J73617J58859K44450
36489a729605M76687P23826P99526O34812L08274n9472l90236o30382p08173n63306
36479a138049k23956J74989M73882N90410N42822L97725K24574R0539M6521Q3343
36469A262800J25778J06401L3925m2875j19331k29435l56420m10757l25621j28718
36459h4253J11045L55829N64170O32381M67052J27993j76654k77211j84303k2927
36449A513122J18377K24418K87822K90341K53589K40339K71922K83500K00058
$$ y = [-3162480, -2981144, -2584783, -2015859, -1401959, -940651, -788402, -957239, -1327574, -1755325, -2149821, -2460849, -2641645, -2661330, -2535803, -2311543, -2022634, -1692325, -1376942, -1176525, -1181801, -1411253, -1790892, -2178042, -2420824, -2444783, -2306531, -2132914, -1974055, -1729605, -1252918, -529092, 270434, 905246, 1213520, 1154048, 763812, 133430, -574743, -1138049, -1362005, -1187016, -713134, -122724, 420098, 817823, 1042397, 1132936, 1179457, 1262800, 1388578, 1494979, 1528904, 1486029, 1366698, 1137263, 780843, 370086, 44465, -84253, 26792, 382621, 946791, 1579172, 2046224, 2174217, 1997563, 1720352, 1536049, 1513122, 1631499, 1855917, 2143739, 2434080, 2687669, 2928008, 3199930, 3483430, 3683488]
36440C683488L8955r8998j37955r8561n7664o3038j03975j46315j63277j27024
36430B725636m847J97967L93419M47423K90176j5884l31978n58865o86665p48098
36420A708284p55030o88680n35768l26699j41316o3676j06508j80424j61482K357
36410a248942K58426N03867O39473N88578L38146j375k31499k27377n6606J01949
36400F64640J42638R6038L1420l3753j14189k05483k86658l43663l68152l61056
36390g78218l54272l91023m53659m43519k78031J455K52656L57882L02135J41653
$$ y = [3683488, 3722443, 3623445, 3485490, 3386929, 3329265, 3266227, 3162252, 3015937, 2852660, 2725636, 2720789, 2918756, 3312175, 3759598, 4049774, 4033890, 3701912, 3143047, 2456382, 1708284, 953254, 264574, -271194, -597893, -739209, -802885, -909393, -1089817, -1251299, -1248942, -990516, -486649, 152824, 741402, 1079548, 1078173, 846674, 619297, 562691, 664640, 807278, 903316, 934736, 900983, 786794, 581311, 294653, -49010, -417162, -778218, -1132490, -1523513, -1977172, -2420691, -2698722, -2697267, -2444611, -2086729, -1784594, -1642941]
$$ [...]
##END NTUPLES=NMR SPECTRUM
##END=
