##TITLE=31Pdec_DE-1r_TFA
 DMSO-d6
  24 sc
 22.11.2023
##JCAMPDX= 6.0         $$ Bruker NMR JCAMP-DX V2.0
##DATA TYPE= NMR SPECTRUM
##DATA CLASS= NTUPLES
##ORIGIN= UXNMR, Bruker Analytische Messtechnik GmbH
##OWNER= root
$$ XWIN-NMR		Version 3.5
$$ Wed Nov 22 12:16:27 2023 Russian Standard Time (UT+4h)  she@DPX200
##.OBSERVE FREQUENCY= 81.013821
##.OBSERVE NUCLEUS= ^31P
##.ACQUISITION MODE= SIMULTANEOUS
##.ACQUISITION SCHEME= undefined
##.AVERAGES= 24
##.DIGITISER RES= 16
##SPECTROMETER/DATA SYSTEM= spect
##.PULSE SEQUENCE= zgpg30
##.SOLVENT NAME= CDCl3
##.SHIFT REFERENCE= (INTERNAL, CDCl3, 0, 248.564)
##AUDIT TRAIL= $$ (NUMBER, WHEN, WHO, WHERE, WHAT)
$$ ##TITLE= Audit trail, XWIN-NMR		Version 3.5
$$ ##JCAMPDX= 5.01
$$ ##ORIGIN= Bruker BioSpin GmbH
$$ ##OWNER= she
$$ F:/spectra/data/she/nmr/P31/1/pdata/1/auditp.txt
$$ ##AUDIT TRAIL=  $$ (NUMBER, WHEN, WHO, WHERE, WHAT)
(   1,<2023-11-22 12:15:00.06 +0400>,<she>,<DPX200>,
      <created by zg, POWCHK disabled, PULCHK disabled
       configuration hash MD5:
       00 E9 B6 7A A2 85 ED C7 34 08 36 98 17 FE 4E 26
       data hash MD5: 32K
       C5 79 4B EE 62 E6 68 E2 14 15 91 33 D6 F1 74 51>)
(   2,<2023-11-22 12:15:06.53 +0400>,<she>,<DPX200>,
      <Start of raw data processing
       efp BC_mod = 2 LB = 10 FT_mod = 6 PKNL = 1 PHC0 = -11382.09 PHC1 = 124.4937 SI = 64K 
       data hash MD5: 64K
       49 1F B9 8C 3A 90 B3 F7 1C E5 5A 8D FA 12 A9 44>)
(   3,<2023-11-22 12:15:29.75 +0400>,<she>,<DPX200>,
      <pk PHC0 = 7.393333 PHC1 = -81.79998 
       data hash MD5: 64K
       06 56 58 D6 C3 F2 E9 37 6B 55 8F A2 4F 78 94 92>)
(   4,<2023-11-22 12:15:51.89 +0400>,<she>,<DPX200>,
      <pk PHC0 = -1.279338 PHC1 = -2.8 
       data hash MD5: 64K
       7F 3D 21 66 87 B1 FF D9 95 9C 73 39 36 EA 80 4B>)
(   5,<2023-11-22 12:15:56.09 +0400>,<she>,<DPX200>,
      <abs ABSG = 5 
       data hash MD5: 64K
       FC 3B AC 60 83 27 79 60 9D F2 73 3D 05 F1 BC C5>)
$$ ##END=
$$ 
$$ hash MD5
$$ 3F C5 90 3E A7 3C 3C 17 FE 81 6C A9 85 42 47 D9
##$RELAX= 
##$RELAX= 
##$RELAX= 
##$RELAX= 
##$RELAX= 
##$RELAX= 
##$RELAX= 
##$RELAX= 
##$RELAX= 
$$ Bruker specific parameters
$$ --------------------------
##$DU= <F:/spectra>
##$EXPNO= 1
##$NAME= <P31>
##$PROCNO= 1
##$TYPE= <nmr>
##$USER= <she>
##$AMP= (0..31)
100 100 100 100 100 100 100 100 100 100 100 100 100 100 100 100 100 100 
100 100 100 100 100 100 100 100 100 100 100 100 100 100 
##$AQSEQ= 0
##$AQ_mod= 1
##$AUNM= <au_zg>
##$AUTOPOS= <>
##$BF1= 81.014009
##$BF2= 200.13
##$BF3= 200.13
##$BF4= 200.13
##$BF5= 200.13
##$BF6= 200.13
##$BF7= 200.13
##$BF8= 200.13
##$BYTORDA= 1
##$CFDGTYP= 0
##$CFRGTYP= 5
##$CHEMSTR= <none>
##$CNST= (0..31)
1 1 145 1 1 1 1 1 1 1 1 1 1 1 1 1 1 1 1 1 1 1 1 1 1 1 1 1 1 1 1 1 
##$CPDPRG= <waltz16>
##$CPDPRG1= <>
##$CPDPRG2= <waltz16>
##$CPDPRG3= <>
##$CPDPRG4= <mlev>
##$CPDPRG5= <mlev>
##$CPDPRG6= <mlev>
##$CPDPRG7= <mlev>
##$CPDPRG8= <mlev>
##$CPDPRGB= <>
##$CPDPRGT= <>
##$D= (0..31)
$$ [...]
##$SUBNAM3= <"">
##$SUBNAM4= <"">
##$SUBNAM5= <"">
##$SUBNAM6= <"">
##$SUBNAM7= <"">
##$SUBNAM8= <"">
##$SUBNAM9= <"">
##$SW= 501.771253377433
##$SWIBOX= (0..15)
0 1 3 0 0 0 0 0 0 0 0 0 0 0 0 0 
##$SW_h= 40650.406504065
##$TD= 32768
##$TD0= 1
##$TE= 0
##$TE2= 300
##$TE3= 300
##$TEG= 300
##$TL= (0..7)
0 120 53 12 22 120 120 120 
##$TP= (0..7)
150 150 150 150 150 150 150 150 
##$TP07= 0
##$TPNAME0= <>
##$TPNAME1= <>
##$TPNAME2= <>
##$TPNAME3= <>
##$TPNAME4= <>
##$TPNAME5= <>
##$TPNAME6= <>
##$TPNAME7= <>
##$TPOAL= (0..7)
0.5 0.5 0.5 0.5 0.5 0.5 0.5 0.5 
##$TPOFFS= (0..7)
0 0 0 0 0 0 0 0 
##$TUNHIN= 0
##$TUNHOUT= 0
##$TUNXOUT= 0
##$USERA1= <user>
##$USERA2= <user>
##$USERA3= <user>
##$USERA4= <user>
##$USERA5= <user>
##$V9= 5
##$VALIST= <valist>
##$VCLIST= <CCCCCCCCCCCCCCC>
##$VD= 0
##$VDLIST= <DDDDDDDDDDDDDDD>
##$VPLIST= <PPPPPPPPPPPPPPP>
##$VTLIST= <TTTTTTTTTTTTTTT>
##$WBST= 1024
##$WBSW= 4
##$XGAIN= (0..3)
0 0 0 0 
##$XL= 0
##$YL= 0
##$YMAX_a= 2363
##$YMIN_a= -2548
##$ZGOPTNS= <>
##$ZL1= 120
##$ZL2= 120
##$ZL3= 120
##$ZL4= 120
##$ABSF1= 248.5645
##$ABSF2= -253.2056
##$ABSG= 5
##$ABSL= 3
##$ALPHA= 0
##$AQORDER= 0
##$ASSFAC= 0
##$ASSFACI= 0
##$ASSFACX= 0
##$ASSWID= 0
##$AUNMP= <proc_1d>
##$AZFE= 0.1
##$AZFW= 0.5
##$BCFW= 0
##$BC_mod= 2
##$BYTORDP= 0
##$COROFFS= 0
##$CY= -3
##$DATMOD= 1
##$DC= 0
##$DFILT= <>
##$DTYPP= 0
##$F1P= 0
##$F2P= 0
##$FCOR= 1
##$FTSIZE= 65536
##$FT_mod= 6
##$GAMMA= 0
##$GB= 0
##$INTBC= 1
##$INTSCL= 6.047779e-11
##$ISEN= 30
##$LB= 10
##$LEV0= 0
##$LPBIN= 0
##$MAXI= 10000
##$MC2= 0
##$MEAN= 0
##$ME_mod= 0
##$MI= 50
##$NCOEF= 0
##$NC_proc= -9
##$NLEV= 6
##$NOISF1= 182.463
##$NOISF2= 159.3651
##$NSP= 0
##$NTH_PI= 0
##$NZP= 0
##$OFFSET= 248.5645
##$PC= 4
##$PHC0= -11375.98
##$PHC1= 39.89372
##$PH_mod= 1
##$PKNL= yes
##$PPARMOD= 0
##$PSCAL= 0
##$PSIGN= 0
##$REVERSE= no
##$SF= 81.0140089999694
##$SI= 65536
##$SIGF1= 159.3651
##$SIGF2= -187.1042
##$SINO= 113.3802
##$SIOLD= 16384
##$SREGLST= <1H.CDCl3>
##$SSB= 0
##$STSI= 65536
##$STSR= 0
##$SW_p= 40650.406504065
##$SYMM= 0
##$S_DEV= 0
##$TDeff= 32768
##$TDoff= 0
##$TI= <>
##$TILT= no
##$TM1= 0
##$TM2= 0
##$TOPLEV= 0
##$USERP1= <user>
##$USERP2= <user>
##$USERP3= <user>
##$USERP4= <user>
##$USERP5= <user>
##$WDW= 1
##$XDIM= 65536
##$YMAX_p= 315699463
##$YMIN_p= -12480161
$$ End of Bruker specific parameters
$$ ---------------------------------
##NTUPLES= NMR SPECTRUM
##VAR_NAME=  FREQUENCY,     SPECTRUM/REAL,   SPECTRUM/IMAG
##SYMBOL=    X,             R,               I
##VAR_TYPE=  INDEPENDENT,   DEPENDENT,       DEPENDENT
##VAR_FORM=  AFFN,          ASDF,            ASDF
##VAR_DIM=   65536,         65536,           65536
##UNITS=     HZ,            ARBITRARY UNITS, ARBITRARY UNITS
##FACTOR=    0.620285442955139, 1,           1
##FIRST=     20137.2065510682, 0,            0
##LAST=      -20513.1999529968, 0,           0
##MIN=       -20513.1999529968, -12480161,   0
##MAX=       20137.2065510682, 315699463,    0
$$ Real data points
##PAGE= N=1
##DATA TABLE= (X++(R..R)), XYDATA
$$ [...]
42119d316497J30569J54353J78817K02944K24850K40555K44847K34385K09915
$$ -4316497 -4185928 -4031575 -3852758 -3649814 -3424964 -3184409 -2939562 -2705177 -2495262
42110b495262J74857J32063Q3201L1714j5389n0896p3404q9131j07264j33489
$$ -2495262 -2320405 -2188342 -2105141 -2073427 -2088816 -2139712 -2213116 -2302247 -2409511 -2543000
42100b543000j67398k03872k35335k53667k53108k33377j99872j59696j16852
$$ -2543000 -2710398 -2914270 -3149605 -3403272 -3656380 -3889757 -4089629 -4249325 -4366177
42091d366177p1058k0784L2612Q2860J20003J34077J19273P6082J0042p1652j62812
$$ -4366177 -4437235 -4458019 -4425407 -4342547 -4222544 -4088467 -3969194 -3893112 -3883070 -3954722 -4117534
42080d117534k58392l52700m37838n04234n43610n52626n34178m94631m38864
$$ -4117534 -4375926 -4728626 -5166464 -5670698 -6214308 -6766934 -7301112 -7795743 -8234607
42071h234607l67298k77107j65970l5088J09852K59079M00058N20106O09914O66195
$$ -8234607 -8601905 -8879012 -9044982 -9080070 -8970218 -8711139 -8311081 -7790975 -7181061 -6514866
42061f514866O91676O92630O75630O45112O02790N48916M84475M12566L37616
$$ -6514866 -5823190 -5130560 -4454930 -3809818 -3207028 -2658112 -2173637 -1761071 -1423455
42052a423455K62932J88484J10691K4563p2525j77329k79873l66638m26275m54009
$$ -1423455 -1160523 -972039 -861348 -836785 -909310 -1086639 -1366512 -1733150 -2159425 -2613434
42042b613434m51868m25471l80374l20205k46845j61720o7312L2031J30682K23050
$$ -2613434 -3065302 -3490773 -3871147 -4191352 -4438197 -4599917 -4667229 -4635198 -4504516 -4281466
42032d281466L03955L67394M05244M08465L71335K96320J95990R0220n5n9431
$$ -4281466 -3977511 -3610117 -3204873 -2796408 -2425073 -2128753 -1932763 -1842543 -1842598 -1902029
42022a902029q2114p1950l8477Q876O4957J28621J99044K72870L45105M12101
$$ -1902029 -1984143 -2056093 -2094570 -2085694 -2020737 -1892116 -1693072 -1420202 -1075097 -662996
42012f62996M72331N23767N60951N75465N60108N13844M44404L66927K99009K54008
$$ -662996 -190665 333102 894053 1469518 2029626 2543470 2987874 3354801 3653810 3907818
42002C907818K35698K36675K41504K33444K02243J49172Q6259K9951o735j9070
$$ 3907818 4143516 4380191 4621695 4855139 5057382 5206554 5292813 5322764 5316029 5296959
41992E296959j0625J0349L5813O1631Q7749J14770J39918J56122J54861J29746
$$ 5296959 5286334 5296683 5332496 5394127 5481876 5596646 5736564 5892686 6047547 6177293
41982F177293P8165J030r7754k11384l30109m41438n31100n85373n94526n55634
$$ 6177293 6255458 6256488 6158734 5947350 5617241 5175803 4644703 4059330 3464804 2909170
41972B909170m72676l53980k09258m8782J14995K65609L83626M51610M60889M15833
$$ 2909170 2436494 2082514 1873256 1824474 1939469 2205078 2588704 3040314 3501203 3917036
41962C917036L32626K32902J35651N1556j7562p4966j24229j66899k02998k32174
$$ 3917036 4249662 4482564 4618215 4669771 4652209 4577243 4453014 4286115 4083117 3850943
41952C850943k53631k65441k64703k48857k17052j70622j12939m9264J3198O5608
$$ 3850943 3597312 3331871 3067168 2818311 2601259 2430637 2317698 2268434 2281632 2347240
41942B347240R9548J11016J04007R0023Q2488Q9872J12459J43834J74638J96206
$$ 2347240 2446788 2557804 2661811 2751834 2834322 2924194 3036653 3180487 3355125 3551331
41932C551331K03703J98008J84472J68300J49914J24250Q4179K5030n2573j42024
$$ 3551331 3755034 3953042 4137514 4305814 4455728 4579978 4664157 4689187 4636614 4494590
41922D494590k31973l09397l63652l89597l88386l66148l31809k94481k60880
$$ 4494590 4262617 3953220 3589568 3199971 2811585 2445437 2113628 1819147 1558267
41913A558267k33497k10605j88022j61402j27945q7349m2098K874M1361O8236
$$ 1558267 1324770 1114165 926143 764741 636796 549447 507349 510223 551584 619820
41903F19820Q2212Q7431R1690J01214J15122J24328J16537Q3962K8172m0547j07775
$$ 619820 702032 789463 881153 982367 1097489 1221817 1338354 1422316 1450488 1409941 1302166
41892A302166j60099j88945j92532j75589j46732j14737q5690o2222m3945k7864
$$ 1302166 1142067 953122 760590 585001 438269 323532 237842 175620 131675 103811
41882A03811q657J9912O2096J17084J78127K34734K76460K95591K87732K51470
$$ 103811 95154 115066 177162 294246 472373 707107 983567 1279158 1566890 1818360
41872A818360J88641J04996R693q6799j75122k48290l02080l35457l50982l54171
$$ 1818360 2007001 2111997 2121690 2034891 1859769 1611479 1309399 973942 622960 268789
41862B68789l51588l48855l49475l54069l59429l58259l41267l01386k37524j54975
$$ 268789 -82799 -431654 -781129 -1135198 -1494627 -1852886 -2194153 -2495539 -2733063 -2888038
41852b888038o2221L3354J27967K20957L12248L99437M76092N32433N58695N49999
$$ -2888038 -2950259 -2916905 -2788938 -2567981 -2255733 -1856296 -1380204 -847771 -289076 260923
41842B60923N10058M50842L87860L33777K94305K68321K50909K36535K20841K01241
$$ 260923 770981 1221823 1609683 1943460 2237765 2506086 2756995 2993530 3214371 3415612
41832C415612J76638J46018J06165N0404k9463j38273k72816m20712n63614o82782
$$ 3415612 3592250 3738268 3844433 3894837 3865374 3727101 3454285 3033573 2469959 1787177
41822A787177p64262q01838p97079p56986o90523o05787n08481m01745k87237
$$ 1787177 1022915 221077 -576002 -1332988 -2023511 -2629298 -3137779 -3539524 -3826761
41813c826761j67358m7832O1456J48840K05569K29620K26013K03779J72284J39367
$$ -3826761 -3994119 -4041951 -3980495 -3831655 -3626086 -3396466 -3170453 -2966674 -2794390 -2655023
41803b655023J11232R1913Q1188P2607N5019J8517l8435j05892j66174k02418
$$ -2655023 -2543791 -2451878 -2370690 -2298083 -2243064 -2224547 -2262982 -2368874 -2535048 -2737466
41793b737466k06638j82152j39332q8479l5481J7360O8089J13345J48736J69045
$$ -2737466 -2944104 -3126256 -3265588 -3354067 -3389548 -3372188 -3304099 -3190754 -3042018 -2872973
41783b872973J67760J38273P8125o883j03115j94484k68490l18517l42013l37714
$$ -2872973 -2705213 -2566940 -2488815 -2495698 -2598813 -2793297 -3061787 -3380304 -3722317 -4060031
41773d060031l04964k45834j67659q2651l362O3295J18752J69739K21726K73711
$$ -4060031 -4364995 -4610829 -4778488 -4861139 -4864501 -4801206 -4682454 -4512715 -4290989 -4017278
41763d017278L18172L46276L54950L50590L45897L51759L70481L95761M18587
$$ -4017278 -3699106 -3352830 -2997880 -2647290 -2301393 -1949634 -1579153 -1183392 -764805
41754g64805M33244M38839M37220M30802M22122M13735M07083M01093L92024L74711
$$ -764805 -331561 107278 544498 975300 1397422 1811157 2218240 2619333 3011357 3386068
41744C386068L44295K98080K37563J69548J04470N1840J5856n586j8433k9351
$$ 3386068 3730363 4028443 4266006 4435554 4540024 4591864 4607720 4602134 4583701 4554350
41734D554350m4213o7846j03947j54668k19970k96474l76182m46484m92967n04251
$$ 4554350 4510137 4442291 4338344 4183676 3963706 3667232 3291050 2844566 2351599 1847348
41724A847348m76438m14804l31930k43075j60795r1417l5259R906M4526O4689
$$ 1847348 1370910 956106 624176 381101 220306 128889 93630 103536 148062 212751
41714B12751O2861L1909k9211j11417j96256k61998k91809k79651k31250j60163
$$ 212751 275612 307521 278310 166893 -29363 -291361 -583170 -862821 -1094071 -1254234
41704a254234q1210m615O5755J29270J83618K22861K40211K32652K03293J60321
$$ -1254234 -1335444 -1340059 -1274304 -1145034 -961416 -738555 -498344 -265692 -62399 97922
41694I7922J14649P8011O0885O9284J01562J47819J92975K21930K24341J97592
$$ 97922 212571 290582 351467 420751 522313 670132 863107 1085037 1309378 1506970
41684A506970J47427Q6040K7886j5094l6729l7280k2077Q85K3748M1507N3440
$$ 1506970 1654397 1740437 1768323 1753229 1716500 1679220 1657143 1658028 1681776 1723283 1776723
41673A776723O2219P1010Q0602Q9006R3853R5252R5984R8672J02871J05135J01891
$$ 1776723 1838942 1909952 1990554 2079560 2173413 2268665 2364649 2463321 2566192 2671327 2773218
41662B773218R2218P8567O6121O1809P2628J02661J50038K06165K57819K90727
$$ 2773218 2865436 2944003 3010124 3071933 3144561 3247222 3397260 3603425 3861244 4151971
41652D151971K93060K58280J86869Q6132l1958j53472k64679l54029m14598m45800
$$ 4151971 4445031 4703311 4890180 4976312 4944354 4790882 4526203 4172174 3757576 3311776
41642C311776m52434m41087m16475l80323l32730k74357k07938j38436p1885j3362
$$ 3311776 2859342 2418255 2001780 1621457 1288727 1014370 806432 667996 596111 582749
41632E82749L4686P2999J04855J34822J66934K02651K39881K74412L03056L25672
$$ 582749 617435 690434 795289 930111 1097045 1299696 1539577 1813989 2117045 2442717
41622B442717L44108L59075L67783L64340L42484K98772K34408J55026O9312j2480
$$ 2442717 2786825 3145900 3513683 3878023 4220507 4519279 4753687 4908713 4978025 4965545
41612D965545q0168j26491j50566j58760j60375j60548j56602j41889j13785p8613
$$ 4965545 4885377 4758886 4608320 4449560 4289185 4128637 3972035 3830146 3716361 3637748
41602C637748m8980l6030m2901o3961q9491j11763j28423j41556j53991j65617
$$ 3637748 3588768 3552738 3509837 3445876 3356385 3244622 3116199 2974643 2820652 2655035
41592B655035j72065j66251j41727r6027l2422M0226J09069J59664J79154J59889
$$ 2655035 2482970 2316719 2174992 2078965 2046543 2086769 2195838 2355502 2534656 2694545
41582B694545J02295J5244q6721j88025k75909l41934l81683l94427l83537l56371
$$ 2694545 2796840 2812084 2725363 2537338 2261429 1919495 1537812 1143385 759848 403477
41572D03477l22198k88748k60024k36653k17530k00302j80654j52725j12374o1465
$$ 403477 81279 -207469 -467493 -704146 -921676 -1121978 -1302632 -1455357 -1567731 -1629196
41562a629196r371L0514M7345L8102Q101l2933p5858j14566j45019j62914j62791
$$ -1629196 -1638567 -1608053 -1560708 -1522606 -1514505 -1547438 -1623296 -1737862 -1882881 -2045795 -2208586
41551b208586j39842r2782k4909N8066J51479K52631L57614M57018N35372N76007
$$ -2208586 -2348428 -2441210 -2466119 -2408053 -2256574 -2003943 -1646329 -1189311 -653939 -77932
41541g7932N68177N11660M16797L01078J84563Q5445J6270j8865k5374j6277o999
$$ -77932 490245 1001905 1418702 1719780 1904343 1989788 2006058 1987193 1961819 1945542 1938543
41530A938543q732k4204m8556p4376r6785j15188j31570j47507j62564j75326
$$ 1938543 1929811 1905607 1857051 1782675 1685890 1570702 1439132 1291625 1129061 953735
41520I53735j86604k02229k32362k86546l67245m66190n65731o44335o83365o72148
$$ 953735 767131 564902 332540 45994 -321251 -787441 -1353172 -1997507 -2680872 -3353020
41510c353020o09181m99622l51903j76771J1132J92900L49094M65996N39760N75547
$$ -3353020 -3962201 -4461823 -4813726 -4990497 -4979365 -4786465 -4437371 -3971375 -3431615 -2856068
41500b856068N82977N70991N44380N02969M43789L65343K71309J70822P5111o711
$$ -2856068 -2273091 -1702100 -1157720 -654751 -210962 154381 425690 596512 671623 664912
41490F64912o9307j09393j23046j05440n4356K4816J16881K00206K54499K68707
$$ 664912 595605 486212 363166 257726 203370 228186 345067 545273 799772 1068479
41480A068479K44976J97319J46232J11807J07606J37127J93866K64650L34471
$$ 1068479 1313455 1510774 1657006 1768813 1876419 2013546 2207412 2472062 2806533
41471B806533L90459M23774M29890M08641L64445L05767K43080J86002J41236
$$ 2806533 3196992 3620766 4050656 4459297 4823742 5129509 5372589 5558591 5699827
41462E699827J12005R7942R4599R2946Q0366M3816k5715j29513k59968m02292
$$ 5699827 5811832 5909774 6004373 6097319 6177685 6221501 6195786 6066273 5806305 5404013
41452E404013n37703o46309p09483p13115o52111n33682l75971k01808l1503J21018
$$ 5404013 4866310 4220001 3510518 2797403 2145292 1611610 1235639 1033831 1002328 1123346
41442A123346K48096L46579M16474M59845M79242M76075M50231M01405L31260
$$ 1123346 1371442 1718021 2134495 2594340 3073582 3549657 3999888 4401293 4732553
41433D732553K44970J51106N9622k1374q8653j45098j98305k57038l27476m11278
$$ 4732553 4977523 5128629 5188251 5166877 5078224 4933126 4734821 4477783 4150307 3739029
41423C739029n05842o05468p01788p83897q39977q60970q44112p93194p15182
$$ 3739029 3233187 2627719 1925931 1142034 302057 -558913 -1403025 -2196219 -2911401
41414b911401o16082m99681l70080k35571j10213j1006M8328O3558M2525K413
$$ -2911401 -3527483 -4027164 -4397244 -4632815 -4743028 -4754034 -4705706 -4642148 -4599623 -4597210
41404d597210l6954o0490o2424m6483k2542j754P943M876n613j3512r066J2300
$$ -4597210 -4634164 -4694654 -4757078 -4803561 -4826103 -4827857 -4819914 -4815038 -4820651 -4834163 -4843229 -4830929
41392d830929M8008R0346J30698J63186J86113K01220K11933K21748K33373K48333
$$ -4830929 -4782921 -4692575 -4561877 -4398691 -4212578 -4011358 -3799425 -3577677 -3344304 -3095971
41382c095971K66705K87393L09249L31944L54979L74956L83960L71889L32218
$$ -3095971 -2829266 -2541873 -2232624 -1900680 -1545701 -1170745 -786785 -414896 -82678
41373h2678K67566J90964J21438P5963O2246P6517J07090J40438J65993J78536
$$ -82678 184888 375852 497290 573253 635499 712016 819106 959544 1125537 1304073
41363A304073J79370J76141J79733J98477K33068K75694L13466L33563L28005
$$ 1304073 1483443 1659584 1839317 2037794 2270862 2546556 2860022 3193585 3521590
41354C521590K96914K48847J97086J53491J23848J07300R8822R1983Q0923O1978
$$ 3521590 3818504 4067351 4264437 4417928 4541776 4649076 4747898 4839881 4920804 4982782
41344D982782L5118M264k3999m2619m6378l4260j1421J0718J7765j989n2800j30395
$$ 4982782 5017900 5022164 4998165 4955546 4909168 4874908 4863487 4874205 4891970 4889981 4837181 4706786
41332D706786k24599l23330m15793m94181n53799n91908o05994n93124n51277
$$ 4706786 4482187 4158857 3743064 3248883 2695084 2103176 1497182 904058 352781
41323C52781m81715l90168k85457j76520o9965L0552J23403K07806K83072L48228
$$ 352781 -128934 -519102 -804559 -981079 -1051044 -1020492 -897089 -689283 -406211 -57983
41313e7983M01891M42882M72021M93716N14665N39172N64304N79628N72712N36386
$$ -57983 343908 786790 1258811 1752527 2267192 2806364 3370668 3950296 4523008 5059394
41303E059394M72364L89212K97293K04693J16357L5646l4129q9952j30730j58696
$$ 5059394 5531758 5920970 6218263 6422956 6539313 6574959 6540830 6450878 6320148 6161452
41293F161452j79248j99489k26107k62993l09004l57283l97417m19898m19912
$$ 6161452 5982204 5782715 5556608 5293615 4984611 4627328 4229911 3810013 3390101
41284C390101l97832l56517k98437k25499j41526n4411K4657Q4571J17806J22180
$$ 3390101 2992269 2635752 2337315 2111816 1970290 1915879 1940536 2025107 2142913 2265093
41274B265093J00933O1920J5733k7546o2121q8968j15293j50932k03029k71750
$$ 2265093 2366026 2427946 2443679 2416133 2354012 2265044 2149751 1998819 1795790 1524040
41264A524040l49488m23971m83166n19312n30587n20361m94269m56039m04292
$$ 1524040 1174552 750581 267415 -251897 -782484 -1302845 -1797114 -2253153 -2657445
41255b657445l32549k32725j00544N9231K30136L86683N03343N65895N77769N56809
$$ -2657445 -2989994 -3222719 -3323263 -3264032 -3033896 -2647213 -2143870 -1577975 -1000206 -443397
41245d43397N24907M97467M78265M61172M36571L98240L46545K86943K26793J73997
$$ -443397 81510 578977 1057242 1518414 1954985 2353225 2699770 2986713 3213506 3387503
41235C387503J37074J23754J37412J74338K24520K75085L13934L32528L28112
$$ 3387503 3524577 3648331 3785743 3960081 4184601 4459686 4773620 5106148 5434260
41226E434260L04659K71211K37703K10592J90460J72760J51217J22388Q8687N7782
$$ 5434260 5738919 6010130 6247833 6458425 6648885 6821645 6972862 7095250 7183937 7241719
41216G241719L8803L8229N7868R4769J41493J86239K14005K09637J62216O8921
$$ 7241719 7280522 7318751 7376619 7471388 7612881 7799120 8013125 8222762 8384978 8453899
41206H453899o3435k20133l82903n34364o59853p46408p81862p57184o71374n34948
$$ 8453899 8390464 8170331 7787428 7253064 6593211 5846803 5064941 4307757 3636383 3101435
41196C101435l68539j97203m3564P7414J60786K10611K35644K43329K35057K05273
$$ 3101435 2732896 2535693 2492129 2569543 2730329 2940940 3176584 3419913 3654970 3860243
41186C860243J44871M7456q4388k36097l83930n03321n78584o08476o04656n84726
$$ 3860243 4005114 4052570 3968182 3732085 3348155 2844834 2266250 1657774 1053118 468392
41176D68392n64253n51557n46560n43274n34294n14863m84168m43367l92949l32314
$$ 468392 -95861 -647418 -1193978 -1737252 -2271546 -2786409 -3270577 -3713944 -4106893 -4439207
41166d439207k62017j85920j10921m4544P665M4011O7725Q6578J10210J46118
$$ -4439207 -4701224 -4887144 -4998065 -5042609 -5034944 -4990933 -4923208 -4836630 -4726420 -4580302
41156d580302J96948K60848L33832M11487M88450N56155O01360O08137N64227
$$ -4580302 -4383354 -4122506 -3788674 -3377187 -2888737 -2332582 -1731222 -1123085 -558858
41147e58858M68446L33438J80621L0771j02388k11481k90482l32171l31461k91541
$$ -558858 -90412 243026 423647 454418 352030 140549 -149933 -482104 -813565 -1105106
41137a105106k26440j56527r9765o4864n0019m6423m3219l1671q031K5526O2456
$$ -1105106 -1331546 -1488073 -1587838 -1652702 -1702721 -1749144 -1792363 -1824034 -1832065 -1806539 -1744083
41126a744083R5250J18672J30965J33021J26566J12739R1762O3887L0937k912
$$ -1744083 -1648833 -1530161 -1399196 -1266175 -1139609 -1026870 -935108 -871221 -840284 -843196
41116h43196l1983n1353n9173n7841n3285n2481o0249p6969r8626j19011j32600
$$ -843196 -875179 -926532 -985705 -1043546 -1096831 -1149312 -1209561 -1286530 -1385156 -1504167 -1636767
41105a636767j36199j28742j10144q0578m0659Q192O3818J23680J84586K41631
$$ -1636767 -1772966 -1901708 -2011852 -2092430 -2133089 -2124897 -2061079 -1937399 -1752813 -1511182
41095a511182K87322L12454L09084K74253K12049J32507M8317k8383q7634j22482
$$ -1511182 -1223860 -911406 -602322 -328069 -116020 16487 64804 36421 -51213 -173695
41085a73695j30223j13919q2300m6914j7663P08R090J1819J4068K0703L6127O3091
$$ -173695 -303918 -417837 -500137 -547051 -564714 -564006 -554916 -543097 -529029 -508326 -472199 -409108
41073d09108R9682J36950J60396J55542J14234L7917o3005j72459k72884l48932
$$ -409108 -309426 -172476 -12080 143462 257696 295613 232608 60149 -212735 -561667
41063e61667l89443l87728l41606k54889j39770j7282Q6581J48679J57323J17350
$$ -561667 -951110 -1338838 -1680444 -1935333 -2075103 -2092385 -2005804 -1857125 -1699802 -1582452
41053a582452M8240k4803q2398j18131j36984j47101j51908j48229j30734r8087
$$ -1582452 -1534212 -1559015 -1641413 -1759544 -1896528 -2043629 -2195537 -2343766 -2474500 -2572587
41043b572587n5732j3275K1519M7848P2417J05028J52290K13541K81118L43975
$$ -2572587 -2628319 -2641594 -2620075 -2572227 -2499810 -2394782 -2242492 -2028951 -1747833 -1403858
41033a403858L91824M17480M16711L86858L26239K35338J18676j4817j53561k85568
$$ -1403858 -1012034 -594554 -177843 209015 535254 770592 889268 874451 720890 435322
41023D35322l99429m84611n32949n41446n14274m61423l94480l22070k47732j71177
$$ 435322 35893 -448718 -981667 -1523113 -2037387 -2498810 -2893290 -3215360 -3463092 -3634269
41013c634269r1745j1566O3792J27490J74409K02740K13869K11669K01785J90221
$$ -3634269 -3726014 -3737580 -3673788 -3546298 -3371889 -3169149 -2955280 -2743611 -2541826 -2351605
41003b351605J80892J73798J65512J51690J29548R8903O2062K3249j2660m2089
$$ -2351605 -2170713 -1996915 -1831403 -1679713 -1550165 -1451262 -1389200 -1365951 -1378611 -1420700
40993a420700o3779p7686q2944p7762o2216m1187k4356k2954m5639r5624j69609
$$ -1420700 -1484479 -1562165 -1645109 -1722871 -1785087 -1826274 -1850630 -1873584 -1919223 -2014847 -2184456
40982b184456k58332l48213m23314m67103m64924m07893k96917j43626L2895K11187
$$ -2184456 -2442788 -2791001 -3214315 -3681418 -4146342 -4554235 -4851152 -4994778 -4961883 -4750696
40972d750696L70900M94009N65850N77428N28517M29752L01906J71450O3079p606
$$ -4750696 -4379796 -3885787 -3319937 -2742509 -2213992 -1784240 -1482334 -1310884 -1247805 -1255411
40962a255411l7653l5027j3368J3716L6677N1314N7583N7022N0936M0582K8667
$$ -1255411 -1293064 -1328091 -1341459 -1327743 -1291066 -1239752 -1182169 -1125147 -1074211 -1033629 -1004962
40951a004962J9847J9023K8604M7641P4318J09590J57676K21835K99304L80611
$$ -1004962 -985115 -966092 -937488 -889847 -815529 -705939 -548263 -326428 -27124 353487
40941C53487M53940N09887N42595N48172N24036M70562L93190L02887K14350J42305
$$ 353487 807427 1317314 1859909 2408081 2932117 3402679 3795869 4098756 4313106 4455411
40931D455411R6802P9639Q4127R8343J09743J09058R2567O2171K2735k2036p1927
$$ 4455411 4552213 4631852 4715979 4814322 4924065 5033123 5125690 5187861 5210596 5188560 5116633
40920E116633j28438j90572k52171l03250l34277l40862l26459l01750k80651
$$ 5116633 4988195 4797623 4545452 4242202 3907925 3567063 3240604 2938854 2658203
40911B658203k74651k88085l16695l49859l75391l84542l74793l49135l12746
$$ 2658203 2383552 2095467 1778772 1428913 1053522 668980 294187 -54948 -367694
40902c67694k69476k20441j65256j04739m2969J2984N5626Q0259Q7036Q1140P1061
$$ -367694 -637170 -857611 -1022867 -1127606 -1170575 -1157591 -1101965 -1021706 -934670 -853530 -782469
40891g82469O5110O7355P5449Q2487Q1579O9611M7971K1260m020k0992k4865j5458
$$ -782469 -717359 -650004 -574555 -492068 -410489 -340878 -292907 -271647 -275667 -296659 -321524 -336982
40879c36982K664K3405M3542O4911R2547J29845J73631K12214K28033K04469J34135
$$ -336982 -334318 -310913 -267371 -202460 -109913 19932 193563 405777 633810 838279 972414
40868I72414K4687j01538k14730k88200l06659k68729j84455p0806N2856J68856
$$ 972414 997101 895563 680833 392633 85974 -182755 -367210 -438016 -385160 -216304
40858b16304K64146L31375L67862L73957L52124L07181K47095J82775J25524Q2391
$$ -216304 47842 379217 747079 1121036 1473160 1780341 2027436 2210211 2335735 2418126
40848B418126N2154K5137j2258p0707j52123k47148l37101m00160m19591l90017
$$ 2418126 2470280 2495417 2483159 2412452 2260329 2013181 1676080 1275920 856329 466312
40838D66312l18688k21901j19304k8819L6455O9491O9531M2021k157m9294q7412
$$ 466312 147624 -74277 -193581 -222400 -185945 -116454 -46923 -4902 -7059 -56353 -143765
40827a43765j10158j17094j10114q9604n3859j895O3418J34959K03882K62977
$$ -143765 -253923 -371017 -481131 -570735 -624594 -626489 -563071 -428112 -224230 38747
40817C8747L08345L38867L54618L55892L43452L19201K86064K46735K02262J51584
$$ 38747 347092 685959 1040577 1396469 1739921 2059122 2345186 2591921 2794183 2945767
40807B945767R2583K4045n2392j31007k02028k53255k73225k54885j97892j08425
$$ 2945767 3038350 3062395 3010003 2878996 2676968 2423713 2150488 1895603 1697711 1589286
40797A589286L092J24624K44309L51529M37977M98506N30998N35313N12593M65578
$$ 1589286 1592378 1717002 1961311 2312840 2750817 3249323 3780321 4315634 4828227 5293805
40787E293805L98764L17095K24373J23827K1042p4407j51816k05437k38803k63596
$$ 5293805 5692569 6009664 6234037 6357864 6378906 6304499 6152683 5947246 5708443 5444847
40777E444847k93534l37019l92931m52028n03114n39582n61876n75171n85193
$$ 5444847 5151313 4814294 4421363 3969335 3466221 2926639 2364763 1789592 1204399
40768A204399n95011o03451o05210n93352n63840n19399m69364m25416l95851
$$ 1204399 609388 5937 -599273 -1192625 -1756465 -2275864 -2745228 -3170644 -3566495
40759c566495l81633l75727l65786l38852k86043k05758j05112P58R2553J53725
$$ -3566495 -3948128 -4323855 -4689641 -5028493 -5314536 -5520294 -5625406 -5624648 -5532095 -5378370
40749e378370J77216J67669J37818J02215P2219N4079M9514N7497P6025J03013
$$ -5378370 -5201154 -5033485 -4895667 -4793452 -4721233 -4667154 -4617640 -4560143 -4484118 -4381105
40739d381105J36231J72822K08836K39306K59772K69282K72564K78127K92511
$$ -4381105 -4244874 -4072052 -3863216 -3623910 -3364138 -3094856 -2822292 -2544165 -2251654
40730b251654L15298L39262L55170L56825L43160L17465K84940K49367K10132
$$ -2251654 -1936356 -1597094 -1241924 -885099 -541939 -224474 60466 309833 519965
40721E19965J62061R9498K2643n8409j25553j60421j54111j13449n9832k0515
$$ 519965 682026 781524 804167 745758 620205 459784 305673 192224 132392 111877
40711A11877j6577n3837j21397j98231k63638l05391l21479l15933k93339k56383
$$ 111877 95300 41463 -79934 -278165 -541803 -847194 -1168673 -1484606 -1777945 -2034328
40701b034328k06871j47209p9879o185P2968J54039K28912K86842L18871L20723
$$ -2034328 -2241199 -2388408 -2468287 -2474472 -2401504 -2247465 -2018553 -1731711 -1412840 -1092117
40691a092117K92307K35838J55393N7997m5820j43347k22342k73684k93213k82238
$$ -1092117 -799810 -563972 -408579 -350582 -396402 -539749 -762091 -1035775 -1328988 -1611226
40681a611226k46096j90952j20565l5538O4036J74334K85180L80991M44624M61895
$$ -1611226 -1857322 -2048274 -2168839 -2204377 -2140341 -1966007 -1680827 -1299836 -855212 -393317
40671c93317M25061L34822K00817M0366j25004k74820l95138m81709n38683n73047
$$ -393317 31744 366566 567383 607749 482745 207925 -187213 -668922 -1207605 -1780652
40661a780652n88038n80238n42602m71114l69882k50849j28573j4143Q7698J77208
$$ -1780652 -2368690 -2948928 -3491530 -3962644 -4332526 -4583375 -4711948 -4726091 -4638393 -4461185
40651d461185K56502L27686L93063M55398N16160N72480O15746O34121O17959
$$ -4461185 -4204683 -3876997 -3483934 -3028536 -2512376 -1939896 -1324150 -690029 -72070
40642g2070N64715M80215L75945K64441J55592N5354l3394j09273j71246k18400
$$ -72070 492645 972860 1348805 1613246 1768838 1824192 1790798 1681525 1510279 1291879
40632A291879k50424k68600k76831k81544k89437l03649l21049l33197l30437
$$ 1291879 1041455 772855 496024 214480 -74957 -378606 -699655 -1032852 -1363289
40623a363289l06033k58208j90754j13265l9805J5731M5995N3873N0389M8608
$$ -1363289 -1669322 -1927530 -2118284 -2231549 -2271354 -2255623 -2209628 -2155755 -2105366 -2056758
40613b056758N7635P9706J10968J44854J76028K02350K23977K41361K54629K64700
$$ -2056758 -1999123 -1919417 -1808449 -1663595 -1487567 -1285217 -1061240 -819879 -565250 -300550
40603c00550K74153K86326L02920L21845L37021L40841L28399L00507K62974K22500
$$ -300550 -26397 259929 562849 884694 1221715 1562556 1890955 2191462 2454436 2676936
40593B676936J82562J42417R9391N2161K769m3714q1510j07105j21177j28662
$$ 2676936 2859498 3001915 3101306 3153467 3156236 3112522 3031012 2923907 2802730 2674068
40583B674068j37038j53312j80698k16566k53398k82525k98290l00166k92236
$$ 2674068 2537030 2383718 2203020 1986454 1733056 1450531 1152241 852075 559839
40574E59839k80904k71721k66518k62733k55866k43281k25861k06427j87082j68234
$$ 559839 278935 7214 -259304 -522037 -777903 -1021184 -1247045 -1453472 -1640554 -1808788
40564a808788j49690j32084j17219j07120j02386j00721r6912q5030o1927k9997
$$ -1808788 -1958478 -2090562 -2207781 -2314901 -2417287 -2518008 -2614920 -2699950 -2761877 -2791874
40554b791874K659K5295K9675J5110r567k8725k6526O061O7422J46222K26145
$$ -2791874 -2789215 -2763920 -2734245 -2719135 -2728702 -2757427 -2783953 -2777892 -2710470 -2564248 -2338103
40543b338103K92055L35090L54961L58755L56746L56835L60535L63384L59677
$$ -2338103 -2046048 -1710958 -1355997 -997242 -640496 -283661 76874 440258 799935
40534G99935L47911L31927L16826L03628K87964K63833K29017J87564J47703J16890
$$ 799935 1147846 1479773 1796599 2100227 2388191 2652024 2881041 3068605 3216308 3333198
40524C333198R7503Q6043P6091O2239M1952J4865j8392n6252r6152j35643j74103
$$ 3333198 3430701 3516744 3592835 3655074 3697026 3711891 3693499 3637247 3541095 3405452 3231349
40513C231349k12861k53292k94696l33890l66503l88518l97091l90515l67742
$$ 3231349 3018488 2765196 2470500 2136610 1770107 1381589 984498 593983 226241
40504B26241l27841k69931j93823j01122L572J11805K11458K89118L34477L44310
$$ 226241 -101600 -371531 -565354 -666476 -662904 -551099 -339641 -50523 283954 628264
40494F28264L22776K77360K14055J36105M6958m6189j32252j99768k40964k53526
$$ 628264 951040 1228400 1442455 1578560 1625518 1579329 1447077 1247309 1006345 752819
40484G52819k39795k05013j55822r9034m0512J5486O5974J08056J37908J50874
$$ 752819 513024 308011 152189 53155 12643 28129 94103 202159 340067 490941
40474D90941J42925J12880O4182N122n2862r8012j20879j16065q3235k7518M1648
$$ 490941 633866 746746 810928 816050 763188 665176 544297 428232 344997 317479 359127
40463C59127J13710J80794K39276K87951L24863L45902L46093L21828K72146J98800
$$ 359127 472837 653631 892907 1180858 1505721 1851623 2197716 2519544 2791690 2990490
40453B990490J06344K822r9862j87692k48773k77751k76775k52014k08681j48885
$$ 2990490 3096834 3099656 2999794 2812102 2563329 2285578 2008803 1756789 1548108 1399223
40443A399223p3403J5158J10334K01568K75527L19157L24255K91163K28843J50988
$$ 1399223 1325820 1340978 1451312 1652880 1928407 2247564 2571819 2862982 3091825 3242813
40433C242813P0865j703o0056r8814j13211j01269o6932k0628K4623N9224Q0818
$$ 3242813 3313678 3311975 3251919 3153105 3039894 2938625 2871693 2851065 2875688 2934912 3015730
40422C015730R3376J02778J12135J20029J22696J18236J08862R8920R0591Q1520
$$ 3015730 3109106 3211884 3324019 3444048 3566744 3684980 3793842 3892762 3983353 4064873
40412D064873O6337L9906n88n5218j21515j95264k72462l51364m32275n14444
$$ 4064873 4131210 4171116 4170528 4115310 3993795 3798531 3526069 3174705 2742430 2227986
40402B227986n92619o56652o94569o96591o57315n75664m54557l01628j30445
$$ 2227986 1635367 978715 284146 -412445 -1069760 -1645424 -2099981 -2401609 -2532054
40393b532054M0097J89604L01965L69804L94932L85196L50845L02730K51946K08490
$$ -2532054 -2491957 -2302353 -2000388 -1630584 -1235652 -850456 -499611 -196881 55065 263555
40383B63555J78107J59593J45265J25057R1617M3696j2991o7060j04517j13134
$$ 263555 441662 601255 746520 871577 963194 1006890 993899 926839 822322 709188
40373G09188q6753k7383N5938J50307K41892L17479L65355L76834L48579K84470
$$ 709188 622435 595052 650990 801297 1043189 1360668 1726023 2102857 2451436 2735906
40363B735906J95424R6603K639p7158j41055j93413k40709k87679l34916l77538
$$ 2735906 2931330 3027933 3030572 2953414 2812359 2618946 2378237 2090558 1755642 1378104
40353A378104m05029m04121l65559k91516j98117j10288n1412l3082m9899q2155
$$ 1378104 973075 568954 203395 -88121 -286238 -396526 -447938 -481020 -530919 -613074
40343f13074j05952j05354p8686l4798J6572P1474J30597J93517K55318L08641
$$ -613074 -719026 -824380 -903066 -937864 -921292 -849818 -719221 -525704 -270386 38255
40333C8255L48261L73120L84620L84090L72715L53431L31553L12681K99447K89774
$$ 38255 386516 759636 1144256 1528346 1901061 2254492 2586045 2898726 3198173 3487947
40323C487947K77436K54598K15862J62509J03790N3081K0728Q674J0372J4881
$$ 3487947 3765383 4019981 4235843 4398352 4502142 4555223 4575951 4584625 4594997 4609878
40313D609878J1863n002l6404p7281j18173j48503j61352j57475j45186j35160
$$ 4609878 4621741 4616739 4580335 4503054 4384881 4236378 4075026 3917551 3772365 3637205
40303C637205j33851j41012j52780j65977j78960j89364j92783j84892j65321
$$ 3637205 3503354 3362342 3209562 3043585 2864625 2675261 2482478 2297586 2132265
40294B132265j39771j18563j11739j23018j46241j67555j73148j57859j28941
$$ 2132265 1992494 1873931 1762192 1639174 1492933 1325378 1152230 994371 865430
40285H65430j02588r5627j17101j63709k20747k67771k86339k66438k09208j25593
$$ 865430 762842 667215 550114 386405 165658 -102113 -388452 -654890 -864098 -989691
40275i89691l2375N2766J16023J50835J58274J43811J12357O5368K085p6591j65452
$$ -989691 -1022066 -969300 -853277 -702442 -544168 -400357 -288000 -222632 -220547 -297138 -462590
40264d62590k55858l38980m08289m59219m86861m84497m45104l65247k48726j07835
$$ -462590 -718448 -1057428 -1465717 -1924936 -2411797 -2896294 -3341398 -3706645 -3955371 -4063206
40254d063206L8373J68547K65502L22308L44201L43960L33484L17683K94678K60656
$$ -4063206 -4024833 -3856286 -3590784 -3268476 -2924275 -2580315 -2246831 -1929148 -1634470 -1373814
40244a373814K14404J58141R5361K8479m1419j12849j81966k42112k85285l04538
$$ -1373814 -1159410 -1001269 -905908 -877429 -918848 -1031697 -1213663 -1455775 -1741060 -2045598
40234b045598k96095k60444k01953j27233m3207M3862J28181K03919K65257L07019
$$ -2045598 -2341693 -2602137 -2804090 -2931323 -2974530 -2930668 -2802487 -2598568 -2333311 -2026292
40224b026292L25635L19906K90853K40224J68986P7886k9648j44841k53792l40498
$$ -2026292 -1700657 -1380751 -1089898 -849674 -680688 -602802 -632450 -777291 -1031083 -1371581
40214a371581l90589l94363l48735k57730j31345J6108J67056L01730M01135M51788
$$ -1371581 -1762170 -2156533 -2505268 -2762998 -2894343 -2878235 -2711179 -2409449 -2008314 -1556526
40204a556526M49672M01196L21507K31174J51629R9623Q2754R8251J35292J79188
$$ -1556526 -1106854 -705658 -384151 -152977 -1348 98275 181029 279280 414572 593760
40194E93760K15885K35881K36619K21868J98303J71153J41542J06863O3873J2758
$$ 593760 809645 1045526 1282145 1504013 1702316 1873469 2015011 2121874 2185747 2198505
40184B198505m0415q5045j10879j13751r8461p7190o4429p0903r8597j38699j73890
$$ 2198505 2158090 2073045 1962166 1848415 1749954 1672764 1608335 1537432 1438835 1300136 1126246
40173A126246j85092j59838r7407p620R4916J96396K86266L57172M04577M26580
$$ 1126246 941154 781316 683909 676289 771205 967601 1253867 1611039 2015616 2442196
40163B442196M23704L98685L56401L03220K45027J85124J24157O2615L622m6627
$$ 2442196 2865900 3264585 3620986 3924206 4169233 4354357 4478514 4541129 4544751 4498124
40153D498124q1506r7777r7818q8509p7568p0202o8509p3011q3746r9537j16862
$$ 4498124 4416618 4318841 4221023 4132514 4054946 3984744 3916235 3843224 3759478 3659941 3543079
40142C543079j30263j34410j25992j04194p0017k5464K6702Q2652J37291J84979
$$ 3543079 3412816 3278406 3152414 3048220 2978203 2952739 2979441 3062093 3199384 3384363
40132C384363K21008K42741K49414K40927K16808J75863J16215L5962o4729j80415
$$ 3384363 3605371 3848112 4097526 4338453 4555261 4731124 4847339 4883301 4818572 4638157
40122D638157k98466m01200m71712n00101m86389m39248l71978k97976k27041
$$ 4638157 4339691 3938491 3466779 2966678 2480289 2041041 1669063 1371087 1144046
40113A144046j63287j05196m7765J4015Q1519J50291K10398K49588K57911K31727
$$ 1144046 980759 875563 827798 841813 923332 1073623 1284021 1533609 1791520 2023247
40103B023247J75518J01041K4199l9225p7024q1759n0429J5266J07296K10352
$$ 2023247 2198765 2299806 2324005 2284780 2207756 2125997 2075568 2090834 2198130 2408482
40093B408482L04221L69271L92229L69425L06728K17155J17786K7131l7199o1775
$$ 2408482 2712703 3081974 3474203 3843628 4150356 4367511 4485297 4512428 4475229 4413454
40083D413454m1646J6916R8360J84176K59335L14635L44783L45632L13906K49936
$$ 4413454 4371808 4388724 4487084 4671260 4930595 5245230 5590013 5935645 6249551 6499487
40073F499487J60822O0625l3909j09866j62758j96781k21277k45802k75272l06660
$$ 6499487 6660309 6720934 6687025 6577159 6414401 6217620 5996343 5750541 5475269 5168609
40063E168609l28917l26961k88038k07192q9697M9809J91040L13855M04367M58432
$$ 5168609 4839692 4512731 4224693 4017501 3927804 3977613 4168653 4482508 4886875 5345307
40053E345307M80701M80157M64986M39259M02446L51535K84500K03287J14440
$$ 5345307 5826008 6306165 6771151 7210410 7612856 7964391 8248891 8452178 8566618
40044H566618K6822n1937j18276j73612k23587k76096l38386m13884n00160n88712
$$ 8566618 8593440 8541503 8423227 8249615 8026028 7749932 7411546 6997662 6497502 5908790
40034E908790o66045p15142p18241o61867n42867l71489j68708M0816K35956M03026
$$ 5908790 5242745 4527603 3809362 3147495 2604628 2233139 2064431 2105247 2341203 2744229
40024B744229N35722O32458O93152P17532P05673O59623N84149M85682L70446
$$ 2744229 3279951 3912409 4605561 5323093 6028766 6688389 7272538 7758220 8128666
40015H128666K43100J06655l6550j83552l29930m69799n96566p04211p88837q49804
$$ 8128666 8371766 8478421 8441871 8258319 7928389 7458590 6862024 6157813 5368976 4519172
40005D519172q89301r10043r12868q96369q58687p99252p18790o18578n00801
$$ 4519172 3629871 2719828 1806960 910591 51904 -747348 -1466138 -2084716 -2585517
39996b585517l69783k31999r3848M0935J71537K97617M16635N23581O13239O82734
$$ -2585517 -2955300 -3187299 -3281147 -3240212 -3068675 -2771058 -2354423 -1830842 -1217603 -534869
39986e34869P32279P64026P80386P83219P74355P56644P34086P09909O83205O47002
$$ -534869 197410 961436 1741822 2525041 3299396 4056040 4790126 5500035 6183240 6830242
39976F830242N90315N03948L86219K44700R3200n3270j82460k86380l60900m04354
$$ 6830242 7420557 7924505 8310724 8555424 8648624 8595354 8412894 8126514 7765614 7361260
39966G361260m16134l96530l48577k80546k05934j39294r0163n9413m0161k1624
$$ 7361260 6945126 6548596 6200019 5919473 5713539 5574245 5484082 5424669 5384508 5362884
39956E362884O917N3092J18893J98700K79314L43304L75045L66511L19407K42650
$$ 5362884 5369801 5422893 5541786 5740486 6019800 6363104 6738149 7104660 7424067 7666717
39946G666717J47899M6582n0869j35779k02927k51263k81713k93890k85088k52485
$$ 7666717 7814616 7861198 7810329 7674550 7471623 7220360 6938647 6644757 6359669 6107184
39936F107184j96006j19364k9013O7777J64398K54847L32007L86264M06925L86466
$$ 6107184 5911178 5791814 5762801 5830578 5994976 6249823 6581830 6968094 7375019 7761485
39926G761485L24270K26999J05982k5772j55643k72897l70093m43872m94746n26017
$$ 7761485 8085755 8312754 8418736 8392964 8237321 7964424 7594331 7150459 6655713 6129696
39916F129696n42409n48538n47365n38790n18874m80400m15498l19932j97064
$$ 6129696 5587287 5038749 4491384 3952594 3433720 2953320 2537822 2217890 2020826
39907B020826n8783P7896J97208K90494L58043M06080M41361M67324M83742M88681
$$ 2020826 1962043 2039939 2237147 2527641 2885684 3291764 3733125 4200449 4684191 5172872
39897E172872M80303M57478M19751L67296L00599K19476J22229O323j28800k77954
$$ 5172872 5653175 6110653 6530404 6897700 7198299 7417775 7540004 7546327 7417527 7139573
39887G139573m28339n61613o59499p09993p10959o69959o01346n22480m50258
$$ 7139573 6711234 6149621 5490122 4780129 4069170 3399211 2797865 2275385 1825127
39878A825127l98120l73293l74696l92903m13524m23302m15783l93239l64135
$$ 1825127 1427007 1053714 679018 286115 -127409 -550711 -966494 -1359733 -1723868
39869a723868l38367l23274l21828l32613l50898l70484l85879l93738l92813
$$ -1723868 -2062235 -2385509 -2707337 -3039950 -3390848 -3761332 -4147211 -4540949 -4933762
39860d933762l82881l63953l36260l00166k55370k00128j31423m6102N7756J79363
$$ -4933762 -5316643 -5680596 -6016856 -6317022 -6572392 -6772520 -6903943 -6950045 -6892289 -6712926
39850f712926L13534M49421N71375O62398P09256P07219O62721N92173N16474
$$ -6712926 -6399392 -5949971 -5378596 -4716198 -4006942 -3299723 -2637002 -2044829 -1528355
39841a528355M53608M13703L98945M06126M27977M52447M63263M44436L87118
$$ -1528355 -1074747 -661044 -262099 144027 572004 1024451 1487714 1932150 2319268
39832B319268K94118J78959O0607m2606j17386j58066j67473j55217j32808j08056
$$ 2319268 2613386 2792345 2852952 2810346 2692960 2534894 2367421 2212204 2079396 1971340
39822A971340q2563n4024k0696J5801N0722P8330R4353R8047R3075Q6431Q5585
$$ 1971340 1888777 1834753 1814057 1829858 1880580 1958910 2053263 2151310 2244385 2330816 2416401
39811B416401R5449J16668J45594J75487J98280K06539J95455J64713J19886P2655
$$ 2416401 2511850 2628518 2774112 2949599 3147879 3354418 3549873 3714586 3834472 3907127
39801C907127L9073L5655P4063J55969K70627L97458N13589O02557O58851O85504
$$ 3907127 3946200 3981855 4055918 4211887 4482514 4879972 5393561 5996118 6654969 7340473
39791G340473O87073O63662O10405N22482M01581K58692J11112k4183j36203k21418
$$ 7340473 8027546 8691208 9301613 9824095 10225676 10484368 10595480 10571297 10435094 10213676
39781A0213676k81509l20254l41952l51387l53764l53604l53388l53287l52152
$$ 10213676 9932167 9611913 9269961 8918574 8564810 8211206 7857818 7504531 7152379
39772G152379l48794l42933l36031l31855l35664l51300l77510m06166m24135
$$ 7152379 6803585 6460652 6124621 5792766 5457102 5105802 4728292 4322126 3897991
39763C897991m18215l80764l13061k24660j29393m0561L2272Q4293J14858J25686
$$ 3897991 3479776 3099012 2785951 2561291 2431898 2391337 2423609 2507902 2622760 2748446
39753B748446J18591R4476N5082O138m1798p7092r3204r2182q2354p1661o1809
$$ 2748446 2867037 2961513 3016595 3022733 2980935 2903843 2810639 2718457 2636103 2564442 2502633
39742B502633m7571k1431K0547P5980J37643J96992K47169K84197L06258L11715
$$ 2502633 2455062 2433631 2454178 2530158 2667801 2864793 3111962 3396159 3702417 4014132
39732D014132K97547K59922J96590J08828J182j20270k49079l78374n00354o06143
$$ 4014132 4311679 4571601 4768191 4877019 4878201 4757931 4508852 4130478 3630124 3023981
39722C023981o86251p31633p35454o95385o15658n07886l89453k78821j88923
$$ 3023981 2337730 1606097 870643 175258 -440400 -948286 -1337739 -1616560 -1805483
39713a805483j22199p0602k0925L7675J08055J83738K52148L00839L23425L21810
$$ -1805483 -1927682 -1998284 -2019209 -1981534 -1873479 -1689741 -1437593 -1136754 -813329 -491519
39703d91519L03522K76850K47859K20929K00750J92905K02409K31808K79975L41635
$$ -491519 -187997 88853 336712 557641 758391 951296 1153705 1385513 1665488 2007123
39693B007123M07246M64004M98522N00235M63894L90053K83943J53543P952j43068
$$ 2007123 2414369 2878373 3376895 3877130 4341024 4731077 5015020 5168563 5176515 5033447
39683E033447k88344m14972n10160n64954n77066n50645m93573m14781l23318
$$ 5033447 4745103 4330131 3819971 3255017 2677951 2127306 1633733 1218952 895634
39674H95634k28701j41097p0377k4372p271j8894n4559j05187j58409k01934k28406
$$ 895634 666933 525836 455459 431087 423816 404922 350363 245176 86767 -115167 -343573
39663c43573k38211k37392k32016k23713k09828j86956j54097j12827o5177j1634
$$ -343573 -581784 -819176 -1051192 -1274905 -1484733 -1671689 -1825786 -1938613 -2003790 -2015424
39653b015424M8734J16039J87314K56521L17297L66298M04563M36170M65505M94749
$$ -2015424 -1966690 -1850651 -1663337 -1406816 -1089519 -723221 -318658 117512 583017 1077766
39643A077766N22237N42200N46519N28345M85398M20761L41239K55532J73231
$$ 1077766 1600003 2142203 2688722 3217067 3702465 4123226 4464465 4719997 4893228
39634D893228J03273N0706J3878j4472m1865p0333r4229j02520q3893l2577M7615
$$ 4893228 4996501 5047207 5061085 5046613 5004748 4934415 4840186 4737666 4653773 4621196 4668811
39623D668811J43744K39277L21494L85751M34896M75800N15589N58320O02124
$$ 4668811 4812555 5051832 5373326 5759077 6193973 6669773 7185362 7743682 8345806
39614H345806O38359O53975O36113N76253M72391L29750J60856j5574j77947l07034
$$ 8345806 8984165 9638140 10274253 10850506 11322897 11652647 11813503 11797929 11619982 11312948
39604A1312948l91127m28556m26356l96135l49831k97539k47314k05204j74066
$$ 11312948 10921821 10493265 10066909 9670774 9320943 9023404 8776090 8570886 8396820
39595H396820j52097j33213j10235p9027m0515Q49M0384P5311J04575J27921J45823
$$ 8396820 8244723 8111510 8001275 7922248 7881733 7882582 7922966 7998277 8102852 8230773 8376596
39584H376596J59849J71974J82714J89753J88581J74953J47792J10915P2316M0652
$$ 8376596 8536445 8708419 8891133 9080886 9269467 9444420 9592212 9703127 9775443 9816095
39574I816095K0714J1251P012L059k650j0077j9473l2358n0338p3109r7265j16870
$$ 9816095 9836809 9848060 9855072 9858131 9855481 9845404 9825931 9793573 9743235 9670126 9572861 9455991
39562I455991j25761j20434j01646p3779m3022j6178m91l134k9371q0007j49991
$$ 9455991 9330230 9209796 9108150 9034371 8991349 8975171 8974680 8971546 8942175 8862168 8712177
39551H712177k29660l08545l79361m39003m85367n13092n13065m77045m03331
$$ 8712177 8482517 8173972 7794611 7355608 6870241 6357149 5844084 5367039 4963708
39542D963708k98407j73768m1634Q7044K02354K94901L56316L80696L66477L17889
$$ 4963708 4665301 4491533 4449899 4536943 4739297 5034198 5390514 5771210 6137687 6455576
39532F455576K44681J59415P3567m814p0608j19712j48384j54630j39800j08096
$$ 6455576 6700257 6859672 6933239 6928425 6857817 6738105 6589721 6435091 6295291 6187195
39522F187195o3952r857N2709J19293J78816K14654K11351J63270P9144k0482
$$ 6187195 6123243 6113386 6166095 6285388 6464204 6678858 6890209 7053479 7132623 7112141
39512G112141j11076j72653j95428j81214j40423q5878k6504L5330J01413J72745
$$ 7112141 7001065 6828412 6632984 6451770 6311347 6225469 6198965 6234295 6335708 6508453
39502F508453K46335L15800L74522M18506M47377M63677M71414M74386M74413
$$ 6508453 6754788 7070588 7445110 7863616 8310993 8774670 9246084 9720470 10194883
39493A0194883M70102M57318M31837L92715L43856K92344K44751K04169J69875
$$ 10194883 10664985 11122303 11554140 11946855 12290711 12583055 12827806 13031975 13201850
39484A3201850J39293J10183Q1388N2171K1557j1346m6736q4073j22197j58507
$$ 13201850 13341143 13451326 13532714 13584885 13606442 13595096 13548360 13464287 13342090 13183583
39474A3183583j87613k01833j94559j64810j19485p1477l4277j5629j3559j7745
$$ 13183583 12995970 12794137 12599578 12434768 12315283 12243806 12209529 12193900 12180341 12162596
39464A2162596j5955j502K3916N3753Q3107J12688J47953J95230K58414L37639
$$ 12162596 12146641 12145139 12169055 12222808 12305915 12418603 12566556 12761786 13020200 13357839
39454A3357839M29044N24083O09280O68620O89300O67801O11828N36364M56496
$$ 13357839 13786883 14310966 14920246 15588866 16278166 16945967 17557795 18094159 18550655
39445A8550655L81368L12188K43925J68985Q0848k2926j38556k55313l57357m28246
$$ 18550655 18932023 19244211 19488136 19657121 19737969 19715043 19576487 19321174 18963817 18535571
39435A8535571m56275m37722l76634k81962j64159l2819J03849K38278L63013
$$ 18535571 18079296 17641574 17264940 16982978 16818819 16786000 16889849 17128127 17491140
39426A7491140M71523N59838O27198O74913P04532P16618P10612O85567O41774
$$ 17491140 17962663 18522501 19149699 19824612 20529144 21245762 21956374 22641941 23283715
39417B3283715N82587N14738M46283L83362L28078K78510K30191J78552J22241
$$ 23283715 23866302 24381040 24827323 25210685 25538763 25817273 26047464 26226016 26348257
39408B6348257O6196K2149M854K5275Q4457J71885K69514L59118M28624M74559
$$ 26348257 26414453 26436602 26441456 26466731 26551188 26723073 26992587 27351705 27780329 28254888
39398B8254888N00991N17315N35807N68186O20948O91728P69403Q38337Q84642
$$ 28254888 28755879 29273194 29809001 30377187 30998135 31689863 32459266 33297603 34182245
39389C4182245R01760Q93098Q70315Q47763Q36214Q39927Q58279Q89623R34211
$$ 34182245 35084005 35977103 36847418 37695181 38531395 39371322 40229601 41119224 42053435
39380D2053435R94662J074354J174556J291609J415919J534093J633589J707968
$$ 42053435 43048097 44122451 45297007 46588616 48004535 49538628 51172217 52880185
39372E2880185J760444J803881J856095J931765K035567K161192K296561K430805
$$ 52880185 54640629 56444510 58300605 60232370 62267937 64429129 66725690 69156495
39364F9156495K558132K677903K793176K909791L035825L180429L351586L553359
$$ 69156495 71714627 74392530 77185706 80095497 83131322 86311751 89663337 93216696
39356I3216696L783914M035847M299117M565184M830123N095324N365766N646592
$$ 93216696 97000610 101036457 105335574 109900758 114730881 119826205 125191971 130838563
39348A30838563N939602O241993O548593O855833P163745P473680P783329Q082593
$$ 130838563 136778165 143020158 149568751 156424584 163588329 171062009 178845338 186927931
39340A86927931Q352684Q568173Q700589Q722333Q610310Q349187P934351P374510
$$ 186927931 195280615 203848788 212549377 221271710 229882020 238231207 246165558 253540068
39332B53540068O692745N924656N113185M302198L531648K835639K242110J772145
$$ 253540068 260232813 266157469 271270654 275572852 279104500 281940139 284182249 285954394
39324B85954394J438311J243145J178719J227241J362584J553247J767036J975799
$$ 285954394 287392705 288635850 289814569 291041810 292404394 293957641 295724677 297700476
39316B97700476K157952K297627K381501K395250K321699K142172J841006J411066
$$ 297700476 299858428 302156055 304537556 306932806 309254505 311396677 313237683 314648749
39308C14648749Q56908J93806n56193j368597k219157l084197l939168m757237
$$ 314648749 315505657 315699463 315143270 313774673 311555516 308471319 304532151 299774914
39300B99774914n510213o172226o723890p154114p459247p641758p710378p680875
$$ 299774914 294264701 288092475 281368585 274214471 266755224 259113466 251403088 243722213
39292B43722213p575371p419094p235935p044971o858975o683974o518599o353602
$$ 243722213 236146842 228727748 221491813 214446842 207587867 200903893 194385294 188031692
39284A88031692o173314n960088n700092n387524n025676m625513m203159l776917
$$ 188031692 181858378 175898290 170198198 164810674 159784998 155159485 150956326 147179409
39276A47179409l364442k980614k636631k339759k093323j897179j748907j644764
$$ 147179409 143814967 140834353 138197722 135857963 133764640 131867461 130118554 128473790
39268A28473790j579412j544942j531479j530319j537576j555225j588557j642081
$$ 128473790 126894378 125349436 123817957 122287638 120750062 119194837 117606280 115964199
39260A15964199j716395j807027j905074j999285k078967k136360k167038k168347
$$ 115964199 114247804 112440777 110535703 108536418 106457451 104321091 102154053 99985706
39252I9985706k137781k072978j973585j843539j692147j532765j379225j241519
$$ 99985706 97847925 95774947 93801362 91957823 90265676 88732911 87353686 86112167
39244H6112167j123469j024214r42524q80379q42984q35578q59988r13404r89483
$$ 86112167 84988698 83964484 83021960 82141581 81298597 80463019 79603031 78689627 77700144
39235G7700144j080539j179487j280593j378431j465865j533629j573456j582850
$$ 77700144 76619605 75440118 74159525 72781094 71315229 69781600 68208144 66625294
39227F6625294j567097j535891j497299j453944j403871j344574j276879j206401
$$ 66625294 65058197 63522306 62025007 60571063 59167192 57822618 56545739 55339338
39219E5339338j141840j091066j057230j037367j024238j010203r90830r66133
$$ 55339338 54197498 53106432 52049202 51011835 49987597 48977394 47986564 47020431
39211D7020431r38603r09470q76727q37451p92781p50670p23393p21712p50050
$$ 47020431 46081828 45172358 44295631 43458180 42665399 41914729 41191336 40469624 39719574
39202C9719574q05081q77374r54638j025105j079480j110688j112872j082374
$$ 39719574 38914493 38037119 37082481 36057376 34977896 33867208 32754336 31671962
39194C1671962j021148r39417q53716p80330p28423o97335o78949o62223o36986
$$ 31671962 30650814 29711397 28857681 28077351 27348928 26651593 25972644 25310421 24673435
39185B4673435n96156n36997m61410l74721k83443j93381j09086l4299K7349P1912
$$ 24673435 24077279 23540282 23078872 22704151 22420708 22227327 22118241 22083942 22111291 22183203
39175B2183203R5595R6553P6979M3317M059l2809o0426p2579o4789l7898j766
$$ 22183203 22278798 22375351 22452330 22495647 22499706 22466897 22406471 22333892 22269103 22231205 22229439
39164B2229439K4380J7174m1008j51809k96992m45001n64819o38269o63555o50418
$$ 22229439 22253819 22270993 22229985 22078176 21781184 21336183 20771364 20133095 19469540 18819122
39154A8819122o12623n63039n12162m68327m37402m21253m15919m11390l94317
$$ 18819122 18206499 17643460 17131298 16662971 16225569 15804316 15388397 14977007 14582690
39145A4582690l53218k83973j92811r4635p162N5832Q7767Q7782N7649J013p4541
$$ 14582690 14229472 13945499 13752688 13658053 13650891 13706723 13794490 13882272 13939921 13940934 13866393
39134A3866393j56013k27154k74036k90860k82656k63145k48541k50377k71127
$$ 13866393 13710380 13483226 13209190 12918330 12635674 12372529 12123988 11873611 11602484
39125A1602484l04470l38919l62232l64933l42666k97272k35865j67958j02302
$$ 11602484 11298014 10959095 10596863 10231930 9889264 9591992 9356127 9188169 9085867
39116I085867m5451k488K1761K2626l355n7428j37838k38847l49680m54945n37569
$$ 9085867 9040416 9037928 9059689 9082315 9078960 9021532 8883694 8644847 8295167 7840222 7302653
39105G302653n83196n83586n37675m50923l34205k02615p3386L7391J18504J66247
$$ 7302653 6719457 6135871 5598196 5147273 4813068 4610453 4537067 4574458 4692962 4859209
39095D859209J84828J84544J78268J77050J85977K02227K16812K19669K05275
$$ 4859209 5044037 5228581 5406849 5583899 5769876 5972103 6188915 6408584 6613859
39086F613859J75506J38119J02030P2410M8520K5463j679l4435p0397j05508j37001
$$ 6613859 6789365 6927484 7029514 7101924 7150444 7175907 7174228 7139793 7069396 6963888 6826887
39075F826887j64694j89773k12200k29298k37093k33265k18880j97363j72106
$$ 6826887 6662193 6472420 6260220 6030922 5793829 5560564 5341684 5144321 4972215
39066D972215j44982j16296q5678n3403k1820M460K0833K5914K2507J5166P052
$$ 4972215 4827233 4710937 4625259 4571856 4550036 4554496 4575329 4601243 4623750 4638916 4645968
39055D645968m89n745m884P124L3847P5314J27736J84495K37441K77937K97572
$$ 4645968 4645479 4639734 4634850 4641974 4675821 4751135 4878871 5063366 5300807 5578744 5876316
39044E876316K88733K45557J65650N1949q6807k37639l85325n12848o01503o34259
$$ 5876316 6165049 6410606 6576256 6628205 6541398 6303759 5918434 5405586 4804083 4169824
39034D169824o03212n15646l92211k57446j30279k1079O5867J29686J72669K00300
$$ 4169824 3566612 3050966 2658755 2401309 2271030 2249951 2315818 2445504 2618173 2818473
39024B818473K19381K35097K49000K58784K59356K44434K08251J47094O0869m5440
$$ 2818473 3037854 3272951 3521951 3780735 4040091 4284525 4492776 4639870 4700739 4655299
39014D655299j61341k72712l65545m29533m59797m56964m26677l78587l24258
$$ 4655299 4493958 4221246 3855701 3426168 2966371 2509407 2082730 1704143 1379885
39005A379885k74007k33486k01222j68509j22606n2904M2515J53501K59852L38135
$$ 1379885 1105878 872392 671170 502661 380055 327151 369666 523167 783019 1121154
38995A121154L70348L50498K85889J92538Q7480j7468j16986k08569k87008l41669
$$ 1121154 1491502 1842000 2127889 2320427 2407907 2390439 2273453 2064884 1777876 1436207
38985A436207l59278l30970k58631j55932m3533N7989J33480J75713J85762J71746
$$ 1436207 1076929 745959 487328 331396 287863 345852 479332 655045 840807 1012553
38975A012553J45609J18613R7781Q5633Q2921R1410J13750J50154J95061K37717
$$ 1012553 1158162 1276775 1374556 1460189 1543110 1634520 1748270 1898424 2093485 2331202
38965B331202K67303K79062K76236K65834K51452K29103J89430J24630L4853p0051
$$ 2331202 2598505 2877567 3153803 3419637 3671089 3900192 4089622 4214252 4249105 4179054
38955D179054j74065k61445l22649l56968l70470l70573l60981l40511l05935
$$ 4179054 4004989 3743544 3420895 3063927 2693457 2322884 1961903 1621392 1315457
38946A315457k55560j90655j14624l1715N3875J38591K19509K93131L53786L93980
$$ 1315457 1059897 869242 754618 722903 776778 915369 1134878 1428009 1781795 2175775
38936B175775M07515L93245L56262L05858K51804K00881J54338J07629N3890r507
$$ 2175775 2583290 2976535 3332797 3638655 3890459 4091340 4245678 4353307 4407197 4397690
38926D397690p5984j31287j61627j62623j42485j17670j04691j13153j42745j84307
$$ 4397690 4321706 4190419 4028792 3866169 3723684 3606014 3501323 3388170 3245425 3061118
38916C061118k23849k48111k49736k29650j95190j55178j15126p5652l4440J0402
$$ 3061118 2837269 2589158 2339422 2109772 1914582 1759404 1644278 1568626 1534186 1544588
38906A544588N8261J06128J49777J84597K05470K06659J82777J30945N2908m4507
$$ 1544588 1602849 1708977 1858754 2043351 2248821 2455480 2638257 2769202 2822110 2777603
38896B777603j51052k56174l52364m37192n12706n81980o44694o95007p23701
$$ 2777603 2626551 2370377 2018013 1580821 1068115 486135 -158559 -853566 -1577267
38887a577267p23225o92080o35717n63543m83932m00263l10293k09101r3381L5718
$$ -1577267 -2300492 -2992572 -3628289 -4191832 -4675764 -5076027 -5386320 -5595421 -5688802 -5653084
38877e653084J72204L06359M26420N20901N81997O08759O07929N91215N69982
$$ -5653084 -5480880 -5174521 -4748101 -4227200 -3645203 -3036444 -2428515 -1837300 -1267318
38868a267318N50172N30498N05303M70302M27202L83699L49022L28609L21657
$$ -1267318 -717146 -186648 318655 788957 1216159 1599858 1948880 2277489 2599146
38859B599146L22519L23635L17627K97912K59221J98789J17359J8647r2098k08626
$$ 2599146 2921665 3245300 3562927 3860839 4120060 4318849 4436208 4454855 4362757 4154131
38849D154131l22635m23386n00317n47713n67543n67707n57010n40795n19764
$$ 4154131 3831496 3408110 2907793 2360080 1792537 1224830 667820 127025 -392739
38840c92739m91607m53547m04571l46582k83975k21207j59864r7828l1775L9068
$$ -392739 -884346 -1337893 -1742464 -2089046 -2373021 -2594228 -2754092 -2851920 -2883695 -2844627
38830b844627J11842J82930K51875L22311L98994M83811N73930O62464P40016
$$ -2844627 -2732785 -2549855 -2297980 -1975669 -1576675 -1092864 -518934 143530 883546
38821H83546P95738Q18234P97335P27301O10495M59240K93766J36249L678r6949
$$ 883546 1679284 2497518 3294853 4022154 4632649 5091889 5385655 5521904 5525582 5428633
38811E428633j69141k23659k73192l26955l87258m49479n05143n45786n65263
$$ 5428633 5259492 5035833 4762641 4435686 4048428 3598949 3093806 2548020 1982757
38802A982757n59962n28206m69887l86708k82939j66550m9668N3005J28574J71002
$$ 1982757 1422795 894589 424702 37994 -244945 -411495 -461163 -408158 -279584 -108582
38792a08582J83859J78748J70432J71327J88114K21487K68063L22064L75382M16935
$$ -108582 75277 254025 424457 595784 783898 1005385 1273448 1595512 1970894 2387829
38782B387829M33950M16018L59649K69705J56564L1338r7236k22684l38556m36630
$$ 2387829 2821779 3237797 3597446 3867151 4023715 4055053 3957817 3735133 3396577 2959947
38772B959947n07000n39980n28785m71892l74135k45704r9357N2442J98279L26578
$$ 2959947 2452947 1912967 1384182 912290 538155 292451 193094 245536 443815 770393
38762G70393M25086M83606M98937M77617M33352L80391L27596K76897K25964J72152
$$ 770393 1195479 1679085 2178022 2655639 3088991 3469382 3796978 4073875 4299839 4471991
38752D471991J15187N7903N105l9382p6405j12943j58666k18816k88808l54989
$$ 4471991 4587178 4645081 4650186 4610804 4534399 4421456 4262790 4043974 3755166 3400177
38742C400177m00921m14305l90789l34276k55233j67907q7007k4689J1373J8700
$$ 3400177 2999256 2584951 2194162 1859886 1604653 1436746 1349739 1325050 1336423 1355123
38732A355123m93m1420r9881j73917k61839l57991m50433n23089n60481n51506
$$ 1355123 1354630 1313210 1213329 1039412 777573 419582 -30851 -553940 -1114421 -1665927
38722a665927m90956l80391k29157n4187J23103K82238M08870M97410N50135N73399
$$ -1665927 -2156883 -2537274 -2766431 -2820618 -2697515 -2415277 -2006407 -1508997 -958862 -385463
38712c85463N72924N50897N06414M38217L47436K39010J22016Q618q9212j64485
$$ -385463 187461 738358 1244772 1682989 2030425 2269435 2391451 2400069 2310857 2146372
38702B146372k18143k57260k89473l18217l42341l59793l71914l84644m04901
$$ 2146372 1928229 1670969 1381496 1063279 720938 361145 -10769 -395413 -800314
38693h00314m33975m62835m74042m50405l84724k83758j64224m4674O1150J46949
$$ -800314 -1234289 -1697124 -2171166 -2621571 -3006295 -3290053 -3454277 -3498951 -3437801 -3290852
38683c290852K13386K66019L11679L53522L87457M03382L91559L49836K86435
$$ -3290852 -3077466 -2811447 -2499768 -2146246 -1758789 -1355407 -963848 -614012 -327577
38674c27577K17020J58847J25624J24666J56034K12854K82284L47476L91359M02175
$$ -327577 -110557 48290 173914 298580 454614 667468 949752 1297228 1688587 2090762
38664B090762L77951L26453K60354J91280J26781P0469K2997j7275n3239q7268
$$ 2090762 2468713 2795166 3055520 3246800 3373581 3444050 3467047 3449772 3396533 3309265
38654C309265j19949j50556j78418k03560k26014k44766k57567k61494k53360
$$ 3309265 3189316 3038760 2860342 2656782 2430768 2186002 1928435 1666941 1413581
38645A413581k29509j85848j19110k9104P9682J98318L15264M18930N00241N54482
$$ 1413581 1184072 998224 879114 850010 929692 1128010 1443274 1862204 2362445 2916927
38635B916927N81274N82522N60223N16578M56156L87475L21525K68080K32573
$$ 2916927 3498201 4080723 4640946 5157524 5613680 6001155 6322680 6590760 6823333
38626F823333K15170K11623K14628K15314K05005J77114J28412N9521k4869j16019
$$ 6823333 7038503 7250126 7464754 7680068 7885073 8062187 8190599 8250120 8225251 8109232
38616H109232k02563k74199l26035l60370l84187m04425m24513m43577m57402
$$ 8109232 7906669 7632470 7306435 6946065 6561878 6157453 5732940 5289363 4831961
38607D831961m60007m45494m10172l54782k86555k20066j74604j66995k03057
$$ 4831961 4371954 3926460 3516288 3161506 2874951 2654885 2480281 2313286 2110229
38598B110229k73876l59815m38443m90491n02103m66574l87536k80664j69713
$$ 2110229 1836353 1476538 1038095 547604 45501 -421073 -808609 -1089273 -1258986
38589a258986p6805j2595K7281N7575R4203J46259K12905K85091L49948L95674
$$ -1258986 -1335791 -1348386 -1321105 -1263530 -1169327 -1023068 -810163 -525072 -175124 220550
38579B20550M15299M08208L79127L35455K84526K31610J78679J24186O4561k475
$$ 220550 635849 1044057 1423184 1758639 2043165 2274775 2453454 2577640 2642201 2639726
38569B639726p4380j42497j94262k17968k07443j64373r7601k0544N2021J07370
$$ 2639726 2565346 2422849 2228587 2010619 1803176 1638803 1541202 1520658 1572679 1680049
38559A680049J38161J44573J33561J15330R9409R2349R6823J10845J27699J38621
$$ 1680049 1818210 1962783 2096344 2211674 2311083 2403432 2500255 2611100 2738799 2877420
38549B877420J37885J26345J09847R3825P9193O2718M0407J0421k5957o4541r9011
$$ 2877420 3015305 3141650 3251497 3345322 3424515 3487233 3527640 3538061 3512104 3447563 3348552
38538C348552j22541j30164j20874r8379p0405m6787l6469m3876o6360r4590j16312
$$ 3348552 3226011 3095847 2974973 2876594 2806189 2759402 2722933 2679057 2612697 2518107 2401795
38527B401795j21562j06402p3713l1442J0162M1667N7468N7401M5352K5412q36
$$ 2401795 2280233 2173831 2100118 2068676 2078838 2120505 2177973 2235374 2280726 2306138 2305302
38516B305302l2836o7003r5012j07457r9903p5574m2210o289K9974O6715J02199
$$ 2305302 2272466 2205463 2110451 2002994 1903091 1827517 1785307 1779018 1808992 1875707 1977906
38505A977906J30819J44998J39102J11940O6635Q887n5090j20297j83977k45032
$$ 1977906 2108725 2253723 2392825 2504765 2571400 2580287 2525197 2404900 2220923 1975891
38495A975891l01926l50650l84768l97960l87327l55276l08838k56779k06173
$$ 1975891 1673965 1323315 938547 540587 153260 -202016 -510854 -767633 -973806
38486i73806j60035j16829p1663j8779M5112J17641J89541K46616K74478K63948
$$ -973806 -1133841 -1250670 -1322333 -1341112 -1296000 -1178359 -988818 -742202 -467724 -203776
38476b03776K14546J34262L5849o7574j64240k42396k89177k92965k48088j57676
$$ -203776 10770 145032 180881 113307 -50933 -293329 -582506 -875471 -1123559 -1281235
38466a281235l2728J10992K55853L85412M88364N61787O10632O43066O64775O76025
$$ -1281235 -1313963 -1202971 -947118 -561706 -73342 488445 1099077 1742143 2406918 3082943
38456C082943O72415O47850N97904N22595M27559L22714K18322J20643L0395n4662
$$ 3082943 3755358 4403208 5001112 5523707 5951266 6273980 6492302 6612945 6643340 6588678
38446F588678j35100k07200k64113k99459l10413k98838k70531k33297j94662
$$ 6588678 6453578 6246378 5982265 5682806 5372393 5073555 4803024 4569727 4375065
38437D375065j60309j34155j19294j18304j31982j57500j87725k12629k22539
$$ 4375065 4214756 4080601 3961307 3843003 3711021 3553521 3365796 3153167 2930628
38428B930628k12063j82793j43279j06061q3365q3451j08496j53857k08801k59087
$$ 2930628 2718565 2535772 2392493 2286432 2203067 2119616 2011120 1857263 1648462 1389375
38418A389375k91058k96043k73458k31599j85369j51043j39718j52478j79861
$$ 1389375 1098317 802274 528816 297217 111848 -39195 -178913 -331391 -511252
38409e11252k05473k11897j86490j25441l4535P3956J86399K91680L82182M53246
$$ -511252 -716725 -928622 -1115112 -1240553 -1275088 -1201132 -1014733 -723053 -340871 112375
38399A12375N03087N32727N44590N40380N20868M88021M46490M01534L54557L00471
$$ 112375 615462 1148189 1692779 2233159 2754027 3242048 3688538 4090072 4444629 4745100
38389D745100K29577J32756O874j42167k99658m45467n59708o28773o49479o29190
$$ 4745100 4974677 5107433 5114307 4972140 4672482 4227015 3667307 3038534 2389055 1759865
38379A759865n81761n21506m58754l99077l44965k97255k55418k17998j83941
$$ 1759865 1178104 656598 197844 -201233 -546198 -843453 -1098871 -1316869 -1500810
38370a500810j53548j27701j06506q9667p8648p7714r1619j21061j59882j96438
$$ -1500810 -1654358 -1782059 -1888565 -1978232 -2056880 -2134594 -2226213 -2347274 -2507156 -2703594
38360b703594k18397k17821j94026j53520j07698o9173m7969m9023p2077j13652
$$ -2703594 -2921991 -3139812 -3333838 -3487358 -3595056 -3664229 -3712198 -3761221 -3833298 -3946950
38350c946950j69298k34521l04207l71683m28467m65030m72117m41966l69440
$$ -3946950 -4116248 -4350769 -4654976 -5026659 -5455126 -5920156 -6392273 -6834239 -7203679
38341g203679k53534r9797P7630K56867M13408N27463N89282N99789N67062N01281
$$ -7203679 -7457213 -7557010 -7479380 -7222513 -6809105 -6281642 -5692360 -5092571 -4525509 -4024228
38331d024228M10757L00860J76211M4283q2519j88189k56993k78110k49518j79941
$$ -4024228 -3613471 -3312611 -3136400 -3092117 -3174636 -3362825 -3619818 -3897928 -4147446 -4327387
38321d327387q7018Q420Q9074J44909J73083J76506J63258J46046J39843J57531
$$ -4327387 -4414405 -4405985 -4316911 -4172002 -3998919 -3822413 -3659155 -3513109 -3373266 -3215735
38311c215735K05312K80157L70530M59884N30620N66472N54074M86137L66010
$$ -3215735 -3010423 -2730266 -2359736 -1899852 -1369232 -802760 -248686 237451 603461
38302F03461K09512M0801j15309k39284l18894l49542l34520k83674k09185j20584
$$ 603461 812973 853774 738465 499181 180287 -169255 -503775 -787449 -996634 -1117218
38292a117218k2739Q2076J90176K93548L80110M37659M59545M48202M13823L69662
$$ -1117218 -1139957 -1057881 -867705 -574157 -194047 243612 703157 1151359 1565182 1934844
38282A934844L27860K97615K83858K84823K90432K85212K55994J99618J24692
$$ 1934844 2262704 2560319 2844177 3129000 3419432 3704644 3960638 4160256 4284948
38273D284948M6346k1418o9945r5232r5481p0230k1511M4717J18028J84331K28564
$$ 4284948 4331294 4309876 4239931 4144699 4049218 3978988 3957477 4002194 4120222 4304553 4533117
38262D533117K39053K11193J47776N6479n2211j64844k65164l37594l72849l70740
$$ 4533117 4772170 4983363 5131139 5187618 5135407 4970563 4705399 4367805 3994956 3624216
38252C624216l37596k80901k06059j17315k0548P5231J58952K19683K48760K41488
$$ 3624216 3286620 3005719 2799660 2682345 2661797 2737028 2895980 3115663 3364423 3605911
38242C605911J98778J27766M0017n2276j39614k15794k76504l18608l41648l50020
$$ 3605911 3804689 3932455 3972472 3920196 3780582 3564788 3288284 2969676 2628028 2278008
38232B278008l53000l61402l82390m15710m53950m86523n04521n03266m82033
$$ 2278008 1925008 1563606 1181216 765506 311556 -174967 -679488 -1182754 -1664787
38223a664787m42648l88430l23247k50567j73399r5820k4867K9421N6590M9255
$$ -1664787 -2107435 -2495865 -2819112 -3069679 -3243078 -3338898 -3363765 -3334344 -3277754 -3228499
38213c228499N809o8193j59768k50049l18449l48758l34577k81025k01430j10683
$$ -3228499 -3222690 -3290883 -3450651 -3700700 -4019149 -4367907 -4702484 -4983509 -5184939 -5295622
38203e295622j9099O9519J54899K35370L05398L57211L84497L84670L58596L09375
$$ -5295622 -5314721 -5245202 -5090303 -4854933 -4549535 -4192324 -3807827 -3423157 -3064561 -2755186
38193b755186K41940J63326Q2461R685m3388o4177m1465K9794J44055K84875M29377
$$ -2755186 -2513246 -2349920 -2267459 -2257774 -2301162 -2365339 -2406804 -2377010 -2232955 -1948080 -1518703
38182a518703N54640O42541O82160O70490O11941N16372L96161K63872J31791
$$ -1518703 -964063 -321522 360638 1031128 1643069 2159441 2555602 2819474 2951265
38173B951265J2506q1596j41237j64479j59339j42017j30426j35913j57841j84167
$$ 2951265 2963771 2882175 2740938 2576459 2417120 2275103 2144677 2008764 1850923 1666756
38163A666756j97327j81569j27867l5498Q8368K29683L69281M86183N62414N88072
$$ 1666756 1469429 1287860 1159993 1124495 1212863 1442546 1811827 2298010 2860424 3448496
38153C448496N64516N03845M24044L41710K66031J97120J28648N2426l7666j43265
$$ 3448496 4013012 4516857 4940901 5282611 5548642 5745762 5874410 5926836 5889170 5745905
38143E745905k60636l81264m93737n85994o46924o67606o43011n74350m70370
$$ 5745905 5485269 5104005 4610268 4024274 3377350 2709744 2066733 1492383 1022013
38134A022013l45710k16358r4778J2502J03933J79949K40015K81109K98298K87299
$$ 1022013 676303 459945 365167 377669 481602 661551 901566 1182675 1480973 1768272
38124A768272K47825J85589J11360L7595k5305p1369r9448j11843j11949j02030
$$ 1768272 2016097 2201686 2313046 2350641 2325336 2253967 2154519 2042676 1930727 1828697
38114A828697q2279n1601r492M1766R5540J41036J66045J61178J23118N5282l3385
$$ 1828697 1746418 1694817 1685325 1727091 1822631 1963667 2129712 2290890 2414008 2469290 2435905
38103B435905j30062k19792k88071l24275l24784k94260k43934j86826j31815
$$ 2435905 2305843 2086051 1797980 1473705 1148921 854661 610727 423901 292086
38094B92086q0105k6868L2893R8348J60772K06715K24375K09393J66455J05994
$$ 292086 211981 185113 218006 316354 477126 683841 908216 1117609 1284064 1390058
38084A390058L9001k6239q4246j30665j60312j65805j38471p3213K4694J36674
$$ 1390058 1429059 1402820 1318574 1187909 1027597 861792 723321 650108 674802 811476
38074H11476K35627K95705L00626K46980J43377P101j41230k83777m09404n13057
$$ 811476 1047103 1342808 1643434 1890414 2033791 2040892 1899662 1615885 1206481 693424
38064F93424n92025o42762o61113o45384n99252n31455m52298l70021k89970k15813
$$ 693424 101399 -541363 -1202476 -1847860 -2447112 -2978567 -3430865 -3800886 -4090856 -4306669
38054d306669j49799r1217l5435K4046R1733J67420K46139L20136L81543M24348
$$ -4306669 -4456468 -4547685 -4583120 -4559074 -4467341 -4299921 -4053782 -3733646 -3352103 -2927755
38044b927755M44485M38237M01334L30651K27415R8860m2887j83097l06254l97634
$$ -2927755 -2483270 -2045033 -1643699 -1313048 -1085633 -986773 -1029660 -1212757 -1519011 -1916645
38034a916645m45377m42983l91362k99837j85053o7061L6519J15026J65355J89191
$$ -1916645 -2362022 -2805005 -3196367 -3496204 -3681257 -3748318 -3711799 -3596773 -3431418 -3242227
38024c242227J89933J71194J36561Q9570L3789k6593q5862j36449j69977j79594
$$ -3242227 -3052294 -2881100 -2744539 -2654969 -2621180 -2647773 -2733635 -2870084 -3040061 -3219655
38014c219655j62625j22009o5650l955N3189R9165J32360J56222J77106K00578
$$ -3219655 -3382280 -3504289 -3569939 -3573894 -3520705 -3421540 -3289180 -3132958 -2955852 -2755274
38004b755274K28406K58199K85687L07584L22974L32858L39133L43920L49189
$$ -2755274 -2526868 -2268669 -1982982 -1675398 -1352424 -1019566 -680433 -336513 12676
37995A2676L56211L64981L74197L81809L85739L84445L77482L65650L50137L30754
$$ 12676 368887 733868 1108065 1489874 1875613 2260058 2637540 3003190 3353327 3684081
37985C684081L04648K66991K13376J42472N7489l4221j23358k01934k65962l15987
$$ 3684081 3988729 4255720 4469096 4611568 4669057 4634836 4511478 4309544 4043582 3727595
37975C727595l55252l86941m11866m27046m25298l96346l30256k22625p9057Q4287
$$ 3727595 3372343 2985402 2573536 2146490 1721192 1324846 994590 771965 692908 777195
37965G77195K45656L86112M96307N77253O35094O74138O93114O86623O50152N84871
$$ 777195 1022851 1408963 1905270 2482523 3117617 3791755 4484869 5171492 5821644 6406515
37955F406515M98882M03876L09422K18690J28205L1306p6510j92840l06542m00918
$$ 6406515 6905397 7309273 7618695 7837385 7965590 7996896 7920386 7727546 7421004 7020086
37945G020086m61212m82288m71282m43245m12658l86286l61700l32017k93141
$$ 7020086 6558874 6076586 5605304 5162059 4749401 4363115 4001415 3669398 3376257
37936C376257k47943k04289j69171j44168j25616j08408r0053p2355o0325n9576
$$ 3376257 3128314 2924025 2754854 2610686 2485070 2376662 2286609 2214254 2153929 2094353
37926B094353p3882j04047j48106k02185k61780l23037l82851m36934m77249m92122
$$ 2094353 2020471 1916424 1768318 1566133 1304353 981316 598465 161531 -315718 -807840
37916h07840m70209m05758l01341j66850j6422J34873K73738L90248M78110N34044
$$ -807840 -1278049 -1683807 -1985148 -2151998 -2168420 -2033547 -1759809 -1369561 -891451 -357407
37906c57407N57495N50721N18244M64999L94139L06650K03937R2211j4700r7544
$$ -357407 200088 750809 1269053 1734052 2128191 2434841 2638778 2730989 2716289 2618745
37896B618745j38925j31127p9128K725R6941J87912K64443L20771L56619L75909
$$ 2618745 2479820 2348693 2269565 2272290 2369231 2557143 2821586 3142357 3498976 3874885
37886C874885L84272L86316L83539L73350L49548L04602K33203J35421J7703j08773
$$ 3874885 4259157 4645473 5029012 5402362 5751910 6056512 6289715 6425136 6442839 6334066
37876F334066k31171l37664m18853m68383m83705m66769m23725l63489k96208
$$ 6334066 6102895 5765231 5346378 4877995 4394290 3927521 3503796 3140307 2844099
37867B844099k32352j81977j53055j49349j69181k06146k51274k95281l30077
$$ 2844099 2611747 2429770 2276715 2127366 1958185 1752039 1500765 1205484 875407
37858H75407l49587l50740l34679l06964k75179k44566k14967j81837j40924r2900
$$ 875407 525820 175080 -159599 -466563 -741742 -986308 -1201275 -1383112 -1524036 -1616936
37848a616936m4618o186J4347J5569L432j2342k3338k4791j4362R669M7798R7007
$$ -1616936 -1661554 -1667740 -1653393 -1637824 -1634392 -1646734 -1670072 -1694863 -1709225 -1699556 -1651758 -1554751
37836a554751J50247J99160K38186K66616K87038L01421L07823L00048K70243
$$ -1554751 -1404504 -1205344 -967158 -700542 -413504 -112083 195740 495788 766031
37827G66031K12629J26648J8960r6451k01493k80483l26637l43808l42436l33289
$$ 766031 978660 1105308 1124268 1027817 826324 545841 219204 -124604 -467040 -800329
37817h00329l23535l15874l08862k97427k74688k35763j81346j18133n5404l72
$$ -800329 -1123864 -1439738 -1748600 -2046027 -2320715 -2556478 -2737824 -2855957 -2911361 -2911733
37807b911733M4663Q2140J16824J52122J86558K12699K20251K02168J59367J00611
$$ -2911733 -2867070 -2784930 -2668106 -2515984 -2329426 -2116727 -1896476 -1694308 -1534941 -1434330
37797a434330L8474j4874m9733n9622m1979J341O4474J38573K13035K77250L22988
$$ -1434330 -1395856 -1410730 -1460463 -1520085 -1562064 -1560723 -1496249 -1357676 -1144641 -867391 -544403
37786e44403L45915L44780L18992K67336J89138Q6705l3102j58836k75751l68203
$$ -544403 -198488 146292 465284 732620 921758 1008463 975361 816525 540774 172571
37776A72571m23200m34048m02381l37130k50966j56222o2622K2378R2471J43027
$$ 172571 -250629 -684677 -1087058 -1424188 -1675154 -1831376 -1893998 -1871620 -1779149 -1636122
37766a636122J73547J89524K00824K16814K41398K71381K99027L16778L20718
$$ -1636122 -1462575 -1273051 -1072227 -855413 -614015 -342634 -43607 273171 593889
37757E93889L10778K88401K54277K07898J48302P4773j2167j08943k07418k96157
$$ 593889 904667 1193068 1447345 1655243 1803545 1878318 1866151 1757208 1549790 1253633
37747A253633l64473m06147m20210m09647l80272l40059k97395k58131k23284
$$ 1253633 889160 483013 62803 -346844 -727116 -1067175 -1364570 -1622701 -1845985
37738a845985j88879j47668r1953j7304P3527J68689K49095K93920K87443K24715
$$ -1845985 -2034864 -2182532 -2274485 -2291789 -2218262 -2049573 -1800478 -1506558 -1219115 -994400
37728i94400J14048k4640j65127k82041l57435l84612l67590l16341k40741j47598
$$ -994400 -880352 -904992 -1070119 -1352160 -1709595 -2094207 -2461797 -2778138 -3018879 -3166477
37718c166477m2173O8611J75237K67241L35038L70839L69954L33371K69777J94538
$$ -3166477 -3208650 -3140039 -2964802 -2697561 -2362523 -1991684 -1621730 -1288359 -1018582 -824044
37708h24044J25463P7623N9853P4039J16556J80291K56298L35437M10610M78477
$$ -824044 -698581 -620958 -561105 -487066 -370510 -190219 66079 401516 812126 1290603
37698A290603N38429N88924O24263O35088O12300N51320M54304L30072J92459
$$ 1290603 1829032 2417956 3042219 3677307 4289607 4840927 5295231 5625303 5817762
37689E817762N7365o0770j51833k11079k38675k38844k19075j88709j56239j26145
$$ 5817762 5875127 5814357 5662524 5451445 5212770 4973926 4754851 4566142 4409903 4283758
37679D283758r7550o6336k9458J1956N2908Q7081J08971J14593J01767P1049K6477
$$ 4283758 4186208 4119872 4090414 4102370 4155278 4242359 4351330 4465923 4567690 4638739 4665216
37668D665216k4998p5270j16827j44041j54315j49325j35467j22493j20605j37288
$$ 4665216 4640218 4564948 4448121 4304080 4149765 4000440 3864973 3742480 3621875 3484587
37658C484587j74912k29304k89783l42079l74099l81464l68378l43150l12886
$$ 3484587 3309675 3080371 2790588 2448509 2074410 1692946 1324568 981418 668532
37649F68532k81890k53534k31373k17539k10628k06493k01454j94856j88729j85126
$$ 668532 386642 133108 -98265 -315804 -526432 -732925 -934379 -1129235 -1317964 -1503090
37639a503090j83454j79707j68573j47524j20535r8366r3995j15172j58639k10119
$$ -1503090 -1686544 -1866251 -2034824 -2182348 -2302883 -2401249 -2495244 -2610416 -2769055 -2979174
37629b979174k50658k65579k50260k09159j49522p5713J0699J05688J98538K74037
$$ -2979174 -3229832 -3495411 -3745671 -3954830 -4104352 -4180065 -4169366 -4063678 -3865140 -3591103
37619c591103L19554L30420L09594K64295K04301J41990R0519N8921M7767M9614
$$ -3591103 -3271549 -2941129 -2631535 -2367240 -2162939 -2020949 -1930430 -1871509 -1823742 -1774128
37609a774128N4067N4013M9462M7432N7785Q6883J32669J84297K26374K45086
$$ -1774128 -1720061 -1666048 -1616586 -1569154 -1511369 -1424486 -1291817 -1107520 -881146 -636060
37599f36060K33424J93802J37245P9065L2714M906n317l572M361J5574L0187M9301
$$ -636060 -402636 -208834 -71589 7476 40190 45096 39779 36207 40568 56142 86329 135630
37587A35630P2756R8166J21624J39283J49062J51640J50215J49345J53702J67256
$$ 135630 208386 306552 428176 567459 716521 868161 1018376 1167721 1321423 1488679
37577A488679J92279K27912K69164L07855L35431L45790L36327L06868K57753
$$ 1488679 1680958 1908870 2178034 2485889 2821320 3167110 3503437 3810305 4068058
37568D068058J88819J00390l993j15277k19528l01956l52034l66536l49065l07211
$$ 4068058 4256877 4357267 4353274 4237997 4018469 3716513 3364479 2997943 2648878 2341667
37558B341667k49382j82858j13115m4014K1378P9352J24512J50669J54088J36453
$$ 2341667 2092285 1909427 1796312 1752298 1773676 1853028 1977540 2128209 2282297 2418750
37548B418750J04284O4493J9797l1757r2857j62027k32009k92686l36274l60639
$$ 2418750 2523034 2587527 2607324 2575567 2482710 2320683 2088674 1795988 1459714 1099075
37538A099075l68030l60593l37095k94171k30476j49348n7635L7068J27646K06785
$$ 1099075 731045 370452 33357 -260814 -491290 -640638 -698273 -661205 -533559 -326774
37528c26774K66762L00973L06124K83399K38710J82583J29014R1816P8902Q7669
$$ -326774 -60012 240961 547085 830484 1069194 1251777 1380791 1472607 1551509 1639178
37518A639178J05042J12917R6391N0672j6836r0582j55117k02801k36086k63260
$$ 1639178 1744220 1857137 1953528 2004200 1987364 1896782 1741665 1538864 1302778 1039518
37508A039518k91311l21305l48921l68487l76677l72975l57042l25687k72816
$$ 1039518 748207 426902 77981 -290506 -667183 -1040158 -1397200 -1722887 -1995703
37499a995703j93269q7878L4538J60026K74955L70234M42312M91522N19765N29012
$$ -1995703 -2188972 -2276850 -2242312 -2082286 -1807331 -1437097 -994785 -503263 16502 545514
37489E45514N21178M98793M64747M20508L64255K91464J98297Q5105m2809j77123
$$ 545514 1066692 1565485 2030232 2450740 2814995 3106459 3304756 3389861 3347052 3169929
37479C169929l09048m30823n36202o20444o79923p11750p13948o86079o29618
$$ 3169929 2860881 2430058 1893856 1273412 593489 -118261 -832209 -1518288 -2147906
37470b147906n48068m47392l36616k26830j27569m2620L1114J00183J68988K35863
$$ -2147906 -2695974 -3143366 -3479982 -3706812 -3834381 -3877001 -3845887 -3745704 -3576716 -3340853
37460c340853K93345L32033L45392L32579K97833K47476J87147J21172N3818r122
$$ -3340853 -3047508 -2715475 -2370083 -2037504 -1739671 -1492195 -1305048 -1183876 -1130058 -1139180
37450a139180o0089r1399r8488q3127n4039k3356l68J2922K1048L0162M3601O1470
$$ -1139180 -1199269 -1290668 -1389156 -1472283 -1526322 -1549678 -1550046 -1537124 -1516076 -1485914 -1442313 -1380843
37438a380843Q3145J09138J40401J76210K12577K42327K57102K51187K25351J87770
$$ -1380843 -1297698 -1188560 -1048159 -871949 -659372 -417045 -159943 91244 316595 504365
37428E04365J50308J22255J05738R5461Q2140N7434J7988l3276q9417j43593j91839
$$ 504365 654673 776928 882666 978127 1060267 1117701 1135689 1102413 1012996 869403 677564
37417F77564k32624k64997k88305l04142l17690l35495l60217l86212m00033l86152
$$ 677564 444940 179943 -108362 -412504 -730194 -1065689 -1425906 -1812118 -2212151 -2598303
37407b598303l34387k44283j24499J1404J49710K79599L93936M88138N58180N99412
$$ -2598303 -2932690 -3176973 -3301472 -3290068 -3140358 -2860759 -2466823 -1978685 -1420505 -821093
37397h21093O07421N80647N22679M42470L52527K66716J98576J59146J53525J77394
$$ -821093 -213672 366975 889654 1332124 1684651 1951367 2149943 2309089 2462614 2640008
37387B640008K16461K50305K58928K28909J57197N2083o8682j82867k70678l20993
$$ 2640008 2856469 3106774 3365702 3594611 3751808 3803891 3735209 3552342 3281664 2960671
37377B960671l33964l18891k88871k55171k23972j96235j69341j38796r9469m6934
$$ 2960671 2626707 2307816 2018945 1763774 1539802 1343567 1174226 1035430 935961 889027
37367H89027K0779J01469J87667K66883L23893L45293L24678K65776J81699R1013
$$ 889027 909806 1011275 1198942 1465825 1789718 2135011 2459689 2725465 2907164 2998177
37357B998177J2262m1692o7793p3245p1092p3287q5821j08815j40026j77837k21495
$$ 2998177 3010439 2968747 2900954 2827709 2756617 2683330 2597509 2488694 2348668 2170831 1949336
37346A949336k69673l19735l68487m12758m48486m68983m64795m26429l48951
$$ 1949336 1679663 1359928 991441 578683 130197 -338786 -803581 -1230010 -1578961
37337a578961k35729r8983M3556J74360K81120L58623M07832M34512M48784M63815
$$ -1578961 -1814690 -1913673 -1870117 -1695757 -1414637 -1056014 -648182 -213670 235114 698929
37327F98929M91678N37127N93254O42371O62110O33702N48529M10625K34994M3331
$$ 698929 1190607 1727734 2320988 2963359 3625469 4259171 4807700 5218325 5453319 5496650
37317E496650j41253k99476m20003n00798n47037n67230n70509n65584n59440
$$ 5496650 5355397 5055921 4635918 4135120 3588083 3020853 2450344 1884760 1325320
37308A325320n54534n46852n28189m92392m40921l83203l31794k96099k78400
$$ 1325320 770786 223934 -304255 -796647 -1237568 -1620771 -1952565 -2248664 -2527064
37299b527064k73454k71142k61237k38754k07366j78627j66758j81099k19618
$$ -2527064 -2800518 -3071660 -3332897 -3571651 -3779017 -3957644 -4124402 -4305501 -4525119
37290d525119k66706k97558k88300k27037j19450J4298J48720K62593L44820L95613
$$ -4525119 -4791825 -5089383 -5377683 -5604720 -5724170 -5709872 -5561152 -5298559 -4953739 -4558126
37280d558126M23737M41419M59150M82691N12811N46018N74680N87137N70030
$$ -4558126 -4134389 -3692970 -3233820 -2751129 -2238318 -1692300 -1117620 -530483 39547
37271C9547N13973M20138L03201J87270R6365M4986L3685N0416P5347Q6667O6671
$$ 39547 553520 973658 1276859 1464129 1560494 1605480 1639165 1689581 1764928 1851595 1918266
37260A918266P219q7156k00171l08838l90953m31850m27263l81384l02861k02568
$$ 1918266 1925485 1838329 1638158 1329320 938367 506517 79254 -302130 -604991 -807559
37250h07559r4068O544Q4211J30289J45415J37834J19068J00183Q9889R3791J13707
$$ -807559 -901627 -895083 -810872 -680583 -535168 -397334 -278266 -178083 -88194 5597 119304
37239A19304J46815J85569K19556K39429K41201K28135K08807J92649J85628J88118
$$ 119304 266119 451688 671244 910673 1151874 1380009 1588816 1781465 1967093 2155211
37229B155211J95214J98508J88595J58027J04408L2391m6807j18405j67889j83906
$$ 2155211 2350425 2548933 2737528 2895555 2999963 3032354 2985547 2867142 2699253 2515347
37219B515347j59986r5900J345J18056K36936L41834M21707M71653M90960M80339
$$ 2515347 2355361 2259461 2260806 2378862 2615798 2957632 3379339 3850992 4341952 4822291
37209D822291M40947L75555K90123J93684R6757R678n8642j02356j20658j18621
$$ 4822291 5263238 5638793 5928916 6122600 6219357 6229035 6170393 6068037 5947379 5828758
37199E828758j05563r1861q6276r4695j19422j58257k04369k48450k82592l03078
$$ 5828758 5723195 5631334 5545058 5450363 5330941 5172684 4968315 4719865 4437273 4134195
37189D134195l09552l01818k78173k37743j84450j27757p8484m3048k1012p361
$$ 4134195 3824643 3522825 3244652 3006909 2822459 2694702 2616218 2573170 2552158 2544797
37179B544797L325J4164K5779L7361M7653N5313N9012N7797N1740M2632L4093
$$ 2544797 2548122 2562286 2588065 2625426 2673079 2728392 2787404 2845201 2896941 2939573 2973666
37168B973666L0761L6415N1729P3101R3879J07712J11525J05676R1346O8258L5381
$$ 2973666 3004427 3040842 3092571 3165672 3259551 3367263 3478788 3584464 3675810 3744068 3779449
37157C779449n654m7978q0792r4821q8463p0175n4607n4278p2007r9119j20430
$$ 3779449 3773795 3725817 3645025 3550204 3461741 3391566 3336959 3282681 3210674 3111555 2991125
37146B991125j22582j00524n9349j1973K5092L6196J0774n3285j48381k59186
$$ 2991125 2868543 2768019 2708670 2696697 2721789 2757985 2768759 2715474 2567093 2307907
37136B307907l67480m57538n19217n47699n41082m98356m19726l08982j75953
$$ 2307907 1940427 1482889 963672 415973 -125109 -623465 -1043191 -1352173 -1528126
37127a528126l6712Q9444J85221K40504K55067K37629K01936J61808J27303J03186
$$ -1528126 -1564838 -1475394 -1290173 -1049669 -794602 -556973 -355037 -193229 -65926 37260
37117C7260Q9604Q3920Q2547Q2088Q0114P6340P3941P9278R8693J33690J78353
$$ 37260 126864 210784 293331 375419 455533 531873 605814 685092 783785 917475 1095828
37106A095828K21690K53622K70017K73012K66777K52298K25036J76778J00311
$$ 1095828 1317518 1571140 1841157 2114169 2380946 2633244 2858280 3035058 3135369
37097C135369n702j33309k64395l73295m33726m28381l56555k34912r0760M7710
$$ 3135369 3129667 2996358 2731963 2358668 1924942 1496561 1140006 905094 814334 862044
37087H62044J58696K29249K54713K37743J87673J19233M9813m195l0461k2528
$$ 862044 1020740 1249989 1504702 1742445 1930118 2049351 2099164 2094969 2064508 2041980
37077B041980J9344Q8091J71152K53907L24098L74897M05194M17991M18470M12061
$$ 2041980 2061324 2149415 2320567 2574474 2898572 3273469 3678663 4096654 4515124 4927185
37067D927185M01821L85716L55956L01950K15787R6994m6086j98489l42748m63220
$$ 4927185 5329006 5714722 6070678 6372628 6588415 6685409 6639323 6440834 6098086 5634866
37057E634866n49557n98689o14493o05379n81685n54751n36748n38421n63787
$$ 5634866 5085309 4486620 3872127 3266748 2685063 2130312 1593564 1055143 491356
37048D91356o05345o44576o58497o28437n46431m17231k56147q3791Q0083K20760
$$ 491356 -113989 -758565 -1417062 -2045499 -2591930 -3009161 -3265308 -3349099 -3269016 -3048256
37038c048256L29054L99488M28952M17194L67973K88987J89936P9818l4468j47031
$$ -3048256 -2719202 -2319714 -1890762 -1473568 -1105595 -816608 -626672 -546854 -581322 -728353
37028g28353k50617l35682l92503m14721m01494l57077k88838k04983j12676j7402
$$ -728353 -978970 -1314652 -1707155 -2121876 -2523370 -2880447 -3169285 -3374268 -3486944 -3504346
37018c504346P5924J61301K31952K83305L15888L34797L45793L51392L49990L38210
$$ -3504346 -3428422 -3267121 -3035169 -2751864 -2435976 -2101179 -1755386 -1403994 -1054004 -715794
37008g15794L14496K81746K47305K19553K02608J92887J80847J57304J19447P2103
$$ -715794 -401298 -119552 127753 347306 549914 742801 923648 1080952 1200399 1272502
36998A272502K3984j6881m4858n5592m5185j1678M2182J07657J71838K22011K50537
$$ 1272502 1296486 1279605 1234747 1179155 1133970 1122292 1164474 1272131 1443969 1665980 1916517
36987A916517K57763K51140K40733K33796K32116K33449K34716K33553K27271
$$ 1916517 2174280 2425420 2666153 2899949 3132065 3365514 3600230 3833783 4061054
36978D061054K11604J81588J34307P1142k222p7717j47566k06636k53619k90467
$$ 4061054 4272658 4454246 4588553 4659695 4657473 4579756 4432190 4225554 3971935 3681468
36968C681468l20390l45913l68455l88988m08175m25177m36011m33291m08030
$$ 3681468 3361078 3015165 2646710 2257722 1849547 1424370 988359 555068 147038
36959A47038l52976k66322j54449l2187Q0245J63044K03059J97716J54924Q9319
$$ 147038 -205938 -472260 -626709 -658896 -578651 -415607 -212548 -14832 140092 229411
36949B29411J6870m9641j02812j40478j64394j78336j85786j87422j79940j57806
$$ 229411 246281 196640 93828 -46650 -211044 -389380 -575166 -762588 -942528 -1100334
36939a100334j17954o4417q889L4226N5181N3228L5048R223j8379m5227o9551
$$ -1100334 -1218288 -1282705 -1291594 -1257368 -1202187 -1148959 -1113911 -1104688 -1123067 -1168294 -1237845
36928a237845q7555r2865p8681m1534J5304Q0677J37896J70030J66140J26003
$$ -1237845 -1325400 -1418265 -1496946 -1538480 -1523176 -1442499 -1304603 -1134573 -968433 -842430
36918h42430O1231q088o0488q1168o6994k5716K9859Q8689J44933J96705K42759
$$ -842430 -781199 -789287 -849775 -930943 -997937 -1023653 -993794 -905105 -760172 -563467 -320708
36907c20708K80866L09306L29483L46559L66868L93655M23922M48225M53545M27976
$$ -320708 -39842 269464 598947 945506 1312374 1706029 2129951 2578176 3031721 3459697
36897C459697L65527K69279J51205K7913q6112j83638k64406l29973l78775m05994
$$ 3459697 3825224 4094503 4245708 4273621 4187509 4003871 3739465 3409492 3030717 2624723
36887B624723m07548l83402l37373k75243k04456j35258q0463n1961n5672q8300
$$ 2624723 2217175 1833773 1496400 1221157 1016701 881443 800980 749019 693347 605047
36877F05047j38253j90375k31930k56456k63718k56842k39397k14350j84581j53382
$$ 605047 466794 276419 44489 -211967 -475685 -732527 -971924 -1186274 -1370855 -1524237
36867a524237j24089r8925p8005n9022l7713q910L1602Q4427J44727K03233K50147
$$ -1524237 -1648326 -1747251 -1825256 -1884278 -1921991 -1930901 -1899299 -1814872 -1670145 -1466912 -1216765
36856a216765K78437K83814K62637K11999J33019L3996p0093j61308k22974k43129
$$ -1216765 -938328 -654514 -391877 -179878 -46859 -12863 -82956 -244264 -467238 -710367
36846g10367k17468j51241n8740L9983J23805J75441J85870J57092J01591L7984
$$ -710367 -927835 -1079076 -1137816 -1097833 -974028 -798587 -612717 -455625 -354034 -316050
36836c16050j5454m6644n2851m0300k1229r994j9385n6872j20965k00032k75958
$$ -316050 -331504 -378148 -430999 -471299 -492528 -502522 -521907 -578779 -699744 -899776 -1175734
36825a175734l31699l58032l55575l32404k99940k68972k46405k33633k27244
$$ -1175734 -1507433 -1865465 -2221040 -2553444 -2853384 -3122356 -3368761 -3602394 -3829638
36816c829638k21256k08950j83798j40421p6108P894J06153K09209L03811L74397
$$ -3829638 -4050894 -4259844 -4443642 -4584063 -4660171 -4652277 -4546124 -4336915 -4033104 -3658707
36806c658707M07195L95888L45366K70525J90319J20214O7184K9838L044j6653
$$ -3658707 -3251512 -2855624 -2510258 -2239733 -2049414 -1929200 -1862016 -1832178 -1829134 -1845787
36796a845787k8994l2418k7924k0515j7103k2599l6590n2113n7616m2214j854
$$ -1845787 -1874781 -1907199 -1935123 -1955638 -1972741 -1995340 -2031930 -2084043 -2141659 -2183873 -2185727
36785b185727N7673J22728J77027K06678K03901J69356J11895M4183k3822q8812
$$ -2185727 -2128054 -2005326 -1828299 -1621621 -1417720 -1248364 -1136469 -1092286 -1116108 -1204920
36775a204920j52282k15294k74799l24043l55661l64492l48649l09188k49604
$$ -1204920 -1357202 -1572496 -1847295 -2171338 -2526999 -2891491 -3240140 -3549328 -3798932
36766c798932j75482r3715j0666O9591J45018K12904K67060K97772K95313K55302
$$ -3798932 -3974414 -4068129 -4078795 -4009204 -3864186 -3651282 -3384222 -3086450 -2791137 -2535835
36756b535835J83105R4615J2260m2184n3944j7793O3112J79548L18005M61949
$$ -2535835 -2352730 -2258115 -2245855 -2288039 -2341983 -2359776 -2296664 -2117116 -1799111 -1337162
36746a337162N93152O93714P49473P54324P12999O39434N50904M61622L79256
$$ -1337162 -744010 -50296 699177 1453501 2166500 2805934 3356838 3818460 4197716
36737D197716L04889K35059J64792R0816J3429o4275j39024k09097k73150l27250
$$ 4197716 4502605 4737664 4902456 4993272 5006701 4942426 4803402 4594305 4321155 3993905
36727C993905l63269l71046l43655k82322j97622j06206k5248L2364O0298N8502
$$ 3993905 3630636 3259590 2915935 2633613 2435991 2329785 2304537 2336901 2397199 2455701
36717B455701L1502j3575o8745j26870j83341k36824k88409l39892l92618m47048
$$ 2455701 2487203 2473628 2404883 2278013 2094672 1857848 1569439 1229547 836929 389881
36707C89881n01894n52630n91236o08473n97450n55925m86366l94742k89008j77537
$$ 389881 -112013 -664643 -1255879 -1864352 -2461802 -3017727 -3504093 -3898835 -4187843 -4365380
36697d365380o7814L4075J23446J97451K55829L00614L34203L57563L70673L74692
$$ -4365380 -4433194 -4399119 -4275673 -4078222 -3822393 -3521779 -3187576 -2830013 -2459340 -2084648
36687b084648L72806L67715L57908L36843K96685K33784J51417N8598l3056j12327
$$ -2084648 -1711842 -1344127 -986219 -649376 -352691 -118907 32510 91108 58052 -54275
36677e4275j71517k09823k34792k58991k92842l38432l88399m29696m48911m36325
$$ -54275 -225792 -435615 -670407 -929398 -1222240 -1560672 -1949071 -2378767 -2827678 -3264003
36667c264003l87897l05377j95167o6962O6972J92138K93243L57646L79710L63451
$$ -3264003 -3651900 -3957277 -4152444 -4219406 -4152434 -3960296 -3667053 -3309407 -2929697 -2566246
36657b566246L21047K67455K14250J66672J25269Q9792O1737M4079L9551M9295
$$ -2566246 -2245199 -1977744 -1763494 -1596822 -1471553 -1381761 -1320024 -1275945 -1236394 -1187099
36647a187099P2229J04576J39531J68144J81888J76138J52511J18176Q1937M9229
$$ -1187099 -1114870 -1010294 -870763 -702619 -520731 -344593 -192082 -73906 8031 57260
36637E7260J9421j2404n0412r3275j32566j54624j44671r2113L969J31707K68668
$$ 57260 76681 64277 13865 -79410 -211976 -366600 -511271 -603384 -599415 -467708 -199040
36626a99040L89547M74993N16289N14201M75137M08422L25649K40355J66364J14786
$$ -199040 190507 665500 1181789 1695990 2171127 2579549 2905198 3145553 3311917 3426703
36616C426703R0660R0553J02562J09551R4843M7552l5194j49480k86857m35280
$$ 3426703 3517363 3607916 3710478 3820029 3914872 3962424 3927230 3777750 3490893 3055613
36606C055613n78940o99512p80147q10441p88942p21776o19326m93834l58713
$$ 3055613 2476673 1777161 997014 186573 -602369 -1324145 -1943471 -2437305 -2796018
36597b796018k27862j13501k3129M2169Q6639J16649J37375J50891J55761J47792
$$ -2796018 -3023880 -3137381 -3160510 -3118341 -3031702 -2915053 -2777678 -2626787 -2471026 -2323234
36587b323234J21994P5956J3452n4223j11056j42286j40029j05264m5484K9575
$$ -2323234 -2201240 -2125284 -2111832 -2166055 -2277111 -2419397 -2559426 -2664690 -2710174 -2680599
36577b680599J10877J90359K59667L09512L30717L16678K66322J86500R2174K896
$$ -2680599 -2569722 -2379363 -2119696 -1810184 -1479467 -1162789 -896467 -709967 -617793 -614897
36567f14897o3808r8944j04687r1865p3860o0444n4966n6399o4128q0990j11535
$$ -614897 -678705 -777649 -882336 -974201 -1048061 -1108505 -1163471 -1219870 -1283998 -1364988 -1476523
36556a476523j57240k13327k69839l15916l44439l54934l53305l47927l43951
$$ -1476523 -1633763 -1847090 -2116929 -2432845 -2777284 -3132218 -3485523 -3833450 -4177401
36547d177401l39602l27465k99706k53934j96449j41236j04455r6459j15664j48446
$$ -4177401 -4517003 -4844468 -5144174 -5398108 -5594557 -5735793 -5840248 -5936707 -6052371 -6200817
36537f200817j75206j78528j49227q8449o226Q2769J64714K31017K79718L13650
$$ -6200817 -6376023 -6554551 -6703778 -6792227 -6798453 -6715684 -6550970 -6319953 -6040235 -5726585
36527e726585L36895L51378L55184L44112L16233K76734K38750K18089K24628
$$ -5726585 -5389690 -5038312 -4683128 -4339016 -4022783 -3746049 -3507299 -3289210 -3064582
36518c064582K56456L00992L41744L65451L65661L43293L06652K70706K53065
$$ -3064582 -2808126 -2507134 -2165390 -1799939 -1434278 -1090985 -784333 -513627 -260562
36509b60562K66477L12119L78613M47245M99127N20201N03106M46739L54338K31235
$$ -260562 5915 318034 696647 1143892 1643019 2163220 2666326 3113065 3467403 3698638
$$ [...]
##END NTUPLES=NMR SPECTRUM
##END=
