##TITLE=31Pdec_DE-19H_b
 D2O, 64 sc
 21.1.2025
##JCAMPDX= 6.0         $$ Bruker NMR JCAMP-DX V2.0
##DATA TYPE= NMR SPECTRUM
##DATA CLASS= NTUPLES
##ORIGIN= UXNMR, Bruker Analytische Messtechnik GmbH
##OWNER= root
$$ XWIN-NMR		Version 3.5
$$ Tue Jan 21 17:45:13 2025 Russian Standard Time (UT+4h)  she@DPX200
##.OBSERVE FREQUENCY= 81.013821
##.OBSERVE NUCLEUS= ^31P
##.ACQUISITION MODE= SIMULTANEOUS
##.ACQUISITION SCHEME= undefined
##.AVERAGES= 64
##.DIGITISER RES= 17
##SPECTROMETER/DATA SYSTEM= spect
##.PULSE SEQUENCE= zgpg30
##.SOLVENT NAME= CDCl3
##.SHIFT REFERENCE= (INTERNAL, CDCl3, 0, 198.062)
##AUDIT TRAIL= $$ (NUMBER, WHEN, WHO, WHERE, WHAT)
$$ ##TITLE= Audit trail, XWIN-NMR		Version 3.5
$$ ##JCAMPDX= 5.01
$$ ##ORIGIN= Bruker BioSpin GmbH
$$ ##OWNER= she
$$ F:/spectra/data/she/nmr/P31/2/pdata/1/auditp.txt
$$ ##AUDIT TRAIL=  $$ (NUMBER, WHEN, WHO, WHERE, WHAT)
(   1,<2025-01-21 17:43:59.56 +0400>,<she>,<DPX200>,
      <created by zg, POWCHK disabled, PULCHK disabled
       configuration hash MD5:
       00 E9 B6 7A A2 85 ED C7 34 08 36 98 17 FE 4E 26
       data hash MD5: 32K
       26 9E 96 14 10 CC 81 DB 56 62 E7 4A 26 68 E2 61>)
(   2,<2025-01-21 17:44:01.89 +0400>,<she>,<DPX200>,
      <Start of raw data processing
       efp BC_mod = 2 LB = 1.5 FT_mod = 6 PKNL = 1 PHC0 = 1662.442 PHC1 = 279.8863 SI = 64K 
       data hash MD5: 64K
       35 CA B4 E1 AD CA 54 FD CD 08 E7 46 BA 09 9F 1F>)
(   3,<2025-01-21 17:44:20.53 +0400>,<she>,<DPX200>,
      <pk PHC0 = -0.1088326 PHC1 = 0 
       data hash MD5: 64K
       96 41 82 F6 57 55 78 63 9F D8 A4 E4 2A 3B 70 92>)
(   4,<2025-01-21 17:44:29.34 +0400>,<she>,<DPX200>,
      <abs ABSG = 5 
       data hash MD5: 64K
       CC 22 42 7E F5 4D 3D 2D 32 0B 8C C0 64 42 C8 50>)
(   5,<2025-01-21 17:44:44.53 +0400>,<she>,<DPX200>,
      <pk PHC0 = 2.599757 PHC1 = 0 
       data hash MD5: 64K
       B4 01 D1 22 21 19 B2 B0 F0 BF 94 ED 74 F7 9E EF>)
$$ ##END=
$$ 
$$ hash MD5
$$ 2A 3B 55 59 4F 34 B0 D2 E1 C3 2A 2A 32 E4 AD 97
##$RELAX= 
##$RELAX= 
##$RELAX= 
##$RELAX= 
##$RELAX= 
##$RELAX= 
##$RELAX= 
##$RELAX= 
$$ Bruker specific parameters
$$ --------------------------
##$DU= <F:/spectra>
##$EXPNO= 2
##$NAME= <P31>
##$PROCNO= 1
##$TYPE= <nmr>
##$USER= <she>
##$AMP= (0..31)
100 100 100 100 100 100 100 100 100 100 100 100 100 100 100 100 100 100 
100 100 100 100 100 100 100 100 100 100 100 100 100 100 
##$AQSEQ= 0
##$AQ_mod= 1
##$AUNM= <au_zg>
##$AUTOPOS= <>
##$BF1= 81.014009
##$BF2= 200.13
##$BF3= 200.13
##$BF4= 200.13
##$BF5= 200.13
##$BF6= 200.13
##$BF7= 200.13
##$BF8= 200.13
##$BYTORDA= 1
##$CFDGTYP= 0
##$CFRGTYP= 5
##$CHEMSTR= <none>
##$CNST= (0..31)
1 1 145 1 1 1 1 1 1 1 1 1 1 1 1 1 1 1 1 1 1 1 1 1 1 1 1 1 1 1 1 1 
##$CPDPRG= <waltz16>
##$CPDPRG1= <>
##$CPDPRG2= <waltz16>
##$CPDPRG3= <>
##$CPDPRG4= <mlev>
##$CPDPRG5= <mlev>
##$CPDPRG6= <mlev>
##$CPDPRG7= <mlev>
##$CPDPRG8= <mlev>
##$CPDPRGB= <>
##$CPDPRGT= <>
##$D= (0..31)
0 1 0 0 0 0 0 0 0 0.06 0 0.03 2e-05 3e-06 0 0 0.0002 0 0 0 0 0 0 0 0 0 
$$ [...]
##$SUBNAM3= <"">
##$SUBNAM4= <"">
##$SUBNAM5= <"">
##$SUBNAM6= <"">
##$SUBNAM7= <"">
##$SUBNAM8= <"">
##$SUBNAM9= <"">
##$SW= 400.765351723535
##$SWIBOX= (0..15)
0 1 3 0 0 0 0 0 0 0 0 0 0 0 0 0 
##$SW_h= 32467.5324675325
##$TD= 32768
##$TD0= 1
##$TE= 0
##$TE2= 300
##$TE3= 300
##$TEG= 300
##$TL= (0..7)
0 120 53 12 22 120 120 120 
##$TP= (0..7)
150 150 150 150 150 150 150 150 
##$TP07= 0
##$TPNAME0= <>
##$TPNAME1= <>
##$TPNAME2= <>
##$TPNAME3= <>
##$TPNAME4= <>
##$TPNAME5= <>
##$TPNAME6= <>
##$TPNAME7= <>
##$TPOAL= (0..7)
0.5 0.5 0.5 0.5 0.5 0.5 0.5 0.5 
##$TPOFFS= (0..7)
0 0 0 0 0 0 0 0 
##$TUNHIN= 0
##$TUNHOUT= 0
##$TUNXOUT= 0
##$USERA1= <user>
##$USERA2= <user>
##$USERA3= <user>
##$USERA4= <user>
##$USERA5= <user>
##$V9= 5
##$VALIST= <valist>
##$VCLIST= <CCCCCCCCCCCCCCC>
##$VD= 0
##$VDLIST= <DDDDDDDDDDDDDDD>
##$VPLIST= <PPPPPPPPPPPPPPP>
##$VTLIST= <TTTTTTTTTTTTTTT>
##$WBST= 1024
##$WBSW= 4
##$XGAIN= (0..3)
0 0 0 0 
##$XL= 0
##$YL= 0
##$YMAX_a= 22986
##$YMIN_a= -24541
##$ZGOPTNS= <>
##$ZL1= 120
##$ZL2= 120
##$ZL3= 120
##$ZL4= 120
##$ABSF1= 198.0616
##$ABSF2= -202.7028
##$ABSG= 5
##$ABSL= 3
##$ALPHA= 0
##$AQORDER= 0
##$ASSFAC= 0
##$ASSFACI= 0
##$ASSFACX= 0
##$ASSWID= 0
##$AUNMP= <proc_1d>
##$AZFE= 0.1
##$AZFW= 0.5
##$BCFW= 0
##$BC_mod= 2
##$BYTORDP= 0
##$COROFFS= 0
##$CY= -3
##$DATMOD= 1
##$DC= 0
##$DFILT= <>
##$DTYPP= 0
##$F1P= 0
##$F2P= 0
##$FCOR= 1
##$FTSIZE= 65536
##$FT_mod= 6
##$GAMMA= 0
##$GB= 0
##$INTBC= 1
##$INTSCL= 9.790993e-09
##$ISEN= 30
##$LB= 1.5
##$LEV0= 0
##$LPBIN= 0
##$MAXI= 10000
##$MC2= 0
##$MEAN= 0
##$ME_mod= 0
##$MI= 50
##$NCOEF= 0
##$NC_proc= -5
##$NLEV= 6
##$NOISF1= 182.463
##$NOISF2= 159.3651
##$NSP= 0
##$NTH_PI= 0
##$NZP= 0
##$OFFSET= 198.0616
##$PC= 4
##$PHC0= 1664.933
##$PHC1= 279.8863
##$PH_mod= 1
##$PKNL= yes
##$PPARMOD= 0
##$PSCAL= 0
##$PSIGN= 0
##$REVERSE= no
##$SF= 81.0140089999434
##$SI= 65536
##$SIGF1= 159.3651
##$SIGF2= -187.1042
##$SINO= 113.3802
##$SIOLD= 16384
##$SREGLST= <1H.CDCl3>
##$SSB= 0
##$STSI= 65536
##$STSR= 0
##$SW_p= 32467.5324675325
##$SYMM= 0
##$S_DEV= 0
##$TDeff= 32768
##$TDoff= 0
##$TI= <>
##$TILT= no
##$TM1= 0
##$TM2= 0
##$TOPLEV= 0
##$USERP1= <user>
##$USERP2= <user>
##$USERP3= <user>
##$USERP4= <user>
##$USERP5= <user>
##$WDW= 1
##$XDIM= 65536
##$YMAX_p= 314891662
##$YMIN_p= -31321309
$$ End of Bruker specific parameters
$$ ---------------------------------
##NTUPLES= NMR SPECTRUM
##VAR_NAME=  FREQUENCY,     SPECTRUM/REAL,   SPECTRUM/IMAG
##SYMBOL=    X,             R,               I
##VAR_TYPE=  INDEPENDENT,   DEPENDENT,       DEPENDENT
##VAR_FORM=  AFFN,          ASDF,            ASDF
##VAR_DIM=   65536,         65536,           65536
##UNITS=     HZ,            ARBITRARY UNITS, ARBITRARY UNITS
##FACTOR=    0.49542278885378, 1,            1
##FIRST=     16045.7642231865, 0,            0
##LAST=      -16421.768244346, 0,            0
##MIN=       -16421.768244346, -31321309,    0
##MAX=       16045.7642231865, 314891662,    0
$$ Real data points
##PAGE= N=1
##DATA TABLE= (X++(R..R)), XYDATA
$$ [...]
41649i33782J71423J35223n8656o3465J28793K32343J49527L2962k5569l6862
$$ -933782 -762359 -627136 -685792 -749257 -620464 -388121 -238594 -205632 -231201 -268063
41639b68063N6074K58714L11856m0770n70243p03342k41352L54640N42438L22944
$$ -268063 -211989 46725 358581 317811 -252432 -955774 -1197126 -842486 -300048 22896
41629B2896R5744P9034J34339J00209K8758K1688K6647o2624k04844k63458k28474
$$ 22896 118640 197674 332013 432222 460980 482668 509315 446691 241847 -21611 -250085
41618b50085k39690l62698m60069l50517k7568L36235N55120N59792M09327K17216
$$ -250085 -489775 -852473 -1312542 -1663059 -1690627 -1354392 -799272 -239480 169847 387063
41608C87063M7921j07334k21543j69735R7808L69666L59844R4870j04458p8638
$$ 387063 434984 327650 106107 -63628 34180 403846 763690 858560 754102 675464
41598F75464j1454n3935o6954N5323J02972r1730k58777o1888K92469K89672r7648
$$ 675464 664010 610075 543121 598444 701416 609686 350909 289021 581490 871162 773514
41587G73514l48100j94672M728j06497l30608k96136n0401R8622J08276J81788
$$ 773514 425414 230742 235470 128973 -201635 -497771 -548172 -449550 -341274 -159486
41577a59486L36309L58168J76769k2355r6242j05121j07661j5219K23811M34369
$$ -159486 176823 534991 711760 689405 593163 488042 380381 365162 588973 1023342
41567A023342L64106k597l78698m56682k30347P119K456j75682k65103j68074
$$ 1023342 1387448 1384851 1006153 549471 319124 326243 328699 153017 -112086 -280160
41557b80160l6264Q365N4354K02404L33537K38947p8017l72714m21931k23536
$$ -280160 -316424 -308059 -253705 -51301 282236 521183 443166 70452 -351479 -575015
41547e75015M9822K17805K23626J56983J42796J92678K08655J37919L8655l3781
$$ -575015 -525193 -307388 -83762 73221 216017 408695 617350 755269 793924 760143
41537G60143j02587j83296k30335k31772k43553k56326j57375P2399K53368K33184
$$ 760143 657556 474260 243925 12153 -231400 -487726 -645101 -572702 -319334 -86150
41527h6150J08676P6218J57867K32632K49809K36301J65287Q845j22848q2545
$$ -86150 22526 98744 256611 489243 739052 975353 1140640 1149485 1026637 944092
41517I44092R5875K46186L02658L10950K49753N0318k11463l44496k82330j28233
$$ 944092 1039967 1286153 1588811 1899761 2149514 2199832 1988369 1643873 1361543 1233310
41507A233310J9267J00519P182k83483n10270l68306K5954K34222J18380j881
$$ 1233310 1252577 1353096 1360278 1076795 566525 198219 224173 458395 576775 574894
41497E74894P9009J44300L0518l0513J11313J20620k66082o12428l25771L55261
$$ 574894 653903 798203 828721 798208 909521 1030141 764059 151631 -174140 181121
41487A81121N96598J72304k55735j88786N8516M7426p3754j941Q1377j29469m09784
$$ 181121 777719 950023 694288 505502 564018 611444 537690 535749 617126 487657 77873
41476G7873l21439J7039R2645j53634k55260l1297J35526N405q3398J97992N67737
$$ 77873 -243566 -226527 -133882 -287516 -542776 -574073 -438547 -433142 -516540 -318548 249189
41465B49189N21302P3699k72616j95024J21322K88434J32539j84548l40365j87212
$$ 249189 770491 844190 571574 376550 497872 786306 918845 734297 393932 206720
41455B06720M4819J0104k59149l67327j68169m1846l05327o38100m89145J08973
$$ 206720 251539 261643 2494 -364833 -533002 -574848 -880175 -1518275 -2007420 -1898447
41445a898447N65995N28605K35637L9014m3521j61811l16252l79923k65569J7280
$$ -1898447 -1332452 -803847 -568210 -529196 -572717 -734528 -1050780 -1430703 -1696272 -1678992
41435a678992L17325L55130K2424l26381k02147L21447N92708K35280l28610m73493
$$ -1678992 -1361667 -1006537 -984113 -1310494 -1512641 -1191194 -598486 -363206 -691816 -1165309
41425a165309j88813N3886M3763K1684J90505M24201N22102M57128K81256J8522
$$ -1165309 -1354122 -1300236 -1256473 -1234789 -1044284 -620083 -97981 359147 640403 658925
41415F58925k39592l19931j82049k6469o1036k24328k55988l3220K48627K80906
$$ 658925 419333 99402 -82647 -109116 -170152 -394480 -650468 -683688 -435061 -154155
41405a54155Q767k80813k96612r8893K3602O53P2155L47448N23813K74950k38281
$$ -154155 -145388 -426201 -722813 -821706 -798104 -797451 -725296 -377848 145965 420915 182634
41394A82634n36152m43539k46101j92987j43398J31894N05674N90249K31759k76753
$$ 182634 -353518 -797057 -1043158 -1236145 -1379543 -1247649 -741975 -151726 80033 -196720
41384a96720n14714l57470k2772K25478L04109K50340R3075r9058j54241J9177
$$ -196720 -711434 -1068904 -1091676 -866198 -562089 -311749 -218674 -317732 -471973 -452796
41374d52796K26239J99440L2976J10868M91367O84134K93063l77931p06015n63990
$$ -452796 -226557 -27117 5859 116727 608094 1292228 1585291 1207360 501345 -62645
41364f2645l53140l05131k14588N3768K28386M7394k74656k94825O9408M44647
$$ -62645 -415785 -720916 -935504 -881736 -653350 -605956 -880612 -1175437 -1106029 -661382
41354f61382M56391J04610l10075n04554m20954j86509N5736K26970K58545J03374
$$ -661382 -204991 -100381 -410456 -915010 -1335964 -1522473 -1466737 -1239767 -981222 -877848
41344h77848j17723j25687J93748N73127O57798M34263J52874q0528l43545n73950
$$ -877848 -995571 -1121258 -927510 -354383 303415 737678 890552 810024 466479 -107471
41334a07471n61936l22410j37837j13984j5253K87664N13156L60427k0590k21609
$$ -107471 -669407 -991817 -1129654 -1243638 -1258891 -971227 -458071 -97644 -118234 -339843
41324c39843r7261J40725K46485J55066m0399j57407n0319J98136L13098J74395
$$ -339843 -437104 -296379 -49894 105172 64773 -92634 -142953 55183 368281 542676
41314E42676n983J1273J55776J77294r284k61709l85939k64662M3114K42338O4484
$$ 542676 536693 547966 703742 881036 871752 610043 224104 -40558 2556 244894 309378
41303C09378k87494k54576K98619P40223M52038l05055p27061m92048j570K90818
$$ 309378 21884 -232692 65927 806150 1258188 953133 226072 -265976 -267546 23272
41293B3272L11875J48461j33479l69046l79009k61842k69708l48957j74196K86084
$$ 23272 335147 483608 350129 -18917 -397926 -659768 -929476 -1278433 -1452629 -1166545
41283a166545O23366N36701J79874j62160l86599m21365j48972K93077M73797
$$ -1166545 -543179 -6478 173396 11236 -375363 -796728 -945700 -652623 -178826
41274a78826J90224k42433m41226m04957k87710o2665K65827M17895K07022o1320
$$ -178826 11398 -231035 -672261 -1077218 -1364928 -1427593 -1161766 -743871 -536849 -598169
41264e98169J8374L01800K72682j77096n58170m26231J05052N70383O37837L33353
$$ -598169 -579795 -277995 -5313 -182409 -740579 -1166810 -1061758 -491375 146462 479815
41254D79815l5470j51970j6963M8874j35175k95082r1986L17218M61048K34766
$$ 479815 444345 292375 275412 324286 189111 -105971 -197957 119261 580309 815075
41244H15075N435K074K944k24569n16171n60717l17727J9696K88128L94270K68069
$$ 815075 820510 822584 825528 600959 84788 -475929 -793656 -773960 -485832 -91562 176507
41233A76507k4862k52989k73163j98108j67626j12301O4476K23284J59953n1685
$$ 176507 151645 -101344 -374507 -572615 -740241 -852542 -788066 -564782 -404829 -456514
41223d56514j54081j02610r6952k06790k42857p9907J40896K57759L12248L60175
$$ -456514 -610595 -713205 -810157 -1016947 -1259804 -1339711 -1198815 -941056 -628808 -268633
41213b68633K71372l3370k96948j92158J75760L58472J88880j3484K8897J55483
$$ -268633 2739 -30631 -327579 -519737 -343977 14495 203375 189891 218788 374271
41203C74271J18071J9566P5184J67383M4763j76963j69970N203l6962k89776k53364
$$ 374271 492342 511908 587092 754475 799238 622275 452305 457508 420546 130770 -122594
41192a22594K36835O10603L65121j63926l10057m2627J11370p4198l04535l46318
$$ -122594 114241 724844 1089965 926039 615982 573355 684725 610527 305992 -40326
41182d0326k97265k29057m2706K04845K50449N5601p5730K2998J15665l1671k78911
$$ -40326 -337591 -566648 -609354 -404509 -154060 -98459 -174189 -151191 -35526 -67197 -346108
41171c46108l60614k60198j18570K4566J82984K79921K48821J59324R8712M8293
$$ -346108 -706722 -966920 -1085490 -1060924 -877940 -598019 -349198 -189874 -91162 -42869
41161d2869j6882n2069n9920j15550j87115j26949N9498J51490M1283r0700n9689
$$ -42869 -59751 -111820 -171740 -287290 -474405 -601354 -541856 -390366 -349083 -439783 -499472
41150d99472P6349J74158J78830L0926l12110o17070m73672J21982O04593N33773
$$ -499472 -423123 -248965 -70135 -39209 -351319 -968389 -1442061 -1320079 -715486 -181713
41140a81713J50435n3485o836M9035L8362J2095j12097l44392l93037p9011K63649
$$ -181713 -31278 -84763 -91599 -42564 -4202 7893 -104204 -448596 -841633 -920644 -656995
41129f56995K73761J73266L26318M69609J07450m97464n64160j9898L66195K06270
$$ -656995 -383234 -209968 116350 585959 693409 195945 -368215 -388113 -21918 184352
41119A84352o234J15890K15843k4828k30666k0297K80056K16561k6771n8646k405
$$ 184352 178118 294008 509851 485023 254357 234060 514116 730677 703906 645260 642855
41108F42855j39844k60459o4935J45459o9619m32701l52033K9240M4825l28234
$$ 642855 503011 242552 177617 323076 253457 -179244 -531277 -502037 -457212 -785446
41098g85446m16673k7653K17331l8647k93982n2732M01764N44136L65536J46010
$$ -785446 -1202119 -1229772 -1012441 -1051088 -1345070 -1397802 -996038 -451902 -86366 59644
41088E9644n6591k35392j73842J66574L55823P9559k94211k36721J16090K00540
$$ 59644 3053 -232339 -406181 -239607 116216 195775 -98436 -335157 -219067 -18527
41078a8527j01850l91377m41005l84079k33868J87077P21443Q36543L63903j58130
$$ -18527 -120377 -511754 -952759 -1336838 -1570706 -1383629 -662186 174357 538260 380130
41068C80130j98693M5632J5747l49673n38527k05986L62658O17035L55429j24646
$$ 380130 181437 227069 242816 -106857 -645384 -851370 -488712 128323 483752 359106
41058C59106l65321j70849K19975L48644J7839m25406m31564O6128M96709L51252
$$ 359106 -6215 -177064 42911 391555 409394 -16012 -447576 -381448 115261 466513
41048D66513j32180k82561P4309L98301K49182r6120j33462R4013J52188l9201
$$ 466513 334333 51772 126081 524382 773564 677444 543982 637995 790183 750982
41038G50982j30145J5173J07046k3468j27179K570J60069Q7593j07466j83599
$$ 750982 620837 636010 743056 719588 592409 594979 755048 842641 735175 551576
41028E51576j52636j42464j02236M4680J44296K1923k08131l32142l61411l62237
$$ 551576 398940 256476 154240 198920 343216 365139 157008 -175134 -536545 -898782
41018h98782j71966L17372P53950O72227J80443j59442j23289j8181m8138j0461
$$ -898782 -1070748 -753376 574 672801 853244 693802 570513 552332 504194 493733
41008D93733K07573L19211J16271j25695o3645J65062J65735j16339l58693l40184
$$ 493733 701306 1020517 1136788 1011093 947448 1112510 1278245 1161906 803213 463029
40998D63029j72409o8555r1875j54347j44431m6164K9099k1838j22418r6099O6780
$$ 463029 290620 222065 130190 -24157 -168588 -214752 -185653 -207491 -329909 -426008 -359228
40987c59228J76148J09536n8761k25791l44256k94180N5970N37647P04302L57825
$$ -359228 -183080 -73544 -132305 -358096 -702352 -996532 -940562 -402915 301387 659212
40977F59212j64793m22820l78177k64698j73800m2425J04919J83608K24892K90638
$$ 659212 494419 71599 -306578 -571276 -745076 -787501 -682582 -498974 -274082 16556
40967A6556L02414J68705r429o1179J3551R5440J19757M7692j61676l77696l23679
$$ 16556 318970 487675 478246 417067 430618 526058 645815 693507 531831 154135 -169544
40956a69544r15J77205k9041k53714p3437K92717L46343J50688J71383L70935
$$ -169544 -170459 6746 -22295 -276009 -349446 -56729 289614 440302 611685 982620
40946I82620J85087m89968r75535p49107j37448K62392L66684M19877M32914K62219
$$ 982620 1167707 677739 -297796 -1046903 -1184351 -921959 -555275 -135398 297516 559735
40936E59735n51j26090r3069m7734o8577j84597m14406n80401l64283J88493N21006
$$ 559735 559184 433094 340025 292291 223714 39117 -375289 -955690 -1319973 -1131480 -610474
40925f10474K56731k37984l66881j21493O4632O8107J49441L63073M33152K55124
$$ -610474 -353743 -591727 -958608 -1080101 -1015469 -947362 -797921 -434848 -1696 253428
40915B53428N2264n0035j78990l30156k43938J39368M41689L08377j18206l96306
$$ 253428 305692 255657 76667 -253489 -497427 -358059 83630 392007 273801 -122505
40905a22505k96354M3490L32418L65921J66821j6836M0543K53105L18017J21616
$$ -122505 -418859 -375369 -42951 322970 489791 472955 513498 766603 1084620 1206236
40895A206236j29098k22730j88801j52797j45533j56092j92859j89589l3505J97876
$$ 1206236 1077138 854408 665607 512810 367277 211185 18326 -171263 -204768 -6892
40885f892K18912q6126m25262m23935q2427K64637L68165K71658J39518M9209
$$ -6892 212020 125894 -299368 -723303 -805730 -541093 -172928 98730 238248 287457
40875B87457j2781n1482k8593P1426J63985J17681o2767j79410p8046J14760J40800
$$ 287457 274676 223194 194601 266027 430012 547693 484926 305516 227470 342230 483030
40864D83030m1636k34363l00789k83143k13794m6387J67479K59326J92446J31383
$$ 483030 441394 207031 -93758 -376901 -590695 -637082 -469603 -210277 -17831 113552
40854A13552J74949K12003J26414m7616k38831l84407l16291R3050N71003N94062
$$ 113552 288501 500504 626918 579302 340471 -43936 -360227 -267177 303826 897888
40844H97888R6027l34637k43803N9450L8278k34662k76842k4878J03269p2113
$$ 897888 993915 659278 415475 474925 513203 278541 1699 -23179 80090 7977
40834G977k45287j67626J6546R8073Q7251L7743q2146k09629j73455J9517J53728
$$ 7977 -237310 -404936 -388390 -290317 -203066 -165323 -247469 -457098 -630553 -611036 -457308
40823d57308J49282J51646K09468J97376J46348K61050M65646L67122r4131m03385
$$ -457308 -308026 -156380 53088 250464 396812 657862 1123508 1490630 1396499 993114
40813I93114k22288M4293j10498m56270m12739k9860R9830j60045k81678J5268
$$ 993114 770826 815119 704621 248351 -164388 -194248 -94418 -254463 -536141 -520873
40803e20873K95258J36175k08201k62770m5363J02738J06675J28237J43785J0133
$$ -520873 -225615 -89440 -297641 -560411 -605774 -503036 -396361 -268124 -124339 -114206
40793a14206j56255j18255L181j48081n13524n63852p1174M76041N16509J63772
$$ -114206 -270461 -388716 -385535 -533616 -1047140 -1610992 -1682166 -1206125 -689616 -525844
40783e25844l1684J41605L88659M14702K40934K6580j10181n9648K07938M70459
$$ -525844 -557528 -415923 -27264 387438 628372 654952 544771 485123 693061 1163520
40773A163520M12790N6170k09097j44017J6105o7834l44897m78735l19602l2852
$$ 1163520 1576310 1632480 1423383 1279366 1295471 1227637 882740 404005 84403 51551
40763E1551J88145L14642L80569L63936K23481k8086k98318m26062k90237J0753
$$ 51551 239696 554338 934907 1298843 1522324 1494238 1195920 769858 479621 490374
40753D90374J79375M4960k06218k69217j12578M5901R7236J48956K64606L22300
$$ 490374 669749 714709 508491 239274 126696 172597 269833 418789 683395 1005695
40743A005695K17673L5206r3430j78886l06920m63229n39757m82590l42546j79980
$$ 1005695 1223368 1258574 1165144 986258 679338 216109 -323648 -806238 -1148784 -1328764
40733a328764Q588K24879L62117K64451l2740k11131O37M18559N62846K94646
$$ -1328764 -1320176 -1095297 -733180 -468729 -501469 -712600 -711963 -293404 269442 564088
40723E64088J7007P2788K37266J12661k17185l43602k05306j30584k33144k54903
$$ 564088 581095 653883 891149 1003810 786625 443023 237717 107133 -126011 -380914
40713c80914r2106K95r1301q0231K08091M48510K91161o0803j35639J17806L01205
$$ -380914 -473020 -472725 -564026 -644257 -436166 12344 303505 242702 107063 224869 526074
40702E26074J56313j37651k63465j35653O8062J33023N3897M9311K33390L44868
$$ 526074 682387 544736 281271 145618 213680 346703 400600 449911 683301 1028169
40692A028169P4603l65419m26437p5240O2660l11058n98071k13984M23214N05003
$$ 1028169 1102772 737353 310916 235676 298336 -12722 -610793 -824777 -401563 103440
40682A03440R5197m1528K60227L22792k09687p90258q49294n48638k65692M7231
$$ 103440 198637 157109 417336 740128 530441 -259817 -1109111 -1657749 -1923441 -1876210
40672a876210M82721O76088L03275k38103k62384K44085O41242N41537K00811
$$ -1876210 -1393489 -717401 -414126 -652229 -914613 -670528 -29286 512251 713062
40663G13062L217P306Q5011J41535P8820j71246m61595n13510k88359o7529o2358
$$ 713062 716279 723585 808596 950131 1028951 857705 396110 -117400 -405759 -473288 -535646
40652e35646j44929r6229M7376O6579j06676k84102k47870L429K57851L18329
$$ -535646 -680575 -776804 -729428 -662849 -769525 -1053627 -1301497 -1298068 -1040217 -721888
40642g21888K14123J54692K58542L96269L76546K26327J53781K33215K68277M4786
$$ -721888 -507765 -353073 -94531 301738 678284 904611 1058392 1291607 1559884 1604670
40632A604670l63130o41984n84475l07435r1671n8183q3194k9834N1203L3176
$$ 1604670 1241540 599556 15081 -292354 -384025 -442208 -525402 -555236 -504033 -470857
40622d70857o5024j10138p2308n4681j02425j44375j53933j96553k59270k14146
$$ -470857 -535881 -646019 -718327 -773008 -875433 -1019808 -1173741 -1370294 -1629564 -1843710
40612a843710m7853M9173m0175j44899k7363K97862O13402P46081O19932K20906
$$ -1843710 -1891563 -1842390 -1882565 -2027464 -2054827 -1756965 -1143563 -397482 222450 443356
40602D43356k84998n41144l68736n2275J5135j11194n1681K51717M05890J71892
$$ 443356 158358 -382786 -751522 -803797 -788662 -899856 -951537 -699820 -293930 -122038
40592a22038j70433k52713j08283R772N2277J25910J97598J59617Q7041J21684
$$ -122038 -292471 -545184 -653467 -643695 -591418 -465508 -267910 -108293 -21252 100432
40582A00432J59341j9237l04855k99483R7852M69923M40429J85396J18004K60910
$$ 100432 259773 240536 -64319 -363802 -265950 203973 644402 829798 947802 1208712
40572A208712K69706p107l51033n71278p22623q08101o08385o6047M04737L42677
$$ 1208712 1478418 1471311 1120278 549000 -173623 -981724 -1590109 -1656156 -1251419 -908742
40562i08742j14231l43533k5441M69797N80776K22164j91660k54989M2701L81406
$$ -908742 -1022973 -1366506 -1391947 -922150 -341374 -119210 -310870 -565859 -523158 -141752
40552a41752M56143K54476P307j27755k36591m11908m86135k37938J90426L80813
$$ -141752 314391 568867 576174 448419 211828 -200080 -686215 -924153 -733727 -352914
40542c52914J86181r9890k03784j89395j68400k8877K85027N01714L64464N1826
$$ -352914 -166733 -266623 -470407 -659802 -828202 -857079 -572052 -70338 294126 345952
40532C45952q2837k9497j1141L292K22694N04388L93623j75690o31866m54986
$$ 345952 263115 233618 222477 225769 448463 952851 1346474 1170784 538918 83932
40522H3932J53409N24915K87624k99205o60235m46680J30899M72529K24159k84178
$$ 83932 237341 762256 1049880 750675 90440 -356240 -225341 247188 471347 187169
40512A87169m54875k18592m0071j05223k1286M21112P03314K97102m10710n38216
$$ 187169 -267706 -486298 -526369 -631592 -652878 -231766 471548 768650 357940 -180276
40502a80276N8319N94080M68987J484j77566M731J51576M8152j60786k92381k88792
$$ -180276 -121957 472123 941110 942594 765028 769759 921335 969487 808701 516320 227528
40491B27528j34090J04502J97827q271k90369k59423R0848L29771J84019q8504
$$ 227528 93438 197940 395767 387496 97127 -162296 -71448 258323 442342 353838
40481C53838j12484L7747l0130m19500p58949o56675j41922L98735N86258L33132
$$ 353838 241354 279101 248971 -170529 -929478 -1586153 -1728075 -1329340 -743082 -409950
40471d09950q7309k40936L1700L64646K56505k47351n25777j72522M42825O45962
$$ -409950 -497259 -738195 -706495 -341849 -85344 -332695 -858472 -1030994 -588169 57793
40461E7793L01125j17278j98047j5903J32487J38310J22166K14278L71156L66964
$$ 57793 358918 241640 43593 27690 160177 298487 420653 634931 1006087 1373051
40451A373051K1214m88010o83940l45882J45573K79602Q9796K474J15974J12487
$$ 1373051 1394265 906255 222315 -123567 22006 301608 391404 393878 509852 622339
40441F22339q2102r3122K37951M82151K65930j26114k31726j62791l31035o22369
$$ 622339 540237 447115 685066 1167217 1433147 1307033 1075307 912516 581481 -40888
40431d0888m80546J64104O47183M63299o2348l06315j97555j37158k74699l26951
$$ -40888 -521434 -357330 289853 753152 690804 384489 186934 49776 -224923 -551874
40421e51874j24497P4637P772j37737M371L69191M71345R4341l41707l24258M7352
$$ -551874 -676371 -601734 -593962 -731699 -727328 -358137 113208 207549 -134158 -458416 -411064
40410d11064K17494m5100l71134l47562l5161K17110K29983Q3371o6728p3159
$$ -411064 -193570 -238670 -609804 -957366 -992527 -775417 -545434 -462063 -528791 -601950
40400f01950J54908N06023O81948N21091K02159o036n8140n5682l6116l0924j55785
$$ -601950 -447042 58981 740929 1262020 1464179 1458143 1400003 1344321 1308205 1277281 1121496
40389A121496m01014m92905k52722L4884m9503m23115n47141j37734M78055P86558
$$ 1121496 720482 227577 -25145 9739 -39764 -462879 -1010020 -1147754 -669699 116859
40379A16859O14916J69534k19352l13617j22881Q4767O8382r8132j92640k20311
$$ 116859 731775 901309 681957 368340 245459 330226 398608 300476 107836 -112475
40369a12475l39282m55746k74162J74791M39769K56810p9914j77770p7445m5267
$$ -112475 -451757 -907503 -1181665 -1006874 -567105 -310295 -390209 -567979 -645424 -690691
40359f90691q3182M229J89519K24811N0361q5231K9123K87550M01896K21129j13142
$$ -690691 -773873 -769644 -580125 -355314 -304953 -390184 -361061 -73511 328385 549514 436372
40348D36372k94326j68252O3782P3047j29599j55095J90491N04295K49806m62197
$$ 436372 142046 -26206 37576 110623 -18976 -174071 16420 520715 770521 308324
40338C08324q94683n65229J62910N48050L57515L8745L3713K02289J14500k38408
$$ 308324 -586359 -1151588 -988678 -440628 -83113 -44368 -10655 191634 306134 67726
40328F7726l64779O770M47206L67514j45453m46318k56902r595j14951l35993
$$ 67726 -297053 -290283 156923 524437 378984 -67334 -324236 -333831 -448782 -784775
40318g84775k33190R8397K00267j589j14560N2926K09715J09614m2541K4928J59408
$$ -784775 -1017965 -919568 -719301 -720890 -835450 -782524 -572809 -463195 -505736 -480808 -321400
40307c21400L2447k74447l27750J95K95210J87372j04217r0236K74661N31402
$$ -321400 -288953 -563400 -891150 -890955 -595745 -408373 -512590 -602826 -328165 203237
40297B03237L61311l7555l12118l74923k73053N3948N53255Q14110M78883j66749
$$ 203237 564548 526993 214875 -160048 -433101 -379153 174102 988212 1467095 1300346
40287A300346m51652k06288L2238j67273n18934m75144K791M29317L92362o4771
$$ 1300346 848694 642406 674644 507371 -11563 -486707 -483916 -54599 337763 272992
40277B72992n50268o55196k92020J92353L71412K36700J22709J43031Q2070p0129
$$ 272992 -277276 -932472 -1224492 -1032139 -660727 -424027 -301318 -158287 -76217 -146346
40267a46346K0487L72242M06631k19305r23673r16167l03226J48059J45385Q7518
$$ -146346 -125859 246383 653014 433709 -489964 -1406131 -1709357 -1561298 -1415913 -1328395
40257a328395K27073L31630K62501K36319L19834K34086r4562k88616j00975J91121
$$ -1328395 -1101322 -769692 -507191 -270872 48962 283048 188486 -100130 -201105 -9984
40247i984K53341J55260P3996p0278l31544m27384j13187L63425N58746M14843
$$ -9984 243357 398617 472613 402335 70791 -356593 -469780 -106355 452391 867234
40237H67234K05044M8742j60136m11871n02787l26960l2679J41520P5068j54572
$$ 867234 1072278 1121020 960884 549013 46226 -280734 -313413 -171893 -96825 -251397
40227b51397l11256j84888J91420N71218P35537N80468N2164p09708j188618q72969
$$ -251397 -562653 -747541 -556121 15097 750634 1331102 1383266 673558 -515060 -1388029
40217a388029M3113P29846O83638K48311j7655m8941m9645j8628P5359K6973k26089
$$ -1388029 -1344916 -615070 68568 316879 299224 250283 200638 182010 257369 284342 58253
40206E8253l00012N0122L78038J67070k98149l64450q2780o4747l77083m32935
$$ 58253 -241759 -191637 186401 353471 55322 -309128 -391908 -456655 -833738 -1266673
40196a266673m7142K47697J48821M8498K31421L55798J64520K6878K31973L42002
$$ -1266673 -1313815 -1066118 -917297 -868799 -637378 -281580 -117060 -90182 141791 483793
40186D83793j02747o97933p04444j62022K28946J67343J5862N8782J27163L7969
$$ 483793 381046 -316887 -1021331 -1183353 -954407 -787064 -771202 -712420 -585257 -547288
40176e47288j07844j86277k12422j52231Q1326L81109N17000M86053M59916L76975
$$ -547288 -655132 -841409 -1053831 -1206062 -1124736 -743627 -226627 259426 719342 1096317
40166A096317m874n68095p82493m00756J39227K65105k7626k80232j96319Q5656
$$ 1096317 1091443 523348 -259145 -659901 -520674 -255569 -283195 -563427 -759746 -674090
40156f74090K45710J15073j92168l70676k13456J39649L53381L13116K05286J50865
$$ -674090 -428380 -313307 -505475 -876151 -1089607 -949958 -596577 -283461 -78175 72690
40146G2690K6067k21873l51407j48300K25435M50987M66427M06413K72911k3097
$$ 72690 98757 -123116 -474523 -622823 -397388 53599 520026 926439 1199350 1176253
40136A176253l65089n01365m10974l00728k15422K3317L94910N30758K03509k82164
$$ 1176253 811164 309799 -101175 -401903 -617325 -594008 -199098 331660 535169 253005
40126B53005m58237k92845j33254j48803j58793k2988J23522J48746J67963L07511
$$ 253005 -205232 -498077 -631331 -780134 -938927 -961915 -838393 -689647 -521684 -214173
40116b14173M19812K89395R887j26172p3011o2941j57941j07245J85996L74157
$$ -214173 205639 495034 504921 378749 305738 242797 84856 -22389 163607 537764
40106E37764J47010k14257j72541K46648M19291M287n45519n96492j57259K31692
$$ 537764 684774 470517 297976 544624 963915 968202 422683 -173809 -331068 -99376
40096i9376K42653L8249j19776j80544j80960j14492l7924q6507k51758l12826
$$ -99376 143277 181526 61750 -118794 -299754 -414246 -452170 -538677 -790435 -1103261
40086a103261j17078K07426M33519M93525M37984K84817P2063o1909l8289J6448
$$ -1103261 -1220339 -1012913 -579394 -85869 352115 636932 708995 647086 608797 625245
40076F25245k4346m4157J04905K39851M7526l44154m08315N199L35194P0577m66894
$$ 625245 600899 556742 661647 901498 949024 604870 196555 201754 536948 607525 140631
40065A40631n45877n3118M16074M63750L34728L14905K23709j43365m73734l27547
$$ 140631 -405246 -458364 -42290 421460 756188 1071093 1294802 1151437 677703 350156
40055C50156J35314L12634J951l50081k92340J03512M59973N25789K67884j89294
$$ 350156 485470 798104 800055 449974 157634 261146 721119 1246908 1514792 1325498
40045A325498n60024n60983k38059N2225J02159P8314J66428K58084J93630O6192
$$ 1325498 765474 204491 -33568 18657 120816 199130 365558 623642 817272 883464
40035H83464J7280n6906k81229m58331l18976j3140M9871j64848k47714K1524
$$ 883464 900744 843838 562609 104278 -214698 -227838 -177967 -342815 -590529 -569005
40025e69005L48657L83237J78328o609r4975j48943j37998j1832J10014N4241
$$ -569005 -220348 162889 341217 334608 239633 90690 -47308 -59140 50874 105115
40015A05115j53808l27311l57323k70810j13235P0994J81287J37840J3821k5868
$$ 105115 -48693 -376004 -733327 -1004137 -1117372 -1046378 -865091 -727251 -713430 -739298
40005g39298P1978J84176J55104l6274k40496k58493m5467K10573K93579K20890
$$ -739298 -667320 -483144 -328040 -364314 -604810 -863303 -908770 -698197 -404618 -183728
39995a83728J68595J64587P4914p5298m9239K00854L54940J63182j67864k80285
$$ -183728 -15133 149454 224368 149070 99831 300685 655625 818807 650943 370658
39985C70658j50038J9126J84879L91751M65255K07398j66827k22944N9047K64545
$$ 370658 220620 239746 424625 816376 1281631 1489029 1322202 1099258 1158305 1422850
39975A422850J87947M9854l619j25309l21259k90021L390P4518l50690p65425
$$ 1422850 1610797 1660651 1657032 1531723 1210464 920443 923833 998351 647661 -117764
39965a17764n54289P2279M02490K92147K57874N25578O49352K69473k90159m92957
$$ -117764 -672053 -599774 -197284 94863 352737 878315 1527667 1797140 1506981 1014024
39955A014024k87969k6511N5124j8638j38248j70967J431K86665L73204J28382
$$ 1014024 726055 699544 754668 736030 597782 426815 428246 714911 1088115 1216497
39945A216497j53952j39139O9497J18584m7495j53883o5849M4260L3370j9524
$$ 1216497 1062545 923406 992903 1111487 1063992 910109 844260 888520 921890 902366
39935I02366l9658q9575j55177p3074J53522K18925o0535l80743l06008J17725
$$ 902366 862708 773133 617956 544882 698404 917329 856794 476051 170043 287768
39925B87768M15486L15838K7224j49727j90696k13932k17863j20026Q7844L51410
$$ 287768 703254 1019092 1046316 896589 705893 491961 274098 154072 241916 593326
39915E93326N90784O37655L23572k24567n72016m69705j97506j62479k99482k06595
$$ 593326 1184110 1821765 2145337 1920770 1348754 879049 681543 519064 219582 12987
39905A2987J84580M62151L30712P810j43057j02970j03523k29718l44976l15647
$$ 12987 197567 659718 990430 998240 855183 752213 648690 418972 73996 -241651
39895b41651j36443J00485K46438J99569O1732O1664K17296K41983o2567m86641
$$ -241651 -378094 -277609 -31171 168398 230130 291794 509090 751073 688506 201865
39885B01865o68137n09895j50076K85078O27650N69877J9391n42659n07530L5922
$$ 201865 -466272 -976167 -1126243 -841165 -213515 356362 375753 -166906 -674436 -638514
39875f38514L60785Q3144l62179m19641j48866N8445J25977K15047K39750k4012
$$ -638514 -277729 -194585 -556764 -976405 -1125271 -1066826 -940849 -725802 -486052 -510064
39865e10064m02767l92303J32188O53583O43281J89264j98797k23128l6191N1391
$$ -510064 -912831 -1305134 -1172946 -519363 123918 313182 114385 -108743 -144934 -93543
39855i3543o9258k15132j16910K36390M70931K07847l97546p27904m47760O2481
$$ -93543 -162801 -377933 -494843 -258453 212478 420325 22779 -705125 -1152885 -1090404
39845a090404K46701J24700J36914L62265L83961K7499k52990l0025M10398M59528
$$ -1090404 -843703 -719003 -582089 -219824 164137 191636 -61354 -91379 319019 778547
39835G78547O5011k46131j66203M5521R2272O6730J31303J39612j01390m25933
$$ 778547 843558 597427 431224 476745 569017 635747 767050 906662 805272 379339
39825C79339n02263k99590o5076N9153R3041j7848l35350o24764m91913N6806
$$ 379339 -122924 -422514 -487590 -428437 -335396 -353244 -688594 -1313358 -1805271 -1748465
39815a748465M98169M14911K475k42205j46741N5722J46212J54353J81958K10790
$$ -1748465 -1250296 -835385 -832910 -1075115 -1221856 -1166134 -1019922 -865569 -683611 -472821
39805d72821J64959N4451k1340J5556J32528J96209Q5849j67151l55205k53205
$$ -472821 -307862 -253411 -274751 -259195 -126667 69542 155391 -11760 -366965 -620170
39795f20170J54693N96874P13843M10752o006j54024m1130l6238l11799n52656
$$ -620170 -465477 131397 845240 1255992 1249986 1095962 1054832 1018594 706795 154139
39785A54139m19189q2783K6206j29350j98877p0395l0172j92771k39056K0997
$$ 154139 -265050 -347833 -321627 -450977 -649854 -720249 -750421 -943192 -1182248 -1161251
39775a161251K25340k0458m72751n33059p7990L97777M49542J58521r2385n0869
$$ -1161251 -935911 -956369 -1429120 -1962179 -2040169 -1642392 -1192850 -1034329 -1126714 -1177583
39765a177583K48889N59752O09755L65495R9228N2701R8428o7189m48150p06246
$$ -1177583 -928694 -368942 240813 606308 705536 758237 856665 789476 341326 -364920
39755c64920n91662j93641K47142N51102N99047L58314k921k06297j54563p325
$$ -364920 -956582 -1150223 -903081 -351979 247068 605382 602461 396164 241601 234276
39745B34276O1504L2980m1984j12863p8128J42268M08826M07726n98n75465q96330
$$ 234276 295780 328760 286776 173913 95785 238053 646879 1054605 1054007 478542 -417788
39734d17788p12042j36177L88288M15294j0060k85516L4032N57949N13987j36522
$$ -417788 -1129830 -1266007 -877719 -462425 -472485 -758001 -723969 -166020 347967 211445
39724B11445n76940k91200K27286K91018L6137N3919L41085L25629j33165m64512
$$ 211445 -365495 -656695 -429409 -138391 -102254 -48335 292750 618379 485214 20702
39714B0702k64861J12679J46494j01265k03220o6250J1363j16630k36639j59179
$$ 20702 -244159 -131480 15014 -86251 -289471 -355721 -344358 -460988 -697627 -856806
39704h56806k03O4712J04314K67616M31249K95257j29477m03621k15686J46188
$$ -856806 -857009 -792297 -687983 -420367 10882 306139 176662 -226959 -442645 -296457
39694b96457J69967j42539k91070m6360K24328J79089L4714J36665L23766J94389
$$ -296457 -126490 -269029 -560099 -606459 -382131 -203042 -168328 -31663 292103 486492
39684D86492j74697l04321q0804P1472j11639l35605k49656N2770K92652M19073
$$ 486492 311795 7474 -73330 -1858 -113497 -449102 -698758 -645988 -353336 65737
39674F5737M64890K99677r9414l67710j79023J80979J25542l77135p19194n05166
$$ 65737 530627 830304 730890 363180 184157 365136 490678 113543 -605651 -1110817
39664a110817n1366J53993R7951N4026N9691j6322o1904J67143N36171N71600
$$ -1110817 -1162183 -1008190 -910239 -856213 -796522 -812844 -874748 -707605 -171434 400166
39654D00166J47293k41149j35854K33922K98742k7001k70953j30927J29998J48851
$$ 400166 547459 306310 170456 404378 703120 676119 405166 274239 404237 553088
39644E53088j8886r3078m1051m4005j18869j09685l9226j38069m26360n50196
$$ 553088 534202 441124 400073 356068 237199 127514 88288 -49781 -476141 -1026337
39634a026337k35666K73331M77781K60405J6809J04776L68280L71005Q897l31950
$$ -1026337 -1262003 -988672 -510891 -250486 -233677 -128901 239379 610384 619281 287331
39624B87331k88550j875J08660m2024j03489J36108L67229J80533l14566n99199
$$ 287331 -1219 -3094 105566 63542 -39947 96161 463390 643923 329357 -269842
39614b69842m11804q228K49977K69962J20553j49481m17589m45584j56812J80938
$$ -269842 -681646 -689874 -439897 -169935 -49382 -198863 -616452 -1062036 -1218848 -1037910
39604a037910K53911R4222o663R4704K49594K46795M3442k14464l05531j19428
$$ -1037910 -783999 -689777 -696440 -601736 -352142 -105347 -61905 -276369 -581900 -701328
39594g01328J79554K60760J3924k65324k16257J44242M68322M85787K12053j60857
$$ -701328 -521774 -261014 -247090 -512414 -728671 -584429 -116107 369680 581733 420876
39584D20876m03924l70968j71774j27290l38302m37055p6069M58430N49110J45766
$$ 420876 16952 -354016 -525790 -653080 -991382 -1428437 -1504506 -1046076 -496966 -351200
39574c51200j31727R1619M33536M25745K28550K45917L76531J96909k63679m87399
$$ -351200 -482927 -391308 42228 467973 696523 942440 1318971 1515880 1252201 764802
39564G64802k34632J17541J33122j39965l47592k86111j9193K63693L59875J78628
$$ 764802 530170 647711 780833 640868 293276 7165 -12028 251665 611540 790168
39554G90168j20729k34810n3008K15852L07805J71183p3269k89450l76547l07012
$$ 790168 669439 434629 381621 597473 905278 1076461 1003192 713742 337195 30183
39544C0183j95709k11909l55226m32586l05521l9269K19381L62128L05077O0474
$$ 30183 -165526 -377435 -732661 -1165247 -1470768 -1510037 -1290656 -928528 -623451 -562977
39534e62977j36772k0466L01288M01937J40128q3884R4846M40203M44465L5983
$$ -562977 -699749 -720215 -418927 -16990 123138 39254 134100 574303 1018768 1054751
39524A054751l92586n49379m83083l18931j16054N112o6510j76346k3169L80248
$$ 1054751 662165 112786 -370297 -689228 -805282 -800170 -866680 -1043026 -1066195 -685947
39514f85947O45119N17605J99907K5916L9007N3302m1060k02228l47175m02103
$$ -685947 -40828 476777 676684 702600 741607 794909 753849 551621 204446 -197657
39504a97657l29902j94558j04952m6539R8745L18842M27734L32740J69645O7689
$$ -197657 -527559 -722117 -827069 -873608 -774863 -456021 -28287 304453 474098 541787
39494E41787m5382k68808n12114o04239n03500k70866M1654L40035M52587L11334
$$ 541787 496405 227597 -284517 -888756 -1392256 -1663122 -1621468 -1281433 -828846 -517512
39484e17512R0741K6798J56879L29072L77672K14665j16954l87011l38178k2006
$$ -517512 -426771 -399973 -243094 85978 463650 678315 561361 174350 -163828 -185834
39474a85834K02457J42633K9421J08250K15006N7817k65598l96676k59344r7230
$$ -185834 16623 159256 188677 296927 511933 569750 304152 -92524 -351868 -449098
39464d49098r916J51283L82955M11920J19062k21203k91550r2733J83594M16053
$$ -449098 -459014 -307731 75224 487144 606206 385003 93453 720 184314 600367
39454F00367N30612M27858J32181j30268j87109j47912k16340l70764m02878k18499
$$ 600367 1130979 1558837 1691018 1560750 1373641 1225729 1009389 638625 235747 17248
39444A7248N8915K66916L52677L29337J89878p1398l73977n46735m69209k22433
$$ 17248 76163 343079 695756 1025093 1214971 1143573 769596 222861 -246348 -468781
39434d68781j9814M8500R5166J91415K04901M5526q7409K4476J99022N3096l72622
$$ -468781 -488595 -440095 -344929 -153514 51387 96913 9504 33980 233002 286098 -86524
39423h6524n64556k37070K54881M12643K29336O7019J04963K14897K78590L24451
$$ -86524 -651080 -888150 -633269 -220626 8710 75729 180692 395589 674179 998630
39413I98630L47538K39411k7346k89377l52888k10596m6817k6127r9958p9784
$$ 998630 1346168 1585579 1558233 1268856 915968 705372 658555 632428 532470 452686
39403D52686P4706J58399K9321j16502n885K59868L17828R4605j02173j01196
$$ 452686 527392 685791 715112 598610 592725 852593 1170421 1265026 1162853 1061657
39393A061657r8430k27485k82045j07172P1315Q161j54416j59956n9400j4724
$$ 1061657 963227 735742 453697 346525 417840 426001 271585 111629 52229 37505
39383C7505P2876L41595N79117M87646J86489L867r7894l84825p21113o54205
$$ 37505 110381 451976 1031093 1518739 1705228 1709095 1611201 1226376 505263 -148942
39373a48942j80079J46172K9791j56811l6436J81565J27245q8790q8636J44321
$$ -148942 -329021 -182849 -153058 -309869 -346305 -164740 -37495 -126285 -214921 -70600
39363g0600K69582J26612q8700j69374j34784q5049k4689R4574K59278L76660
$$ -70600 198982 325594 236894 67520 -67264 -152313 -177002 -82428 176850 553510
39353E53510L52196J98108O1675Q1633K15441K94048K40460J23976J4292p3089
$$ 553510 905706 1103814 1165489 1247122 1462563 1756611 1997071 2121047 2135339 2062250
39343B062250r7589l6888j1162j58794l65993l54521r9552Q3739k7126k71233
$$ 2062250 1964661 1927773 1916611 1757817 1391824 1037303 937751 1021490 994364 723131
39333G23131l66321k42226J5908L25879N43272M57414O2006l32761m48945l56854
$$ 723131 356810 114584 130492 456371 999643 1457057 1519063 1186302 737357 380503
39323C80503k79622k57684k03898j27594p8507O650J85731L43852L41435K28663
$$ 380503 100881 -156803 -360701 -488295 -566802 -560152 -374421 -30569 310866 539529
39313E39529J33862N6211m4527p9157M3348K24030K98739K47867J23781o6583
$$ 539529 673391 729602 685075 605918 649266 873296 1172035 1419902 1543683 1477100
39303A477100k22684j12166K60912M57078J11035n12434q34434p08404m56018
$$ 1477100 1254416 1142250 1403162 1860240 1971275 1458841 624407 -83997 -540015
39294e40015k58064K1448L91826N81783M57488K31313J17470Q1339L7837j918
$$ -540015 -798079 -776631 -384805 196978 654466 885779 1003249 1084588 1122425 1120507
39284A120507q7945l28118o00477n69827j51342L04533M46609L05590J11566j3071
$$ 1120507 1032562 704444 103967 -465860 -617202 -312669 133940 439530 551096 538025
39274E38025k6573J11780L11642L47824J40804j46717l84382n91517o88658m70017
$$ 538025 511452 623232 934874 1282698 1423502 1276785 892403 300886 -387772 -857789
39264h57789m294K76824J42057r1458m8678J63343K25715J35452Q7612O7660k7969
$$ -857789 -862083 -585259 -443202 -534660 -583338 -419995 -194280 -58828 28784 96444 68475
39253F8475n4324J60486L91595K67894j27564l47198k32251m9749M593K832k5481
$$ 68475 14151 174637 566232 834126 706562 359364 127113 77364 81957 84789 59308
39242E9308j47892k25645k2752K91059K39574j95866m20592r8978L06006K43847
$$ 59308 -88584 -314229 -336981 -45922 193652 -2214 -422806 -521784 -215778 28069
39232B8069r6001j53741J05945K20953R482k23617k59164k61129l88823m85940
$$ 28069 -67932 -221673 -115728 105225 114707 -108910 -368074 -629203 -1018026 -1503966
39222a503966l26068P3103N05773P61178O87155K87320j61597l00024r8088J05729
$$ -1503966 -1830034 -1756931 -1251158 -489980 197175 484495 322898 22874 -75214 30515
39212C0515O7085p6729j08458q6191j76581l06036k57382l8505J24911J62945
$$ 30515 97600 20871 -87587 -173778 -350359 -656395 -913777 -952282 -827371 -664426
39202f64426K55494M71745N55830K52493k81960n94278m44480n6839J71922J15217
$$ -664426 -408932 62813 618643 871136 589176 -5102 -449582 -506421 -334499 -219282
39192b19282p461L8063J96206K27916Q0968p234J31796K91194J64151j46149k10258
$$ -219282 -226743 -188680 7526 235442 316410 309176 440972 732166 896317 750168 539910
39181E39910O9531K39469l5537l96612k84088J78758L07074j26196n10386k49116
$$ 539910 609441 848910 813373 416761 132673 311431 618505 492309 -18077 -267193
39171b67193M20496P82733N35786j5980m64981o31610n05208k13879k6932r1806
$$ -267193 153303 936036 1471822 1455842 990861 359251 -145957 -359836 -386768 -478574
39161d78574j93785n1129K16872K67150J46148K74524P02056Q41919K57499o21497
$$ -478574 -672359 -723488 -506616 -239466 -93318 181206 883262 1725181 1982680 1361183
39151A361183r73719o02915p5625R6233M55l0885L7258mj74357k66331j27321
$$ 1361183 387464 -215451 -291076 -194843 -194388 -225273 -188015 -188019 -362376 -628707 -756028
39140g56028J24456K90927L31042L07907K15811L1787j11292k8733J95826K33439
$$ -756028 -631572 -340645 -9603 298304 514115 545902 434610 405877 601703 835142
39130H35142j1641j77015P0148N03175O08359K83369r2906k58742l48029n07202
$$ 835142 823501 646486 716634 1219809 1828168 2111537 2018631 1759889 1411860 904658
39120I04658o20082n70238m43627k86529J6063M03054N15417K16869o4665R5407
$$ 904658 284576 -285662 -729289 -1015818 -999755 -596701 -81284 135585 70920 166327
39110A66327M39328L70885j47294n30406m13492r5522j3348j51064j87592J8914
$$ 166327 605655 976540 829246 298840 -114652 -210174 -223522 -374586 -562178 -543264
39100e43264L17191M99076M85449L50222K53222K89166L63325K86592O04l70181
$$ -543264 -226073 273003 758452 1108674 1361896 1651062 2014387 2300979 2301583 1931402
39090A931402o60919p53574n74303j63009K70900N09458N26369M05899J52441
$$ 1931402 1270483 516909 -57394 -220403 50497 559955 1086324 1492223 1644664
39081A644664k15181m62226l23470R0643L41764J85554j70244l76779k94433N335
$$ 1644664 1429483 967257 643787 734430 1076194 1261748 1091504 714725 420292 425627
39071D25627L40445M51757J86741k47263m33721k46887J2159N6470n7171j40238
$$ 425627 766072 1217829 1404570 1157307 723586 476699 488858 545328 488157 347919
39061C47919j47628r6825L8844J92805J92289M4267l994J38207K06189p625k91991
$$ 347919 200291 103466 142310 335115 527404 571671 567677 705884 912073 904448 612457
39050F12457l25229j33716K6818O4785N6572J9433n3090p5188l1537q5315k76259
$$ 612457 287228 153512 180330 245115 301687 321120 268030 192842 161305 75990 -200269
39039b00269l26280n5647K26839J36997j57396j68222J57525L89664L05724J61387
$$ -200269 -526549 -582196 -355357 -218360 -375756 -543978 -386453 3211 308935 470322
39029D70322J99037L03243K73510J02180j39877l99046n21667l31709O3953L06164
$$ 470322 669359 972602 1246112 1348292 1208415 809369 287702 -44007 19946 326110
39019C26110K18146j5466j50376j12971R0748L93309N48324L22902j12830l11942
$$ 326110 544256 528790 378414 265443 356191 749500 1297824 1620726 1507896 1195954
39009A195954j54079J1561p7384k61892l19110k80050k11120m6537J48074J05762
$$ 1195954 1041875 1053436 976052 714160 395050 115000 -96120 -142657 5417 111179
38999A11179k00477l90698k20577M6341R5971M1427J05691J77714R3348M2549
$$ 111179 -89298 -479996 -700573 -654232 -558261 -516834 -411143 -233429 -140081 -97532
38989i7532K27608L83618J63883k01370k05453R6512J60505j44217l22555o8598
$$ -97532 130076 513694 677577 476207 270754 367266 527771 383554 60999 -7599
38979g599K67001K60975J2016j37866j17764m9903P1157K89766M48291L52609
$$ -7599 259402 520377 532393 394527 276763 226860 298017 587783 1036074 1388683
38969A388683J10703L8863K21461L70065J97967j84704l77983j96908N9193j9851
$$ 1388683 1499386 1538249 1759710 2129775 2327742 2143038 1765055 1568147 1627340 1607489
38959A607489l76326n28320k53032O9269K707l15177m12457j63485J55439L79584
$$ 1607489 1231163 702843 449811 519080 521787 206610 -205847 -369332 -213893 165691
38949A65691N83666O99187M62087j16296n91864o04057k99689p2176q5706k10009
$$ 165691 749357 1448544 1910631 1794335 1202471 598414 298725 226549 140843 -69166
38939f9166k53676j27488R5152K04380O8673j56205j93025o863J91305K63980
$$ -69166 -322842 -450330 -355178 -150798 -82125 -238330 -431355 -438218 -246913 17067
38929A7067K23198N0513k27746l31154j4447M14825L63096j47426l82271N4561
$$ 17067 240265 290778 63032 -268122 -282569 132256 495352 347926 -34345 20216
38919B0216O06607N84339J28996j42048r5997j13111l50491n44285m98864l05381
$$ 20216 626823 1211162 1340158 1198110 1102113 989002 638511 94226 -404638 -710019
38909g10019o8987J98241M04961M29766L40301K83479K08158j2643k60172l00108
$$ -710019 -779006 -580765 -175804 253962 594263 877742 1085900 1073257 813085 512977
38899E12977j76554j33895j87164j29213M9575J22830L8824J0571J31688K31152
$$ 512977 336423 202528 15364 -113849 -64274 58556 97380 107951 239639 470791
38889D70791J89116R7858L2796n4632j46985j30669r136J01605J88921K74345
$$ 470791 659907 757765 790561 735929 588944 458275 449139 550744 739665 1014010
38879A014010J86284k08077n74575m09100J73287M87413K75163P1752K86586N14114
$$ 1014010 1200294 992217 417642 8542 181829 669242 944405 1016157 1302743 1816857
38869A816857K39018k69975l91119j35308j2954r1172Q5592N95246Q38124L88976
$$ 1816857 2055875 1785900 1394781 1259473 1246519 1155347 1240939 1836185 2674309 3063285
38859C063285l45198o51229l82914J1541J46567P6783O8480K24559L92316L56265
$$ 3063285 2718087 2066858 1683944 1695485 1842052 1918835 1987315 2211874 2604190 2960455
38849B960455P3219k86905n22108n71759m91630l41921j69840k8250P3283J74169
$$ 2960455 3033674 2746769 2224661 1652902 1161272 819351 649511 621261 694544 868713
38839H68713K58457K43273J41626J00086J71185K06303J11528K7580O5274N5191
$$ 868713 1127170 1370443 1512069 1612155 1783340 1989643 2101171 2128751 2194025 2249216
38829B249216j74338m31051l91802r7257J26940J78194K43691L81159M17466L09998
$$ 2249216 2074878 1643827 1252025 1154768 1281708 1459902 1703593 2084752 2502218 2812216
38819B812216K40698K62842J99040l773j54190j67630j94328k63139j66062J23696
$$ 2812216 3052914 3315756 3514796 3511023 3356833 3189203 2994875 2731736 2565674 2689370
38809B689370L01626K31729K02119L80887M25073N7027l22901j44779M32199P20539
$$ 2689370 2990996 3222725 3424844 3805731 4230804 4287831 3964930 3820151 4252350 4972889
38799D972889N13526K95008M00295N42115L61276j5428k30294j75450K8605K74150
$$ 4972889 5486415 5781423 6181718 6723833 7085109 7069681 6839387 6663937 6692542 6966692
38789F966692M54502M21903J78583m0366m7095O8923J13936L4137j28686l40491
$$ 6966692 7421194 7843097 8021680 7981314 7934219 8003142 8117078 8151215 8022529 7682038
38779G682038m90923l84390J3060M44904O14373M43366J9138m95865p90292n32082
$$ 7682038 7191115 6806725 6819785 7264689 7879062 8322428 8341566 7845701 7055409 6523327
38769F523327J83959P37029O16933J9601m39948m51313j79171J15204K84670K43334
$$ 6523327 6707286 7444315 8061248 8080849 7640901 7189588 7010417 7125621 7410291 7653625
38759G653625N4141k314K19258M01914J84251j82325r2756M81293Q77919P14194
$$ 7653625 7707766 7705452 7924710 8326624 8510875 8328550 8235794 8717087 9595006 10309200
38749A0309200M10176M53485O65012O41092N04974O50282R89839J063677Q04821
$$ 10309200 10719376 11172861 11837873 12478965 12983939 13634221 14624060 15687737 16492558
38740A6492558O27243P30693Q47550P87122P34431Q10544P85114N16242L04922
$$ 16492558 17119801 17850494 18698044 19485166 20219597 21030141 21815255 22331497 22636419
38731B2636419M48471P12858O55607L05852R5708J77790K47435J08366J1182K26151
$$ 22636419 23084890 23797748 24453355 24759207 24854915 25032705 25280140 25388506 25399688 25625839
38721B5625839N71888O50590M08963K00730L31750P52406J203012J486944J561648
$$ 25625839 26197727 26848317 27257280 27458010 27789760 28542166 29745178 31232122 32793770
38712C2793770J504357J461492J547723J742746J955039K210413K664712L354176
$$ 32793770 34298127 35759619 37307342 39050088 41005127 43215540 45880252 49234428
38704D9234428M040946M453598M652848N003575N732120O629793P311006P720761
$$ 49234428 53275374 57728972 62381820 67385395 73117515 79747308 87058314 94779075
38696I4779075Q241365R241247J0635599J2037758J3297288J4670883J6376565
$$ 94779075 103020440 112261687 122897286 134935044 148232332 162903215 179279780
38689A79279780J8183167J9629831K0478132K0635976J9713678J7087331J2572761
$$ 179279780 197462947 217092778 237570910 258206886 277920564 295007895 307580656
38682C07580656O763318N47688n438537j0746533j4914954j7729458j9444038
$$ 307580656 314343974 314891662 309453125 298706592 283791638 266062180 246618142
38675B46618142k0351561k0331144j9241784j7550989j5995738j4686721j3155995
$$ 246618142 226266581 205935437 186693653 169142664 153146926 138460205 125304210
38668A25304210j1319295r724819q675025p779766o718922n823335n424228n171614
$$ 125304210 113984915 104260096 95585071 87805305 81086383 75263048 69838820 64667206
38660F4667206m598416l940864l720224l792513l534494k846077k269497k116294
$$ 64667206 60068790 56127926 52407702 48615189 45080695 42234618 39965121 37848827
38652C7848827k114254j990882j822929j686388j490440j300812j333028j481682
$$ 37848827 35734573 33743691 31920762 30234374 28743934 27443122 26110094 24628412
38644B4628412j356930r53697p57799r58736j094881q06231m33038m37060o47955
$$ 24628412 23271482 22317785 21559986 20601250 19506369 18700138 18267100 17830040 17182085
38635A7182085n87519k51228n7586j86160m12584n02435m03642j45862J30929
$$ 17182085 16594566 16343338 16285752 16099592 15687008 15184573 14780931 14635069 14765998
38626A4765998J64672j05034l31802j83040J82017L63718K72984P7275k11912
$$ 14765998 14930670 14825636 14493834 14310794 14492811 14856529 15129513 15206788 14994876
38617A4994876o57269j033326j031419p79861o89095p88929o99611k99082O6730
$$ 14994876 14337607 13304281 12272862 11493001 10803906 10014977 9315366 9016284 9083014
38608I083014J33778J7390j54613m29857o89401o08587k04519L7531j18888k66139
$$ 9083014 9216792 9234182 9079569 8649712 7960311 7351724 7147205 7184736 7065848 6799709
38598F799709l9283K39866R1407l00573l73906q4353R1198l4128j46407p7483
$$ 6799709 6760426 7000292 7091699 6791126 6417220 6332867 6424065 6389937 6243530 6166047
38588F166047r1071l43333n35203l67839P063K55578K93086J88277r7231n53539
$$ 6166047 6074976 5731643 5196440 4828601 4835664 5091242 5384328 5572605 5475374 4921835
38578D921835q84541p64033k71138J88218L48881K53105J8984k79919m93695m24516
$$ 4921835 4037294 3273261 3002123 3190341 3539222 3792327 3811311 3531392 3037697 2613181
38568B613181q2287K55611L38406J89267M727q2552q2450p5190j05471r8714Q4676
$$ 2613181 2530894 2786505 3124911 3314178 3318905 3236353 3153903 3078713 2973242 2874528 2959204
38557B959204M09197N48602K18519l79329o93738m79390q0615N4263r3665k32553
$$ 2959204 3368401 3917003 4135522 3756193 3062455 2583065 2502450 2556713 2463048 2230495
38547B230495j90568n414K42630M42526M26485J71262p7656r4401L9705J36505
$$ 2230495 2039927 2034513 2277143 2719669 3146154 3317416 3239760 3145359 3185064 3321569
38537C321569J89736J96681m7925n61384q07193l01979N06566O41941m5892o22638
$$ 3321569 3511305 3707986 3660061 3098677 2291484 1989505 2496071 3138012 3092120 2469482
38527B469482m05983J22516J67684k05215l37231k4942L28208M09514K85230Q8575
$$ 2469482 2063499 2186015 2353699 2148484 1811253 1786311 2114519 2524033 2809263 2897838
38517B897838j09952j80785p2295Q535j11482k39539j31000N1765J1350j46506
$$ 2897838 2787886 2607101 2534806 2543341 2431859 2192320 2061320 2113085 2124435 1977929
38507A977929j31041m5596j82734l66400j49015L51771M97080J09768k49251j74259
$$ 1977929 1846888 1801292 1618558 1252158 1103143 1454914 1951994 2061762 1812511 1638252
38497A638252O0050J34321K12231M43527N00810J13340l53227l76922o1664M7000
$$ 1638252 1698302 1832623 2044854 2488381 2989191 3102531 2749304 2372382 2310718 2357718
38487B357718k49137o10069o38328k37419L81553Q09663P31082L06755L3036N1342
$$ 2357718 2108581 1498512 860184 622765 1004318 1813981 2545063 2851818 2884854 2936196
38477B936196k8755l75177n03690o3522M13191K12813m05706n12840J39938Q16052
$$ 2936196 2907441 2532264 2028574 1965052 2378243 2591056 2185350 1672510 1812448 2628500
38467B628500Q87170N30820J71183j28601m16059n13402l02923L550J91934L50106
$$ 2628500 3515670 4046490 4217673 4089072 3673013 3159611 2856688 2860238 3052172 3402278
38457C402278N80949P07528N53561K65254O8673o0974k02242k07414K3344J91297
$$ 3402278 3983227 4690755 5244316 5509570 5578243 5517269 5315027 5107613 5130957 5322254
38447E322254m0194m31367l95377J07665L81528p3001q05799r58744l63656K96336
$$ 5322254 5282060 4850693 4455316 4562981 4944509 4871508 4065709 3106965 2743309 3039645
38437C039645L85619r89l51042m01654k72090j47604j06246j61729k39603j78644
$$ 3039645 3425264 3424275 3073233 2671579 2399489 2251885 2145639 1983910 1744307 1565663
38427A565663K9989J08307j33266l96879k48257J82660L18080R247k29121o6545
$$ 1565663 1595652 1703959 1570693 1173814 925557 1108217 1426297 1435544 1206423 1139878
38417A139878J01249j60204n59670n23935q1377K62858L18083K92621K28493k8891
$$ 1139878 1241127 1080923 521253 -2682 -84059 178799 496882 789503 1017996 989105
38407I89105l27094k89023L2650J63376j1511o1145J91060K85014r8344n02613
$$ 989105 662011 372988 405638 569014 557503 496358 687418 972432 874088 371475
38397C71475l42373J77297L48030j8065l97471l60017p1989J21017K13246L84955
$$ 371475 29102 206399 554429 536364 138893 -221124 -293113 -172096 41150 426105
38387D26105N57420M31048k5513l87146k54061K01375M29839K45320M8675J70868
$$ 426105 983525 1414573 1389060 1001914 747853 949228 1379067 1624387 1673062 1843930
38377A843930L46020J66457k24464l66091k36818k19539l54460k41989J94255
$$ 1843930 2189950 2356407 2131943 1765852 1529034 1309495 955035 713046 907301
38368I07301M59554K67729J9609J30129L52290K42394o7143j00645J70143L00231
$$ 907301 1366855 1634584 1654193 1784322 2136612 2379006 2311863 2211218 2381361 2681592
38358B681592O0409l01278m80881m28540k17065Q4660L57876M83776M74522L94060
$$ 2681592 2742001 2440723 1959842 1531302 1314237 1398897 1756773 2240549 2715071 3109131
38348C109131K00245j46634m81409n49952l03775P4527L83253N05352L99508J40214
$$ 3109131 3309376 3162742 2681333 2131381 1827606 1902133 2285386 2790738 3190246 3330460
38338C330460j21266l38124n61627o82715m67299k0818J37934k14175n50635k82901
$$ 3330460 3209194 2871070 2309443 1626728 1159429 1138611 1276545 1062370 511735 228834
38328B28834L60146O53783M01457O8029l6007j00437k82652l87550k52405r214
$$ 228834 588980 1242763 1644220 1712249 1676242 1575805 1293153 905603 653198 643984
38318F43984K05412M13761N30173L31713j30970m63471m42417k52180p3810J43693
$$ 643984 849396 1263157 1793330 2125043 1994073 1530602 1088185 836005 762195 905888
38308I05888L20675J35272m14636p70833n28530k9807J77285J34070K24689M12522
$$ 905888 1226563 1361835 947199 176366 -352164 -381971 -204686 -70616 154073 566595
38298E66595L28365K808j05008J50374L76800K93007J19293J19173J70207O4336
$$ 566595 894960 897768 792760 943134 1319934 1612941 1732234 1851407 2021614 2085950
38288B085950r5928j16201q3358j88065l34742k72286m2171M0962j26644k79357
$$ 2085950 1990022 1873821 1790463 1602398 1267656 995370 953199 994161 867517 588160
38278E88160k00213l1097Q92m4248L7439J94388J52338j35602l33929j52173K45210
$$ 588160 387947 356850 357742 313494 350933 545321 697659 562057 228128 75955 321165
38267C21165M33652K49977n4843j66372n9391L8354n4690k58659l00471j8323
$$ 321165 754817 1004794 949951 783579 724188 762542 707852 449193 148722 130399
38257A30399L85466M85424J15137l74432m79854j20975L11885M64632L70039K44532
$$ 130399 515865 1001289 1116426 741994 262140 141165 453050 917682 1287721 1532253
38247A532253J47534K025j65508k04575o3261J10302J51347Q7602P7446J56468
$$ 1532253 1679787 1681812 1516304 1311729 1248468 1358770 1510117 1597719 1675165 1831633
38237A831633J56902m8364l06180l35233j00239J40628J95896J48269J11397P183
$$ 1831633 1988535 1940171 1633991 1298758 1198519 1339147 1535043 1683312 1794709 1801892
38227A801892k23690l81611k46433N8611K24026K08278K38120L74918L93983J57194
$$ 1801892 1578202 1196591 950158 1008769 1232795 1441073 1679193 2054111 2448094 2605288
38217B605288j61175l17843k67895j18645k500m3736k58628m45355l69150q9099
$$ 2605288 2444113 2126270 1858375 1739730 1737230 1693494 1434866 989511 620361 531262
38207E31262J05885J00537N0633O4438Q0485J12431K86950N27472N23642J70410
$$ 531262 637147 737684 788317 852755 933240 1045671 1332621 1860093 2383735 2554145
38197B554145k53608m86608n47726m64538j36817K90709L41726j35986n81629
$$ 2554145 2300537 1813929 1266203 801665 664848 955557 1297283 1161297 579668
38188E79668m28999P9415K76420N0087j14947L0726K12399K10497J83835K50497
$$ 579668 150669 230084 506504 556591 441644 472370 684769 895266 1079101 1329598
38178A329598J96489j43352n17969n32809j30455L67802N92232M21611P3206p5842
$$ 1329598 1526087 1382735 864766 331957 201502 569304 1161536 1583147 1656353 1580511
38168A580511J07353L07789J45215k89271n41841m27196k27416j93710j94204
$$ 1580511 1687864 1995653 2140868 1851597 1309756 882560 655144 461434 267230
38159B67230l9197J30570N2232k18174l37999j15441K66393M71558L56286P7247
$$ 267230 228033 358603 410835 192661 -145338 -260779 5614 477172 833458 910705
38149I10705j05326j14408j00716j71021j86693K5770L51762M87352L39799J17801
$$ 910705 805379 690971 590255 419234 232541 258311 610073 1097425 1437224 1555025
38139A555025J3688O913J2856J5127k123n8095o5993P7238K50203J91780r6944
$$ 1555025 1568713 1575626 1588482 1603609 1601486 1543391 1477398 1554636 1804839 1996619 1899675
38128A899675k81831j50015R2765J38048n588q8050K9576K60521M20132L44549
$$ 1899675 1617844 1467829 1560594 1698642 1693054 1605004 1634580 1895101 2315233 2659782
38118B659782K808l94653n26496l14321k8086N3683n0530j50068j52568r9896
$$ 2659782 2662590 2267937 1741441 1427120 1399034 1452717 1402187 1252119 1099551 999655
38108I99655p9594j85284l98501m58330j05482M41664N77306Q4106m92651n35238
$$ 999655 920061 734777 336276 -122054 -227536 214128 791434 875540 382889 -152349
38098a52349j31513J96700K78810L36792M04893K61717m9092j53788N5054J96160
$$ -152349 -283862 -87162 191648 528440 933333 1195050 1145958 992170 1047224 1243384
38088A243384j6191l28488l49883j16558M1024O722m7826o186N3014N4988N1527
$$ 1243384 1227193 898705 548822 432264 473288 480010 432184 425998 479012 534000 585527
38077E85527R0346J00977l464j58869j61245J10222M87603O12426L14216j61997
$$ 585527 675873 776850 773386 614517 453272 563494 1051097 1663523 1977739 1815742
38067A815742m06843k84761p478J74872J84707M2959j97200l90566l74413j93749
$$ 1815742 1408899 1124138 1116660 1291532 1476239 1519198 1321998 931432 557019 363270
38057C63270p5949q1626K4944L99425P85454P84118L62201j33025m20390n14128
$$ 363270 287321 205695 230639 630064 1415518 2199636 2561837 2428812 2008422 1494294
38047A494294n00090l32422J9424L76163M74817K59866o4384k73540l28754l15684
$$ 1494294 994204 661782 681206 1057369 1532186 1792052 1727668 1454128 1125374 809690
38037H09690k59156j01919J24591K26952O6674j90551k04965J09468M37335M50758
$$ 809690 550534 448615 573206 800158 866832 676281 471316 580784 1018119 1468877
38027A468877K12006J0203j01851l29996o76257p72867l86323J36486K51927k8273
$$ 1468877 1680883 1691086 1589235 1259239 582982 -189885 -576208 -439722 -187795 -216068
38017b16068j43494J73917M42191J07420n75830p84090k18719M91764O57530M06556
$$ -216068 -359562 -185645 256546 363966 -211864 -995954 -1214673 -722909 -65379 341177
38007C41177L38616N45789M92387r8253p27978p76376l54956j08364k79793m12092
$$ 341177 679793 1225582 1717969 1619716 891738 115362 -239594 -347958 -627751 -1039843
37997a039843p4786M84349O84017L91931K9516m3376Q4739J64932J55579J27586
$$ -1039843 -1114629 -630280 53737 445668 475184 431808 516547 681479 837058 964644
37987I64644L9209j40086k24791k1785L09870L96131J58478r0993j25658q8610
$$ 964644 1003853 863767 638976 617191 927061 1323192 1481670 1390677 1265019 1176409
37977A176409j64953k41624j25413Q7347J27452n4868k54727l16638k56705j19302
$$ 1176409 1011456 769832 644419 731766 859218 804350 549623 232985 -23720 -143022
37967a43022O7581J95717J41205m2972j63164j38032p0393o1284j06100j79125
$$ -143022 -75441 120276 261481 218509 55345 -82687 -153080 -214364 -320464 -499589
37957d99589k56117k41155m1671K63170M92977O05064O68418O07286K43462l30877
$$ -499589 -755706 -996861 -1038532 -775362 -282385 322679 991097 1598383 1841845 1510968
37947A510968o99685n99230k35475K6251Q3119M6610l583m883J49315M10504M86964
$$ 1510968 811283 212053 -23422 2829 85948 132558 128975 124092 273407 683911 1170875
37936A170875K20049j09874j48712R710J5672j45946j83259p2952j26095l96403
$$ 1170875 1390924 1281050 1132338 1142048 1157720 1011774 828515 755563 629468 233065
37926B33065n01782k40681M3177O689j49782n8135J90363K38199R8531J13120
$$ 233065 -268717 -509398 -466221 -459532 -609314 -667449 -477086 -238887 -140356 -27236
37916b7236L25375L72300P8999k51194l01785j66777j01746j06338j779K20163
$$ -27236 298139 670439 749438 498244 196459 29682 -72064 -178402 -180181 39982
37906C9982L47125J97815j88706n53319n64846j06719N19121Q32802O90276L74042
$$ 39982 387107 584922 396216 -157103 -721949 -828668 -309547 523255 1213531 1587573
37896A587573J20233j50845m77999n82129k74468J22438J78034L733L5212K74697
$$ 1587573 1707806 1556961 1078962 496833 222365 344803 522837 526570 561782 836479
37886H36479K99884M9657J317L56042N98821K44193l97919o52156l87701l1694
$$ 836479 1136363 1186020 1187337 1543379 2142200 2386393 1988474 1336318 948617 916923
37876I16923J36701K17205K87618K44092R1914K0610R8210J74204J50053R1736
$$ 916923 1053624 1270829 1558447 1802539 1894453 1915063 2013273 2187477 2337530 2429266
37866B429266L5883n2722r3292O1535L28935M27820K84402J25772Q1464L2j98405
$$ 2429266 2465149 2412427 2319135 2380670 2709605 3137425 3421827 3547599 3629063 3629095 3430690
37855C430690l00079j39526J00726J76039J46274J94959K61313J40730j48074
$$ 3430690 3130611 2991085 3091811 3267850 3414124 3609083 3870396 4011126 3863052
37846C863052l49502k75694M2357M16114N72787L30548j14631k65291P6420M78676
$$ 3863052 3513550 3237856 3280213 3696327 4269114 4599662 4485031 4219740 4296160 4774836
37836D774836M48583J36478P9083L77590O17839N97970O17871R01694J196554
$$ 4774836 5223419 5359897 5438980 5816570 6434409 7032379 7650250 8551944 9748498
37827I748498J209712J093720J185676J504646J809571J983793K068859K027065
$$ 9748498 10958210 12051930 13237606 14742252 16551823 18535616 20604475 22631540
37819B2631540J748619J253951O72655N2545o22033j246781j620596j682675j603333
$$ 22631540 24380159 25634110 26306765 26359310 25737277 24490496 22869900 21187225 19583892
37810A9583892j600165j720497j813282j697108j380708j099028j049182j120967
$$ 19583892 17983727 16263230 14449948 12752840 11372132 10273104 9223922 8102955
37802H102955j035272p34113m29849k56193j34123m6179j24493l21712l40600
$$ 8102955 7067683 6333570 5903721 5647528 5513405 5467226 5342733 5021021 4680421
37793D680421j27816q5891m52479p99682o10925r8362J05577q8450j86814J2599
$$ 4680421 4552605 4466714 4014235 3214553 2603628 2505266 2610843 2522393 2335579 2348178
37783B348178J67021J00852J10017L21510L59955L693l54345l22855j40024k16583
$$ 2348178 2515199 2616051 2726068 3047578 3407533 3411226 3056881 2734026 2594002 2377419
37773B377419m33194m11468j86671p0354o9426J0968O3491j51296m46713m06558
$$ 2377419 1944225 1532757 1346086 1275732 1206306 1217274 1280765 1129469 682756 276198
37763B76198q6730O8777J413R3568L74270L46288j51699n26096k49995L68269
$$ 276198 189468 258245 259658 353226 727496 1073784 922085 395989 145994 514263
37753E14263O47536M10311J1366k20337k00751J6346K37803K15949j5940j33004
$$ 514263 1161799 1572110 1583476 1363139 1162388 1178734 1416537 1632486 1616546 1483542
37743A483542n1733j13919m45070n63941j01566M68823M27395j17530m16419k08215
$$ 1483542 1431809 1317890 872820 308879 207313 676136 1103531 986001 569582 361367
37733C61367M2921L9587N0923K45889K95499k5575l63316l06784l141J42120Q4976
$$ 361367 404288 443875 494798 740687 1036186 1010611 647295 340511 337370 479490 564466
37722E64466O5519J14831L7517j89390l24322j86760J07400K48620J4391m74535
$$ 564466 629985 744816 782333 592943 268621 81861 189261 437881 452272 -22263
37712b2263p63028n04746O3228L32500R4605j99410j13987J67375K07319J4909
$$ -22263 -785291 -1290037 -1226809 -894309 -799704 -999114 -1113101 -945726 -738407 -723498
37702g23498j4420K64014N50892N43650K75293j7885j49034q2232N0580M7534
$$ -723498 -737918 -473904 76988 620638 895931 878046 729012 646780 697360 744894
37692G44894j07148j57440P6843L61534L01901j11172m72686m86487k58338j9379
$$ 744894 637746 480306 557149 918683 1220584 1109412 636726 150239 -108099 -127478
37682a27478J83073L85365M86665L19481r7041m86119n30387j75738K73514M26516
$$ -127478 55595 440960 927625 1247106 1150065 663946 133559 -42179 231335 657851
37672F57851K15832n1304j05026k4299r441k4169Q8089K41622J72623j35289l75338
$$ 657851 873683 822379 717353 693054 683613 659444 747533 989155 1161778 1026489 651151
37661F51151l28651j11625O3964J54643K06181K11807J82325K04551K96927L20644
$$ 651151 322500 210875 274839 429482 635663 847470 1029795 1234346 1531273 1851917
37651A851917J50180j55027m31642n71053n29981k99862L6212L03042L81728L01624
$$ 1851917 2002097 1847070 1415428 844375 314394 14532 50744 353786 735514 1037138
37641A037138J40362p2268k91890m06852l38177j30384J09596K92415L42467K37568
$$ 1037138 1177500 1105232 813342 406490 68313 -62071 47525 339940 682407 919975
37631I19975J06017J42146L32672M06973J89928j23960k23901j17508r3835k74842
$$ 919975 1025992 1168138 1500810 1907783 2097711 1973751 1749850 1632342 1538507 1263665
37621A263665m37449l52408j01043Q8349J75772K74502L43897J80998k01572m28475
$$ 1263665 826216 473808 372765 461114 636886 911388 1255285 1436283 1234711 806236
37611H06236k00463K65348M95513L77669J95916O8253k22471o81273q35742l88588
$$ 806236 605773 871121 1366634 1744303 1940219 2008472 1786001 1104728 268986 -119602
37601a19602J96037K49495j49362l27234n4120J73256q299k64011j34799K83915
$$ -119602 76435 325930 176568 -150666 -204786 -31530 -39829 -303840 -438639 -154724
37591a54724N90064O54105N75271L33013j08122n12964n84255l74782j75916q2044
$$ -154724 435340 1089445 1664716 1997729 1889607 1376643 792388 417606 241690 159646
37581A59646K5050J36000R1759j06433k46451j78048P4153M19547O93731O30631
$$ 159646 184696 320696 412455 306022 59571 -118477 -44324 375223 1068954 1699585
37571A699585J43251m15386n89921l99355k47793k85649k63377o5328O8447K1590
$$ 1699585 1842836 1427450 837529 438174 190381 -95268 -358645 -423973 -355526 -333936
37561c33936O5333L64258N87441L70924j03218l68993l18485k00350j35671m6536
$$ -333936 -268603 95655 683096 1054020 950802 581809 263324 62974 -72697 -119233
37551a19233L0187j1060k1013K34298N53990M34873j42864n41943l33562R9642
$$ -119233 -89046 -100106 -121119 113179 667169 1102042 959178 417235 83673 183315
37541A83315J85169J468Q797K06339J57964k05049m04116j53752K19781L04199
$$ 183315 368484 369952 378749 585088 743052 538003 133887 -19865 199916 504115
37531E04115J25943r1759l07821m93922m26983k6623L56839L79317K06518J71156
$$ 504115 630058 538299 230478 -263444 -690427 -717050 -360211 19106 225624 396780
37521C96780J60405j21226m34975k26617L97022O16585Q7379m63926k80984L04493
$$ 396780 557185 435959 984 -225633 171389 787974 875353 411427 130443 434936
37511D34936M12248n6037l47835o1693K88301J24467l22326l90325N6865M86077
$$ 434936 847184 791147 443312 381619 669920 794387 472061 81736 138601 624678
37501F24678M48830J20510k5912J41269L07048J77672j60874m19370m69407l80181
$$ 624678 1073508 1194018 1168106 1309375 1616423 1794095 1633221 1213851 744444 364263
37491C64263k13197J225J37763Q2184k6812O8385L13246L42543L6754k33681j31858
$$ 364263 151066 152291 290054 372238 345426 413811 727057 1069600 1106354 872673 740815
37480G40815J61488K71255J98840K21873L78634M24296K39139m9631l23421n53340
$$ 740815 902303 1173558 1372398 1594271 1972905 2397201 2636340 2586709 2263288 1709948
37470A709948o58689n79145m58133m51016l86598K4104O28823Q76463N27939k5670
$$ 1709948 1051259 472114 13981 -437035 -823633 -799529 -170706 705757 1233696 1208026
37460A208026l09092l09283k82175l00914k58881j40396l4762L2489J03816J84904
$$ 1208026 898934 589651 307476 6562 -252319 -392715 -427477 -394988 -291172 -106268
37450a06268K43742K45899J44853m7023j60066j9637K68582M03554L10531K15057
$$ -106268 137474 383373 528226 481203 321137 301500 570082 973636 1284167 1499224
37440A499224K12578Q8472k53776n14072m26107j88120j19489j18320J16171M63563
$$ 1499224 1711802 1800274 1546498 1032426 606319 418199 298710 180390 296561 760124
37430G60124M71948P3702k55490j87486J0581m7602k62726k50175K9606K04977
$$ 760124 1232072 1305774 1050284 862798 873379 825777 563051 312876 342482 547459
37420E47459N3700j79445j52908R0800K22856J19160K681M4864P1509j32583l95266
$$ 547459 601159 421714 268806 359606 582462 701622 704303 749167 820676 688093 292827
37409B92827l54538n3532L6855k76454n34375k48321L57292O21939L53879K0385
$$ 292827 -61711 -115243 -78388 -354842 -889217 -1137538 -780246 -158307 195572 215957
37399B15957L746J06410n937k29157k23015J4567J51058M3301r7807j22890j89582
$$ 215957 219703 326113 320176 91019 -131996 -117429 33629 76930 -20877 -143767 -333349
37388c33349m07676n05776j69176L96110N92932J94054l23008l83207m2060J56865
$$ -333349 -741025 -1246801 -1415977 -1019867 -426935 -232881 -555889 -939096 -981156 -824291
37378h24291n1539l42918l09542p641J81986R2412o0973m0156R6975J50160J16424
$$ -824291 -875830 -1218748 -1528290 -1535931 -1353945 -1261533 -1322506 -1362662 -1265687 -1115527 -999103
37367i99103J72118L21544L03829k377k81239j65161J88158K75052J7694q0785
$$ -999103 -826985 -505441 -201612 -203989 -485228 -650389 -462231 -187179 -169485 -250270
37357b50270K62341N87337L47473k31671m41782q9640L02516K83410l088j65292
$$ -250270 12071 599408 946881 715210 273428 183788 486304 769714 766626 601334
37347F01334n4002K15000M29293L71754r09m14833n51960m55318l84925l43204
$$ 601334 547332 762332 1191625 1563379 1562470 1147637 595677 140359 -244566 -587770
37337e87770j38475J25065J20786q8682n0787L28322N77255M09626J37699O3249
$$ -587770 -726245 -601180 -480394 -569076 -619863 -291541 285714 695340 833039 896288
37327H96288m92k44467m19715k98644j13762r6038l5920K20498L18470L207k75649
$$ 896288 895796 651329 231614 -67030 -180792 -276830 -312750 -92252 226218 229425 -46224
37316d6224k7942M04354L70863j6666j38412M7150L5275k20088k21146J23734
$$ -46224 -74166 330188 701051 684385 545973 593123 628398 408310 187164 310898
37306C10898L09666J29461j6600J02932J80596J0376j54034j26965p8289p4007
$$ 310898 620564 750025 733425 836357 1016953 1027329 873295 746330 668041 594034
37296E94034P0794K68690J21903l47377n75130l42541j14967j73193j30720K41908
$$ 594034 664828 933518 1055421 708044 132914 -209627 -324594 -497787 -628507 -386599
37286c86599M41566P9641l33360j58143L21596L73705k4110k67338j35839Q550
$$ -386599 54967 134608 -198752 -356895 -35299 338406 314296 46958 -88881 -80331
37276h0331o5476j81920j69196n6218R8026J90283L8942k67815k49124K93040
$$ -80331 -145807 -327727 -496923 -553141 -455115 -264832 -225890 -493705 -742829 -449789
37266d49789P71902N44370j27148m76068l67055l00658m17549l13841J01110L45249
$$ -449789 322113 866483 739335 263267 -103788 -404446 -821995 -1135836 -1034726 -689477
37256f89477J64363p1504k9665R0598m23k22872l64282l64504j71624K54071O17260
$$ -689477 -525114 -596618 -626283 -535685 -536108 -758980 -1123262 -1487766 -1659390 -1405319 -788059
37245g88059M57781j21728m00107k0346M57878L87870k3498j19247J76637L19531
$$ -788059 -330278 -452006 -852113 -872459 -414581 -26711 -50209 -169456 7181 326712
37235C26712L0139l14484k55892J42429M10934K16890k99154o62821n34603n8803
$$ 326712 356851 42367 -213525 -71096 339838 556728 257574 -405247 -939850 -998653
37225i98653L18264L67060K57992K15405K20193J57329M3612m1341q9368j03419
$$ -998653 -680389 -313329 -55337 160068 380261 537590 581202 539861 450493 347074
37215C47074n7786j5723j00877k52432k32146n375J36242K1307q2861J35026N05519
$$ 347074 289288 273565 172688 -79744 -311890 -317265 -181023 -159716 -242577 -107551 397968
37204C97968N58222J37505m32420p54443p00302l76911K2662L06187L80415L12122
$$ 397968 956190 1093695 661275 -93168 -793470 -1170381 -1147719 -841532 -461117 -148995
37194a48995K26974J65265R1763n874r4153j25776o9174K8023K8906j04376j54280
$$ -148995 77979 243244 335007 329133 234980 109204 40030 68053 96959 -7417 -161697
37183a61697Q7489M02677L20047j90447n49747l16827K10139M39127K71562P9981
$$ -161697 -74208 328469 648516 458069 -91678 -408505 -198366 240761 512323 592304
37173E92304P5740R9710j1175j95119l16037k97659j25281Q9719J27779n1364
$$ 592304 668044 767754 756579 561460 245423 -52236 -177517 -87798 39981 -11383
37163a1383j77071p3783m556k43206m88942k28011L77993N73234J11189l11382
$$ -11383 -188454 -262237 -266793 -509999 -998941 -1226952 -848959 -275725 -164536 -475918
37153d75918l6890O21784Q66180M82693o4057l95779n44146n56418l02282J69814
$$ -475918 -512808 108976 975156 1457849 1393792 998013 453867 -102551 -404833 -235019
37143b35019M64511K83136j64210m13985l04669p4489M3711J10629K92288N20816
$$ -235019 229492 512628 348418 -65567 -370236 -444725 -401014 -290385 1903 522719
37133E22719N04171R7751m40439o71287m37679j0162K50491K67317K07413J71055
$$ 522719 1026890 1124641 684202 12915 -424764 -434926 -184435 82882 290295 461350
37123D61350Q6029r0931k37356k22702r8524j2632L806K7837N9797K0890m6085
$$ 461350 547379 456448 219092 -3610 -102134 -114766 -110960 -83123 -23326 -2436 -48521
37112d8521K0921J98009J84048j72303n14997l67618J67855M61407J88706k40365
$$ -48521 -27600 170409 354457 182154 -332843 -700461 -532606 -71199 117507 -122858
37102a22858k94610n0541K8271j59409k46354j0714L07895M14869L55635L14692
$$ -122858 -417468 -468009 -439738 -599147 -845501 -856215 -548320 -133451 222184 536876
37092E36876K67835Q8721j39079j90685n3501K5534j02445k69125k32291j2559
$$ 536876 804711 893432 754353 563668 510167 535701 433256 164131 -68160 -80719
37082h0719J51384J24989J0436l9920l510O1668J18745J26366L3157q6581j8664
$$ -80719 70665 195654 206090 166170 162660 224328 343073 469439 502596 416015 397351
37071C97351K81523M65911J58438m62859p68882m75793k8457L0176k02276k20205
$$ 397351 678874 1144785 1303223 840364 71482 -404311 -432768 -402592 -604868 -825073
37061h25073R2420L32758K48487J01368J84327L20743J54029k57851m94980l77637
$$ -825073 -732653 -399895 -151408 -50040 134287 455030 609059 351208 -143772 -521409
37051e21409j65031p1069P8352M58350P71852N71782o713k98911l3354K36105
$$ -521409 -686440 -757509 -679157 -220807 551045 1122827 1116114 817203 783849 1019954
37041A019954o2806o45333p80154l53990N3906J05920R0639K55133L65363K20486
$$ 1019954 957148 311815 -468339 -822329 -768423 -662503 -571864 -316731 48632 269118
37031B69118P4915J53719J91095q5275l82139k89600k6748j46334o36735r00049
$$ 269118 344033 497752 688847 603572 221433 -68167 -94915 -241249 -877984 -1778033
37021a778033n97159L98N06247P77494P44921L74378r1720k66893j08748P1571
$$ -1778033 -2375192 -2374794 -1868547 -1091053 -346132 28246 -63474 -330367 -439115 -367544
37011c67544J29143K16382L48377K94964L2930j30416n4194J9358p5328j44488
$$ -367544 -238401 -22019 326358 621322 654252 523836 469642 489000 413672 269184
37001B69184j7807J49943J71319R1844r514j42761j90750K4250L06660J94468
$$ 269184 251377 401320 572639 664483 654969 512208 321458 345708 652368 846836
36991H46836k93551n40154k38767J37537J42244L8918J80808K88845P527l04428
$$ 846836 553285 13131 -225636 -88099 54145 93063 273871 562716 570243 265815
36981B65815j10236L34001L66153K8919p1959J15941L4700l99188n62739j73774
$$ 265815 155579 489580 855733 884652 812693 928634 963334 564146 1407 -172367
36971a72367K51889K82685J68353J95273J35315j97873m25150j74700K46558K82739
$$ -172367 79522 362207 530560 725833 861148 663275 238125 63425 309983 592722
36961E92722o6708l33646k43302R6470M53901N90333L49064o9914j89880Q2517
$$ 592722 526014 192368 -50934 45536 499437 1089770 1438834 1368920 1179040 1261557
36951A261557J98084k56973q55035q85543l66369M6999J1243j97146k58644j57872
$$ 1261557 1459641 1202668 347633 -537910 -904279 -857280 -846037 -1043183 -1301827 -1459699
36941a459699N7939L68087N61887L89225J4362j10317Q6208J98503M0093n9752
$$ -1459699 -1401760 -1033673 -471786 -82561 -68199 -178516 -92308 106195 146288 86536
36931H6536J23057K80580J14345j25035q9996J8812j82716m68656k31540M89672
$$ 86536 209593 490173 604518 479483 389487 408299 225583 -243073 -474613 15059
36921A5059Q57760L50649m87401p78395m26268m6045P83k6585J59599L99743L89749
$$ 15059 872819 1223468 736067 -42328 -468596 -514641 -513858 -540443 -380844 18899 408648
36910D08648J39201j03399j86202j14504O4872K38165K12656n7941l23382l10975
$$ 408648 547849 444450 258248 143744 208616 446781 659437 601496 278114 -32861
36900c2861p8671R2694P8444k4073j21650j70935o7404K20736M36473K76073j23718
$$ -32861 -111532 -18838 59606 35533 -86117 -257052 -324456 -103720 332753 608826 485108
36889D85108k75656o309K97252K37870j11048m45472o34701o56411m22411L2407
$$ 485108 209452 203143 500395 738265 627217 181745 -452956 -1109367 -1531778 -1499371
36879a499371M02447M46138K97056J85889P0289j42114k24950Q3999N44095O09319
$$ -1499371 -1096924 -650786 -353730 -167841 -97552 -239666 -464616 -380617 163478 772797
36869G72797J69033l07312m15237k37629l8685J07514K20409K24887O1456j71513
$$ 772797 941830 634518 219281 -18348 -57033 50481 270890 495777 557233 385720
36859C85720l18417l00907j10859J81655L91673L63568J71700Q918r7611k35829
$$ 385720 67303 -233604 -344463 -162808 228865 592433 764133 773051 675440 439611
36849D39611l17646j53983J52558K36278p742k56251k52075j37677j13089r0751
$$ 439611 121965 -32018 120540 356818 349076 92825 -159250 -296927 -410016 -500767
36839e00767N2652J65533O8293j06408j30822o2318q8379j40460j4823K01069
$$ -500767 -448115 -282582 -214289 -320697 -451519 -513837 -602216 -742676 -757499 -556430
36829e56430J84684j21988l73457k57995J41869M98163N84823M14113J47083o6665
$$ -556430 -371746 -493734 -867191 -1125186 -983317 -485154 99669 513782 660865 594200
36819E94200k00842l09861l82593l34650j70999j1662R5982K11615K89154J77638
$$ 594200 393358 83497 -299096 -633746 -804745 -816407 -720425 -508810 -219656 -42018
36809d2018n5129j05541P5153J24686j14560k14361J71037O16381M97959l301
$$ -42018 -97147 -202688 -127535 -2849 -117409 -331770 -160733 455648 953607 950306
36799I50306j79868N0016P3492k87591m37401o4974K69961P0705k80439k32314
$$ 950306 770438 820454 893946 606355 168954 103980 373941 444646 164207 -68107
36789f8107L108n6066j95173J36956P48978Q52844K65595l23876m11224k89931
$$ -68107 -64999 -121065 -316238 -179282 569696 1422540 1688135 1364259 953035 663104
36779F63104l68982n01795l64075m1767J60488J97189K16996K35779J71009L9923
$$ 663104 294122 -207673 -571748 -613515 -453027 -255838 -38842 196937 367946 407869
36769D07869j03025k60901l50610j88043J79081L77271K10956J0347J41292L92605
$$ 407869 304844 43943 -306667 -494710 -315629 61642 272598 282945 424237 816842
36759H16842K83206j56444m10159k79267j41914k63530l33266J435M99208O28995
$$ 816842 1100048 943604 533445 254178 112264 -151266 -484532 -483097 16111 645106
36749F45106L08226p0072k47360l20546l53506k00657J28260K91019P0278k35172
$$ 645106 953332 883260 635900 315354 -38152 -238809 -110549 180470 250748 15576
36739A5576j82568K00243M86200M46489K44741O5513q4709j49130K3425L25076
$$ 15576 -166992 33251 519451 965940 1210681 1276194 1191485 1042355 1065780 1390856
36729A390856L42066p4931m84950m28446q1716O1025k4170P2766M09800M95433
$$ 1390856 1732922 1657991 1173041 744595 662879 723904 699734 772500 1182300 1677733
36719A677733M2009n42945o96679l98082k4679K13689L44294L11578j9154n46866
$$ 1677733 1719742 1176797 480118 82036 57357 271046 615340 926918 907764 360898
36709C60898r10064q33047l57278K41487O36674O37571L67786J88347K78426L95271
$$ 360898 -549166 -1382213 -1739491 -1498004 -861330 -223759 144027 332374 610800 1006071
36699A006071K49598j6980l3314J97424K70723M396k78551k45296k1192O2389
$$ 1006071 1255669 1238689 1205375 1402799 1673522 1677918 1399367 1154071 1132879 1195268
36689A195268m8162j61935k01394k43033k76723j99198m6472O999p0962r4454
$$ 1195268 1147106 985171 783777 540744 264021 64823 18351 25350 -45612 -140066
36679a40066N1274K19685K30014J51008J84103L28016L58542J63684q7735k06301
$$ -140066 -88792 130893 360907 511915 696018 1024034 1382576 1546260 1458525 1252224
36669A252224k51801l77865n17641m56672j94592K3874R5605K05951M39972N12378
$$ 1252224 1000423 622558 104917 -351755 -546347 -522473 -426868 -220917 219055 731433
36659G31433J62947l50520n01999j92580J43210J63645K8877O1138K71847M21352
$$ 731433 894380 543860 41861 -150719 -7509 156136 185013 246151 517998 939350
36649I39350L66903J55182j11126l23490l71482k54496j28830j15227j29042l5971
$$ 939350 1306253 1461435 1350309 1026819 655337 400841 272011 156784 27742 -8229
36639h229R2999N6450j49784k41172L4240N40070Q08359N10886j32476n20468
$$ -8229 84770 141220 -8564 -249736 -215496 324574 1132933 1643819 1511343 990875
36629I90875l32358Q2733J54672j54769l35859q1636K97650L73457J88165O0301
$$ 990875 658517 741250 895922 741153 405294 323658 621308 994765 1182930 1243231
36619A243231M2653n8362k42470k76119r3906Q3805R3919L2827M3436J15595J69948
$$ 1243231 1285884 1227522 985052 708933 615027 698832 792751 825578 869014 984609 1154557
36608A154557J54858O553k94695n67357n29598j57961K20372K96966J06299j02996
$$ 1154557 1309415 1315968 1021273 453916 -75682 -233643 -13271 283695 389994 286998
36598B86998j71345r9660M5230J70930J96277J46583J34842J84979J81474O5696
$$ 286998 115653 15993 61223 232153 428430 575013 709855 894834 1076308 1142004
36588A142004m4674l4574K5315k335j10675j91751k30800l19614m82373n83880
$$ 1142004 1097330 1062756 1088071 1085736 975061 783310 552510 232896 -249477 -833357
36578h33357m39554j3789M64466O26538L30384r5819j51329K28182N40120L21179
$$ -833357 -1272911 -1286700 -822234 -195696 134688 38869 -112460 115722 655842 977021
36568I77021k76136o88974o05899k18414J13833K18137J27224m2711j45834o4864
$$ 977021 700885 11911 -593988 -812402 -698569 -480432 -353208 -395919 -541753 -606617
36558f06617J80733M12403M25960J67401j90866l54030j71901J65230L05778J70916
$$ -606617 -425884 -13481 412479 579880 389014 34984 -136917 28313 334091 505007
36548E05007O7859K50388N14353M40950k8286m90781n65927k85501L6474J55569
$$ 505007 572866 823254 1337607 1778557 1750271 1259490 693563 408062 444536 600105
36538F00105N2426j31422k25156j59155j1852J01613J60996J95364J66299L0297
$$ 600105 652531 521109 295953 136798 124946 226559 387555 582919 749218 779515
36528G79515j09490p7215J25314K86911K50869Q4999o1855j48940k12466k42623
$$ 779515 670025 592810 718124 1005035 1255904 1340903 1279048 1130108 917642 675019
36518F75019j92173p7191k392o7799k38423l14482j11879K80369N30029M48415
$$ 675019 482846 405655 403263 335464 97041 -217441 -329320 -48951 481078 929493
36508I29493K30427J57609J83932M4554k99012n91649o46843n14486k88069k4074
$$ 929493 1159920 1317529 1501461 1546015 1247003 655354 8511 -505975 -794044 -818118
36498h18118J32671O0806m9328J28724M92777N14995L223n27409n27536j14651
$$ -818118 -685447 -624641 -673969 -545245 -52468 462527 465750 -61659 -589195 -703846
36488g03846K32634L55371L74995K54074r2738m07085l31275J1882J69763O0960
$$ -703846 -471212 -115841 259154 513228 420490 13405 -317870 -305988 -136225 -75265
36478g5265K3150J48137J18661j69314l56365k12392l395K493m8584J0473q355
$$ -75265 -52115 96022 214683 45369 -310996 -523388 -526783 -524290 -572874 -562401 -570756
36467e70756k24137k72451J70308P15138O85116R3682l57568k55266P0077J56670
$$ -570756 -794893 -1067344 -897036 -181898 503218 596900 239332 -15934 54143 210813
36457B10813Q990j09575j12564p7869m8022n4402j58881l07429l10939j12628
$$ 210813 219803 110228 -2336 -80205 -128227 -182629 -341510 -648939 -959878 -1072506
36447a072506R8332J77913K43109M23574N73399M54489J01872k04237k67647j06111
$$ -1072506 -974174 -796261 -553152 -129578 443821 898310 1000182 795945 528298 422187
36437D22187J65575L87155L54368j735m38021o02275m33213j81048k2586J24557
$$ 422187 587762 974917 1329285 1327550 889529 287254 -145959 -327007 -349593 -225036
36427b25036L42171M95389M23139J80567p1237k84099m48039m15848n4454M47955
$$ -225036 117135 612524 1035663 1216230 1144993 860894 412855 -2993 -57447 390508
36417C90508O72625M39182R774k48979k50273j46520o3639j7053O382J8012K0217
$$ 390508 1063133 1502315 1512089 1263110 1012837 866317 802678 785625 792007 810019 830236
36406H30236n5221k97083o00413o52136l15662R6287J81486J867k1461K44371
$$ 830236 775015 477932 -122481 -774617 -1090279 -993992 -812506 -810639 -832100 -587729
36396e87729M42422K73422o9522k10897j01254K0509J7821k6699m405R3216J86363
$$ -587729 -145307 128115 58593 -152304 -253558 -233049 -215228 -241927 -246332 -153116 33247
36385C3247J35462j27289l95494l14881J14357L86451J12047m03224n49972k41030
$$ 33247 168709 41420 -354074 -668955 -554598 -168147 -56100 -459324 -1009296 -1250326
36375a250326P4997J62088K61096N09972N85905K06663l42328n19926k05103K12712
$$ -1250326 -1175329 -1013241 -752145 -242173 343732 550395 208067 -311859 -516962 -304250
36365c04250L31234J19995j30044r6748K67330O20141N20912o9436o92625q84750
$$ -304250 26984 146979 16935 -79813 187517 807658 1328570 1259134 566509 -318241
36355c18241o25448k08250J43153L57517L78095J85152q3807k17303j45248J1642
$$ -318241 -943689 -1151939 -1008786 -651269 -273174 -88022 -171829 -389132 -534380 -522738
36345e22738Q4670J3237q3149K711K85206M50333K33045j01423j8914M61112O54743
$$ -522738 -438068 -424831 -507980 -505269 -220063 230270 463315 361892 342978 804090 1458833
36334A458833J78789m15257m01297P1482K42036j41669n69168o04837l89450j86097
$$ 1458833 1637622 1222365 821068 892550 1134586 992917 423749 -181088 -570538 -756635
36324g56635N2294M08435O69626N73986J92179j54157k42105j06757L1799m6172
$$ -756635 -704341 -295906 373720 947706 1139885 985728 743623 636866 668665 622493
36314F22493l21278m96785l58222r4424k2566r4394j9161J88552K21540O1048
$$ 622493 301215 -195570 -553792 -648216 -670782 -765176 -784337 -595785 -374245 -313197
36304c13197N8936L07858M11713J18458k50494k99154j13755n57K402R194k7826
$$ -313197 -254261 53597 465310 583768 333274 34120 -79635 -80192 -77790 -68596 -96422
36293i6422j60655k24289j16514n4575k04094l12490j11412J62249J10771j51587
$$ -96422 -257077 -481366 -597880 -652455 -856549 -1169039 -1280451 -1118202 -1007431 -1159018
36283a159018j75209R4941K85742K45716K13480L13161L69051K98381K35849J69226
$$ -1159018 -1334227 -1239286 -953544 -707828 -494348 -181187 187864 486245 722094 891320
36273H91320r7421m69078m95650k4385M48776L71406j70491o08888n65034j55152
$$ 891320 793899 324821 -170829 -195214 253562 624968 454477 -154411 -719445 -874597
36263h74597K24953K50889o9210l69395k92968N9074K39208O4834j44348n6467
$$ -874597 -649644 -398755 -467965 -837360 -1130328 -1071254 -832046 -767212 -911560 -968027
36253i68027K22424L80985L49036K69867J93090N2328j27530k15695j58777n7222
$$ -968027 -745603 -364618 -15582 254285 447375 499703 372173 156478 -2299 -59521
36243e9521o5940k54010n05011n65791l12833N1337K33018K38098K88507L81623
$$ -59521 -125461 -379471 -884482 -1450273 -1763106 -1711769 -1478751 -1240653 -952146 -570523
36233e70523K75245l4538k08950r8402m533j74769l78531k88932M246J98797K51419
$$ -570523 -295278 -329816 -538766 -637168 -641701 -816470 -1195001 -1483933 -1479687 -1280890 -1029471
36222a029471K86217K38867j5958l15130l61488j50486P5985K06215K78947K48426
$$ -1029471 -743254 -504387 -520345 -835475 -1196963 -1347449 -1271464 -1065249 -786302 -537876
36212e37876P4282o1852R037J03160k2163j50908J18605O19443P00280J76039
$$ -537876 -463594 -525446 -516409 -413249 -435412 -586320 -467715 151728 852008 1028047
36202A028047l39235k77568J57736L99966K78184M0555r8618j03117J830J06744
$$ 1028047 688812 411244 568980 968946 1247130 1287685 1189067 1085950 1087780 1194524
36192A194524L3073j96912k76917l7504K27981J28444k72294n50809m86115k56000
$$ 1194524 1227597 1030685 753768 716264 944245 1072689 800395 249586 -236529 -492529
36182d92529j10180r0857r1708k0617J17856K11136J49003N419p809J45728K36607
$$ -492529 -602709 -693566 -785274 -805891 -688035 -476899 -327896 -322477 -330286 -184558 52049
36171E2049J35225N7419K12841L99677K69635j20786l79388l51726k53527k09902
$$ 52049 187274 244693 457534 857211 1126846 1006060 626672 274946 21419 -188483
36161a88483n9199K46628M06521J89065j55227j90248J21583L99659L63661J31520
$$ -188483 -247682 -1054 405467 594532 439305 249057 370640 770299 1133960 1265480
36151A265480k7626m4342n9513j92806m12183o07703p01462o51830m17410q718
$$ 1265480 1237854 1193512 1133999 941193 529010 -78693 -780155 -1431985 -1849395 -1858113
36141a858113M30028O91796O96074N21648K33995j55582m75168l73753K17669
$$ -1858113 -1428085 -736289 -40215 481433 715428 559846 84678 -289075 -71406
36132g1406P55889N96264j51635o55171l83767K31446M02861r958m25911l39133
$$ -71406 684483 1280747 1129112 473941 90174 321620 724481 714523 288612 -50521
36122e0521J38142N17235M61766M3449l47485l28091R2744M63711L69961p6774
$$ -50521 87621 604856 1066622 1110071 762586 434495 527239 990950 1360911 1284137
36112A284137m05824l94355k56306k19030k05989n8998J66689L02269K92343J66335
$$ 1284137 878313 483958 227652 8622 -197367 -256365 -89676 212593 504936 671271
36102F71271o4028l18172l99948k15849P0108K54158L30721L42347J70473k54436
$$ 671271 607243 289071 -110877 -326726 -256618 -2460 328261 670608 841081 586645
36092E86645o58312o61908k75818J37487L57295M32054L50458K3266l21150k04284
$$ 586645 -71667 -733575 -1009393 -871906 -514611 -82557 267901 291167 -29983 -234267
36082b34267L85164P59686L89359l33485o25361l68395j22272j96450k78510o1374
$$ -234267 150897 910583 1299942 966457 341096 -27299 -149571 -346021 -624531 -685905
36072f85905K62595L50840J98022L8841Q028Q8426J97015J83407m1598k66479
$$ -685905 -423310 -72470 125552 164393 172421 260847 457862 641269 599671 333192
36062C33192j47913K36250L47487n1345m51194k95145J82929L25696O0860p2835
$$ 333192 185279 421529 769016 717671 266477 -28668 154261 479957 540817 467982
36052D67982J17024J59550k37416o25509m86856k6131J86180O4181k7682Q470
$$ 467982 585006 744556 507140 -118369 -605225 -631356 -445176 -380995 -408677 -400207
36042d00207j00053l68892l83636L6416M34108K98370k13479m77142j90001L48034
$$ -400207 -500260 -869152 -1252788 -1216372 -782264 -483894 -697373 -1174515 -1364516 -1016482
36032a016482O85439O73272M54204K28621J06965N7139n5023k86105m82757m44216
$$ -1016482 -331043 342229 796433 1025054 1132019 1189158 1134135 848030 365273 -78943
36022g8943k00280J8717Q5298Q2197R7748J10389J17165J56858J30114j42959
$$ -78943 -279223 -260506 -175208 -93011 4737 115126 232291 389149 519263 376304
36012C76304n37806n87045j00634M17076L53354j56117m11667j56423J19479J4412
$$ 376304 -161502 -748547 -849181 -432105 -78751 -234868 -646535 -802958 -683479 -669067
36002f69067j66634K6126L99390L75169j43229o39224o85659l68392K5655L52829
$$ -669067 -835701 -809575 -410185 -35016 -178245 -817469 -1503128 -1871520 -1845865 -1493036
35992a493036N25922M31489J43135k9728P4326K23979J49636l1556j1757K00064
$$ -1493036 -967114 -535625 -392490 -422218 -347892 -123913 25723 -5833 -17590 182474
35982A82474K74465N6605k18474k76456j41176j4286j895q8581k29967l21423
$$ 182474 456939 513544 295070 18614 -122562 -136848 -138743 -227324 -457291 -778714
35972g78714k03282J20149L54014K15189j66617l61837j80743J02033J37642o5201
$$ -778714 -981996 -861847 -507833 -292644 -459261 -821098 -1001841 -899808 -762166 -827367
35962h27367k22032j44180J19422M08371N60878M70775J97138k8563n4699j2776
$$ -827367 -1049399 -1193579 -1074157 -665786 -104908 365867 563005 534442 479743 466967
35952D66967r4178j93619m0437L03968L96959J4628m62375n11481j49321J38320
$$ 466967 372789 179170 138733 442701 839660 854288 391913 -119568 -268889 -130569
35942a30569P2140j22301j24432N4596J91245J94001J34953M5514j04090k32010
$$ -130569 -58429 -180730 -305162 -250566 -59321 134680 269633 315147 211057 -20953
35932b0953j57306J19994K95714R5677l03234l90880M7525N83729O16226J16500
$$ -20953 -178259 -58265 237449 333126 29892 -360988 -313463 270266 886492 1002992
35922A002992l27449k44639J75901M09392K73792N6702M0130J47210J19598j19464
$$ 1002992 675543 430904 606805 1016197 1289989 1346691 1386821 1534031 1653629 1534165
35912A534165l85773m45900k25781J61486N24782P13992O70961M35197J51545
$$ 1534165 1148392 702492 476711 638197 1162979 1876971 2547932 2983129 3134674
35903C134674K5768J56680L87131M27154J75818j77482m21644n55017o42518n91755
$$ 3134674 3160442 3317122 3704253 4131407 4307225 4129743 3708099 3153082 2510564 1918809
35893A918809k76678J73681M28092L27988N6134j13485j13727q0014j34940k34101
$$ 1918809 1642131 1815812 2243904 2571892 2628026 2514541 2400814 2320800 2185860 1951759
35883A951759k05546M5462L52441L96662Q7676k64086l06572j03031l1460k55352
$$ 1951759 1746213 1791675 2144116 2540778 2628454 2364368 2057796 1954765 1923305 1667953
35873A667953n17815n03593k11007J10733K40594J33076p7209j59831o227J96456
$$ 1667953 1150138 646545 435538 546271 786865 919941 842732 682901 676674 873130
35863H73130J51752j52541m03951l58017q0953K43164N00291N45104K08092l77920
$$ 873130 1024882 872341 468390 110373 29420 272584 772875 1317979 1526071 1148151
35853A148151p06375m51532O4371K68530Q3577p2807K6368J41980N4461o9128
$$ 1148151 441776 -9756 54615 323145 406722 333915 360283 502263 556724 487596
35843D87596j1954Q5667l7985k95532l57412j83170r9250k57864l33661k876M77565
$$ 487596 475642 561309 523324 227792 -129620 -312790 -412040 -669904 -1003565 -1006441 -528876
35832e28876N23849L6685m06780l18091O0772J64229p2951k00427Q124K42361
$$ -528876 -5027 31658 -375122 -693213 -632441 -468212 -541163 -741590 -733466 -491105
35822d91105J85636k6549r2767K794Q2883J01544J05276M0649j21052k03214n4716
$$ -491105 -305469 -332018 -424785 -421991 -339108 -237564 -132288 -91639 -212691 -415905 -470621
35811d70621J49360J40365k952Q071J38687L5410l67319o34556m16447N0576K74221
$$ -470621 -321261 -180896 -183848 -175777 -37090 -1680 -368999 -1003555 -1420002 -1369426 -1095205
35800a095205J38077n6451o5167M2302R1168N9948N4801J24539J92783J77019
$$ -1095205 -957128 -1013579 -1078746 -1036444 -945276 -885328 -830527 -705988 -513205 -336186
35790c36186J14286R1386O5146r8353l33346l15350J03533N50318N26469Q7060
$$ -336186 -221900 -130514 -65368 -163721 -497067 -812417 -708884 -158566 367903 454963
35780D54963k24206j38902K6269m2528j49102M6114M30967N65937K72018k04770
$$ 454963 230757 91855 118124 75596 -73506 -27392 403575 969512 1241530 1036760
35770A036760n34746n55299k65829J55922L77820K18397q2652j35774P6443K11526
$$ 1036760 502014 -53285 -319114 -163192 214628 433025 350373 214599 291042 502568
35760E02568J05842q203P5092J84323N4129k25658k99593m0679K49970J87917
$$ 502568 608410 600207 675299 859622 913751 688093 388500 347821 597791 785708
35750G85708k51416o97106p66108m35235k382K83707M37742N41953N05945K15456
$$ 785708 534292 -162814 -928922 -1364157 -1366539 -1082832 -645090 -103137 402808 618264
35740F18264j61709k78080n4854J97538K01186N2305k212M0448k6144k69044n05931
$$ 618264 456555 178475 123621 321159 522345 574650 572438 612886 586742 317698 -188233
35729a88233n43763l84410j77364o6934q9994j45034p5683J38576L10226K61062
$$ -188233 -731996 -1116406 -1293770 -1360704 -1450698 -1595732 -1671415 -1532839 -1222613 -961551
$$ [...]
##END NTUPLES=NMR SPECTRUM
##END=
