##TITLE=31Pdec_DE-18kwshTFA
  CDCl3
  24 sc
 25.9.2023
##JCAMPDX= 6.0         $$ Bruker NMR JCAMP-DX V2.0
##DATA TYPE= NMR SPECTRUM
##DATA CLASS= NTUPLES
##ORIGIN= UXNMR, Bruker Analytische Messtechnik GmbH
##OWNER= root
$$ XWIN-NMR		Version 3.5
$$ Wed Sep 27 16:32:38 2023 Russian Standard Time (UT+4h)  she@DPX200
##.OBSERVE FREQUENCY= 81.013821
##.OBSERVE NUCLEUS= ^31P
##.ACQUISITION MODE= SIMULTANEOUS
##.ACQUISITION SCHEME= undefined
##.AVERAGES= 24
##.DIGITISER RES= 16
##SPECTROMETER/DATA SYSTEM= spect
##.PULSE SEQUENCE= zgpg30
##.SOLVENT NAME= CDCl3
##.SHIFT REFERENCE= (INTERNAL, CDCl3, 0, 248.564)
##AUDIT TRAIL= $$ (NUMBER, WHEN, WHO, WHERE, WHAT)
$$ ##TITLE= Audit trail, XWIN-NMR		Version 3.5
$$ ##JCAMPDX= 5.01
$$ ##ORIGIN= Bruker BioSpin GmbH
$$ ##OWNER= she
$$ F:/spectra/data/she/nmr/P31/1/pdata/1/auditp.txt
$$ ##AUDIT TRAIL=  $$ (NUMBER, WHEN, WHO, WHERE, WHAT)
(   1,<2023-09-27 16:31:47.98 +0400>,<she>,<DPX200>,
      <created by zg, POWCHK disabled, PULCHK disabled
       configuration hash MD5:
       00 E9 B6 7A A2 85 ED C7 34 08 36 98 17 FE 4E 26
       data hash MD5: 32K
       DA B9 4B 69 E8 69 E4 D4 60 EC 98 4A 50 92 F5 EA>)
(   2,<2023-09-27 16:31:50.60 +0400>,<she>,<DPX200>,
      <Start of raw data processing
       efp BC_mod = 2 LB = 5 FT_mod = 6 PKNL = 1 PHC0 = -10632.09 PHC1 = 25.68629 SI = 64K 
       data hash MD5: 64K
       C0 91 4B D2 7B 33 FD 51 11 B5 9B 5E 3D E0 2B 32>)
(   3,<2023-09-27 16:32:04.85 +0400>,<she>,<DPX200>,
      <pk PHC0 = -1.44522 PHC1 = 0 
       data hash MD5: 64K
       29 82 60 E4 4B 95 E7 65 21 9C C0 23 20 50 66 DC>)
(   4,<2023-09-27 16:32:08.07 +0400>,<she>,<DPX200>,
      <abs ABSG = 5 
       data hash MD5: 64K
       AC 06 1A 70 58 A6 06 9A 0F 3F 4B B2 30 2F D8 9F>)
$$ ##END=
$$ 
$$ hash MD5
$$ BD DD DF C4 20 B8 21 B7 CA 53 19 AF AA 2F C6 13
##$RELAX= 
##$RELAX= 
##$RELAX= 
##$RELAX= 
##$RELAX= 
##$RELAX= 
##$RELAX= 
##$RELAX= 
##$RELAX= 
$$ Bruker specific parameters
$$ --------------------------
##$DU= <F:/spectra>
##$EXPNO= 1
##$NAME= <P31>
##$PROCNO= 1
##$TYPE= <nmr>
##$USER= <she>
##$AMP= (0..31)
100 100 100 100 100 100 100 100 100 100 100 100 100 100 100 100 100 100 
100 100 100 100 100 100 100 100 100 100 100 100 100 100 
##$AQSEQ= 0
##$AQ_mod= 1
##$AUNM= <au_zg>
##$AUTOPOS= <>
##$BF1= 81.014009
##$BF2= 200.13
##$BF3= 200.13
##$BF4= 200.13
##$BF5= 200.13
##$BF6= 200.13
##$BF7= 200.13
##$BF8= 200.13
##$BYTORDA= 1
##$CFDGTYP= 0
##$CFRGTYP= 5
##$CHEMSTR= <none>
##$CNST= (0..31)
1 1 145 1 1 1 1 1 1 1 1 1 1 1 1 1 1 1 1 1 1 1 1 1 1 1 1 1 1 1 1 1 
##$CPDPRG= <waltz16>
##$CPDPRG1= <>
##$CPDPRG2= <waltz16>
##$CPDPRG3= <>
##$CPDPRG4= <mlev>
##$CPDPRG5= <mlev>
##$CPDPRG6= <mlev>
##$CPDPRG7= <mlev>
##$CPDPRG8= <mlev>
##$CPDPRGB= <>
##$CPDPRGT= <>
##$D= (0..31)
0 1 0 0 0 0 0 0 0 0 0 0.03 2e-05 3e-06 0 0 0 0 0 0 0 0 0 0 0 0 0 0 0 0 
0 0 
##$DATE= 1695817907
##$DBL= (0..7)
120 120 120 11 120 120 24 19 
##$DBP= (0..7)
150 150 150 150 150 150 150 150 
##$DBP07= 0
##$DBPNAM0= <>
##$DBPNAM1= <>
$$ [...]
##$SUBNAM3= <"">
##$SUBNAM4= <"">
##$SUBNAM5= <"">
##$SUBNAM6= <"">
##$SUBNAM7= <"">
##$SUBNAM8= <"">
##$SUBNAM9= <"">
##$SW= 501.771253377433
##$SWIBOX= (0..15)
0 1 3 0 0 0 0 0 0 0 0 0 0 0 0 0 
##$SW_h= 40650.406504065
##$TD= 32768
##$TD0= 1
##$TE= 0
##$TE2= 300
##$TE3= 300
##$TEG= 300
##$TL= (0..7)
0 120 53 12 22 120 120 120 
##$TP= (0..7)
150 150 150 150 150 150 150 150 
##$TP07= 0
##$TPNAME0= <>
##$TPNAME1= <>
##$TPNAME2= <>
##$TPNAME3= <>
##$TPNAME4= <>
##$TPNAME5= <>
##$TPNAME6= <>
##$TPNAME7= <>
##$TPOAL= (0..7)
0.5 0.5 0.5 0.5 0.5 0.5 0.5 0.5 
##$TPOFFS= (0..7)
0 0 0 0 0 0 0 0 
##$TUNHIN= 0
##$TUNHOUT= 0
##$TUNXOUT= 0
##$USERA1= <user>
##$USERA2= <user>
##$USERA3= <user>
##$USERA4= <user>
##$USERA5= <user>
##$V9= 5
##$VALIST= <valist>
##$VCLIST= <CCCCCCCCCCCCCCC>
##$VD= 0
##$VDLIST= <DDDDDDDDDDDDDDD>
##$VPLIST= <PPPPPPPPPPPPPPP>
##$VTLIST= <TTTTTTTTTTTTTTT>
##$WBST= 1024
##$WBSW= 4
##$XGAIN= (0..3)
0 0 0 0 
##$XL= 0
##$YL= 0
##$YMAX_a= 2072
##$YMIN_a= -2061
##$ZGOPTNS= <>
##$ZL1= 120
##$ZL2= 120
##$ZL3= 120
##$ZL4= 120
##$ABSF1= 248.5645
##$ABSF2= -253.2056
##$ABSG= 5
##$ABSL= 3
##$ALPHA= 0
##$AQORDER= 0
##$ASSFAC= 0
##$ASSFACI= 0
##$ASSFACX= 0
##$ASSWID= 0
##$AUNMP= <proc_1d>
##$AZFE= 0.1
##$AZFW= 0.5
##$BCFW= 0
##$BC_mod= 2
##$BYTORDP= 0
##$COROFFS= 0
##$CY= -3
##$DATMOD= 1
##$DC= 0
##$DFILT= <>
##$DTYPP= 0
##$F1P= 0
##$F2P= 0
##$FCOR= 1
##$FTSIZE= 65536
##$FT_mod= 6
##$GAMMA= 0
##$GB= 0
##$INTBC= 1
##$INTSCL= 6.047779e-11
##$ISEN= 30
##$LB= 5
##$LEV0= 0
##$LPBIN= 0
##$MAXI= 10000
##$MC2= 0
##$MEAN= 0
##$ME_mod= 0
##$MI= 50
##$NCOEF= 0
##$NC_proc= -8
##$NLEV= 6
##$NOISF1= 182.463
##$NOISF2= 159.3651
##$NSP= 0
##$NTH_PI= 0
##$NZP= 0
##$OFFSET= 248.5645
##$PC= 4
##$PHC0= -10633.54
##$PHC1= 25.68629
##$PH_mod= 1
##$PKNL= yes
##$PPARMOD= 0
##$PSCAL= 0
##$PSIGN= 0
##$REVERSE= no
##$SF= 81.0140089999694
##$SI= 65536
##$SIGF1= 159.3651
##$SIGF2= -187.1042
##$SINO= 113.3802
##$SIOLD= 16384
##$SREGLST= <1H.CDCl3>
##$SSB= 0
##$STSI= 65536
##$STSR= 0
##$SW_p= 40650.406504065
##$SYMM= 0
##$S_DEV= 0
##$TDeff= 32768
##$TDoff= 0
##$TI= <>
##$TILT= no
##$TM1= 0
##$TM2= 0
##$TOPLEV= 0
##$USERP1= <user>
##$USERP2= <user>
##$USERP3= <user>
##$USERP4= <user>
##$USERP5= <user>
##$WDW= 1
##$XDIM= 65536
##$YMAX_p= 268545704
##$YMIN_p= -16440635
$$ End of Bruker specific parameters
$$ ---------------------------------
##NTUPLES= NMR SPECTRUM
##VAR_NAME=  FREQUENCY,     SPECTRUM/REAL,   SPECTRUM/IMAG
##SYMBOL=    X,             R,               I
##VAR_TYPE=  INDEPENDENT,   DEPENDENT,       DEPENDENT
##VAR_FORM=  AFFN,          ASDF,            ASDF
##VAR_DIM=   65536,         65536,           65536
##UNITS=     HZ,            ARBITRARY UNITS, ARBITRARY UNITS
##FACTOR=    0.620285442955139, 1,           1
##FIRST=     20137.2065510682, 0,            0
##LAST=      -20513.1999529968, 0,           0
##MIN=       -20513.1999529968, -16440635,   0
##MAX=       20137.2065510682, 268545704,    0
$$ Real data points
##PAGE= N=1
##DATA TABLE= (X++(R..R)), XYDATA
$$ [...]
45914 -59867 174795 242071 101614 -197808 -487746 -628147 -646946 -673290 -780716 -961298
45904 -961298 -1199072 -1473034 -1712602 -1849824 -1922676 -2047423 -2272274 -2521295 -2699020 -2794181
45894 -2794181 -2860016 -2938086 -3022905 -3073147 -3054250 -2998923 -3007456 -3130259 -3257265 -3200831 -2913684
45883 -2913684 -2564111 -2363028 -2364790 -2463035 -2518072 -2432980 -2150895 -1656753 -991607 -233316
45873 -233316 534373 1216475 1698745 1894731 1811670 1551884 1247265 992969 811766 642147
45863 642147 367444 -99156 -730878 -1390737 -1923404 -2246680 -2370785 -2354198 -2246102 -2052487
45853 -2052487 -1739930 -1274268 -673118 -36955 472758 710205 632488 332797 -3961 -182442
45843 -182442 -65955 376000 1045373 1750679 2305495 2619971 2712789 2663529 2571313 2529472
45833 2529472 2593127 2761958 3001804 3254986 3404497 3285168 2827537 2199113 1714932 1557495
45823 1557495 1627948 1702695 1678692 1611385 1556479 1451776 1159969 589885 -218057 -1089598
45813 -1089598 -1804103 -2225513 -2369274 -2347470 -2268789 -2194714 -2145569 -2106131 -2046427 -1969183 -1905177
45802 -1905177 -1819009 -1563096 -1011265 -239896 498017 998351 1247339 1330206 1289999 1140428
45792 1140428 956272 853292 875152 960534 1028623 1043180 977243 773911 398904 -76018
45782 -76018 -482257 -664623 -582077 -313369 11189 280488 437710 482758 451695 384525
45772 384525 307778 249242 253974 351702 491809 535818 353145 -64387 -593231 -1079323 -1434707
45761 -1434707 -1646262 -1730226 -1703466 -1585831 -1410068 -1229707 -1116486 -1126264 -1250409 -1422763
45751 -1422763 -1603203 -1835988 -2180124 -2581408 -2865468 -2887955 -2664827 -2332871 -2018520 -1783383
45741 -1783383 -1657157 -1640040 -1658114 -1587573 -1378656 -1134643 -1026878 -1129143 -1344486 -1478134
45731 -1478134 -1373938 -1013872 -518840 -41209 362740 737581 1099573 1357912 1422224 1357453
45721 1357453 1352219 1521594 1795500 2009672 2046473 1868170 1482688 936749 318309 -277034
45711 -277034 -774061 -1104018 -1209757 -1111658 -949168 -914647 -1143389 -1668092 -2429906 -3287466
45701 -3287466 -4051337 -4582383 -4867718 -4967997 -4903658 -4641361 -4185843 -3626403 -3075281 -2596925
45691 -2596925 -2201351 -1856211 -1489960 -1042001 -556333 -194212 -104469 -285933 -605806 -943433
45681 -943433 -1287435 -1700151 -2220889 -2809762 -3360575 -3755835 -3924464 -3863602 -3611472 -3207681
45671 -3207681 -2690677 -2128695 -1628270 -1288608 -1142461 -1149817 -1253328 -1433788 -1709545 -2096965
45661 -2096965 -2587654 -3150590 -3719267 -4166767 -4335460 -4140560 -3651992 -3058120 -2548404
45652 -2548404 -2228215 -2103467 -2093080 -2059548 -1881341 -1527057 -1053826 -548086 -102757 170229
45642 170229 194530 43884 -54245 98852 492455 938739 1252699 1349120 1201048 811243
45632 811243 268013 -235611 -509267 -496043 -284011 -10773 227531 411034 588625 828096
45622 828096 1131227 1386422 1429242 1166840 645019 5147 -609724 -1120293 -1519913 -1836579
45612 -1836579 -2079217 -2219792 -2234443 -2147256 -2003632 -1801429 -1486871 -1040334 -540928 -116025
45602 -116025 164170 317813 383732 350361 163138 -204670 -689844 -1144955 -1419204 -1454404
45592 -1454404 -1306594 -1071347 -799796 -496687 -174937 127939 387993 611116 791595
45583 791595 875939 791372 508978 77567 -390590 -767706 -974827 -1022137 -973333 -853533
45573 -853533 -605888 -157984 480655 1206500 1891792 2435563 2754386 2773764 2467748 1904160
45563 1904160 1232417 619457 188542 -8501 5735 148143 315407 445332 555174 711317
45553 711317 949132 1227612 1474462 1669068 1859488 2090835 2329744 2465343 2379009 2027291
45543 2027291 1492584 960103 600178 432043 321094 148124 -32721 -52777 151339 428115
45533 428115 550091 429456 160587 -126650 -402784 -721102 -1108076 -1503374 -1796190 -1899423
45523 -1899423 -1799915 -1569619 -1340367 -1246834 -1365636 -1691392 -2152552 -2631224 -2981832 -3089870
45513 -3089870 -2963634 -2755093 -2638112 -2644355 -2636179 -2444810 -2016632 -1432955 -829119 -306599
45503 -306599 116194 494169 874260 1211441 1406657 1455887 1516012 1770307 2250598 2833203
45493 2833203 3372521 3771643 3955585 3891355 3673202 3501014 3497034 3569652 3505826 3177207
45483 3177207 2621738 1959322 1287847 652767 61768 -485311 -953647 -1267063 -1388212
45474 -1388212 -1408059 -1498579 -1736978 -2001500 -2077049 -1855777 -1414707 -920554 -500425 -195237
45464 -195237 23777 232113 515845 908791 1357960 1772806 2107649 2372283 2564710 2633310
45454 2633310 2531461 2292594 2029295 1867725 1894143 2133256 2523172 2899502 3057689 2899393
45444 2899393 2541371 2251241 2232696 2457503 2723351 2886421 3015436 3294479 3795442 4387068
45434 4387068 4857036 5061660 4936136 4427721 3498739 2199233 698311 -762414 -1940647
45425 -1940647 -2666263 -2917031 -2837942 -2639336 -2440711 -2213405 -1866687 -1368444 -792428 -281212
45415 -281212 41955 168770 228888 386635 694692 1058540 1333801 1425647 1307716 1017145
45405 1017145 669557 428457 393404 514436 644543 674611 602019 485584 370171 264353
45395 264353 173372 136601 219764 459013 819310 1229790 1658499 2119160 2591530 2972151
45385 2972151 3142257 3076954 2863568 2619487 2413437 2259274 2153881 2099672 2089969 2082504
45375 2082504 2006474 1817412 1547503 1286446 1111398 1049380 1094334 1214372 1326356 1310727
45365 1310727 1100984 750030 375806 45041 -266432 -607929 -976979 -1303325 -1481232
45356 -1481232 -1421703 -1114969 -666670 -249161 23176 185037 373780 677764 1035865 1302363
45346 1302363 1406412 1418203 1446807 1509874 1543604 1517230 1473163 1438233 1346458 1089698 628346
45335 628346 30072 -583425 -1107884 -1494109 -1745814 -1885899 -1920906 -1847305 -1696204 -1557006
45325 -1557006 -1544809 -1738094 -2122476 -2566341 -2873938 -2926170 -2792957 -2672096 -2699610 -2845284
45315 -2845284 -2986570 -3020281 -2881680 -2535467 -2028116 -1524374 -1218722 -1187899 -1340012 -1493613
45305 -1493613 -1502308 -1353261 -1188885 -1202323 -1462316 -1846872 -2165937 -2316500 -2301702 -2170699
45295 -2170699 -2009505 -1939084 -2022914 -2180471 -2266150 -2229815 -2128488 -1986235 -1732116 -1301922
45285 -1301922 -729729 -105006 503758 1048948 1482519 1786385 1999831 2177010 2322286
45276 2322286 2382461 2297556 2068538 1802359 1678933 1822656 2189451 2610060 2948255 3182229
45266 3182229 3338017 3408628 3372389 3256225 3153643 3194867 3485574 4010246 4569700 4872157
45256 4872157 4746722 4267190 3655890 3087617 2587627 2067980 1425628 630587 -246535
45247 -246535 -1091296 -1820038 -2372523 -2657235 -2588662 -2211706 -1723850 -1317174 -1026004 -759663
45237 -759663 -438270 -48950 392713 875120 1392408 1944876 2514688 3012505 3288103 3249808
45227 3249808 2964124 2606818 2335816 2228846 2283875 2412922 2470764 2369563 2159045 1932852
45217 1932852 1671414 1254428 631525 -97913 -798949 -1429752 -2020227 -2571418 -3021746
45208 -3021746 -3294071 -3349723 -3209440 -2934036 -2570694 -2117058 -1559270 -940781 -362665 81844
45198 81844 342665 402332 296284 151910 132961 299015 559839 798696 989930 1155031
45188 1155031 1264806 1263748 1161643 1016915 833764 557117 184431 -195793 -515453 -812991
45178 -812991 -1152560 -1501289 -1754005 -1861425 -1870071 -1838519 -1777211 -1684709 -1583942 -1488611 -1376265
45167 -1376265 -1234018 -1097898 -1000656 -903123 -730384 -468502 -173206 118300 424672 746179
45157 746179 1004495 1102339 1021402 822458 558768 221593 -232841 -828517 -1537140 -2270965
45147 -2270965 -2901915 -3312017 -3446206 -3323655 -3007377 -2571124 -2084566 -1605345 -1167999
45138 -1167999 -776076 -409007 -51782 264532 456731 449282 247703 -68711 -431960 -830887
45128 -830887 -1254447 -1625962 -1834708 -1819863 -1591564 -1186071 -644967 -35768 555864 1075951
45118 1075951 1521242 1900626 2206324 2436270 2612870 2746210 2782786 2611524 2135350 1361634
45108 1361634 457119 -287313 -604565 -427716 66629 606525 1018354 1277704 1415630
45099 1415630 1438642 1347602 1177029 974538 766949 580171 465586 455487 496700 475492
45089 475492 316385 23100 -367334 -803796 -1178877 -1349594 -1265532 -1032367 -787705 -557924
45079 -557924 -310756 -98718 -27736 -83087 -113856 -37735 44513 11348 -88360 -101180 28708
45068 28708 226771 432213 666315 938235 1162495 1211650 1018503 613136 95664 -410069
45058 -410069 -800372 -1007250 -976192 -663391 -95504 584031 1178897 1560669 1710321 1669183
45048 1669183 1501969 1293134 1103593 900959 577819 75699 -521519 -1026297 -1266138
45039 -1266138 -1180794 -852895 -462690 -186516 -119381 -285694 -676031 -1216019 -1726717 -2011257
45029 -2011257 -2019167 -1878819 -1745990 -1664746 -1587803 -1466453 -1283033 -1051867 -838319 -736942
45019 -736942 -784355 -925022 -1094909 -1286371 -1480316 -1577108 -1488583 -1274681 -1090298 -988039
45009 -988039 -860684 -606700 -274700 7084 190884 342010 547446 852365 1265491 1750612
44999 1750612 2191221 2421774 2351708 2058128 1729026 1514170 1450930 1527804 1772078 2236215
44989 2236215 2915803 3728506 4584125 5436890 6243249 6898348 7262514 7261829 6944054 6429634
44979 6429634 5820126 5156426 4449755 3737145 3099295 2618106 2312962 2123376 1958617
44970 1958617 1758615 1504946 1193582 826134 431542 72062 -194001 -357723 -465035
44961 -465035 -583163 -766730 -1045126 -1418796 -1851736 -2272394 -2598211 -2769952 -2764811 -2582547
44951 -2582547 -2230656 -1726189 -1104442 -427322 200044 620181 672425 308392 -321465 -925394
44941 -925394 -1257815 -1278837 -1142229 -1031054 -1000808 -970840 -849758 -645522 -441279 -283725
44931 -283725 -128279 111429 506968 1123177 2021336 3179479 4407330 5397106 5898504
44922 5898504 5850797 5361817 4593513 3676920 2708613 1793065 1057734 595628 383754 289741
44912 289741 188660 55254 -81337 -234659 -454494 -737672 -1007575 -1189445 -1259951 -1225632
44902 -1225632 -1113356 -990727 -926640 -898324 -789486 -514932 -101871 383319 934201 1577648
44892 1577648 2283902 2955040 3480201 3763923 3739499 3420858 2927691 2395654 1858276 1269792
44882 1269792 648875 136346 -132157 -188788 -234900 -474828 -947427 -1502720 -1923032 -2067647
44872 -2067647 -1929122 -1596718 -1194655 -832385 -564749 -389089 -308794 -395673 -740135 -1319657
44862 -1319657 -1952430 -2399373 -2484761 -2130366 -1363973 -354356 620956 1328494 1703364
44853 1703364 1803351 1695730 1454887 1227351 1194559 1444553 1920769 2489362 3009412 3363021
44843 3363021 3508613 3534965 3606623 3820719 4136991 4440680 4623606 4602782 4329127 3819567
44833 3819567 3154567 2429665 1738474 1198611 929486 969183 1249395 1676127 2195819 2757243
44823 2757243 3258454 3588352 3712173 3685132 3589899 3476491 3339632 3124806 2767355 2252294
44813 2252294 1637461 1012550 446040 -28661 -403598 -687294 -882866 -964029 -903862 -749893
44803 -749893 -641699 -715610 -992761 -1372355 -1715298 -1915006 -1915349 -1712007 -1354604 -931085
44793 -931085 -539028 -270781 -205844 -376299 -711478 -1028287 -1122278 -916096 -529319 -176032
44783 -176032 21990 101329 133832 92646 -106295 -461528 -860891 -1205805 -1499464 -1793317
44773 -1793317 -2097972 -2370755 -2546883 -2558244 -2362578 -1980460 -1469321 -849367 -113641 658861
44763 658861 1271838 1567645 1587361 1517402 1500204 1550977 1627005 1693047 1713660 1656571 1531992
44752 1531992 1377189 1171740 805948 169254 -737753 -1778699 -2734662 -3378528 -3562803
44743 -3562803 -3311199 -2842355 -2468494 -2421062 -2725270 -3203857 -3597915 -3721885 -3550120 -3184471
44733 -3184471 -2752708 -2339175 -1990436 -1746344 -1636496 -1649369 -1725411 -1793566 -1812575 -1770548
44723 -1770548 -1652210 -1432628 -1121417 -797038 -565348 -479494 -519835 -647181 -839575 -1067698
44713 -1067698 -1274028 -1405103 -1442972 -1386463 -1233597 -1014537 -813811 -715714 -739968 -868214
44703 -868214 -1112681 -1494108 -1936319 -2234969 -2178773 -1709866 -968854 -195485 428393 881680
44693 881680 1276649 1718342 2181604 2534800 2676734 2620461 2438441 2166301 1794654 1335085
44683 1335085 842762 348643 -208277 -936207 -1850875 -2793860 -3524050 -3897604 -3934018 -3712082
44673 -3712082 -3269249 -2654929 -2031169 -1614933 -1486153 -1505066 -1452975 -1220609 -834549 -351085
44663 -351085 205062 796467 1325624 1669008 1747789 1548093 1088069 407143 -387943 -1096140
44653 -1096140 -1509269 -1571284 -1437065 -1339482 -1396138 -1555399 -1699352 -1750253 -1688225 -1537850
44643 -1537850 -1378667 -1332476 -1488793 -1834964 -2268290 -2663376 -2918561 -2967046 -2787234 -2417454
44633 -2417454 -1951122 -1508223 -1198144 -1083488 -1158491 -1360478 -1602672 -1790520 -1820183 -1603412
44623 -1603412 -1126978 -482989 179588 742753 1168850 1482750 1715065 1853689 1848261 1674619
44613 1674619 1393530 1123175 946023 861096 828096 823885 839661 858312 870207 897677 976833
44602 976833 1118703 1289592 1396162 1279417 793527 -27698 -896808 -1447913 -1523981 -1270898
44592 -1270898 -961743 -786525 -808011 -1015839 -1339355 -1650801 -1852425 -1977394 -2147244 -2401399
44582 -2401399 -2598983 -2514901 -2027390 -1217380 -317705 422701 867202 1046995 1118282 1254436
44572 1254436 1549078 1981254 2436471 2763754 2861648 2754225 2575504 2438418 2302014 1987399
44562 1987399 1343908 399151 -652854 -1594435 -2310702 -2806525 -3143016 -3373268 -3520954
44553 -3520954 -3592156 -3589240 -3509676 -3342107 -3080931 -2751700 -2410145 -2101361 -1822889 -1544003
44543 -1544003 -1266850 -1054264 -980064 -1053709 -1215473 -1421210 -1712601 -2159633 -2715171 -3161272
44533 -3161272 -3244437 -2863376 -2102783 -1113749 -30364 995186 1774513 2182377 2248788
44524 2248788 2098544 1830263 1519699 1307021 1362747 1721880 2222793 2666401 2994742 3268091
44514 3268091 3514976 3681450 3719951 3658580 3559515 3449631 3317272 3149135 2936689 2655991
44504 2655991 2283067 1858250 1517557 1402902 1498884 1581853 1391289 871669 215606 -335460
44494 -335460 -688586 -891974 -1007825 -1058186 -1061418 -1047913 -1038042 -1053410 -1145378 -1354662 -1626140
44483 -1626140 -1804841 -1736952 -1356856 -689939 166904 1043351 1734208 2109598 2196996 2135718
44473 2135718 2053041 1988496 1911484 1780827 1589226 1368757 1156748 953640 722192 430014
44463 430014 79766 -301533 -676307 -989079 -1176414 -1211893 -1124616 -949069 -676992 -296444
44453 -296444 128854 462305 592673 510146 280923 -25548 -370348 -732859 -1093233 -1423152
44443 -1423152 -1681919 -1834513 -1893294 -1932118 -2028113 -2176533 -2276985 -2216842 -1968941 -1613915
44433 -1613915 -1282666 -1074277 -997948 -968585 -867151 -623461 -237439 277276 923817 1647742
44423 1647742 2259660 2520418 2347518 1896908 1402421 966489 544973 91234 -365044
44414 -365044 -780181 -1160076 -1524246 -1850245 -2098608 -2277561 -2445236 -2639849 -2821279 -2892004
44404 -2892004 -2785726 -2544852 -2302350 -2167842 -2129660 -2079522 -1925303 -1663551 -1359849 -1098445
44394 -1098445 -952435 -961343 -1115669 -1378620 -1723510 -2124886 -2522291 -2845461 -3091497 -3327190
44384 -3327190 -3582891 -3783878 -3826138 -3692056 -3455462 -3202692 -2993137 -2870917 -2853367 -2903681
44374 -2903681 -2957076 -2980167 -2974784 -2928353 -2802582 -2581737 -2302246 -2025746 -1807541 -1692247
44364 -1692247 -1698777 -1779461 -1809834 -1653435 -1260962 -719659 -204793 138216 282390 289186
44354 289186 197799 -17082 -357374 -718566 -952439 -997205 -890074 -658655 -268408 299870
44344 299870 973642 1628637 2183501 2635883 3029681 3404842 3757255 4032759 4180891 4222831
44334 4222831 4239217 4282352 4334883 4367983 4395068 4432686 4440035 4342644 4110074 3786491 3457385
44323 3457385 3204329 3065051 2999028 2901070 2681826 2336204 1920652 1487999 1079259 758764
44313 758764 597444 599987 679992 733264 731232 740356 863879 1164653 1619687 2126627 2549568
44302 2549568 2764054 2677708 2253311 1559144 798724 243565 83443 314990 768998 1248355
44292 1248355 1654883 2011432 2390460 2835667 3340437 3863200 4326683 4607936 4576717 4184328
44282 4184328 3519162 2766965 2115189 1675584 1447259 1317334 1119825 746895 229223
44273 229223 -294315 -684670 -881249 -899669 -786158 -582472 -324509 -71303 71130 -13912
44263 -13912 -358625 -850282 -1287661 -1505232 -1439061 -1093976 -494835 299340 1146601 1828876
44253 1828876 2152045 2070525 1716937 1291133 906154 539842 123222 -347276 -780107 -1037897
44243 -1037897 -1015233 -716059 -284511 73046 238189 252559 237790 277191 389825 563992
44233 563992 759314 904782 957339 958509 992607 1104448 1299788 1593816 1980501 2353535
44223 2353535 2533775 2404628 1983977 1368395 670993 17096 -489276 -847003 -1153014
44214 -1153014 -1468169 -1726826 -1817752 -1711278 -1461396 -1123328 -725288 -293352 156373 639464
44204 639464 1164636 1675329 2072627 2300492 2381683 2378275 2348991 2335303 2348040 2362644 2357116
44193 2357116 2357196 2417284 2554001 2722648 2862004 2941903 2966083 2946578 2871788 2680278 2277597
44182 2277597 1618843 789612 -16983 -621897 -959115 -1066944 -1014459 -856086 -645043 -462517
44172 -462517 -407495 -539606 -830637 -1188290 -1534649 -1844739 -2101331 -2245295 -2209193 -1991714
44162 -1991714 -1660864 -1274966 -828496 -293591 298021 832174 1177270 1278227 1193563 1038956
44152 1038956 892957 764579 645006 551738 490631 399711 188314 -146836 -473176 -616623
44142 -616623 -501492 -193106 177832 510482 763188 927334 1006896 1022500 999798 924532
44132 924532 725732 348252 -143544 -565922 -749636 -673362 -465393 -298398 -290343 -464334
44122 -464334 -750945 -1024672 -1170176 -1133584 -917478 -548010 -66968 458659 950651 1350747
44112 1350747 1632066 1794022 1866856 1910849 1980373 2080198 2172125 2229221 2271009 2335921 2417600
44101 2417600 2431092 2260065 1867168 1363551 942657 729642 707323 778611 852039 857125
44091 857125 752155 585391 512542 674623 1053868 1498846 1887892 2217843 2536033 2845944
44081 2845944 3095865 3211316 3120008 2794698 2309737 1829953 1505243 1368600 1335671 1293690
44071 1293690 1203648 1147501 1273001 1652415 2179892 2631695 2837355 2776314 2521763 2143937
44061 2143937 1691748 1230389 851997 638644 611860 709385 823768 889604 925330 959686
44051 959686 929315 699752 204651 -460491 -1083525 -1451877 -1454638 -1146780 -732449 -424561
44041 -424561 -280414 -196389 -63666 123439 320148 515182 717846 918503 1116937 1350577
44031 1350577 1637951 1916603 2082690 2074494 1885999 1534801 1068475 578317 145805 -228392
44021 -228392 -607341 -1029454 -1450885 -1750736 -1773786 -1420231 -761768 -56506 415478 549045
44011 549045 425861 150313 -273604 -897159 -1703209 -2549656 -3227174 -3582863 -3611768 -3425667
44001 -3425667 -3123266 -2713215 -2179561 -1579794 -1030532 -619837 -378241 -304778 -352027 -395464
43991 -395464 -298255 -39653 256335 433687 419815 241072 -21255 -278991 -485916 -653701
43981 -653701 -789436 -824669 -659773 -285380 193718 665989 1088784 1447850 1718643 1910037
43971 1910037 2083292 2270036 2416336 2465640 2454639 2453209 2434744 2294986 2014253 1731289
43961 1731289 1617849 1712110 1895710 1997975 1894412 1540896 974580 299547 -360474 -931103
43951 -931103 -1419039 -1866699 -2271462 -2560369 -2655963 -2560950 -2363176 -2162357 -2017441 -1973114
43941 -1973114 -2103128 -2479733 -3081070 -3738968 -4194401 -4222995 -3740292 -2830070 -1699868
43932 -1699868 -598684 269565 807416 1031048 1017659 836913 528335 133790 -268030
43923 -268030 -566463 -649991 -442573 53073 728191 1411437 1971784 2370810 2602454 2620211
43913 2620211 2375232 1915355 1392046 954850 667008 518865 472658 477468 488938 513825
43903 513825 612235 818671 1064091 1198697 1097881 747887 240869 -307471 -840940 -1360689
43893 -1360689 -1837481 -2161266 -2229241 -2078692 -1875435 -1755793 -1728531 -1740624 -1756275 -1710658
43883 -1710658 -1454244 -858727 4934 864222 1454132 1702137 1707993 1599870 1445223 1262583
43873 1262583 1061309 857545 673720 534204 455747 437455 461036 503355 554377 626951
43863 626951 741156 884930 990993 972670 799654 535960 293306 150521 130687 248721
43853 248721 542150 1022975 1618040 2205004 2712976 3137688 3434637 3460908 3102263 2449980
43843 2449980 1779679 1326078 1108523 979695 794260 511671 191822 -56100 -140147 -48703
43833 -48703 142368 331709 450157 459065 333387 80473 -238465 -528305 -697177 -683444
43823 -683444 -494669 -245274 -113571 -217598 -547853 -1036440 -1641315 -2314396 -2933440 -3351475
43813 -3351475 -3523512 -3537391 -3517483 -3531872 -3571457 -3555381 -3360568 -2924368 -2353907 -1885554
43803 -1885554 -1694011 -1754712 -1897983 -1957380 -1850235 -1569821 -1159198 -689929 -233596 155771
43793 155771 433846 562999 535055 389482 200281 47029 -14561 18706 99674 192026
43783 192026 329702 576850 921487 1257324 1499507 1679457 1884069 2124059 2309671 2363239
43773 2363239 2336085 2405859 2743516 3345567 3984951 4367508 4371116 4114980 3786722 3452160
43763 3452160 3066012 2600149 2074242 1490073 841312 206134 -261492 -484287 -549411 -594648
43753 -594648 -652229 -662245 -607558 -562887 -606067 -732011 -869890 -954481 -971020 -956466 -965749
43742 -965749 -1013244 -1037505 -944608 -700575 -375344 -102802 -18419 -219324 -720262 -1404932
43732 -1404932 -2048384 -2438727 -2489069 -2226624 -1707558 -989568 -172721 601189 1222327 1655780
43722 1655780 1893068 1902623 1672516 1282166 876080 547244 270222 -32739 -367271 -616807
43712 -616807 -613717 -264184 376574 1127935 1774500 2162015 2266197 2216756 2234815 2473736
43702 2473736 2878383 3227443 3352509 3312663 3344123 3660032 4302929 5131969 5898260 6373275
43692 6373275 6492588 6391343 6250704 6105871 5852531 5430638 4917253 4410151 3900026
43683 3900026 3321625 2689038 2123627 1774477 1748471 2066637 2613811 3155309 3491137 3617015
43673 3617015 3692161 3849663 4086757 4332220 4541680 4689593 4720455 4561080 4172362 3576677
43663 3576677 2864282 2187091 1697151 1435223 1279053 1025179 525709 -241391 -1183782
43654 -1183782 -2138960 -2942056 -3508214 -3857335 -4043338 -4085547 -4007884 -3915652 -3954420 -4166311
43644 -4166311 -4434421 -4602264 -4618317 -4534982 -4398397 -4187618 -3854404 -3376575 -2759907 -2025750
43634 -2025750 -1233253 -506113 2732 208872 169010 44373 -20818 13649 109936 233032
43624 233032 376387 524663 642647 719693 789698 882003 983882 1086062 1236881 1495941
43614 1495941 1833815 2124093 2248075 2176258 1943555 1591967 1164952 723690 330659 26441
43604 26441 -162115 -216445 -153098 -27571 125360 332461 616004 899895 1042941 983941
43594 983941 810322 657996 576336 521008 452278 397740 420455 557563 799684 1106620
43584 1106620 1415399 1625573 1600067 1230122 540670 -275589 -970447 -1408301 -1616435 -1684587
43574 -1684587 -1665929 -1597712 -1567151 -1690040 -2013690 -2463933 -2883882 -3107327 -3019225 -2602595
43564 -2602595 -1952828 -1225769 -550737 10496 441619 753106 1001869 1294377 1723309
43555 1723309 2282035 2842879 3222661 3283182 3000250 2466793 1836187 1245533 766193 401190
43545 401190 114836 -130269 -349010 -535067 -680537 -785665 -846281 -844021 -758643 -578988
43535 -578988 -294826 94508 531240 878243 1003332 907460 745336 706901 892811 1283660
43525 1283660 1755299 2091534 2061522 1592006 874471 236985 -117380 -218438 -189339 -75263
43515 -75263 150342 470193 796562 1064741 1302475 1589713 1981047 2484767 3089689 3777276
43505 3777276 4503612 5186838 5726399 6044987 6125199 6014012 5785775 5487241 5110520 4618926
43495 4618926 3999088 3285382 2532411 1767741 979836 160200 -638441 -1286786 -1633055
43486 -1633055 -1601080 -1270279 -867738 -641941 -683152 -839353 -827978 -460256 229674 1055183
43476 1055183 1833613 2457784 2866839 3026640 2960079 2752266 2494670 2245820 2065485 2051426
43466 2051426 2290836 2769059 3349855 3849778 4126628 4123759 3874360 3467394 2975028 2403409
43456 2403409 1740877 1053144 479330 102112 -142896 -387184 -681170 -971412 -1210061
43447 -1210061 -1420599 -1625957 -1750458 -1638661 -1177657 -395816 542782 1425389 2089215
43438 2089215 2474174 2611314 2574831 2442996 2280272 2120419 1951913 1738900 1480183 1250558
43428 1250558 1176435 1363932 1830070 2467246 3059590 3369307 3262637 2779297 2078681 1317875
43418 1317875 577591 -123683 -782013 -1378442 -1870870 -2208246 -2375067 -2428593 -2462535 -2508763
43408 -2508763 -2487879 -2281398 -1852349 -1284756 -717861 -264987 11311 86949 -25430 -266074
43398 -266074 -537277 -742922 -832888 -818055 -745421 -657134 -569525 -482331 -394418 -304013 -199761
43387 -199761 -57184 158037 476172 888202 1311640 1616321 1718666 1650159 1512075 1372003
43377 1372003 1235937 1110615 1031510 997446 921435 700864 330428 -86997 -431441 -637214
43367 -637214 -693464 -628782 -503143 -368613 -219783 -22188 186983 263889 60994 -449864
43357 -449864 -1174336 -1978147 -2730815 -3299048 -3575652 -3547839 -3307951 -2972730 -2599657 -2178353
43347 -2178353 -1671429 -1048726 -308121 508771 1322212 2043062 2592047 2900637 2929987 2714976
43337 2714976 2372648 2033560 1752284 1486683 1157046 717247 178727 -416551 -1040737
43328 -1040737 -1698856 -2396338 -3080921 -3621978 -3857337 -3670116 -3042832 -2072467 -947633
43319 -947633 114734 947966 1472898 1677394 1593423 1310913 981863 759841 714801 810966
43309 810966 960916 1089484 1158342 1155832 1071778 881977 576815 224611 -13887 23089
43299 23089 374544 923088 1463433 1790642 1774131 1434174 968626 642298 595453 762811
43289 762811 979228 1125411 1160094 1073979 877769 626269 411266 322920 419742 697202
43279 697202 1047673 1279796 1235197 894761 350431 -300384 -982221 -1585614 -1971960 -2080156
43269 -2080156 -1993432 -1864733 -1793888 -1797721 -1869253 -2019869 -2257680 -2548934 -2816127 -2977712
43259 -2977712 -2996288 -2892392 -2707990 -2456782 -2115283 -1658617 -1097568 -489741 70229 481209
43249 481209 684886 694381 564286 338284 44385 -269487 -535749 -723575 -883543 -1126950
43239 -1126950 -1557001 -2190676 -2911397 -3511903 -3833548 -3872846 -3720111 -3408388 -2888937 -2162105
43229 -2162105 -1348289 -583481 85836 636667 954228 881798 391394 -352556 -1106096 -1695669
43219 -1695669 -2091425 -2397811 -2758290 -3200164 -3570671 -3683501 -3521795 -3225731 -2883749
43210 -2883749 -2435331 -1817476 -1116997 -505503 -76642 183466 305456 294785 167152 -39054
43200 -39054 -285666 -522970 -661881 -611139 -352746 52351 533517 1054424 1599003 2160905
43190 2160905 2750447 3365601 3939352 4348948 4494061 4347018 3932161 3299648 2529560
43181 2529560 1714430 908520 122832 -612231 -1220386 -1648708 -1929072 -2129327 -2270688
43172 -2270688 -2343202 -2384005 -2475413 -2652546 -2858882 -3010672 -3067217 -3017690 -2839147 -2511048
43162 -2511048 -2063705 -1584957 -1177149 -911938 -803436 -794825 -772971 -620036 -264676 306253
43152 306253 1057702 1907014 2738157 3458879 4049516 4526490 4854642 4935567 4710731 4255914
43142 4255914 3741333 3296732 2928990 2565680 2158628 1737999 1374225 1097527 866020
43133 866020 626458 405669 318690 463489 806189 1178814 1394551 1378217 1210344 1054080
43123 1054080 1017311 1068056 1096716 1065645 1062397 1182731 1405171 1633649 1828669 2011923
43113 2011923 2146351 2121945 1924354 1746275 1834306 2228475 2708002 2984238 2896251 2442614
43103 2442614 1724087 905775 175184 -344117 -654219 -841695 -979967 -1079970 -1108609 -1018194
43093 -1018194 -762429 -321155 269306 916146 1505562 1938119 2145397 2104107 1850737 1469443
43083 1469443 1046161 631911 255321 -41268 -206408 -237008 -216069 -257292 -389100 -504446
43073 -504446 -455029 -209660 92653 262029 225764 65491 -104102 -261490 -464177 -730380
43063 -730380 -974603 -1070215 -949263 -629049 -177873 303976 691645 895778 950451 1007468
43053 1007468 1203587 1541994 1922237 2257051 2518317 2690701 2748830 2699168 2591827 2455798
43043 2455798 2260262 1983652 1694060 1503299 1441524 1429081 1388214 1336840 1338142 1389381 1412437
43032 1412437 1357951 1282292 1301658 1481904 1781158 2084472 2279929 2313682 2200711 2001292
43022 2001292 1785894 1608900 1494534 1422439 1314490 1058186 593575 13873 -432635 -491582
43012 -491582 -99755 548030 1127936 1390598 1269044 848586 285511 -248962 -606337 -703281
43002 -703281 -542320 -178969 333623 958320 1634821 2245384 2640720 2716754 2477868 2025895
42992 2025895 1477688 888904 263333 -371357 -929688 -1332119 -1583240 -1754170 -1891962
42983 -1891962 -1976934 -1970199 -1869859 -1708568 -1522381 -1334304 -1142645 -915458 -635428 -380016
42973 -380016 -322504 -600572 -1182136 -1885658 -2518097 -2963099 -3166992 -3119215 -2872270 -2525032
42963 -2525032 -2140979 -1705510 -1193452 -654197 -194020 114680 279457 359440 424548 529286
42953 529286 678489 807160 832445 750978 661818 663014 732999 741359 581987 281280 -22232
42942 -22232 -178560 -98736 229268 735368 1266748 1646245 1788685 1764097 1720510 1743244
42932 1743244 1808072 1858496 1882060 1892746 1876162 1794261 1642724 1479642 1389646 1421967 1555276
42921 1555276 1714849 1833312 1907844 1997334 2158523 2386933 2617722 2772267 2803481 2714727
42911 2714727 2548430 2352715 2159272 2000117 1927264 1975382 2100063 2198405 2215712 2192454
42901 2192454 2170047 2091615 1862320 1498682 1147046 925688 791514 598424 265163 -147923
42891 -147923 -517739 -776410 -937516 -1031097 -1053858 -1002056 -924091 -887997 -885533 -815690 -598377
42880 -598377 -270965 73932 419890 828408 1306624 1744050 2023983 2161258 2278579 2445691
42870 2445691 2567882 2442788 1931206 1094688 190838 -465581 -667150 -400799 156886
42861 156886 706200 954128 786564 355220 -45702 -228036 -232917 -218387 -278807 -403214
42851 -403214 -560683 -761112 -1038347 -1425859 -1956312 -2632710 -3361040 -3933872 -4134032 -3887270
42841 -3887270 -3311611 -2605805 -1894170 -1194631 -526814 -2521 230890 124385 -232593
42832 -232593 -708868 -1241634 -1845801 -2538861 -3268278 -3903559 -4300811 -4384562 -4157513 -3629819
42822 -3629819 -2790507 -1700931 -577452 310658 838017 1051787 1009066 696807 162974
42813 162974 -381171 -705367 -778024 -761099 -816505 -992776 -1265781 -1576527 -1813029 -1856035
42803 -1856035 -1704374 -1516592 -1491277 -1718479 -2135800 -2571551 -2820669 -2751714 -2400179 -1941347
42793 -1941347 -1539646 -1225326 -909246 -479506 117000 825064 1472468 1851607 1863485 1578061
42783 1578061 1136804 624306 64313 -491803 -931958 -1151573 -1136046 -979306 -837127 -847411
42773 -847411 -1060078 -1427859 -1865389 -2309843 -2723170 -3065005 -3300235 -3437857 -3543376 -3700843
42763 -3700843 -3953280 -4256911 -4476130 -4442649 -4065435 -3417079 -2717544 -2212135 -2023560 -2078788
42753 -2078788 -2162977 -2061507 -1680148 -1063925 -345039 305497 722323 827720 701463 527638
42743 527638 435310 402556 320359 113132 -212557 -571485 -794445 -665359 -60819 911831
42733 911831 1945285 2721832 3080906 3047370 2764581 2411215 2125127 1951540 1849671 1748498
42723 1748498 1597156 1385973 1154715 983255 945229 1054789 1261972 1490226 1663190 1715287
42713 1715287 1621037 1426229 1225864 1103050 1106041 1276229 1652330 2216977 2854667 3392183
42703 3392183 3701892 3788664 3789141 3860788 4029750 4143061 3995742 3507420 2765700 1935641
42693 1935641 1183598 658900 436574 425178 402343 215574 -78398 -321366 -461736 -589168
42683 -589168 -783874 -1008611 -1160200 -1167189 -1014303 -719991 -330837 74188 394506 526149
42673 526149 390108 -15893 -584917 -1154468 -1612478 -1934102 -2116183 -2121919 -1920104 -1547132
42663 -1547132 -1089010 -614946 -164421 212616 455871 555731 581207 615304 670772 685247
42653 685247 582169 311711 -144721 -746958 -1347867 -1725984 -1737215 -1444538 -1063662 -778641
42643 -778641 -644749 -661628 -860699 -1260889 -1775574 -2239321 -2543182 -2711458 -2844938 -3028059
42633 -3028059 -3300427 -3673543 -4131287 -4612863 -5015622 -5232061 -5204924 -4967528 -4631707 -4321693
42623 -4321693 -4111497 -4017233 -4018866 -4062287 -4063373 -3961841 -3783933 -3621943 -3539879 -3519588 -3501999
42612 -3501999 -3455974 -3406306 -3424900 -3592094 -3918681 -4288803 -4523402 -4527589 -4342733 -4036499
42602 -4036499 -3598841 -2998035 -2296430 -1634530 -1104483 -699672 -392757 -200846 -147461 -209161
42592 -209161 -344754 -558892 -896917 -1372709 -1923639 -2445724 -2861116 -3137974 -3251146 -3155726
42582 -3155726 -2830234 -2337079 -1802830 -1331945 -974515 -780477 -815320 -1065358 -1368303 -1515234
42572 -1515234 -1424865 -1169033 -834956 -427098 80569 650849 1169743 1493935 1504459 1167586
42562 1167586 577993 -89745 -705050 -1245442 -1739505 -2194704 -2603225 -2966230 -3262720
42553 -3262720 -3420624 -3363607 -3077779 -2616399 -2079405 -1623410 -1433443 -1589284 -1952058 -2255308
42543 -2255308 -2344148 -2294927 -2286735 -2392194 -2515653 -2509097 -2325313 -2071383 -1923283 -1970186 -2128776
42532 -2128776 -2220243 -2134370 -1904605 -1630969 -1369445 -1115238 -860728 -629466 -454953 -351789
42522 -351789 -316332 -345909 -449175 -632008 -865866 -1072601 -1159767 -1093065 -946462 -881983
42512 -881983 -1061875 -1538638 -2195566 -2804774 -3185188 -3326399 -3352916 -3374909 -3399470 -3383163
42502 -3383163 -3326704 -3295504 -3377681 -3642164 -4094039 -4619994 -5004994 -5081081 -4886126 -4631229
42492 -4631229 -4484634 -4425456 -4339662 -4208041 -4120493 -4109562 -4058301 -3827779 -3432118 -3023288
42482 -3023288 -2716235 -2490112 -2266683 -2024526 -1805166 -1648412 -1556025 -1486804 -1357188 -1093270
42472 -1093270 -743923 -514448 -604113 -994170 -1457609 -1799478 -2029980 -2272221 -2568244 -2848147
42462 -2848147 -3060977 -3254573 -3506754 -3821800 -4115863 -4277805 -4225607 -3921937 -3365352 -2589344
42452 -2589344 -1684994 -814020 -150971 236694 454829 704204 1125122 1711760 2337879
42443 2337879 2817752 2955827 2614883 1802580 705547 -371719 -1122098 -1349220 -1051015
42434 -1051015 -429558 216646 660345 828097 742907 439739 -33436 -575113 -1057130 -1405640
42424 -1405640 -1631814 -1784264 -1897773 -1989712 -2078487 -2189787 -2347240 -2548179 -2737469 -2827027
42414 -2827027 -2778150 -2662637 -2608993 -2682823 -2844558 -3016185 -3143661 -3188797 -3118000 -2932537
42404 -2932537 -2667942 -2329004 -1874568 -1328907 -876488 -758677 -1052995 -1601407 -2170364
42395 -2170364 -2635037 -2989610 -3236114 -3323731 -3191568 -2837789 -2344434 -1847427 -1472239 -1276986
42385 -1276986 -1248005 -1341937 -1519446 -1747275 -1996964 -2245049 -2444375 -2491147 -2265282 -1733602
42375 -1733602 -988964 -165987 654531 1439260 2146092 2721835 3132447 3352125 3345035 3109950
42365 3109950 2730763 2328426 1961668 1616624 1283700 986819 734452 502421 281040
42356 281040 84865 -103770 -343232 -648148 -938938 -1115119 -1153410 -1108861 -1051219 -1024348
42346 -1024348 -1030877 -1026444 -963913 -870702 -837514 -892333 -932963 -835116 -581650 -223688 231973
42335 231973 792606 1351703 1708064 1756590 1591887 1383959 1206677 1027023 810783 583349
42325 583349 407793 341040 395888 519445 625197 666458 662137 643915 615430 582206 574279
42314 574279 593453 565866 398543 80362 -301105 -628136 -807777 -782747 -544167 -145713
42304 -145713 323909 789678 1196541 1483384 1593243 1520535 1324508 1087202 867490 681826
42294 681826 499343 262035 -51936 -375026 -584121 -591889 -388658 -14341 461880 939144
42284 939144 1331160 1646328 1971659 2338856 2649967 2780982 2716537 2519096 2196841 1690506
42274 1690506 1002325 265672 -346145 -737081 -900617 -881381 -772273 -700196 -743067 -865779
42264 -865779 -980274 -1055383 -1122638 -1190879 -1221433 -1198089 -1161178 -1144206 -1124692 -1073040 -1007515
42253 -1007515 -951301 -862709 -669197 -374775 -92253 42701 -27319 -248287 -477080 -538342
42243 -538342 -315973 174728 817118 1497774 2152803 2713127 3067569 3132205 2937493 2610818
42233 2610818 2287396 2063807 2003048 2117423 2334539 2524069 2581280 2471872 2206535 1817508
42223 1817508 1372787 967083 657372 418734 191155 -29336 -153836 -48121 376948
42214 376948 1085609 1898734 2570390 2918980 2906025 2608302 2146780 1651298 1247010 1013179
42204 1013179 938217 935208 912996 832790 711643 591665 501261 429690 343987 242175 171780
42193 171780 167046 176869 92232 -143411 -470210 -762708 -930815 -978744 -991038 -1057742 -1183252
42182 -1183252 -1268292 -1213774 -1042032 -873262 -773494 -672930 -453045 -65123 460850 1055118
42172 1055118 1590831 1882326 1809034 1458093 1077077 863373 841993 943377 1116400 1323409
42162 1323409 1491325 1540763 1448360 1241218 957477 659558 457118 438600 557126 628960
42152 628960 477923 72468 -481725 -1055589 -1579994 -2024196 -2315514 -2311963 -1896786 -1126607
42142 -1126607 -266607 359466 566956 369472 -99575 -657232 -1089294 -1217342 -1031308
42133 -1031308 -727900 -553169 -597266 -759669 -884379 -875082 -684886 -264842 420314 1324242
42123 1324242 2287391 3086452 3533849 3558605 3215254 2629431 1942674 1292178 791752 490671
42113 490671 366802 398775 634716 1142581 1888384 2711925 3440869 3987161 4315341 4382867
42103 4382867 4179175 3793266 3360440 2926819 2423166 1795690 1112455 500176 10851
42094 10851 -392390 -722003 -895495 -812416 -485100 -63627 273007 437691 450331 360470
42084 360470 182691 -91516 -442071 -796120 -1048176 -1099584 -897914 -462738 123971 762218
42074 762218 1370873 1890459 2285143 2568066 2794923 2978250 3007241 2706791 2006808 1034037
42064 1034037 32797 -768485 -1217474 -1262341 -1007033 -714009 -651899 -900125 -1335605 -1810416
42054 -1810416 -2280496 -2738953 -3097490 -3212122 -3017071 -2585860 -2067621 -1607862 -1324868
42045 -1324868 -1295784 -1518903 -1907520 -2353733 -2793922 -3192901 -3480953 -3554578 -3365119 -2983437
42035 -2983437 -2539813 -2098650 -1626821 -1102815 -622351 -346430 -342535 -517627 -721982 -878304
42025 -878304 -977485 -989134 -849032 -545911 -165775 182584 455804 661981 792567 819447
42015 819447 755231 671477 644732 712278 884607 1159587 1498484 1818522 2047198 2175636
42005 2175636 2232475 2215871 2080878 1787566 1329069 712538 -50078 -914787 -1789140 -2555759
41995 -2555759 -3101898 -3337188 -3232024 -2872062 -2451214 -2165433 -2090567 -2154122 -2212250 -2160059
41985 -2160059 -2000143 -1817786 -1665402 -1468883 -1098857 -563403 -73559 148907 104427 -5849
41975 -5849 -12399 90619 238240 413036 616766 793481 856869 776571 596004 389144 236413
41964 236413 206770 302512 433271 500243 507895 548080 672305 823199 897354 834272 639345
41953 639345 372395 135006 12810 -25072 -148370 -532854 -1191348 -1952947 -2600669 -3005082
41943 -3005082 -3141727 -3043373 -2777657 -2444896 -2140558 -1893111 -1648308 -1325154 -887771 -373051
41933 -373051 129131 517558 726831 756847 651588 439159 103424 -376137 -977145 -1645979
41923 -1645979 -2331245 -2967827 -3445236 -3651883 -3572135 -3307551 -2988941 -2697369 -2474939 -2357342
41913 -2357342 -2354389 -2424313 -2500589 -2529643 -2473113 -2319822 -2130633 -2021997 -2038039 -2057756 -1896176
41902 -1896176 -1504247 -1025163 -654490 -486118 -484853 -547780 -579281 -561387 -581613 -762140
41892 -762140 -1141424 -1641938 -2145819 -2560697 -2820291 -2897736 -2861987 -2876658 -3089176 -3518130
41882 -3518130 -4044913 -4474596 -4601010 -4292340 -3590823 -2720117 -1949481 -1440172 -1214498
41873 -1214498 -1218517 -1372461 -1595556 -1835109 -2064169 -2231416 -2257287 -2129260 -1963249 -1897317
41863 -1897317 -1928862 -1911987 -1709602 -1296247 -728150 -91886 503785 963478 1281532 1549326
41853 1549326 1859906 2233085 2638758 3035917 3360804 3537248 3556881 3518663 3533805 3603636
41843 3603636 3631515 3537881 3316921 2992219 2577190 2098750 1620218 1209982 898376 678137
41833 678137 534555 460897 448838 474597 499671 489668 437176 367177 322796 351273 495355
41822 495355 772868 1152217 1565927 1965919 2353633 2738460 3077154 3274856 3243695 2953060
41812 2953060 2443574 1819922 1217802 735718 380362 91396 -174805 -393654 -493190 -405888
41802 -405888 -117331 287166 611614 633660 249778 -458274 -1305305 -2125931 -2802973 -3222021
41792 -3222021 -3273845 -2929913 -2290434 -1537776 -846761 -327540 -7842 168279 315329 543602
41782 543602 897264 1344581 1816043 2243136 2575663 2792901 2912009 2970907 2984510 2919180
41772 2919180 2723701 2389924 1975433 1562167 1199278 892797 642085 464143 367788 315098
41762 315098 237449 109637 974 28862 244355 562771 815688 884035 799375 731176
41752 731176 866578 1266776 1810386 2281896 2541379 2620649 2652176 2713831 2761632 2708908
41742 2708908 2538992 2324508 2159441 2097331 2142713 2268202 2424254 2540886 2535408 2340727
41732 2340727 1956083 1482295 1087053 914278 1027135 1421578 2032330 2686688 3118391
41723 3118391 3141284 2838053 2512339 2420525 2589808 2900250 3248935 3566790 3751202 3703331
41713 3703331 3433431 3042730 2583991 2008586 1273181 435857 -384517 -1086400 -1578855
41704 -1578855 -1748775 -1514703 -927883 -186517 472820 913556 1158682 1326096 1484662
41695 1484662 1566644 1454157 1169836 944781 1054277 1584606 2364826 3097392 3542907 3634739
41685 3634739 3486490 3293946 3188404 3164727 3144982 3078590 2956841 2770898 2513058 2209083
41675 2209083 1904153 1628546 1421838 1367408 1524681 1812153 2022395 1987605 1699827 1267452
41665 1267452 817561 464773 301400 346075 520629 720018 888313 1004310 1043460 1018128
41655 1018128 1031323 1212906 1580167 1996235 2274970 2302422 2067564 1629165 1077978 502535
41645 502535 -36397 -498398 -838928 -1020357 -1057368 -1032257 -1053402 -1203216 -1510626 -1931351
41635 -1931351 -2337328 -2561323 -2498878 -2179702 -1732734 -1284973 -895911 -564505 -262814 43651
41625 43651 377582 722393 1017794 1205963 1284791 1290847 1218340 986992 531873 -81113
41615 -81113 -675979 -1122083 -1437345 -1713381 -1970044 -2126806 -2105096 -1908732 -1591008 -1186634
41605 -1186634 -718698 -264432 33309 64207 -128237 -349164 -414312 -322081 -246657 -353164
41595 -353164 -642155 -985842 -1279432 -1517451 -1742666 -1975574 -2205953 -2413799 -2573459 -2657369
41585 -2657369 -2660958 -2623508 -2616913 -2711406 -2936429 -3246286 -3517555 -3608763 -3454472 -3111402 -2712481
41574 -2712481 -2374678 -2137488 -1964487 -1788884 -1562000 -1267619 -900909 -457003 35472
41565 35472 473251 700078 593486 140157 -558672 -1334854 -2008898 -2435385 -2539696 -2344003
41555 -2344003 -1975038 -1635630 -1519192 -1694400 -2056717 -2416777 -2655395 -2790041 -2895535
41546 -2895535 -2984537 -2979090 -2785319 -2380442 -1830744 -1238451 -682349 -215569 92629 152443
41536 152443 -78032 -530503 -1059315 -1534358 -1889743 -2111904 -2234216 -2345061 -2545822 -2868704
41526 -2868704 -3257161 -3639168 -3990613 -4313744 -4588994 -4771628 -4806417 -4624563 -4167552 -3459851
41516 -3459851 -2635493 -1841311 -1115441 -401049 318711 939371 1301990 1315222 1002859 464877
41506 464877 -176456 -804278 -1322865 -1676304 -1853778 -1863746 -1700503 -1353082 -858150 -320804
41496 -320804 154647 558615 973099 1464028 1993229 2436209 2661139 2595388 2265747 1802246
41486 1802246 1370601 1068337 900308 859588 980057 1270501 1641816 1962723 2171286 2275340
41476 2275340 2255314 2036509 1579885 959703 330468 -164170 -457236 -577212 -610579 -607916
41466 -607916 -514852 -230731 249968 786184 1195982 1391308 1409192 1357452 1350800 1450598 1613021
41455 1613021 1704198 1601723 1288680 847096 385576 -5984 -260445 -343381 -272147 -105221
41445 -105221 99368 315092 544073 789931 1024894 1178120 1171479 981509 659654 284204
41435 284204 -94477 -451055 -748529 -936252 -993910 -967741 -953647 -1033660 -1211632 -1401287
41425 -1401287 -1482695 -1380293 -1101452 -732856 -424440 -340895 -548601 -918030 -1190130 -1197128
41415 -1197128 -1013145 -865871 -925437 -1209460 -1653432 -2196362 -2784095 -3347204 -3818496 -4163242
41405 -4163242 -4384827 -4523623 -4657137 -4861532 -5130054 -5331279 -5282077 -4890655 -4239938 -3531227
41395 -3531227 -2935165 -2477774 -2053532 -1538250 -888271 -150169 587947 1234381 1709705
41386 1709705 1969456 2027619 1947687 1807210 1675185 1609827 1650525 1801453 2029859 2279284
41376 2279284 2481656 2580183 2574862 2541252 2561571 2613525 2548804 2209960 1572217 768326 -14802
41365 -14802 -660703 -1169384 -1607361 -2015442 -2353229 -2525655 -2460968 -2165618 -1720301 -1246156
41355 -1246156 -875323 -721425 -835763 -1162959 -1529404 -1693525 -1460898 -810020 74770
41346 74770 915642 1511253 1816341 1896146 1854816 1810687 1878018 2109920 2452591 2778488
41336 2778488 2972258 2989213 2857581 2649531 2440710 2275619 2174052 2178921 2372422 2803821
41326 2803821 3393693 3937539 4227084 4174767 3835823 3340799 2824149 2400571 2169066 2196251
41316 2196251 2467000 2852331 3156378 3232277 3074676 2809222 2594874 2521663 2570177 2646790
41306 2646790 2663513 2599898 2496049 2397119 2320437 2267510 2231214 2179164 2067951 1903700 1760139
41295 1760139 1699019 1692090 1662840 1591275 1531077 1530064 1585779 1683486 1820622 1969405 2061575
41284 2061575 2044996 1926327 1732499 1468310 1153496 869992 709623 670739 652616 567227
41274 567227 424217 288932 187718 89349 -26187 -112513 -87301 89343 375026 673753
41264 673753 889514 962560 894035 763808 703121 806094 1056965 1363385 1661737 1968537
41254 1968537 2332716 2769198 3240214 3661801 3916593 3905203 3618304 3132189 2507732 1727639
41244 1727639 778190 -221073 -1013039 -1341572 -1100400 -389305 533953 1382943 1989795
41235 1989795 2354197 2548278 2600345 2498880 2272652 2001427 1750105 1543558 1401463 1337319
41225 1337319 1316763 1279683 1220974 1188084 1176325 1099654 915306 713679 605656 547678 354431
41214 354431 -112109 -812105 -1570928 -2189637 -2511633 -2454948 -2034894 -1351638 -546736 220745
41204 220745 780954 1003984 887089 577474 283602 158996 254731 536129 914404 1286673
41194 1286673 1588211 1817617 2005929 2175905 2352325 2597913 2993608 3553932 4173074
41185 4173074 4682740 4975904 5069643 5048710 4966288 4812539 4559707 4199185 3725186 3116402
41175 3116402 2366488 1525571 689214 -52826 -647944 -1079027 -1357866 -1510705 -1539875 -1404300
41165 -1404300 -1076477 -629456 -231546 -25921 -23093 -116209 -177914 -136374 -4100 119360
41155 119360 91427 -166761 -581880 -967114 -1164440 -1142435 -964838 -704088 -409781 -134245
41145 -134245 56111 105951 -10033 -293494 -718526 -1201420 -1596767 -1769487 -1693542 -1466301
41135 -1466301 -1210093 -968019 -706129 -395896 -59409 265714 570172 867758 1175585
41126 1175585 1520425 1937748 2429003 2928626 3345096 3635979 3823646 3949700 4049711
41117 4049711 4169721 4361322 4640816 4986274 5394401 5900397 6499341 7070063 7429680
41108 7429680 7473229 7235894 6828903 6361588 5935813 5659750 5608528 5770911 6066036 6419458
41098 6419458 6803653 7198629 7535289 7703308 7621024 7288820 6768984 6123432 5385638 4588155
41088 4588155 3790431 3064012 2468494 2059831 1894510 1974225 2179250 2305074 2207079 1908663
41078 1908663 1561574 1320328 1262533 1387937 1642050 1943543 2236671 2546179 2970645 3604521
41068 3604521 4457251 5434212 6384077 7179395 7785040 8264453 8708814 9150338 9547842
41059 9547842 9857718 10112914 10431647 10947905 11712254 12626827 13464837 13975784 14009519 13573843
41049 13573843 12801159 11872197 10957418 10198996 9713172 9572789 9759116 10140158 10543249
41040 10543249 10879805 11182228 11504331 11822992 12077775 12279144 12519355 12880974 13387260
41031 13387260 14043579 14864843 15832886 16867191 17868148 18766666 19522226 20119643 20608433
41022 20608433 21127056 21856346 22944730 24463659 26391035 28629366 31097892 33849081
41014 33849081 37065589 40916266 45452182 50665297 56581165 63229717 70580268 78605340
41006 78605340 87399177 97134392 107852747 119298547 130878321 141641142 150293834
40999 150293834 155468481 156289737 152877386 146347543 138298676 130193553 123032425 117375718
40991 117375718 113514241 111589686 111628828 113571238 117343320 122934625 130413310 139893059
40983 139893059 151499864 165330089 181356861 199286481 218383722 237260462 253726035
40976 253726035 265004146 268545704 263135578 249525800 230079618 207713437 184913005
40969 184913005 163318281 143782645 126580594 111610494 98605546 87327507 77648135
40962 77648135 69491146 62730865 57159421 52533908 48632668 45273453 42314139 39664657
40954 39664657 37295462 35223260 33492939 32168242 31294394 30817216 30539731 30204134 29645212
40945 29645212 28863641 27966364 27071313 26266409 25605534 25101382 24727154 24435961 24171409
40936 24171409 23876341 23541958 23263859 23199584 23432316 23908345 24547903 25387727 26561938
40927 26561938 28156647 30142048 32456740 35107698 38156868 41638920 45534745 49834816
40919 49834816 54612027 60017108 66203312 73275629 81333897 90549216 101146161 113276978
40911 113276978 126921156 141890042 157816999 173979756 189040927 201025118 207770890
40904 207770890 207738423 200721649 187988964 171727613 154159548 136900427 120837783
40897 120837783 106335526 93440169 82003661 71815074 62734349 54718238 47743257
40890 47743257 41756331 36694423 32479684 28961867 25919023 23173966 20704845 18607249
40882 18607249 16936478 15587338 14324410 12945180 11449097 10054753 9016176 8395313
40874 8395313 8025317 7703711 7395371 7228057 7315058 7615725 7962743 8193949 8245162 8131109
40864 8131109 7865257 7426688 6813265 6098102 5393860 4759046 4168433 3580251 3002747
40855 3002747 2485327 2074024 1790453 1626829 1542848 1491897 1470062 1513946 1623602 1707553
40845 1707553 1635825 1344890 882862 378667 -11536 -166778 -72947 159658 387601 558453
40835 558453 734704 1012825 1456543 2098170 2937683 3897321 4804705 5469434 5793234 5808852
40825 5808852 5632159 5389879 5165952 4971623 4751089 4433259 3994444 3473707 2933831
40816 2933831 2422114 1971667 1621444 1413870 1370813 1479705 1697695 1953588 2149435 2194321
40806 2194321 2068818 1853774 1672541 1596533 1611584 1663345 1710589 1739185 1760363 1808319 1906061
40795 1906061 2006027 1985838 1737250 1258935 649420 28187 -512301 -905545 -1125055 -1220011
40785 -1220011 -1299909 -1446422 -1634580 -1742144 -1635010 -1262510 -700490 -102153 418145 849706
40775 849706 1205944 1394274 1232696 627817 -310448 -1365849 -2372605 -3218338 -3753317
40766 -3753317 -3827992 -3457051 -2860744 -2279475 -1783687 -1303558 -787952 -255507 287847 886400
40756 886400 1553039 2200964 2701575 2995159 3120215 3148850 3119269 3027145 2861814 2643478
40746 2643478 2427330 2267338 2172126 2098703 1986118 1787116 1478840 1075516 643255 274536
40736 274536 20306 -143628 -265454 -348364 -360600 -307736 -262479 -310367 -476443 -700988
40726 -700988 -865928 -849212 -593489 -154718 317464 659555 762516 587081 161436 -406128
40716 -406128 -936234 -1248746 -1250461 -959007 -456214 159208 777097 1272799 1539561 1540898
40706 1540898 1329150 1006767 662561 333111 7792 -344037 -750225 -1219461 -1723676
40697 -1723676 -2191537 -2534903 -2699321 -2695336 -2580403 -2409000 -2196983 -1931979 -1619184 -1309703
40687 -1309703 -1060684 -852465 -569395 -107649 486164 1013419 1280156 1243518 1004637 701975
40677 701975 445428 315359 348911 502196 667501 764943 809228 868420 965427 1037286 991975
40666 991975 799111 527019 291811 161078 99325 5870 -198464 -521692 -908311 -1254384
40656 -1254384 -1414722 -1253691 -748703 -48104 605038 1024873 1165541 1081878 848854 524750
40646 524750 154144 -229027 -599037 -918724 -1119688 -1120353 -885503 -481814 -73268 160818
40636 160818 135569 -94504 -404758 -717860 -1043458 -1404644 -1758208 -2017835 -2141515 -2155260
40626 -2155260 -2085721 -1914014 -1628371 -1293716 -1017855 -843842 -713935 -553245 -351206 -128417
40616 -128417 149814 570361 1161932 1809203 2299640 2468276 2321680 2049453 1904905 2022272
40606 2022272 2312025 2542549 2541424 2313710 1976588 1631929 1331407 1105747 943341 751252
40596 751252 430377 24942 -273711 -334566 -261148 -295743 -562811 -957063 -1271241 -1372346
40586 -1372346 -1247906 -950369 -548320 -112766 287948 590556 739068 703663 502810 188473
40576 188473 -194221 -611294 -1004886 -1294763 -1441034 -1481433 -1476556 -1428013 -1272185 -948321
40566 -948321 -462437 95705 577441 838131 817313 571614 223452 -117392 -383508 -541402
40556 -541402 -597961 -611643 -662858 -804031 -1049947 -1399503 -1826532 -2243812 -2513183 -2518029
40546 -2518029 -2226337 -1697276 -1061186 -494244 -156403 -94819 -197637 -265143 -147168 167808
40536 167808 567278 899378 1062340 1048682 923639 757315 563903 297573 -88437 -565800
40526 -565800 -1009840 -1267530 -1258949 -1012005 -610522 -143787 285031 558686 617520 517829
40516 517829 360171 158623 -158594 -603542 -1049992 -1350723 -1500280 -1631449 -1862564 -2186537
40506 -2186537 -2502532 -2719727 -2827147 -2890896 -2993588 -3159579 -3326225 -3389128 -3281343 -3020878
40496 -3020878 -2693260 -2376414 -2057390 -1630757 -1019453 -303078 320309 721282 944642
40487 944642 1101485 1208331 1185825 977757 603387 112960 -430562 -920134 -1229833 -1310571
40477 -1310571 -1229599 -1097568 -982983 -895866 -799610 -611937 -239180 343523 1052062 1749322
40467 1749322 2332621 2772356 3103542 3392025 3669878 3881884 3931852 3808736 3630926 3528971
40457 3528971 3511810 3486064 3379071 3192153 2946993 2638595 2257201 1824169 1391574 1020659
40447 1020659 757022 605280 530942 504740 529675 592791 606857 456778 124633 -263208
40437 -263208 -532189 -582951 -416441 -78581 384809 930066 1500889 2023253 2427079 2691339
40427 2691339 2858624 2969519 2980831 2799136 2425149 2024051 1799348 1799527 1875771 1819377
40417 1819377 1519206 1016069 463149 38439 -160609 -180809 -173031 -279401 -550290 -933202
40407 -933202 -1297310 -1487155 -1431516 -1241414 -1158261 -1352956 -1780534 -2247234 -2585487 -2727692
40397 -2727692 -2652745 -2350147 -1864808 -1324544 -872317 -566025 -344397 -71323 383817 1060738
40387 1060738 1856521 2564491 2999988 3109107 2962932 2664243 2274051 1810012 1278944
40378 1278944 698194 104635 -442474 -879529 -1176350 -1349567 -1418043 -1343917 -1044585 -486073
40368 -486073 245381 989186 1626714 2129640 2497429 2694056 2683025 2506661 2293501 2184863
40358 2184863 2263800 2521963 2842011 3021716 2893513 2473918 1971993 1609506 1434255 1323764
40348 1323764 1149621 907200 696201 610932 656809 749536 779597 682945 462428 161158
40338 161158 -160778 -425966 -555575 -516506 -341948 -89629 202113 502074 765722 970253
40328 970253 1151963 1357684 1560497 1674820 1670443 1630792 1674690 1846059 2092949 2316825
40318 2316825 2413089 2297287 1946863 1426624 845525 275161 -279617 -825602 -1307254 -1600269
40308 -1600269 -1592327 -1284229 -811990 -352442 11821 347342 801614 1473983 2314301 3109358
40298 3109358 3585627 3588383 3197379 2654609 2170400 1817076 1594959 1525782 1628747 1845551
40288 1845551 2059687 2193122 2242796 2226549 2143642 2002865 1848572 1729776 1656433 1596009
40278 1596009 1497649 1319132 1062562 805622 682243 811556 1241570 1944877 2825177 3707112
40268 3707112 4362774 4616442 4454504 4026849 3537112 3133742 2886726 2823371 2948042 3220682
40258 3220682 3536685 3759624 3800643 3672103 3451678 3190621 2873717 2474868 2020720 1562633
40248 1562633 1093374 533274 -183389 -1030301 -1909457 -2722341 -3394814 -3851371 -4010137
40239 -4010137 -3824905 -3328544 -2639373 -1933007 -1380878 -1058223 -884950 -692015 -393387
40230 -393387 -92601 12418 -162066 -490939 -753411 -811542 -665568 -369615 56304 614557
40220 614557 1249318 1800114 2054968 1879651 1325798 615469 -7673 -440037 -744148 -1024946
40210 -1024946 -1302686 -1522895 -1672066 -1840790 -2148333 -2615471 -3129509 -3532458 -3734772
40201 -3734772 -3754459 -3671790 -3556100 -3421013 -3232816 -2959109 -2612581 -2249894 -1935596 -1712678
40191 -1712678 -1588995 -1516201 -1376529 -1035860 -458188 231335 823131 1170653 1261738 1174321
40181 1174321 1003855 829158 696357 602123 508336 392849 274767 181952 120275 99122
40171 99122 163577 354433 623259 813452 752535 375568 -227992 -868593 -1352039 -1547919
40161 -1547919 -1414589 -1006868 -475700 -25192 189172 149791 -44471 -294530 -579041 -917954
40151 -917954 -1302672 -1696870 -2077168 -2418856 -2641922 -2624575 -2302564 -1741012 -1097507 -533527
40141 -533527 -167378 -70000 -249536 -624138 -1037851 -1339393 -1469126 -1479980 -1472752 -1502699
40131 -1502699 -1544026 -1544390 -1505539 -1495248 -1576535 -1739230 -1914326 -2053355 -2184410 -2384705 -2691844
40120 -2691844 -3032155 -3235650 -3140663 -2711771 -2071636 -1416059 -887230 -519527 -297612 -245961
40110 -245961 -431061 -861579 -1412411 -1892095 -2197175 -2372464 -2509527 -2624248 -2661880 -2582133
40100 -2582133 -2383836 -2066178 -1637017 -1169489 -780677 -511948 -270595 68682 529791
40091 529791 1029788 1465646 1759196 1855787 1759969 1578216 1459635 1468220 1555686 1674086
40081 1674086 1855632 2135524 2433197 2568253 2393410 1887519 1144410 322938 -401570
40072 -401570 -912772 -1233086 -1508100 -1869378 -2304917 -2674596 -2839638 -2756589 -2465232 -2040935
40062 -2040935 -1583215 -1203692 -957262 -776351 -525559 -157915 206980 395530 357876 200924
40052 200924 60132 -9487 -10922 58254 192969 332999 392503 353351 297115 324927 456926
40041 456926 618487 713748 702611 607824 451500 195838 -227735 -810854 -1402886 -1785372
40031 -1785372 -1828808 -1581512 -1223102 -946972 -860757 -944337 -1080528 -1150272 -1119379 -1027413
40021 -1027413 -896098 -676019 -291659 285700 1014403 1791933 2465858 2877748 2951886 2745816
40011 2745816 2396496 2032824 1759382 1680776 1862330 2246034 2652938 2903004 2922837 2741557
40001 2741557 2431122 2079856 1781526 1587176 1459132 1306124 1076562 798900 523404
39992 523404 244389 -104405 -585315 -1196260 -1862594 -2473899 -2939259 -3238358 -3438696 -3651546
39982 -3651546 -3946381 -4297675 -4616745 -4829544 -4915221 -4885234 -4761620 -4588006 -4430142 -4330634
39972 -4330634 -4266322 -4174696 -4031340 -3898085 -3898145 -4139099 -4629273 -5240977 -5766370 -6040423
39962 -6040423 -6021065 -5755303 -5302028 -4720972 -4106295 -3556463 -3082709 -2588481 -1977386 -1270277
39952 -1270277 -597792 -90593 213205 380266 532374 767761 1085936 1368052 1446368 1222236
39942 1222236 738935 146164 -416033 -907929 -1364129 -1786079 -2100329 -2257383 -2345256 -2544641
39932 -2544641 -2959415 -3531367 -4131518 -4690468 -5219542 -5749500 -6282263 -6767032 -7085555
39923 -7085555 -7094010 -6735655 -6110845 -5400309 -4717142 -4050844 -3339015 -2563535 -1787647 -1127627
39913 -1127627 -675845 -418811 -238139 -21608 235227 461720 619502 727198 792835 792301
39903 792301 738910 722347 835704 1079465 1356284 1539444 1531007 1285696 822262 220158
39893 220158 -407419 -941767 -1272181 -1320613 -1094745 -724651 -418520 -338808 -487052 -706348
39883 -706348 -824813 -819541 -828732 -987528 -1270539 -1518108 -1594168 -1484034 -1267111 -1064274
39873 -1064274 -1017719 -1242947 -1736684 -2344942 -2854727 -3122080 -3128981 -2971148 -2812884 -2796599
39863 -2796599 -2936170 -3115348 -3232162 -3323814 -3502015 -3786641 -4072431 -4266834 -4392897 -4524340
39853 -4524340 -4676535 -4816636 -4942241 -5066517 -5111250 -4883256 -4215433 -3121678 -1782133
39844 -1782133 -390232 944917 2150405 3108348 3676423 3788582 3518271 3050441 2595200
39835 2595200 2284074 2090675 1848715 1396659 738138 55963 -432573 -623632 -555727 -351631
39825 -351631 -155130 -79269 -162499 -369432 -646665 -961421 -1263991 -1434476 -1318463 -844715
39815 -844715 -104207 693162 1337215 1701631 1744640 1474015 942850 268997 -387216 -899567
39805 -899567 -1228837 -1397611 -1445219 -1433645 -1462130 -1618768 -1920974 -2341050 -2863541 -3443696
39795 -3443696 -3919018 -4071835 -3839822 -3403663 -3012791 -2776878 -2674400 -2681046 -2777484 -2866012
39785 -2866012 -2811945 -2602386 -2378889 -2266879 -2225548 -2106386 -1826234 -1457059 -1175965 -1139657
39775 -1139657 -1360690 -1675851 -1872397 -1881479 -1827869 -1871390 -2034024 -2208928 -2296745 -2284946
39765 -2284946 -2225663 -2205482 -2336360 -2700735 -3250936 -3777436 -4017195 -3819903 -3232301 -2452773
39755 -2452773 -1717468 -1199777 -961667 -957012 -1075636 -1209300 -1303219 -1354095 -1358764 -1275190 -1050682
39744 -1050682 -691402 -292717 4528 85501 -98149 -527242 -1130347 -1801641 -2418369 -2857381
39734 -2857381 -3019503 -2868227 -2458951 -1921396 -1399514 -997930 -763590 -682608 -677019 -628136
39724 -628136 -445160 -135532 190279 389683 374809 151202 -201705 -570967 -837987 -899508
39714 -899508 -703129 -283753 245150 757026 1180751 1518191 1819184 2147731 2541435 2968884
39704 2968884 3336626 3570179 3680875 3715483 3645872 3367476 2835577 2158414 1508340 962237
39694 962237 477606 18444 -350316 -519136 -460045 -274406 -123308 -119430 -272444 -518483
39684 -518483 -794463 -1084267 -1396007 -1708017 -1958471 -2095509 -2123523 -2089022 -2034727 -1987620
39674 -1987620 -1980166 -2039086 -2125952 -2115545 -1884277 -1437267 -924835 -520835 -305225 -273131
39664 -273131 -413115 -720858 -1139909 -1541694 -1792914 -1827189 -1643885 -1269691 -751593 -169605
39654 -169605 388133 881061 1327221 1735067 2030151 2084324 1847219 1439795 1081895 912447
39644 912447 898241 918216 893895 818249 718783 663631 773666 1129344 1636084 2049376 2178535
39633 2178535 2030418 1728865 1346774 861860 227251 -583521 -1574492 -2686317 -3739398
39624 -3739398 -4474784 -4694601 -4368811 -3627606 -2687551 -1770963 -1026039 -477042 -64734
39615 -64734 242754 388791 292111 -35408 -447739 -747252 -818468 -692739 -481655 -248792
39605 -248792 31369 377367 702334 861929 796988 591030 391878 319027 435539 728129
39595 728129 1071605 1272291 1218844 978952 700574 433008 99927 -353450 -846694 -1221239
39585 -1221239 -1373114 -1306144 -1088194 -789879 -449274 -63910 377722 835178 1199579 1373069
39575 1373069 1365026 1272695 1152868 946109 554300 -31305 -711282 -1362919 -1889576 -2186281
39565 -2186281 -2130224 -1671585 -926344 -131101 516491 968365 1291762 1559592 1788280 1958879
39555 1958879 2063898 2117829 2128514 2074055 1919136 1653842 1314850 980820 758963 752519
39545 752519 991890 1385899 1788483 2149773 2568689 3150387 3833022 4409701 4716068 4745580
39535 4745580 4588553 4336185 4077388 3919787 3933576 4076360 4215959 4232815 4085547 3797079
39525 3797079 3415306 2988949 2554061 2131958 1741619 1401150 1105664 822542 530931
39516 530931 252085 16314 -185946 -388145 -588155 -736007 -781615 -710436 -540113 -321030
39506 -321030 -142997 -91053 -157265 -212252 -91936 284661 875152 1550329 2143618 2500163
39496 2500163 2544191 2325787 1978838 1611845 1249290 890605 605257 532011 769641 1280511
39486 1280511 1904527 2442774 2714407 2579282 1988803 1052346 16073 -872520 -1486012
39477 -1486012 -1808455 -1856466 -1660327 -1303223 -913298 -593292 -382466 -285515 -296237 -382661
39467 -382661 -493454 -603804 -724862 -851898 -943860 -981883 -1005910 -1048855 -1065235 -980075 -796825
39456 -796825 -605752 -485937 -441038 -429170 -408183 -343289 -215317 -39677 154491 370353
39446 370353 625023 873759 1010912 984674 859187 701931 447077 -38988 -744631 -1445643
39436 -1445643 -1906719 -2120701 -2300183 -2637081 -3099376 -3457005 -3473555 -3070909 -2352750 -1517329
39426 -1517329 -756262 -201661 84933 115897 -25239 -223880 -411063 -609835 -888108 -1255202
39416 -1255202 -1616971 -1844007 -1873727 -1734846 -1491519 -1198156 -910494 -703196 -650064 -801014
39406 -801014 -1193299 -1855929 -2755576 -3731605 -4522141 -4890234 -4742797 -4150008 -3275295 -2278910
39396 -2278910 -1248496 -200573 835818 1734066 2308725 2479580 2387708 2310060 2439645
39387 2439645 2746023 3032885 3112416 2941258 2631129 2346865 2174545 2065258 1902470 1627951
39377 1627951 1309808 1103805 1151934 1483294 1965152 2346799 2397923 2048125 1406882 664228
39367 664228 -4143 -455661 -592414 -431255 -153732 -17315 -170421 -553791 -981936 -1296200
39357 -1296200 -1430527 -1375796 -1154413 -859198 -667308 -729983 -1006108 -1238131 -1151901 -697660
39347 -697660 -70814 507430 992710 1483321 2022560 2484538 2660291 2433946 1876587 1193578
39337 1193578 589252 168028 -50461 -47563 212788 689936 1196275 1494692 1480189 1220045
39327 1220045 809880 260023 -431263 -1149496 -1694257 -1944430 -1946424 -1831893 -1684329 -1488638
39317 -1488638 -1168578 -657318 33178 784678 1427974 1841400 1992996 1911246 1677133 1463755
39307 1463755 1503845 1914765 2537369 3007449 3032276 2598945 1922838 1237263 657696 207903
39297 207903 -96374 -223923 -162622 60617 399101 800447 1187019 1444048 1463368 1210515
39287 1210515 738291 140714 -479444 -999850 -1288417 -1272714 -997858 -599075 -233900 -54719
39277 -54719 -194561 -694023 -1420211 -2108373 -2523313 -2579477 -2323223 -1858447 -1314249 -830652
39267 -830652 -511412 -383731 -417535 -565578 -768472 -953791 -1071932 -1122876 -1115928 -1010927
39257 -1010927 -728005 -214812 502778 1305125 1988025 2337439 2277182 1953168 1616562 1401658
39247 1401658 1246786 1031349 743975 507745 485092 761300 1253789 1702044 1807656 1449428
39237 1449428 751391 -76414 -913516 -1710813 -2375343 -2786239 -2927593 -2916342 -2864626 -2769558
39227 -2769558 -2568259 -2251462 -1882102 -1536629 -1273230 -1139174 -1160866 -1314783 -1526026 -1704033
39217 -1704033 -1786320 -1770599 -1717503 -1699831 -1725331 -1722469 -1623005 -1439869 -1230756 -1000431 -693940
39206 -693940 -304910 54796 240579 225635 136736 136458 287077 526207 743427 861691
39196 861691 869093 816592 800751 918430 1194389 1538354 1794490 1860006 1760157 1598075 1435948
39185 1435948 1245997 983651 681575 438347 312682 254366 155041 -41992 -292021 -498521
39175 -498521 -597468 -593118 -524342 -412758 -260765 -104968 -44546 -172202 -463646 -769679
39165 -769679 -947753 -981928 -941038 -839279 -596406 -154781 403920 895422 1181984 1275534
39155 1275534 1308840 1419309 1644117 1898757 2043509 1972307 1650818 1104160 409176 -300815
39145 -300815 -869220 -1187829 -1228042 -999982 -521897 136539 811280 1302407 1490973 1379730
39135 1379730 1026019 469457 -265518 -1123972 -1998281 -2749397 -3255609 -3462210 -3396876 -3139168
39125 -3139168 -2786375 -2452808 -2262774 -2283192 -2447887 -2588499 -2573577 -2413157 -2225232 -2125078
39115 -2125078 -2157220 -2298952 -2491165 -2674297 -2825810 -2963315 -3086381 -3116538 -2934742 -2513987
39105 -2513987 -2008417 -1672079 -1655624 -1877704 -2107124 -2170662 -2070731 -1917172 -1796169 -1734457
39095 -1734457 -1747353 -1851227 -2020362 -2182472 -2280600 -2309043 -2274513 -2163213 -1976462 -1762546
39085 -1762546 -1564630 -1348333 -1022158 -529746 105901 817953 1527468 2126820 2474596
39076 2474596 2452928 2044859 1359449 586013 -92306 -580156 -897111 -1130168 -1358435 -1617798
39066 -1617798 -1905338 -2174188 -2327737 -2277859 -2051543 -1817183 -1760286 -1922762 -2170966 -2302586
39056 -2302586 -2166706 -1718696 -1033708 -293893 284013 563485 547218 328785 10413 -326202
39046 -326202 -614716 -822333 -968191 -1083859 -1150630 -1107514 -928240 -660790 -382054 -144562
39036 -144562 21113 92739 77374 14337 -85055 -276292 -599314 -953300 -1114217 -918344
39026 -918344 -413383 185083 659682 903067 922080 804789 687260 690931 844050 1067766
39016 1067766 1257484 1377596 1475010 1615973 1820485 2040327 2180103 2157920 1987991 1808558
39006 1808558 1778379 1904229 1994587 1836010 1418843 947031 615979 425168 230800 -66280
38996 -66280 -432779 -767956 -990398 -1066664 -1021176 -939362 -908493 -918812 -858028 -647957 -374046
38985 -374046 -242263 -403513 -833158 -1366916 -1823227 -2092602 -2147346 -2002836 -1685802 -1239710
38975 -1239710 -743720 -295871 41474 272775 437344 556996 625244 632349 578131 461814
38965 461814 275680 10450 -339731 -767095 -1226964 -1631560 -1895803 -2005322 -2031532 -2070497
38955 -2070497 -2167485 -2297712 -2406433 -2456803 -2441451 -2358417 -2185919 -1884885 -1422965 -794039
38945 -794039 -27224 802891 1576809 2172509 2534089 2693524 2711024 2604215 2356878 1992121
38935 1992121 1606636 1312337 1148155 1060664 974734 879317 837853 913232 1093016 1300667
38925 1300667 1472678 1602361 1707343 1786395 1832585 1872340 1959696 2123987 2332915 2509969
38915 2509969 2588837 2561579 2481305 2412720 2381554 2383876 2432116 2552131 2728207 2900265 3043682
38904 3043682 3201164 3381275 3464553 3293704 2859762 2325745 1840929 1391661 877404 291754
38894 291754 -229586 -538915 -624059 -623550 -707767 -940191 -1242078 -1485323 -1610983 -1657945 -1707865
38883 -1707865 -1831177 -2053676 -2312346 -2450983 -2337761 -2017918 -1690855 -1498457 -1388722
38874 -1388722 -1228637 -985859 -723951 -468305 -187650 88037 235181 173537 -22864 -206735
38864 -206735 -322416 -447386 -684889 -1052335 -1473114 -1850000 -2137211 -2350916 -2518987 -2630808
38854 -2630808 -2646010 -2541391 -2320599 -1970140 -1435030 -667443 301073 1349523 2333135
38845 2333135 3161722 3826752 4363769 4787365 5055734 5093265 4845073 4318828 3599353 2835660
38835 2835660 2182470 1706315 1345071 999623 682328 542303 715310 1164729 1696232
38826 1696232 2122163 2394522 2587719 2775701 2931219 2938460 2706403 2269924 1768039 1326745
38816 1326745 992157 779367 723260 819921 946089 922176 687747 373611 173165 170128
38806 170128 306779 472962 579496 572030 435040 193015 -128676 -553257 -1129048 -1837691
38796 -1837691 -2549162 -3092999 -3370038 -3388731 -3215628 -2922465 -2583004 -2290379 -2143903 -2203396
38786 -2203396 -2456863 -2837447 -3270817 -3700399 -4070867 -4308547 -4335871 -4098916 -3571610 -2758155
38776 -2758155 -1737906 -715359 27978 296248 120929 -260116 -566993 -638692 -480337
38767 -480337 -201328 86811 341060 579750 812305 989066 1042873 988845 970788 1187682
38757 1187682 1747244 2562859 3389514 3994176 4325926 4516375 4697446 4835229 4769287 4395570
38747 4395570 3766101 3018200 2267846 1591705 1052735 687150 481726 396191 388635 389449
38737 389449 281133 -36740 -552185 -1136470 -1630950 -1916852 -1930146 -1679091 -1266502 -839341
38727 -839341 -472391 -120645 291098 760330 1219031 1623481 1976948 2260135 2387028 2262150
38717 2262150 1874097 1323074 765351 330698 66650 -66042 -148329 -244109 -381830 -584739
38707 -584739 -887077 -1285062 -1676645 -1899090 -1868854 -1676502 -1507673 -1462164 -1477322 -1438916
38697 -1438916 -1329065 -1222262 -1147978 -1016123 -718687 -291996 57230 101766 -233429 -833833
38687 -833833 -1488716 -1989418 -2158733 -1864659 -1088553 -3457 1054367 1747460 1912438
38678 1912438 1610076 1034659 379544 -240243 -773625 -1166022 -1324858 -1177370 -768086
38669 -768086 -267107 148721 415182 571325 667623 732317 813400 983239 1268320 1612581
38659 1612581 1944860 2254157 2555167 2793226 2837327 2593094 2106380 1538662 1044208 675501
38649 675501 397732 178606 51619 85617 296114 601663 883933 1096413 1309244 1637546
38639 1637546 2112526 2611534 2918039 2871657 2483855 1921298 1381422 979486 732859 617472
38629 617472 615436 715116 890332 1099001 1306538 1501783 1675336 1779799 1734930 1503283
38619 1503283 1164777 892770 839010 1041927 1437610 1930790 2439902 2893617 3211487 3296849
38609 3296849 3059109 2476302 1661927 851545 276377 16098 -38727 -90100 -294883 -687036
38599 -687036 -1192086 -1701838 -2141350 -2470788 -2640811 -2585366 -2279714 -1775154 -1139862 -389930
38589 -389930 462211 1291645 1867296 2030753 1853193 1580505 1429386 1452715 1573680 1696591
38579 1696591 1772800 1798582 1785094 1730602 1608274 1380134 1031390 596261 150472 -224992
38569 -224992 -481699 -619174 -675765 -711120 -789005 -947531 -1155392 -1301003 -1264023 -1025541
38559 -1025541 -692092 -384554 -113631 203634 607080 1011282 1272763 1305033 1104951 706830
38549 706830 173182 -368370 -745066 -850117 -728263 -522576 -334895 -150693 111930 506946
38539 506946 1010025 1526356 1930420 2125097 2100417 1945730 1791042 1719204 1717432 1695149
38529 1695149 1543951 1198926 667484 12324 -689074 -1368144 -1964075 -2428175 -2744958
38520 -2744958 -2937836 -3043019 -3088487 -3107895 -3156651 -3288930 -3517968 -3806959 -4086328 -4265535
38510 -4265535 -4249251 -3981689 -3485206 -2840539 -2133431 -1439719 -846682 -438156 -234809 -174381
38500 -174381 -173908 -200088 -268447 -392155 -547655 -677465 -714380 -617879 -402921 -128095 145825
38489 145825 369771 483711 421458 165129 -226636 -669466 -1117582 -1563432 -2001482 -2417593
38479 -2417593 -2784792 -3035541 -3072019 -2863005 -2521982 -2231799 -2081610 -2012340 -1908436 -1679146
38469 -1679146 -1247993 -553844 371095 1358576 2191685 2723982 2897299 2700057 2180916
38460 2180916 1489840 830581 336665 7264 -239607 -476328 -714325 -895994 -928282 -760703
38450 -760703 -444540 -87974 257477 638606 1119132 1686249 2252715 2723121 3038970 3186669
38440 3186669 3191969 3094386 2902299 2576925 2071156 1375928 534966 -343290 -1072176 -1450596
38430 -1450596 -1420881 -1156417 -920797 -813559 -691703 -350470 267267 1053875 1855607 2545556
38420 2545556 3020164 3216343 3164006 2985603 2817781 2739492 2764991 2863497 2961194 2946721
38410 2946721 2712644 2216602 1521525 787582 203596 -119567 -213372 -202175 -183568 -165493
38400 -165493 -108367 11183 190479 410752 619618 730645 689657 539423 379537 259121
38390 259121 146698 15023 -86781 -76871 66155 286072 514443 719775 887888 984051
38380 984051 960656 804440 569516 361386 281566 368010 566484 752647 797947 641470
38370 641470 317261 -82972 -474050 -809011 -1065594 -1228897 -1295613 -1271564 -1140777 -845995
38360 -845995 -326309 418443 1307328 2214065 3012015 3608048 3979924 4194029 4351772 4487440
38350 4487440 4522986 4332808 3849110 3119305 2305641 1645267 1356666 1512035 1978760 2501984
38340 2501984 2851776 2903458 2636061 2125647 1540756 1070003 792613 620628 390502 15504
38330 15504 -445848 -845389 -1055748 -1054013 -934041 -839495 -857039 -948627 -978932 -817173 -435077
38319 -435077 73446 570610 988764 1367337 1763093 2131970 2332184 2254430 1922196 1451491
38309 1451491 946438 464196 49788 -255172 -449986 -581630 -688406 -748658 -695784 -473376
38299 -473376 -75643 437988 946983 1307817 1427609 1318728 1074645 785918 481990 149256
38289 149256 -216125 -592836 -964364 -1335013 -1696365 -1990067 -2132934 -2090619 -1914201 -1694660
38279 -1694660 -1489762 -1302139 -1115393 -934013 -787207 -699898 -655817 -586672 -414235 -121122
38269 -121122 226166 538731 780447 963576 1083038 1092187 952353 675692 300538 -153656
38259 -153656 -683991 -1269361 -1858250 -2383499 -2774288 -2965978 -2922000 -2645959 -2161448 -1493605
38249 -1493605 -691593 149249 933093 1637847 2298943 2891441 3262445 3229367 2748396 1964244
38239 1964244 1101753 331636 -282409 -775171 -1251254 -1814060 -2455568 -3012298 -3274492
38230 -3274492 -3162121 -2784491 -2333452 -1947497 -1677796 -1530595 -1493103 -1532561 -1616547 -1744265
38220 -1744265 -1930973 -2154191 -2341475 -2424074 -2377912 -2190846 -1814313 -1194970 -372264 478914
38210 478914 1135425 1472151 1526997 1430131 1284489 1123333 965968 870716 896642 1017305
38200 1017305 1106295 1029007 741916 298324 -218902 -742981 -1210494 -1539773 -1648801 -1499735
38190 -1499735 -1129175 -644498 -188835 115388 222447 185747 129239 184207 423273 814595
38180 814595 1214676 1422632 1294534 851659 280407 -204428 -518638 -730033 -924563 -1080329
38170 -1080329 -1098704 -937828 -669900 -404937 -205222 -96812 -120276 -316887 -670379 -1097913
38160 -1097913 -1497225 -1776248 -1851011 -1671452 -1279059 -814871 -443459 -271323 -336702 -644847
38150 -644847 -1182888 -1906399 -2727915 -3517263 -4118836 -4406558 -4359620 -4083177 -3736819 -3444106
38140 -3444106 -3270478 -3245760 -3350908 -3476886 -3443123 -3097685 -2414988 -1515706 -615879 59011
38130 59011 371809 335936 80115 -265695 -648353 -1059781 -1461842 -1777253 -1949469 -1984095
38120 -1984095 -1929660 -1845271 -1802079 -1894129 -2204953 -2729274 -3319040 -3727464 -3742790 -3306717
38110 -3306717 -2515667 -1525999 -484427 455563 1111582 1339446 1144727 704478 259102
38101 259102 -21386 -86647 28802 256182 517249 729742 818127 749233 579152 449079
38091 449079 484242 664019 808979 727999 382361 -100717 -554493 -884489 -1073024 -1128382
38081 -1128382 -1058878 -875738 -591574 -212123 264560 843417 1520777 2252573 2922439 3367481
38071 3367481 3472069 3246998 2814541 2329552 1924505 1696630 1687074 1847962 2059582 2213652
38061 2213652 2281720 2298786 2302242 2312653 2365600 2524642 2833621 3251862 3645550 3853966
38051 3853966 3776247 3409114 2822386 2120116 1422631 844718 447093 212464 102630 135168
38041 135168 358041 739855 1142973 1443158 1630840 1745586 1757356 1597010 1295269 1004786
38031 1004786 860241 880294 1026962 1278735 1585146 1813774 1839442 1686922 1527466 1528039
38021 1528039 1734637 2079088 2436472 2676998 2735060 2670072 2630244 2723594 2925695 3103997
38011 3103997 3097989 2779253 2098253 1129774 71273 -828242 -1355877 -1394513 -965185 -237854
38001 -237854 544989 1202277 1669233 1923145 1917069 1639295 1198847 774438 469643 261603
37991 261603 87773 -71875 -207024 -312847 -384135 -413265 -422742 -462819 -538957 -567872 -447510
37980 -447510 -157896 242163 702034 1215251 1769569 2311588 2784267 3171051 3484404 3738137
37970 3738137 3954751 4173908 4414506 4632569 4749854 4734959 4643681 4580983 4635106 4830276
37960 4830276 5098794 5286582 5225402 4835154 4147679 3223440 2087570 795815 -461087
37951 -461087 -1400556 -1842909 -1845300 -1619745 -1334617 -1014634 -614135 -152643 231222 356137
37941 356137 143569 -291186 -699005 -875890 -805977 -645655 -585788 -725398 -1036289 -1407187
37931 -1407187 -1727602 -1964179 -2167998 -2398930 -2653484 -2886403 -3082973 -3262469 -3405281
37922 -3405281 -3425153 -3242808 -2861878 -2351466 -1782053 -1204008 -654355 -132444 424165 1088009
37912 1088009 1846511 2585081 3181392 3599650 3882589 4074178 4173821 4159390 4033582 3837412
37902 3837412 3616979 3377004 3075907 2681550 2229805 1804507 1445441 1091763 639714
37893 639714 61142 -538746 -976166 -1102547 -892499 -455444 30798 416305 630253 656474
37883 656474 489242 138997 -331165 -816134 -1234272 -1561495 -1783952 -1838244 -1630416 -1119511
37873 -1119511 -374461 442381 1134793 1535077 1555351 1214674 626518 -43147 -621171 -971647
37863 -971647 -1043034 -886753 -610240 -295555 34281 377373 710938 1001417 1233835 1404681
37853 1404681 1490879 1445935 1226656 810298 191445 -612556 -1539064 -2472615 -3275899 -3841011
37843 -3841011 -4126304 -4161465 -4025210 -3813591 -3619248 -3522192 -3568978 -3734375 -3910288 -3968902
37833 -3968902 -3865497 -3677229 -3527346 -3472708 -3472427 -3451240 -3361925 -3181770 -2892295 -2511420
37823 -2511420 -2141242 -1932945 -1968292 -2182748 -2419742 -2554689 -2570413 -2549811 -2620356 -2867454
37813 -2867454 -3242032 -3553648 -3606723 -3365359 -2960193 -2534164 -2124597 -1702876 -1264845 -832585
37803 -832585 -405085 28202 423516 674173 679845 418414 -30195 -505281 -831939 -915250
37793 -915250 -783264 -525823 -203971 159522 526798 833366 1031703 1108073 1056661 883324
37783 883324 647926 458966 394782 446686 552602 664464 770503 877182 987097 1074694
37773 1074694 1069751 890915 524140 61540 -353968 -622543 -731405 -730406 -677739 -597457 -483752
37762 -483752 -355205 -289663 -363558 -547157 -701049 -701369 -538464 -269705 85164 554941
37752 554941 1141482 1780342 2377709 2855181 3160527 3271006 3201797 2994847 2689719 2313094
37742 2313094 1897688 1501401 1203292 1076851 1151939 1391524 1714805 2054297 2384865 2693487
37732 2693487 2935829 3033724 2906976 2509220 1861775 1074219 319667 -229838 -457128 -331563
37722 -331563 49219 446774 597619 413767 43787 -311094 -610325 -955770 -1407137 -1906954
37712 -1906954 -2384280 -2839325 -3289251 -3693616 -3980854 -4117008 -4118402 -4024567 -3880997 -3715498
37702 -3715498 -3501402 -3166348 -2662818 -2015439 -1291170 -559767 93148 558236 766126
37693 766126 757148 648276 521725 370158 161741 -59781 -166229 -56428 217867 459473
37683 459473 491896 320297 104920 -16514 -38594 -23774 880 35813 43493 -40593 -235246
37672 -235246 -498219 -782681 -1067943 -1332292 -1538223 -1658887 -1687284 -1607069 -1390274 -1048794
37662 -1048794 -658046 -289071 75671 521480 1086571 1694676 2222675 2623080 2958447
37653 2958447 3319337 3731862 4148380 4497502 4718557 4766708 4623044 4307378 3864910 3348017
37643 3348017 2837869 2468757 2366699 2527233 2787181 2957886 2973727 2887775 2757334 2589664
37633 2589664 2388955 2189825 2017331 1852210 1664631 1459222 1262553 1084939 920598
37624 920598 775823 675758 647444 706352 844269 1014028 1148151 1228376 1331010 1563379
37614 1563379 1941428 2353806 2652967 2750257 2613053 2226325 1620744 925360 323197 -78909
37604 -78909 -314363 -482930 -647530 -819524 -999822 -1182850 -1329350 -1378838 -1301030 -1120041
37594 -1120041 -893265 -686173 -558153 -543026 -642079 -858688 -1231785 -1793578 -2477212 -3094698
37584 -3094698 -3437414 -3411274 -3095427 -2700567 -2462281 -2515686 -2822819 -3222018 -3568042 -3831038
37574 -3831038 -4072705 -4359509 -4710893 -5094622 -5430889 -5606150 -5518472 -5133506 -4510947 -3796994
37564 -3796994 -3193716 -2893311 -2980452 -3365088 -3815408 -4083736 -4043002 -3745266 -3363057 -3052418
37554 -3052418 -2846799 -2672092 -2446794 -2141618 -1748174 -1239822 -601857 111759 778326
37545 778326 1265305 1490816 1449386 1191552 760877 145077 -678932 -1634026 -2512245 -3091988
37535 -3091988 -3276848 -3113778 -2726546 -2277229 -1946735 -1860703 -2006961 -2259268 -2485698 -2604932
37525 -2604932 -2558491 -2300487 -1839577 -1245133 -588127 86172 710104 1175432 1421078 1524982
37515 1524982 1663230 1968577 2438854 2964865 3416022 3704084 3802315 3731538 3531697 3242239
37505 3242239 2900273 2537841 2163243 1746354 1239630 632408 -4662 -533975 -830926
37496 -830926 -869320 -728657 -514356 -282900 -50501 155946 295798 356062 359101 325516
37486 325516 262208 192810 162259 193148 267990 374234 534034 757419 990853 1156390
37476 1156390 1240033 1309871 1445070 1672059 1967641 2286367 2565811 2735882 2766803 2716966
37466 2716966 2709339 2837030 3085532 3346029 3496760 3469504 3259392 2904601 2466439 2007032
37456 2007032 1567881 1175053 862425 660129 547010 453847 354795 334162 514278 924961
37446 924961 1491238 2140528 2851743 3577245 4187103 4552001 4652190 4550981 4277987 3798124
37436 3798124 3107519 2318388 1617238 1133914 842661 582010 188900 -356549 -911109
37427 -911109 -1298635 -1452094 -1423506 -1293326 -1124902 -1004184 -1052810 -1339283 -1779524 -2164381
37417 -2164381 -2309489 -2182157 -1890818 -1570781 -1289837 -1047612 -834108 -671239 -607113 -683590
37407 -683590 -899185 -1183581 -1416108 -1501018 -1435163 -1280461 -1064433 -740465 -266010 313030
37397 313030 892381 1401176 1817541 2109157 2233970 2235482 2282564 2542812 3014696 3531182
37387 3531182 3936453 4211149 4398346 4455182 4243239 3664411 2756184 1645393 461791
37378 461791 -678387 -1665571 -2445181 -3059245 -3580272 -4001733 -4244572 -4276708 -4169523 -4014308
37368 -4014308 -3831869 -3595071 -3294603 -2935273 -2495913 -1947238 -1307256 -642414 -11081
37359 -11081 573437 1132409 1698113 2288934 2872556 3347308 3583182 3499838 3118925 2563669
37349 2563669 2008983 1587253 1301647 1045452 733258 392171 97845 -136216 -340850
37340 -340850 -485768 -480045 -300024 -48206 153396 276685 352552 372824 295107 129573
37330 129573 -46715 -183891 -333242 -599016 -1014065 -1459967 -1708885 -1571172 -1044180 -334219
37320 -334219 278187 611478 650477 494337 282116 151873 198206 409599 652947 765858
37310 765858 696032 550923 503201 646649 939321 1267635 1546034 1756813 1915872 2018592
37300 2018592 2022826 1887852 1639493 1394452 1295168 1396986 1621886 1835735 1965970 2032990
37290 2032990 2082231 2118778 2116477 2064807 1984588 1903551 1829677 1746051 1623513 1440818 1200344
37279 1200344 925059 635463 327228 -28151 -461184 -984863 -1596267 -2284966 -3014770
37270 -3014770 -3684688 -4137645 -4261599 -4100711 -3833065 -3609758 -3432086 -3203354 -2867958
37261 -2867958 -2459766 -2038117 -1635346 -1272756 -978441 -766423 -623905 -530308 -465994 -405689
37251 -405689 -349261 -376753 -629968 -1202178 -2057541 -3065880 -4081896 -4977902 -5657816 -6096834
37241 -6096834 -6345206 -6443932 -6352700 -6010582 -5457796 -4843412 -4307884 -3901298 -3616283 -3443172
37231 -3443172 -3370503 -3379753 -3475681 -3692455 -4035974 -4437412 -4788272 -5006247 -5055062 -4937815
37221 -4937815 -4709284 -4468672 -4287864 -4147059 -3978534 -3772084 -3598601 -3529326 -3577641 -3730522
37211 -3730522 -3980045 -4279400 -4503302 -4518637 -4310016 -4006400 -3771722 -3683003 -3709634 -3774668
37201 -3774668 -3812963 -3789839 -3701458 -3575392 -3463082 -3413235 -3436865 -3494558 -3527789 -3511819 -3472540
37190 -3472540 -3444236 -3423725 -3389127 -3361585 -3413424 -3583274 -3785482 -3832030 -3572710 -3029985
37180 -3029985 -2399765 -1913956 -1691786 -1711209 -1897918 -2204897 -2591122 -2957537 -3158012 -3094327
37170 -3094327 -2788827 -2362054 -1952274 -1645032 -1439970 -1265901 -1051718 -807365 -629325
37161 -629325 -616055 -784752 -1068927 -1375002 -1640587 -1875982 -2169365 -2614129 -3191694 -3745430
37151 -3745430 -4109746 -4257234 -4289812 -4302731 -4299520 -4228153 -4041272 -3704630 -3198137 -2552505
37141 -2552505 -1870594 -1279618 -852157 -571539 -363410 -162470 31360 155439 162528 110782
37131 110782 160352 453200 979491 1556510 1945260 2014216 1822171 1555977 1383696 1357806
37121 1357806 1433608 1535609 1589407 1536988 1378201 1186341 1030657 878583 618239 189419
37111 189419 -340909 -838326 -1197658 -1373145 -1361680 -1190789 -907080 -562994 -230115 -15572
37101 -15572 -12935 -211296 -482020 -671962 -687479 -501041 -151310 230468 466926 482076
37091 482076 382716 350720 484769 784417 1228096 1777533 2331554 2780053 3123859 3462981
37081 3462981 3835438 4130772 4198306 3985943 3530920 2867534 2012556 1025919 28117 -847533
37071 -847533 -1485403 -1779705 -1658309 -1158384 -464376 168175 549255 625867 443176 76155
37061 76155 -379915 -785964 -995800 -958399 -772033 -610411 -590373 -706430 -860418 -925149
37051 -925149 -799980 -453521 67846 683812 1335382 1995313 2645439 3264993 3820341 4232219
37041 4232219 4371795 4144432 3589396 2859744 2095455 1355117 677789 147000 -161196
37032 -161196 -270112 -294416 -345073 -474857 -707518 -1070299 -1570050 -2150793 -2689882 -3033620
37022 -3033620 -3046279 -2666614 -1964424 -1150030 -485479 -130849 -57450 -127198 -260662 -500765
37012 -500765 -906842 -1440753 -2007544 -2570308 -3141274 -3656583 -3951978 -3918293 -3628756 -3252182
37002 -3252182 -2875707 -2479773 -2064349 -1712730 -1510473 -1467566 -1557655 -1785605 -2167082 -2665820
36992 -2665820 -3195030 -3667536 -4008220 -4139791 -4022991 -3728300 -3413016 -3182157 -2992639
36983 -2992639 -2730458 -2366352 -1994333 -1722761 -1574938 -1508696 -1484734 -1475323 -1432056 -1300266
36973 -1300266 -1080410 -849100 -700550 -669408 -708825 -731185 -669209 -513405 -302937 -82712
36963 -82712 127265 320051 477817 585573 671611 811372 1072341 1454311 1882281 2244465
36953 2244465 2433919 2382160 2098417 1699802 1380810 1300645 1459660 1685983 1767942 1613022
36943 1613022 1278993 873817 469229 116911 -112357 -169078 -99219 -32636 -82951 -274301
36933 -274301 -557800 -865678 -1144835 -1373177 -1567421 -1765454 -1992804 -2252228 -2533546 -2800936
36923 -2800936 -2967705 -2926157 -2638473 -2193790 -1762303 -1495870 -1462890 -1638646 -1928920 -2221045
36913 -2221045 -2447590 -2610216 -2736538 -2821824 -2820873 -2683554 -2384319 -1929038 -1352289 -703932
36903 -703932 -25392 651889 1264942 1681937 1739640 1352327 604441 -257199 -938103 -1246116
36893 -1246116 -1175404 -863999 -465756 -57060 341029 677720 851352 797657 587516 402788
36883 402788 389827 535653 692389 707673 512031 102353 -493591 -1196741 -1855589 -2303739
36873 -2303739 -2452456 -2314495 -1957935 -1475079 -984945 -608093 -406658 -359956 -398340 -437612
36863 -437612 -388034 -176744 212493 732293 1299274 1807296 2142356 2258232 2254531 2314679
36853 2314679 2527383 2811918 3047199 3217632 3385934 3578802 3771903 3957272 4149465
36844 4149465 4329859 4445073 4462129 4379859 4194274 3904733 3550879 3190917 2840692 2480417
36834 2480417 2118206 1791628 1501167 1196236 836603 417130 -71331 -637458 -1224601
36825 -1224601 -1720332 -2076818 -2376652 -2740394 -3210822 -3762191 -4365512 -4979884 -5513737
36816 -5513737 -5867777 -6016988 -6010839 -5906978 -5742159 -5539322 -5283815 -4909152 -4374692 -3757576
36806 -3757576 -3198960 -2743223 -2294740 -1764172 -1200798 -733478 -419106 -202596 -9696
36797 -9696 170929 302670 367185 405724 500909 705134 970464 1162951 1171582 1002679 756106
36786 756106 523531 330973 162304 -3675 -186318 -397084 -615705 -782569 -828928 -717211
36776 -717211 -466420 -165660 38248 10377 -274924 -706623 -1124227 -1435532 -1651516 -1829162
36766 -1829162 -2000693 -2147569 -2222068 -2197236 -2107753 -2027782 -1985372 -1910229 -1701191 -1348646
36756 -1348646 -957021 -634568 -394334 -187180 1930 144259 255799 443060 814776
36747 814776 1349310 1876996 2205173 2250778 2052345 1688044 1219087 697923 169361 -371999
36737 -371999 -990246 -1721837 -2482431 -3099299 -3447827 -3536479 -3461394 -3310340 -3113894 -2849020
36727 -2849020 -2466709 -1943964 -1338122 -778032 -379187 -168593 -93305 -80254 -77887 -68389
36717 -68389 -67254 -101063 -169480 -239586 -281047 -275323 -176018 87441 505204 900170 1012893
36706 1012893 707183 81822 -615879 -1161626 -1454220 -1509827 -1406058 -1225493 -1022093 -818107
36696 -818107 -617649 -421045 -246489 -154378 -229539 -505217 -907846 -1306189 -1615892 -1830811
36686 -1830811 -1958803 -1972798 -1849080 -1629531 -1417811 -1312009 -1340936 -1454002 -1570479 -1649303
36676 -1649303 -1710263 -1781088 -1843623 -1860247 -1837396 -1815952 -1795527 -1720041 -1567038 -1417700 -1400814
36665 -1400814 -1572762 -1865544 -2140154 -2286712 -2299681 -2271036 -2288572 -2329589 -2280712 -2071262
36655 -2071262 -1747197 -1395187 -1050443 -732311 -524417 -529195 -736957 -1016473 -1270728 -1551104
36645 -1551104 -1969871 -2523370 -3043697 -3317139 -3219672 -2751295 -2000144 -1119379 -323909 151744
36635 151744 152576 -311273 -1074443 -1911702 -2628692 -3094585 -3252972 -3148393 -2923917 -2733742
36625 -2733742 -2623817 -2507772 -2275208 -1918931 -1550544 -1303360 -1231777 -1294123 -1408436 -1513483
36615 -1513483 -1588792 -1638870 -1670360 -1677857 -1639938 -1532605 -1364734 -1204758 -1145453 -1208680 -1283404
36604 -1283404 -1189391 -829060 -276565 291131 745075 1079482 1353339 1586998 1724275 1677341
36594 1677341 1400833 948182 480129 194607 194291 399837 614370 689264 616032 462741
36584 462741 269456 39699 -202421 -410277 -577633 -760009 -1008282 -1295382 -1522178 -1592175
36574 -1592175 -1484193 -1263863 -1018999 -771942 -469087 -77740 325446 602554 688713 640531
36564 640531 548229 440304 285804 51754 -257548 -581319 -808131 -850218 -746692 -652600
36554 -652600 -680089 -778659 -821125 -786040 -795610 -973876 -1320044 -1731650 -2101666 -2363183 -2474335
36543 -2474335 -2409949 -2181070 -1847697 -1496506 -1193796 -952860 -750823 -582401 -491013 -539985
36533 -539985 -757626 -1112786 -1533133 -1944779 -2315515 -2674635 -3072599 -3498860 -3849105 -3994509
36523 -3994509 -3879792 -3543709 -3064221 -2514114 -1962007 -1476271 -1102546 -839289 -640872
36514 -640872 -449948 -242425 -53401 47398 15030 -136719 -350512 -550763 -662226 -657493
36504 -657493 -617398 -707361 -1050653 -1639048 -2387432 -3230589 -4113991 -4926855 -5526871 -5838366
36494 -5838366 -5871754 -5648975 -5177089 -4509101 -3761429 -3028465 -2315180 -1583139 -834963 -137617
36484 -137617 402067 674053 634530 378739 102902 -56053 -122401 -188016 -246762 -175140
36474 -175140 130955 648000 1253106 1811009 2212102 2364889 2211779 1786189 1244536 797911
36464 797911 570368 523086 539389 575055 694241 972377 1418584 1992953 2622721 3162023
36454 3162023 3403074 3205470 2608634 1791073 959377 311325 27987 180248 635420
36445 635420 1143470 1543044 1829706 2024781 2073907 1927290 1651751 1387598 1216567 1124546
36435 1124546 1073541 1049512 1033629 973808 814792 553443 261536 52971 12486 143748
36425 143748 396488 746090 1216389 1803069 2403451 2862436 3084373 3078457 2913986 2670412
36415 2670412 2418673 2194040 1968484 1691032 1380663 1143276 1057238 1059839 991390 761520
36405 761520 452396 252523 297956 568727 914446 1174246 1293711 1348590 1462886 1702853
36395 1702853 2041414 2404186 2733114 3013326 3256542 3457304 3554400 3447976 3083915 2525581
36385 2525581 1921988 1404434 1033115 827111 784553 847464 902015 875136 817472 842623
36375 842623 988226 1178464 1321663 1400159 1455505 1526062 1614759 1681827 1648123 1438956 1056934
36364 1056934 595168 151958 -258200 -689737 -1170746 -1635119 -1937008 -1924841 -1534684 -858641
36354 -858641 -132359 374490 498145 258755 -160436 -513136 -624430 -485865 -236201 -41282
36344 -41282 12016 -74741 -252978 -442733 -540716 -475710 -273137 -38754 130575 203930 192645
36333 192645 110010 -24186 -160035 -226983 -175105 -9200 210467 402360 512582 539534
36323 539534 512258 454140 379610 315377 294361 314697 320180 239681 48593 -208186 -444323
36312 -444323 -577950 -562710 -394487 -101729 266769 648766 975253 1186235 1256027 1215227
36302 1215227 1145480 1127151 1163256 1156459 988766 634533 178919 -273036 -669686 -983351
36292 -983351 -1154907 -1115822 -852819 -415889 125756 700851 1224229 1620083 1872220 2025476
36282 2025476 2133317 2225305 2315215 2400670 2453004 2445883 2396564 2338083 2252164 2090820 1882281
36271 1882281 1742405 1720453 1674736 1373608 720092 -159968 -1030696 -1689645 -2012108 -1943487
36261 -1943487 -1515727 -860196 -157594 457508 962183 1429104 1938256 2480287 2932295
36252 2932295 3132298 2987135 2522639 1854228 1125777 463037 -46590 -353506 -440406 -330886
36242 -330886 -102472 131447 269342 246799 23419 -411365 -991783 -1573321 -2035247 -2387040
36232 -2387040 -2734883 -3143871 -3574814 -3959051 -4281020 -4558443 -4785547 -4948047 -5081689
36223 -5081689 -5263402 -5518848 -5751115 -5777829 -5448938 -4745282 -3787117 -2764122 -1852139
36214 -1852139 -1164093 -731984 -507203 -391980 -299508 -188992 -39027 186595 510774 892356
36204 892356 1251188 1554842 1840645 2132020 2369771 2461559 2386358 2227884 2113493 2123426
36194 2123426 2224760 2268860 2086228 1629724 1021282 435119 -48160 -447491 -776877 -994845
36184 -994845 -1055205 -955080 -723311 -408437 -93195 126335 207127 177633 71490 -119927
36174 -119927 -399001 -701454 -929580 -1028479 -989645 -798392 -435242 64944 608365 1122328
36164 1122328 1602786 2047820 2368340 2413712 2101214 1505648 817620 226482 -158884 -309924
36154 -309924 -245115 -15152 298654 610893 887295 1179063 1588902 2185333 2937694 3730154
36144 3730154 4442530 5026257 5510697 5942991 6327416 6620473 6768475 6734357 6496325 6049165
36134 6049165 5425298 4707972 4009787 3428908 3009284 2719058 2465065 2158251 1790458
36125 1790458 1438392 1175536 990023 806579 578611 337063 157469 106010 214106 469514
36115 469514 810543 1139052 1352895 1373340 1162649 742486 191153 -406286 -1009839 -1605299
36105 -1605299 -2142067 -2538334 -2766524 -2890744 -2985509 -3050040 -3045489 -2991676 -2969223 -3025597 -3128268
36094 -3128268 -3219615 -3268963 -3248101 -3106415 -2825345 -2480126 -2186154 -1961343 -1675123 -1167551
36084 -1167551 -414613 439323 1198321 1735935 2013940 2048265 1912947 1758272 1751997 1959729
36074 1959729 2300566 2642824 2927619 3179509 3416302 3579938 3552433 3223113 2560276 1657025
36064 1657025 708045 -97821 -689260 -1119535 -1474140 -1793467 -2077630 -2324262 -2535102
36055 -2535102 -2697540 -2774390 -2710929 -2464781 -2058947 -1605307 -1232496 -962478 -682247 -266304
$$ [...]
##END NTUPLES=NMR SPECTRUM
##END=
