##TITLE=31Pdec_DE-18kwTFA
  CDCl3
  24 sc
 25.9.2023
##JCAMPDX= 6.0         $$ Bruker NMR JCAMP-DX V2.0
##DATA TYPE= NMR SPECTRUM
##DATA CLASS= NTUPLES
##ORIGIN= UXNMR, Bruker Analytische Messtechnik GmbH
##OWNER= root
$$ XWIN-NMR		Version 3.5
$$ Wed Sep 27 16:25:35 2023 Russian Standard Time (UT+4h)  she@DPX200
##.OBSERVE FREQUENCY= 81.013821
##.OBSERVE NUCLEUS= ^31P
##.ACQUISITION MODE= SIMULTANEOUS
##.ACQUISITION SCHEME= undefined
##.AVERAGES= 24
##.DIGITISER RES= 16
##SPECTROMETER/DATA SYSTEM= spect
##.PULSE SEQUENCE= zgpg30
##.SOLVENT NAME= CDCl3
##.SHIFT REFERENCE= (INTERNAL, CDCl3, 0, 248.564)
##AUDIT TRAIL= $$ (NUMBER, WHEN, WHO, WHERE, WHAT)
$$ ##TITLE= Audit trail, XWIN-NMR		Version 3.5
$$ ##JCAMPDX= 5.01
$$ ##ORIGIN= Bruker BioSpin GmbH
$$ ##OWNER= she
$$ F:/spectra/data/she/nmr/P31/1/pdata/1/auditp.txt
$$ ##AUDIT TRAIL=  $$ (NUMBER, WHEN, WHO, WHERE, WHAT)
(   1,<2023-09-27 16:24:46.43 +0400>,<she>,<DPX200>,
      <created by zg, POWCHK disabled, PULCHK disabled
       configuration hash MD5:
       00 E9 B6 7A A2 85 ED C7 34 08 36 98 17 FE 4E 26
       data hash MD5: 32K
       4D BC 6A 3E 87 23 1A 7B 28 87 8D F8 F7 C8 D1 7B>)
(   2,<2023-09-27 16:24:49.54 +0400>,<she>,<DPX200>,
      <Start of raw data processing
       efp BC_mod = 2 LB = 5 FT_mod = 6 PKNL = 1 PHC0 = -10626.98 PHC1 = 25.68629 SI = 64K 
       data hash MD5: 64K
       44 90 60 08 A5 9A 0A CF 2C 6F E1 8A C9 CC 38 39>)
(   3,<2023-09-27 16:25:04.89 +0400>,<she>,<DPX200>,
      <pk PHC0 = -5.1131 PHC1 = 0 
       data hash MD5: 64K
       AC 4A B4 0B B2 27 02 47 05 0F 2A CF B6 E4 BF CE>)
(   4,<2023-09-27 16:25:11.37 +0400>,<she>,<DPX200>,
      <abs ABSG = 5 
       data hash MD5: 64K
       B9 73 C1 F5 7F 48 BE AB 05 30 86 3D 0B E0 3B 44>)
$$ ##END=
$$ 
$$ hash MD5
$$ 6E A5 8D EB 1D E9 AF A6 29 6C D5 13 9F 31 D1 70
##$RELAX= 
##$RELAX= 
##$RELAX= 
##$RELAX= 
##$RELAX= 
##$RELAX= 
##$RELAX= 
##$RELAX= 
##$RELAX= 
$$ Bruker specific parameters
$$ --------------------------
##$DU= <F:/spectra>
##$EXPNO= 1
##$NAME= <P31>
##$PROCNO= 1
##$TYPE= <nmr>
##$USER= <she>
##$AMP= (0..31)
100 100 100 100 100 100 100 100 100 100 100 100 100 100 100 100 100 100 
100 100 100 100 100 100 100 100 100 100 100 100 100 100 
##$AQSEQ= 0
##$AQ_mod= 1
##$AUNM= <au_zg>
##$AUTOPOS= <>
##$BF1= 81.014009
##$BF2= 200.13
##$BF3= 200.13
##$BF4= 200.13
##$BF5= 200.13
##$BF6= 200.13
##$BF7= 200.13
##$BF8= 200.13
##$BYTORDA= 1
##$CFDGTYP= 0
##$CFRGTYP= 5
##$CHEMSTR= <none>
##$CNST= (0..31)
1 1 145 1 1 1 1 1 1 1 1 1 1 1 1 1 1 1 1 1 1 1 1 1 1 1 1 1 1 1 1 1 
##$CPDPRG= <waltz16>
##$CPDPRG1= <>
##$CPDPRG2= <waltz16>
##$CPDPRG3= <>
##$CPDPRG4= <mlev>
##$CPDPRG5= <mlev>
##$CPDPRG6= <mlev>
##$CPDPRG7= <mlev>
##$CPDPRG8= <mlev>
##$CPDPRGB= <>
##$CPDPRGT= <>
##$D= (0..31)
0 1 0 0 0 0 0 0 0 0 0 0.03 2e-05 3e-06 0 0 0 0 0 0 0 0 0 0 0 0 0 0 0 0 
0 0 
##$DATE= 1695817485
##$DBL= (0..7)
120 120 120 11 120 120 24 19 
##$DBP= (0..7)
150 150 150 150 150 150 150 150 
##$DBP07= 0
##$DBPNAM0= <>
##$DBPNAM1= <>
$$ [...]
##$SUBNAM3= <"">
##$SUBNAM4= <"">
##$SUBNAM5= <"">
##$SUBNAM6= <"">
##$SUBNAM7= <"">
##$SUBNAM8= <"">
##$SUBNAM9= <"">
##$SW= 501.771253377433
##$SWIBOX= (0..15)
0 1 3 0 0 0 0 0 0 0 0 0 0 0 0 0 
##$SW_h= 40650.406504065
##$TD= 32768
##$TD0= 1
##$TE= 0
##$TE2= 300
##$TE3= 300
##$TEG= 300
##$TL= (0..7)
0 120 53 12 22 120 120 120 
##$TP= (0..7)
150 150 150 150 150 150 150 150 
##$TP07= 0
##$TPNAME0= <>
##$TPNAME1= <>
##$TPNAME2= <>
##$TPNAME3= <>
##$TPNAME4= <>
##$TPNAME5= <>
##$TPNAME6= <>
##$TPNAME7= <>
##$TPOAL= (0..7)
0.5 0.5 0.5 0.5 0.5 0.5 0.5 0.5 
##$TPOFFS= (0..7)
0 0 0 0 0 0 0 0 
##$TUNHIN= 0
##$TUNHOUT= 0
##$TUNXOUT= 0
##$USERA1= <user>
##$USERA2= <user>
##$USERA3= <user>
##$USERA4= <user>
##$USERA5= <user>
##$V9= 5
##$VALIST= <valist>
##$VCLIST= <CCCCCCCCCCCCCCC>
##$VD= 0
##$VDLIST= <DDDDDDDDDDDDDDD>
##$VPLIST= <PPPPPPPPPPPPPPP>
##$VTLIST= <TTTTTTTTTTTTTTT>
##$WBST= 1024
##$WBSW= 4
##$XGAIN= (0..3)
0 0 0 0 
##$XL= 0
##$YL= 0
##$YMAX_a= 2124
##$YMIN_a= -1193
##$ZGOPTNS= <>
##$ZL1= 120
##$ZL2= 120
##$ZL3= 120
##$ZL4= 120
##$ABSF1= 248.5645
##$ABSF2= -253.2056
##$ABSG= 5
##$ABSL= 3
##$ALPHA= 0
##$AQORDER= 0
##$ASSFAC= 0
##$ASSFACI= 0
##$ASSFACX= 0
##$ASSWID= 0
##$AUNMP= <proc_1d>
##$AZFE= 0.1
##$AZFW= 0.5
##$BCFW= 0
##$BC_mod= 2
##$BYTORDP= 0
##$COROFFS= 0
##$CY= -3
##$DATMOD= 1
##$DC= 0
##$DFILT= <>
##$DTYPP= 0
##$F1P= 0
##$F2P= 0
##$FCOR= 1
##$FTSIZE= 65536
##$FT_mod= 6
##$GAMMA= 0
##$GB= 0
##$INTBC= 1
##$INTSCL= 6.047779e-11
##$ISEN= 30
##$LB= 5
##$LEV0= 0
##$LPBIN= 0
##$MAXI= 10000
##$MC2= 0
##$MEAN= 0
##$ME_mod= 0
##$MI= 50
##$NCOEF= 0
##$NC_proc= -10
##$NLEV= 6
##$NOISF1= 182.463
##$NOISF2= 159.3651
##$NSP= 0
##$NTH_PI= 0
##$NZP= 0
##$OFFSET= 248.5645
##$PC= 4
##$PHC0= -10632.09
##$PHC1= 25.68629
##$PH_mod= 1
##$PKNL= yes
##$PPARMOD= 0
##$PSCAL= 0
##$PSIGN= 0
##$REVERSE= no
##$SF= 81.0140089999694
##$SI= 65536
##$SIGF1= 159.3651
##$SIGF2= -187.1042
##$SINO= 113.3802
##$SIOLD= 16384
##$SREGLST= <1H.CDCl3>
##$SSB= 0
##$STSI= 65536
##$STSR= 0
##$SW_p= 40650.406504065
##$SYMM= 0
##$S_DEV= 0
##$TDeff= 32768
##$TDoff= 0
##$TI= <>
##$TILT= no
##$TM1= 0
##$TM2= 0
##$TOPLEV= 0
##$USERP1= <user>
##$USERP2= <user>
##$USERP3= <user>
##$USERP4= <user>
##$USERP5= <user>
##$WDW= 1
##$XDIM= 65536
##$YMAX_p= 242525965
##$YMIN_p= -323406576
$$ End of Bruker specific parameters
$$ ---------------------------------
##NTUPLES= NMR SPECTRUM
##VAR_NAME=  FREQUENCY,     SPECTRUM/REAL,   SPECTRUM/IMAG
##SYMBOL=    X,             R,               I
##VAR_TYPE=  INDEPENDENT,   DEPENDENT,       DEPENDENT
##VAR_FORM=  AFFN,          ASDF,            ASDF
##VAR_DIM=   65536,         65536,           65536
##UNITS=     HZ,            ARBITRARY UNITS, ARBITRARY UNITS
##FACTOR=    0.620285442955139, 1,           1
##FIRST=     20137.2065510682, 0,            0
##LAST=      -20513.1999529968, 0,           0
##MIN=       -20513.1999529968, -323406576,  0
##MAX=       20137.2065510682, 242525965,    0
$$ Real data points
##PAGE= N=1
##DATA TABLE= (X++(R..R)), XYDATA
$$ [...]
13056H593106j576772j106223m31340j17631l42663q60911j297063j406854j106072
$$ 8593106 7016334 5910111 5478771 5361140 5018477 4157566 2860503 1453649 347577
13047C47577l96571O19618J676591K419675K640206K435484K095908J832147J629909
$$ 347577 -48994 570624 2247215 4666890 7307096 9742580 11838488 13670635 15300544
13038A5300544J335108Q12647L5604q68637j600275j817704j434391p94785m44363
$$ 15300544 16635652 17448299 17483903 16615266 15014991 13197287 11762896 10968111 10523748
13029A0523748o67150j286653j919669k336030k533857k571919k457353k198069
$$ 10523748 9856598 8569945 6650276 4314246 1780389 -791530 -3248883 -5446952
13021e446952j879637j636208j523503j392558r18320J17803J477559K473514
$$ -5446952 -7326589 -8962797 -10486300 -11878858 -12797178 -12679375 -11201816 -8728302
13013h728302K484489J512676J74953q58902j359110j500468j477451j250377
$$ -8728302 -6243813 -4731137 -4556184 -5415086 -6774196 -8274664 -9752115 -11002492
13005a1002492o53742K92407J213932J595849J238902M78489j30042l21559k35099
$$ -11002492 -11656234 -11363827 -10149895 -8554046 -7315144 -6836655 -6966697 -7288256 -7523355
12996g523355q4715R0672L14008N03820N50895M43825J95058k54698r08633j551259
$$ -7523355 -7608070 -7517398 -7203390 -6699570 -6148675 -5704850 -5509792 -5764490 -6673123 -8224382
12986h224382j864023j691816j101853k39869P30543J586973K133047K371417
$$ -8224382 -10088405 -11780221 -12882074 -13121943 -12391400 -10804427 -8671380 -6299963
12978f299963K466074K484046K285795J744379J002744M36217L59116P54507J244471
$$ -6299963 -3833889 -1349843 935952 2680331 3683075 4119292 4478408 5232915 6477386
12969F477386J355899R25234K74979r0994j3112J56832m9854p04911j402329j660382
$$ 6477386 7833285 8758519 9033498 8942504 8929392 9086224 9036370 8331459 6929130 5268748
12959E268748j370676q55667n05848m05258l73414l35057m65156q58780j215522
$$ 5268748 3898072 3042405 2536557 2131299 1757885 1422828 957672 98892 -1116630
12950a116630j083706m04357L65893O89783L84539l30264j034236j372426j320022
$$ -1116630 -2200336 -2604693 -2238800 -1549017 -1164478 -1494742 -2528978 -3901404 -5221426
12941e221426j184306j162633r80866l03537N21486O26512k38110j151531r82669
$$ -5221426 -6405732 -7568365 -8549231 -8852768 -8331282 -7704770 -7942880 -9094411 -10077080
12932a0077080L74828K087628L398795M056019L949000L017151J628738M88154
$$ -10077080 -9702252 -7614624 -4215829 -159810 3789190 6806341 8435079 8923233
12924H923233q8631m19688p73176q54024l04049O03551J174842J039014L31923
$$ 8923233 8834602 8414914 7641738 6787714 6483665 7087216 8262058 9301072 9632995
12915I632995p29020k043104l379819m291762m451884l947306l161178k455749
$$ 9632995 8903975 6860871 3481052 -810710 -5262594 -9209900 -12371078 -14826827
12907a4826827j985941j689079j374838q64370q6283R22139K017569K929671L370030
$$ -14826827 -16812768 -18501847 -19876685 -20741055 -20827338 -19905199 -17887630 -14957959 -11587929
12898a1587929L264121K787184K100392J203477J70845o63752j003639r48075
$$ -11587929 -8323808 -5536624 -3436232 -2232755 -2061910 -2725662 -3729301 -4677376
12890d677376p83836n16694M5564P60682J106964Q21200K67873m2336p3005j70264
$$ -4677376 -5461212 -5977906 -5932342 -5171660 -4064696 -3243496 -2975623 -3017959 -3090964 -3261228
12880c261228n20393r43444j134100r04292k69710N00955R84761R63440O65450
$$ -3261228 -3781621 -4725065 -5859165 -6763457 -7033167 -6532212 -5547451 -4584011 -3918561
12871c918561M73157M22430K02508l45461r66634j310603j311506j117453p99542
$$ -3918561 -3445404 -3022974 -2820466 -3165927 -4132561 -5443164 -6754670 -7872123 -8671665
12862h671665l28837K14012O09686P45020P81368R90048J436975J871258J918733
$$ -8671665 -9000502 -8786490 -8176804 -7431784 -6650416 -5660368 -4223393 -2352135 -433402
12853d33402J369239L13165r25695j962050k522323k550320k191797j676176j208118
$$ -433402 935837 1249002 323307 -1638743 -4161066 -6711386 -8903183 -10579359 -11787477
12844a1787477r25776q38766p32087k52932P19087J803580K400748K270416J673139
$$ -11787477 -12713253 -13552019 -14284106 -14537038 -13817951 -12014371 -9613623 -7343207 -5670068
12835e670068R39178J68440n25732p86343l56701M61872J015595R61951N00009
$$ -5670068 -4730890 -4562450 -5088182 -5874525 -6231226 -5769354 -4753759 -3791808 -3291799
12826c291799k4549m59521p63398q83570q48505p62167n77860q8610O94284J347555
$$ -3291799 -3316348 -3775869 -4539267 -5422837 -6271342 -7033509 -7611369 -7699979 -7005695 -5658140
12816e658140J443402J038806N55174K60039Q3296j13599l38180n65121q15029
$$ -5658140 -4214738 -3175932 -2620758 -2360719 -2277423 -2391022 -2729202 -3294323 -4109352
12807d109352j038135j065337p95673l65964l6110Q4112J49403M19287R84662
$$ -4109352 -5147487 -6212824 -7008497 -7374461 -7410571 -7326459 -7177056 -6757769 -5773107
12798e773107J643637K078227K186521K196091K389872K766929L063430L070061
$$ -5773107 -4129470 -2051243 135278 2331369 4721241 7488170 10551600 13621661
12790A3621661K798869K330419J646039P04509l84858j350027j901361j879584
$$ 13621661 16420530 18750949 20396988 21101497 20716639 19366612 17465251 15585667
12782A5585667j350825o37324j95504l25148r27736j575172j864915j741554j488072
$$ 15585667 14234842 13597518 13402014 13076866 12149130 10573958 8709043 6967489 5479417
12773E479417j398977j458172j368574r30070l39843j8584j24600l43657k33322
$$ 5479417 4080440 2622268 1253694 323624 -16219 -34803 -159403 -503060 -736382
12764g36382K82012Q34050R89740O36598K9717m42998n38228k96286M4161K92542
$$ -736382 -454370 379680 1369420 2006018 2035735 1592737 1054509 758223 802384 1094926
12754A094926M59885O26864P18265N55561J54389k04817l20669l49900n58704
$$ 1094926 1554811 2181675 2899940 3455501 3609890 3405073 3084404 2734504 2175800
12745B175800q64702q60764l50538L10614N14424l2061j059665j931925k046516
$$ 2175800 1311098 450334 99796 410410 924834 892773 -166892 -2098817 -4145333
12736d145333j223326J46313J394466K116087K367612K331454K012485J435368
$$ -4145333 -5368659 -5222346 -3827880 -1711793 655819 2987273 4999758 6435126
12728F435126R24612Q48145J108412J180368P05986j66458j050855j666142j845531
$$ 6435126 7359738 8207883 9316295 10496663 11202649 11036191 9985336 8319194 6473663
12719F473663j496376p36620J11818Q28597J441780J946519K094167J679549Q77356
$$ 6473663 4977287 4240667 4352485 5181082 6622862 8569381 10663548 12343097 13220453
12710A3220453M9306o60018j269314j604888j353330n38450L23996P04167N69831
$$ 13220453 13269759 12609741 11340427 9735539 8382209 7843759 8167755 8871922 9441753
12701I441753L15267K42866J83919l59283j650416l267253m322002m244709l259123
$$ 9441753 9757020 9999886 10183805 9824522 8174106 4906853 584851 -3659858 -6918981
12692f918981j979013p15588N67707J762763K489124K536327K127294J606199
$$ -6918981 -8897994 -9613582 -9045875 -7283112 -4793988 -2257661 -130367 1475832
12684A475832J087371N32868l1266n13041q05242p55586l00768K74409M99022
$$ 1475832 2563203 3096071 3064805 2551764 1746522 990936 690168 964577 1463599
12675A463599L47069M46991J347792K726560L646881L524938K536736J144085
$$ 1463599 1810668 2257659 3605451 6332011 9978892 13503830 16040566 17184651
12667A7184651l83262j881452l074366l680620l610271k931874j789970m87555
$$ 17184651 16801389 14919937 11845571 8164951 4554680 1622806 -167164 -654719
12659f54719N05599Q62816P30120O04479Q27221J242251J367971Q71753j28199
$$ -654719 -149120 713696 1443816 2048295 2875516 4117767 5485738 6357491 6229292
12650F229292j184691j891871k113489j894466j287816l95245M71921Q82789O87501
$$ 6229292 5044601 3152730 1039241 -855225 -2143041 -2538286 -2066365 -1183576 -496075
12641d96075K78851L12866J105140K328125L311276L594802L181046K345128J341538
$$ -496075 -217224 95642 1200782 3528907 6840183 10434985 13616031 15961159 17302697
12632A7302697L24073n73639j211835j492894j364752q04021J00241J039165J576623
$$ 17302697 17626770 17053131 15841296 14348402 12983650 12179629 12279870 13319035 14895658
12623A4895658J432590O72799l56323j217803j565025j310956o92778o6627M24720
$$ 14895658 16328248 17001047 16644724 15426921 13861896 12550940 11858162 11791535 12216255
12614A2216255Q96364J413311J796065J831628J539525J081028M91440l42880
$$ 12216255 13112619 14525930 16321995 18153623 19693148 20774176 21265616 20922736
12606B0922736j467682k708101l678338l907060l139429j698132m14240N1893
$$ 20922736 19455054 16746953 13068615 9161555 6022126 4323994 3909754 3961647
12598C961647j95825n42316o28746o21115p45963q72877o87057q4631P31835J432532
$$ 3961647 3765822 3223506 2594760 1973645 1227682 354805 -332252 -416883 314952 1747484
12588A747484J758612J666123J352378J053930P92233M21473r4182o24753j086444
$$ 1747484 3506096 5172219 6524597 7578527 8370760 8792233 8698051 8073298 6986854
12579F986854j477880j671454j454612r11320m97758n35510q35886j031736j061400
$$ 6986854 5508974 3837520 2382908 1471588 973830 438320 -397566 -1429302 -2490702
12570b490702j052537r27978n02906J06032N54278P78478J088872J662155K240447
$$ -2490702 -3543239 -4471217 -4974123 -4868091 -4313813 -3535335 -2446463 -784308 1456139
12561A456139K471911K302165J874003J270422N61320p4186n08794q44730j213228
$$ 1456139 3928050 6230215 8104218 9374640 9935960 9861774 9352980 8508250 7295022
12552G295022j477139j364444q61695k36601L41929R53462J599815J953810J639767
$$ 7295022 5817883 4453439 3591744 3355143 3697072 4650534 6250349 8204159 9843926
12543I843926O90499m24796j192129j378591j067500n63162k52496l53946o98078
$$ 9843926 10534425 10109629 8917500 7538909 6471409 5908247 5655751 5301805 4603727
12534D603727q62990o17655j58337J54923J89036O1283j22527l76850p01090r94122
$$ 4603727 3740737 3123082 2964745 3119668 3308704 3369987 3247460 2870610 2169520 1175398
12524A175398j135665j042834o37721R5373R58213J570075J663718J314659Q35364
$$ 1175398 39733 -1003101 -1640822 -1545449 -587236 982839 2646557 3961216 4796580
12515D796580N07578M46553O05424Q02774Q15680N69143K19461k9065j64121l46685
$$ 4796580 5304158 5750711 6356135 7158909 7974589 8543732 8763193 8734128 8570007 8223322
12505H223322o83138j103475j450704j600085j484761j095884n12668R3536N19747
$$ 8223322 7540184 6436709 4986005 3385920 1901159 805275 292607 386143 905890
12496I05890O19268L73789q9272n76781r61611j224135j363847j332518j096675
$$ 905890 1525158 1898947 1809675 1232894 271283 -952852 -2316699 -3649217 -4745892
12487d745892p15384k98623Q7051M34207P36935R24192Q16851K12533q17185j695812
$$ -4745892 -5461276 -5759899 -5672848 -5238641 -4501706 -3577514 -2760663 -2548130 -3365315 -5061127
12477e061127j665007n59870Q48513J509410J070126O2828p63810j031873p07126
$$ -5061127 -6726134 -7286004 -6437491 -4928081 -3857955 -3795127 -4558937 -5590810 -6297936
12468f297936J25699J250839K285361K894524L013536K761382K232046J505561
$$ -6297936 -6172237 -4921398 -2636037 258487 3272023 6033405 8265451 9771012
12460I771012P88141L47467K47201K29922n4137o70530j249198j254873m81191
$$ 9771012 10559153 10906620 11153821 11383743 11329606 10659076 9409878 8155005 7673814
12451G673814P14393J700422K056290J714752P52878o94817k259039l337607l527068
$$ 7673814 8388207 10088629 12144919 13859671 14612549 13917732 11658693 8321086 4794018
12442D794018l014228k383773k038324j890123j575689q55775J79717J177537
$$ 4794018 1779790 -603983 -2642307 -4532430 -6108119 -6963894 -6784177 -5606640
12434e606640J750740J722124J218942N63661Q5622j5094K48082O25832P74852
$$ -5606640 -3855900 -2133776 -914834 -351173 -265551 -280645 -32563 593269 1368121
12425A368121N29514L6286m00544n52414l33667K26339R45359J486666J558119
$$ 1368121 1897635 1933921 1533377 980963 647296 873635 1818994 3305660 4863779
12416D863779J158594N74204J31356k1151M0660Q8420r3145m95419q52164r18002
$$ 4863779 6022373 6596577 6727933 6706782 6747442 6835862 6742717 6247298 5395134 4477132
12406D477132p57767o25647n57270k60947M87426J470368K202364K429169K299432
$$ 4477132 3719365 3093718 2536448 2275501 2762927 4233295 6435659 8864828 11164260
12397A1164260K032831J599821Q70930p198n98201o07058j96002K18526L73671
$$ 11164260 13197091 14796912 15667842 15660644 15062443 14455385 14259383 14477909 14851580
12388A4851580K57063o1273m65695p13355n87118j98169P6140L5927j70803m06184
$$ 14851580 15108643 15047370 14581675 13868320 13281202 13083033 13159173 13195100 13024297 12618113
12378A2618113p89262j371327j806186j668307r89543j78955N03709J044361J268522
$$ 12618113 11828851 10457524 8651338 6983031 5993488 5814533 6318242 7362603 8631125
12369H631125P76793m93685j898740k549165k095389r54725J21573N80468K94463
$$ 8631125 9407918 8914233 7015493 4466328 2370939 1416214 1537787 2118255 2412718
12360B412718n01403j401092k010892k062613j513029o47397O561O9420l46404
$$ 2412718 1911315 510223 -1500669 -3563282 -5076311 -5723708 -5717147 -5647727 -5994131
12351e994131p98430j009857j059633j101355j114391j002795p51869l86023P5793
$$ -5994131 -6792561 -7802418 -8862051 -9963406 -11077797 -12080592 -12832461 -13218484 -13142691
12342a3142691N29901Q08498R01159J017621J311953J658638J801291J609048
$$ -13142691 -12612790 -11804292 -10903133 -9885512 -8573559 -6914921 -5113630 -3504582
12334c504582J120270N12345J41137L96137J293322K321796K884951K816004K335902
$$ -3504582 -2384312 -1871967 -1730830 -1334693 -41371 2280425 5165376 7981380 10317282
12325A0317282J678313R73978L48864j55862o85103j306363j699790j435299n89350
$$ 10317282 11995595 12969573 13318437 13162575 12477472 11171109 9471319 8036020 7446670
12316G446670K08512M25243Q7687m43936q75083j041720q84037n89188n62941
$$ 7446670 7655182 8080425 8168112 7724176 6849093 5807373 4923336 4334148 3771207
12307C771207j002598j594572j846110j644436j288557j022713p62572l09975
$$ 3771207 2768609 1174037 -672073 -2316509 -3605066 -4627779 -5390351 -5700326
12299e700326L36195R47626J237988J034653M04697l07268o45471l63025L90043
$$ -5700326 -5364131 -4416505 -3178517 -2143864 -1739167 -2046435 -2691906 -3054931 -2664888
12290b664888J198724J682454J689888J323178Q89912P87079J242776K047010
$$ -2664888 -1466164 216290 1906178 3229356 4119268 4906347 6149123 8196133
12282H196133K611833K442425J563216M06392o71249j611104k419482k960315
$$ 8196133 10807966 13250391 14813607 15219999 14548750 12937646 10518164 7557849
12274G557849l117966k996028k761891k382719j699158p15358L38549J183401
$$ 7557849 4439883 1443855 -1318036 -3700755 -5399913 -6115271 -5776722 -4593321
12266d593321J594548J443417Q77874M02764M67797R01123J012710L94186n74429
$$ -4593321 -2998773 -1555356 -677482 -274718 193079 1094202 2106912 2501098 1926669
12257A926669j144734r67324l28972J96771J81193m10742j175649j531308j211462
$$ 1926669 781935 -185389 -514361 -317590 -136397 -547139 -1722788 -3254096 -4465558
12248d465558n23590m0363p0420m74625q81141r60560n93209N9097O61454R99678
$$ -4465558 -4989148 -5029511 -5099931 -5574556 -6455697 -7416257 -8009466 -7950369 -7288915 -6289237
12238f289237J154516J325277J555121J715774J672027J356689P97151K12525
$$ -6289237 -5134721 -3809444 -2254323 -538549 1133478 2490167 3287318 3499843
12230C499843m7451J05736K33632k27970j265577k220652k503838k169069j665761
$$ 3499843 3452392 3558128 3791760 3563790 2298213 77561 -2426277 -4595346 -6261107
12221f261107j226239p13632P230P73174J253694J276925R64117N69890K31748
$$ -6261107 -7487346 -8200978 -8193748 -7420574 -6166880 -4889955 -3925838 -3355948 -3124200
12212c124200r8733m77861p80703p73740l93210J10650L50558J12106n02751j178569
$$ -3124200 -3222933 -3700794 -4481497 -5255237 -5648447 -5537797 -5187239 -5075133 -5577884 -6756453
12202f756453j592501j558826j062340k41846O23899J194404J281173J033432
$$ -6756453 -8348954 -9907780 -10970120 -11211966 -10588067 -9393663 -8112490 -7079058
12194g079058Q06968P77630P80409O07989L23445R6811j64406p41260j615302
$$ -7079058 -6272090 -5494460 -4714051 -4106062 -3782617 -3685806 -3850212 -4591472 -6206774
12185f206774k300134k314271j689721q62176j43300N32452J354921K293409L083491
$$ -6206774 -8506908 -10821179 -12510900 -13373076 -13516376 -12983924 -11629003 -9335594 -6252103
12176f252103L490673L486066L140029K439027J345533M7133j027509j577951
$$ -6252103 -2761430 724636 3864665 6303692 7649225 7696358 6668849 5090898
12168E090898j719473j745722j691534j353615p15906p9021L13458N33094P15974
$$ 5090898 3371425 1625703 -65831 -1419446 -2135352 -2214373 -1900915 -1367821 -651847
12159f51847P85040O44134M89449O47153J134188J610636J778011J626798J260841
$$ -651847 133193 777327 1266776 1913929 3048117 4658753 6436764 8063562 9324403
12150I324403O85705j11493r97181j742692k214678k453357k592795k744535k917970
$$ 9324403 10010108 9898615 8901434 7158742 4944064 2490707 -102088 -2846623 -5764593
12141e764593k996765k801867k227409j358408m83984K6555l2121m69515p34272
$$ -5764593 -8761358 -11563225 -13790634 -15149042 -15633026 -15606471 -15638592 -16108107 -16842379
12132a6842379l26341P20097J790857K215271J888905J372885J333841J846584
$$ -16842379 -17168720 -16448623 -14657766 -12442495 -10553590 -9180705 -7846864 -6000280
12124f000280K273063J902199P20910n28105j079109q19104j63685N71090J425059
$$ -6000280 -3727217 -1825018 -1104108 -1632213 -2711322 -3530426 -3694111 -3123021 -1697962
12115a697962K436769L307196L609229L256199K626694K224156K246343K433724
$$ -1697962 738807 4046003 7655232 10911431 13538125 15762281 18008624 20442348
12107B0442348K304303J627217P36238K79073N39601J076160J164582N46370m17296
$$ 20442348 22746651 24373868 25110106 25389179 25928780 27004940 28169522 28715892 28298596
12098B8298596j276873j926861k448867k788591k810133k551101k198906j849862
$$ 28298596 27021723 25094862 22645995 19857404 17047271 14496170 12297264 10447402
12090A0447402j486033j178394j098068j262604j447624j455503j346746j295682
$$ 10447402 8961369 7782975 6684907 5422303 3974679 2519176 1172430 -123252
12082a23252j313388j227016q75687k56270M36535Q48230O94285J07604l67352
$$ -123252 -1436640 -2663656 -3539343 -3795613 -3359078 -2510848 -1816563 -1708959 -2076311
12073b076311l38466m9516o2478m89614q13843n15711L75896J425312K197325
$$ -2076311 -2414777 -2464293 -2526771 -3016385 -3830228 -4345939 -3970043 -2544731 -347406
12064c47406K390217J878706R18571J18157j29854j15964m14542j057132j431953
$$ -347406 2042811 3921517 4840088 4958245 4828391 4712427 4297885 3240753 1808800
12055A808800j063810j95488N46939Q43276Q65831R43519J231850J637746J913657
$$ 1808800 744990 549502 1096441 1939717 2805548 3749067 4980917 6618663 8532320
12046H532320J849612J461622R60223M97140L0038n16815j083442j541435j781268
$$ 8532320 10381932 11843554 12803777 13300917 13330955 12814140 11730698 10189263 8407995
12037H407995j622718q40279M71105J676461K087541J715746J257881J219323
$$ 8407995 6785277 5944998 6416103 8092564 10180105 11895851 13153732 14373055
12029A4373055J303742Q70751j87192j298793j888978j938517j816151j764587
$$ 14373055 15676797 16547548 16360356 15061563 13172585 11234068 9417917 7653330
12021G653330j709774j496357j142930q17375o43002o17473p15340r64004j324641
$$ 7653330 5943556 4447199 3304269 2486894 1843892 1226419 511079 -452925 -1777566
12012a777566j547821j305170n31606M59104J265836J701944J726237J257285
$$ -1777566 -3325387 -4630557 -5162163 -4703059 -3437223 -1735279 -9042 1248243
12004A248243L30441n98123q54751k62549N23468O33892j09609j081959j601158
$$ 1248243 1578684 980561 125810 -136739 386729 1020621 911012 -170947 -1772105
11995a772105j573479j367741j273237j248511j123044q87188p46426r19308j359797
$$ -1772105 -3345584 -4713325 -5986562 -7235073 -8358117 -9245305 -9991731 -10911039 -12270836
11986a2270836j663871j334870k42190J194406K350806K932776L120581L218885
$$ -12270836 -13934707 -15269577 -15511767 -14317361 -11966555 -9033779 -5913198 -2694313
11978b694313L280488L116520K570793J675750N90876m66570j214388j410211
$$ -2694313 586175 3702695 6273488 7949238 8540114 8073544 6859156 5448945
11970E448945j127685q58389j120053j878744k490823k335170j435197l62679
$$ 5448945 4321260 3462871 2342818 464074 -2026749 -4361919 -5797116 -6159795
11962f159795L79846P24888Q56737R02682Q83848P96053N97390K03092l74176
$$ -6159795 -5779949 -5055061 -4198324 -3295642 -2411794 -1615741 -1018351 -815259 -1189435
11953a189435r07876j071947o68260K62754J447394K433700K807712K557956K165042
$$ -1189435 -2097311 -3169258 -3837518 -3574764 -2127370 306330 3114042 5671998 7837040
11944G837040K115182K321448K237906J591294P62165K91185J94728L334o02421
$$ 7837040 9952222 12273670 14511576 16102870 16865035 17156220 17350948 17354282 16751861
11935A6751861j443838k141503k519690k599853k380658j851796j194608p50689
$$ 16751861 15308023 13166520 10646830 8046977 5666319 3814523 2619915 1869226
11927A869226o79446p49102o04810k21833M7688p0905l98380n13285k92608p4537
$$ 1869226 1189780 440678 -164132 -385965 -338277 -409182 -807562 -1320847 -1613455 -1687992
11917a687992k33161p21206j131043j119552o64081P473N53280O15391M5387q12297
$$ -1687992 -1921153 -2642359 -3773402 -4892954 -5557035 -5549562 -4996282 -4380891 -4335504 -5147801
11907e147801j216666o46643O49858J839408K255872J902761J260650P76809O02541
$$ -5147801 -6364467 -7011110 -6361252 -4521844 -2265972 -363211 897439 1674248 2276789
11898B276789O65856Q30315J002387J181111J394805J538822J339997N95469n65319
$$ 2276789 2942645 3772960 4775347 5956458 7351263 8890085 10230082 10825551 10260232
11889A0260232j750931k629648l090682l122712k706612j900319r10895J5355
$$ 10260232 8509301 5879653 2788971 -333741 -3040353 -4940672 -5851567 -5836212
11881e836212P18879J109343J147773R45407P63787P53532P44978M62756p0887
$$ -5836212 -5117333 -4007990 -2860217 -1914810 -1151023 -397491 347487 810243 739356
11872G39356n18919o30994m84345k70316l7719K08342L08821Q5348l51610o27902
$$ 739356 220437 -410557 -894902 -1165218 -1202937 -994595 -685774 -600426 -952036 -1579938
11862a579938m79082M8295P94829J672915K487627K729178J868577r811k017529
$$ -1579938 -2059020 -2010725 -1215896 457019 2944646 5673824 7542401 7532590 5515061
11853E515061l074771k735766j400487J64744J368197J938863J838536J245841
$$ 5515061 2440290 -295476 -1695963 -1531219 -163022 1775841 3614377 4860218
11845D860218N49105J35353J01829K47343L75924N16624P87685J140219J362028
$$ 4860218 5409323 5544676 5646505 5893848 6269772 6786396 7574081 8714300 10076328
11836A0076328J315396J051360O65054J55960m87675j154526j693352k104914
$$ 10076328 11391724 12443084 13108138 13264098 12776423 11621897 9928545 7823631
11828G823631k497969k806836k704281j951023p93114J42937M09768J36433j54759
$$ 7823631 5325662 2518826 -185455 -2136478 -2929592 -2786655 -2376887 -2240454 -2395213
11819b395213p1951L21943O38621N64747J52147k70682m84385o43221j082992
$$ -2395213 -2467164 -2145221 -1506600 -941853 -789706 -1060388 -1544773 -2187994 -3270986
11810c270986j867504k615282k815257k260575j170406N926Q58960J226372J268868
$$ -3270986 -5138490 -7753772 -10569029 -12829604 -14000010 -13994084 -13135124 -11908752 -10639884
11801a0639884J305504J477302J592350J364042P53984L459o17805r91406j122559
$$ -10639884 -9334380 -7857078 -6264728 -4900686 -4146702 -4143243 -4761048 -5752454 -6875013
11792f875013j064422q91965o76962m70330l19231k27509m8383M44052J204654
$$ -6875013 -7939435 -8831400 -9508362 -9978692 -10297923 -10525432 -10573815 -10129763 -8925109
11783h925109J723974J427861L11248r86176j746462j649490p36153P48137K294018
$$ -8925109 -7201135 -5773274 -5462026 -6448202 -8194664 -9844154 -10580307 -9832170 -7538152
11774g538152L198678L053252K143609J157948N12892J42442r7297j01560K57110
$$ -7538152 -4339474 -1286222 857387 2015335 2528227 2670669 2573372 2471812 2728922
11765B728922P26286P19610j47773j594545k801771l072479k401647j386503o02519
$$ 2728922 3455208 4174818 4027045 2432500 -369271 -3441750 -5843397 -7229900 -7832419
11756g832419j54382J66658M72502O86719P69743Q24217R45132J112033J287699
$$ -7832419 -7986801 -7820143 -7347641 -6660922 -5891179 -5066962 -4121830 -3009797 -1722098
11747a722098J502176J732508J750792J220274K7076j471008k584981k793313
$$ -1722098 -219922 1512586 3263378 4483652 4510728 3039720 454739 -2338574
11739b338574k168776j279422o38497l13773j04545N2093L8688j28305j78149
$$ -2338574 -4507350 -5786772 -6425269 -6739042 -6843587 -6791494 -6752806 -6881111 -7059260
11730g059260J00632N29655O56786K20800n32902j022004q54655k25907K50638
$$ -7059260 -6958628 -6428973 -5772187 -5551387 -6084289 -7106293 -7960948 -8186855 -7936217
11721g936217J58608l28456p39402q82302r41332j043892j012439o69659j66495
$$ -7936217 -7777609 -8106065 -8845467 -9727769 -10669101 -11712993 -12725432 -13395091 -13561586
11712a3561586K21950N14533R74297J635471K126388K088327J618201J127663
$$ -13561586 -13339636 -12825103 -11850806 -10215335 -8088947 -6000620 -4382419 -3254756
11704c254756Q35051N91814K34064r4379j25517J22726L19111K10747j36347n45726
$$ -3254756 -2419705 -1827891 -1593827 -1688206 -1813723 -1690997 -1371886 -1161139 -1297486 -1843212
11694a843212r88774j480315j850113j840302j414961q06815k58858J37103L71320
$$ -1843212 -2831986 -4312301 -6162414 -8002716 -9417677 -10224492 -10483350 -10346247 -9974927
11685i974927M79344N98380Q63040J170664J219509Q76180L66964K0787l3895
$$ -9974927 -9495583 -8897203 -8034163 -6863499 -5643990 -4767810 -4400846 -4380059 -4413954
11676d413954J58263N08082Q27741Q35901M63102O8590J13788O23697J139022
$$ -4413954 -4255691 -3747609 -2919868 -2083967 -1620865 -1552275 -1438487 -814790 324232
11667C24232J183325O36096k81075j159564j555422j245164m40732L86539R51683
$$ 324232 1507557 2143653 1862578 703014 -852408 -2097572 -2538304 -2151765 -1200082
11658a200082J298797J501452J463062J146653Q06167P63587J017381J257647
$$ -1200082 98715 1600167 3063229 4209882 5016049 5779636 6797017 8054664
11650H054664J265544J146671J126329J217260J170067P34382p5989r86298j690597
$$ 8054664 9320208 10466879 11593208 12810468 13980535 14714917 14638928 13652630 11962033
11641A1962033k022440j914808j345982m77921K28487K91978k80510r06323r81303
$$ 11962033 9939593 8024785 6678803 6200882 6429369 6721347 6440837 5534514 4553211
11632D553211m41308L26406R92700J477743J664167J233374L3088j475055k409457
$$ 4553211 4111903 4438309 5431009 6908752 8572919 9806293 9839381 8364326 5954869
11623E954869k253283j347636m70905K03L19995P91235J261557J400979J264806
$$ 5954869 3701586 2353950 1883045 1883248 2203243 2994478 4256035 5657014 6921820
11614F921820J239038J453157J569313J251995O03391m485l39327l98418k61763
$$ 6921820 8160858 9614015 11183328 12435323 13038714 13034229 12694902 12296484 12034721
11605A2034721p2665r9906o17640j657533k902140l816969l959489l329930k431185
$$ 12034721 11962056 11862150 11244510 9586977 6684837 2867868 -1091621 -4421551 -6852736
11596f852736j780058j309570n02966P80720J928655K254131J788656J099505
$$ -6852736 -8632794 -9942364 -10445330 -9664610 -7735955 -5481824 -3693168 -2593663
11588b593663N64521K18206J20536L54956O67969O06284J35145k72440k86675
$$ -2593663 -2029142 -1810936 -1690400 -1335444 -667475 -61191 73954 -198486 -485161
11579d85161p8936J18310L96856Q53442J218715J126958N43293l28156j318407
$$ -485161 -564097 -445787 -48931 804511 2023226 3150184 3693477 3365321 2046914
11570B046914k192910k528254k073238j120367k12080M00648P31310P10533L09517
$$ 2046914 -145996 -2674250 -4747488 -5867855 -6079935 -5679287 -4947977 -4237444 -3927927
11561c927927r3299K8806O68904J281221J528696J605542J686348J528589R31377
$$ -3927927 -4021226 -3992420 -3323516 -2042295 -513599 1091943 2778291 4306880 5238257
11552E238257K36453k2147K14575N55816P30120P96005Q39226P86231N76057K96578
$$ 5238257 5474710 5452563 5667138 6222954 6953074 7749079 8588305 9374536 9950593 10247171
11542A0247171P7249j9598K3677J88283L97264N99091Q55458J200689J409923
$$ 10247171 10324420 10304822 10328499 10516782 10914046 11513137 12368595 13569284 14979207
11533A4979207J081547N1813j332093k403119k626422j924124o89636M79208J151550
$$ 14979207 16060754 16112567 14780474 12377355 9750933 7826809 7137173 7616381 8767931
11524H767931J250155R17284L08360l84466q25397p13037j39171M06020N08010
$$ 8767931 10018086 10935370 11243730 10859264 10033867 9320830 9181659 9587679 10095689
11515A0095689K19240q6514j25063J30348N60220J011321J351198J551733J682016
$$ 10095689 10314929 10228415 10103352 10233700 10793920 11805241 13156439 14708172 16390188
11506A6390188J693215J282052J85916j354589k632934l097123k820910k270495
$$ 16390188 18083403 19365455 19551371 18196782 15563848 12466725 9645815 7375320
11498G375320j749698j248650p51295m35245m69615p47599r52474q73806n94430
$$ 7375320 5625622 4376972 3625677 3190432 2720817 1973218 1020744 146938 -447492
11489d47492l73084l92421o28235r13315j065790r46062m79151K45062Q74602
$$ -447492 -820576 -1212997 -1841232 -2754547 -3820337 -4766399 -5245550 -5000488 -4125886
11480d125886R53539L38883n56989j068950q69823k20479L39952M71072K41777
$$ -4125886 -3172347 -2833464 -3390453 -4459403 -5329226 -5549705 -5209753 -4738681 -4496904
11471d496904K2948K07203Q84629J692059K066301J741757R58414J54509m20429
$$ -4496904 -4473956 -4266753 -3382124 -1690065 376236 2117993 3076407 3230916 2810487
11462B810487p05078o11182n3553Q01771J520588J742886J483628J044666O78339
$$ 2810487 2105409 1494227 1440674 2242445 3763033 5505919 6989547 8034213 8712552
11453H712552L87159M0574l55215n68923l96784J8503K57741P4738l53679p24885
$$ 8712552 9099711 9140285 8785070 8216147 7819363 7837866 8095607 8170345 7816666 7091781
11443G091781j007236j355207j738072j913316j771073j472865j195499r30969
$$ 7091781 6084545 4729338 2991266 1077950 -693123 -2165988 -3361487 -4292456
11435d292456o01629j90700L08648Q82909J351957J441063J125845O93535K81800
$$ -4292456 -4894085 -5084785 -4776137 -3893228 -2541271 -1100208 25637 719172 1000972
11426A000972m21163j712459l216449m036805l629509k309182q53038J66022N79789
$$ 1000972 579809 -1132650 -4349099 -8385904 -12015413 -14324595 -15177633 -15011611 -14431822
11417a4431822M40479q8984p14474j104871j103497q05447m05641j815M43332
$$ -14431822 -13991343 -14080327 -14794801 -15899672 -17003169 -17808616 -18214257 -18216072 -17772740
11408a7772740R73967J506154J843752J844469J566727J241399J097833J201018
$$ -17772740 -16798773 -15292619 -13448867 -11604398 -10037671 -8796272 -7698439 -6497421
11400f497421J411246J487904J301462J016848J036743J660272K737904L671546
$$ -6497421 -5086175 -3598271 -2296809 -1279961 -243218 1417054 4154958 7826504
11392G826504L785496K765114Q61168j238602k793101l423773l261216k705147
$$ 7826504 11612000 14377114 15238282 13999680 11206579 7782806 4521590 1816443
11384A816443k055388j384684o92096m9962M31843O92665P07157M50039l0556
$$ 1816443 -238945 -1623629 -2315725 -2365687 -1933844 -1241179 -534022 -83983 -114539
11375a14539n24594p65222o97432n84969p38250j121468j335812j061925m34905
$$ -114539 -639133 -1404355 -2101787 -2686756 -3425006 -4546474 -5882286 -6944211 -7379116
11366g379116J28629M15156N76730Q33920J209869J614015J998730K303009K392718
$$ -7379116 -7250487 -6835331 -6258601 -5424681 -4214812 -2600797 -602067 1700942 4093660
11357D093660K238942K062206K089386K183814J905209R79577m02071j741975
$$ 4093660 6332602 8394808 10484194 12668008 14573217 15552794 15150723 13408748
11349A3408748k547239k504659j595168j95960J046157J623615J482496R17939
$$ 13408748 10861509 8356850 6761682 6565722 7611879 9235494 10717990 11635929
11341A1635929K47531l39407p28251q79629r21422j092558j479348j853441j872107
$$ 11635929 11883460 11544053 10815802 9936173 9014751 7922193 6442845 4589404 2717297
11332B717297j443991q25189l42995j08661m3796q2540k05043k86683p3674N82556
$$ 2717297 1273306 448117 105122 -3539 -47335 -129875 -334918 -621601 -695275 -112719
11322a12719J481343K095819J868290O09368j223513k649881k780893j482867
$$ -112719 1368624 3464443 5332733 5942101 4718588 2068707 -712186 -2195053
11314b195053N53502K369867L291748L080100J921856M20961p07008j217601j474971
$$ -2195053 -1641551 728316 4020064 7100164 9022020 9442981 8735973 7518372 6043401
11305F043401j816926k016918j687847j003670n53753n30577n41775l06261p7893
$$ 6043401 4226475 2209557 521710 -481960 -1035713 -1566290 -2108065 -2414326 -2492219
11296b492219j78196m91877o94871o80174m64966N2036Q60308J525168J527162
$$ -2492219 -2670415 -3162292 -3857163 -4537337 -5002303 -4950267 -4089959 -2564791 -1037629
11287a037629R32462M14200N32089J196339J883240K168778J970070J452360Q60086
$$ -1037629 -105167 309033 841122 2037461 3920701 6089479 8059549 9511909 10371995
11278A0371995L78404L7395k69915o43948j040982j276406j173962p34123j46104
$$ 10371995 10750399 10787794 10517879 9873931 8832949 7556543 6382581 5648458 5502354
11269E502354L90897Q10956J080033J044332N80045j00039n20442m28806l6867
$$ 5502354 5893251 6704207 7784240 8828572 9408617 9308578 8788136 8359330 8322463
11260H322463L08408M68933L84200j29217j126173k220737k882956l035756l048993
$$ 8322463 8630871 9099804 9484004 9354787 8228614 6007877 3124921 89165 -2959828
11251b959828l116051k958260k270837j191909j32113O77910J240482J492436
$$ -2959828 -6075879 -9034139 -11304976 -12496885 -12628998 -11951088 -10710606 -9218170
11243i218170J226022L93340o47137j333246j379775j013097o92617o34854o75426
$$ -9218170 -7992148 -7598808 -8245945 -9579191 -10958966 -11972063 -12664680 -13299534 -13974960
11234a3974960n50779j55136N11461J433742K440019L100611L002752K122258
$$ -13974960 -14525739 -14680875 -14169414 -12735672 -10295653 -7195042 -4192290 -2070032
11226b070032P85269o62734j943752k670565k420328j159257N44091J873782K321348
$$ -2070032 -1284763 -1947497 -3891249 -6561814 -8982142 -10141399 -9597308 -7723526 -5402178
11217e402178J919880J086661K92106k46945o47261j107359j594237j878647j847921
$$ -5402178 -3482298 -2395637 -2103531 -2350476 -2997737 -4105096 -5699333 -7577980 -9425901
11208i425901j612351j281011q22934k39162K74152M47108J54491n06874j236485
$$ -9425901 -11038252 -12319263 -13142197 -13381359 -13107207 -12660099 -12505608 -13012482 -14248967
11199a4248967j619656j401002p67102k02949K7034J07529L10051O11027Q18925
$$ -14248967 -15868623 -17269625 -18036727 -18239676 -18212642 -18105113 -17795062 -17184035 -16365110
11190a6365110Q86643Q90450Q50531Q12316R93532J563884K288164K631236K263040
$$ -16365110 -15478467 -14588017 -13737486 -12925170 -11931638 -10367754 -8079590 -5448354 -3185314
11181c185314J303789R1471j070718j902313k134246j689206p92645K00125J040466
$$ -3185314 -1881525 -1790054 -2860772 -4763085 -6897331 -8586537 -9379182 -9179057 -8138591
11172h138591J617042J869280J792626J498458J160472Q51094M40483l09943j491380
$$ -8138591 -6521549 -4652269 -2859643 -1361185 -200713 650381 1090864 780921 -710459
11163g10459k825281l716684l624154k464850o99806R72454K069320K595619K918026
$$ -710459 -3535740 -7252424 -10876578 -13341428 -14041234 -13068780 -10999460 -8403841 -5485815
11154e485815L298078L504459K981115J481604n39351k250399l082709k981971
$$ -5485815 -2187737 1316722 4297837 5779441 5240090 2989691 -93018 -3074989
11146c074989k204834j106783p2071O39536J091551J563714K153719K597438K558881
$$ -3074989 -5279823 -6386606 -6458677 -5819141 -4727590 -3163876 -1010157 1587281 4146162
11137D146162J996596J172646L95809j64802m93426o48375o42233l82231J88817
$$ 4146162 6142758 7315404 7711213 7546411 7052985 6404610 5762377 5380146 5568963
11128E568963Q64041J206641R13281R6238q38880j508312j697161j350426o03149
$$ 5568963 6433004 7639645 8552926 8649164 7810284 6301972 4604811 3254385 2651236
11119B651236K10642P41111Q73719P58740O09095N21029M50716K79870p6011n43651
$$ 2651236 2861878 3602989 4476708 5235448 5844543 6365572 6816288 7096158 7020147 6476496
11109F476496q98881r88321r24014r45359j082871j079547o92023J1082O73160
$$ 6476496 5577615 4589294 3665280 2719921 1637050 557503 -134520 -123438 549722
11100E49722Q75738L43168q71725k246007k962231k491592j078548M67740J500929
$$ 549722 1425460 1768628 896903 -1349104 -4311335 -6802927 -7881475 -7413735 -5912806
11091e912806J975234K201687K395408K576193K725901K811886K703901K275171
$$ -5912806 -3937572 -1735885 659523 3235716 5961617 8773503 11477404 13752575
11083A3752575J609402R61816N01820K30324J32372J96501K30400j02951r09261
$$ 13752575 15361977 16323793 16825613 17055937 17188309 17384810 17615210 17512259 16602998
11074A6602998j892296k717201l370564l950689m272339m000303l128612k018215
$$ 16602998 14710702 11993501 8622937 4672248 399909 -3600394 -6729006 -8747221
11066h747221r39792J27869J187559K023619K467503K622317K639698K460220
$$ -8747221 -9687013 -9559144 -8371585 -6347966 -3880463 -1258146 1381552 3841772
11058C841772J959198J194907L41014m64387j020388j016333l76309M55277Q74857
$$ 3841772 5800970 6995877 7336891 6872504 5852116 4835783 4459474 4914751 5789608
11049E789608P38551L74605M8234k55405n11113n09964k20070j3925k82266r46670
$$ 5789608 6528159 6902764 6950998 6695593 6184480 5674516 5454446 5440521 5158255 4211585
11039D211585j550429j765171j671516j590095j720028j889717j654299p97499
$$ 4211585 2661156 895985 -775531 -2365626 -4085654 -5975371 -7629670 -8427169
11031h427169K10592M78607m10366j905984l035653l272470k699900j588979k22213
$$ -8427169 -8216577 -7737970 -8148336 -10054320 -13089973 -16362443 -19062343 -20651322 -20873535
11022b0873535R46077J440933J274655J025431J195337J644766J821707J411458
$$ -20873535 -19927458 -18486525 -17211870 -16186439 -14991102 -13346336 -11524629 -10113171
11014a0113171O07834j18930l34466J64067J200710K236289K715881K499550J898530
$$ -10113171 -9505337 -9624267 -9958733 -9794666 -8593956 -6357667 -3641786 -1142236 756294
11005G56294J284268P49518J54812o18197j523518k364769k862410k776299k092806
$$ 756294 2040562 2790080 2944892 2326695 803177 -1561592 -4424002 -7200301 -9293107
10996i293107j098066j61603N85830J264717J900091K226124K025027J576023
$$ -9293107 -10391173 -10552776 -9966946 -8702229 -6802138 -4576014 -2550987 -974964
10988i74964J465212J841297K112766J617147M45535o69273j215631j352055j484356
$$ -974964 490248 2331545 4444311 6061458 6506993 5837720 4622089 3270034 1785678
10979A785678j729754j956969k092288k124325j926329j330126l83968O07303
$$ 1785678 55924 -1901045 -3993333 -6117658 -8043987 -9374113 -9758081 -9150778
10971i150778J308178J554305J399095J069973Q31320P85071Q29160Q54101Q77240
$$ -9150778 -7842600 -6288295 -4889200 -3819227 -2987907 -2202836 -1373676 -519575 357665
10962C57665R08667Q47572O86479O84291J082750J691257J999422J722878J036826
$$ 357665 1266332 2113904 2800383 3484674 4567424 6258681 8258103 9980981 11017807
10953A1017807K58261m79388j189673j899738k647521l416738l971028l953005
$$ 11017807 11276068 10796680 9607007 7707269 5059748 1643010 -2328018 -6281023
10945f281023l308820k465059j899711j616520j193219k90322J011105K307874
$$ -6281023 -9589843 -12054902 -13954613 -15571133 -16764352 -17054674 -16043569 -13735695
10937a3735695L168407L364190K951094K171572J270225M31612j58507l79645
$$ -13735695 -10567288 -7203098 -4252004 -2080432 -810207 -378595 -537102 -916747
10929i16747l66320m27312o22208n91802k7457Q14250J326276J228064P71130
$$ -916747 -1283067 -1710379 -2332587 -2924389 -2951846 -2137596 -811320 416744 1187874
10920A187874K91732j41392n61962q86164j054341j205714j484541j764112j785556
$$ 1187874 1479606 1338214 776252 -109912 -1164253 -2369967 -3854508 -5618620 -7404176
10911g404176j557419j412702j587431j857676j705242q32652N27282J789868
$$ -7404176 -8961595 -10374297 -11961728 -13819404 -15524646 -16357298 -15830016 -14040148
10903a4040148K457750K404865J835876J083520M56057J58168K15061M41615N61032
$$ -14040148 -11582398 -9177533 -7341657 -6258137 -5802080 -5643912 -5428851 -4987236 -4426204
10894d426204M25655J36591o0128j815K42054M17490K79437k31592r56564j608017
$$ -4426204 -4000549 -3863958 -3924086 -3925901 -3683847 -3266357 -2986920 -3218512 -4175076 -5783093
10884e783093j886250j600190q07272J39833P85163Q85176N22193p8300p51204
$$ -5783093 -7669343 -9269533 -10076805 -9936972 -9151809 -8266633 -7744440 -7822740 -8573944
10875h573944j401459j943741k314373k451099k194426j344466M2058J505101
$$ -8573944 -9975403 -11919144 -14233517 -16684616 -18879042 -20223508 -20181450 -18676349
10867a8676349K503587K850381K693830K149872J189620p9003j244062j845498
$$ -18676349 -16172762 -13322381 -10628551 -8478679 -7289059 -7368062 -8612124 -10457622
10859a0457622j718113j027230q5622P73607J258756J236207Q33656L71564J47575
$$ -10457622 -12175735 -13202965 -13288587 -12514980 -11256224 -10020017 -9186361 -8814797 -8667222
10850h667222K54919N57474Q07119Q11145N51474K10926J03111M77388J231418
$$ -8667222 -8412303 -7854829 -7047710 -6236565 -5685091 -5474165 -5371054 -4893666 -3662248
10841c662248J806089J572349M86505p37728j281322j005173m54102j50927q3596
$$ -3662248 -1856159 -283810 202695 -535033 -1816355 -2821528 -3275630 -3426557 -3510153
10832c510153J14461O80803J498039K227514K599888K633426K569073K529536
$$ -3510153 -3395692 -2714889 -1216850 1010664 3610552 6243978 8813051 11342587
10824A1342587K305693J616592N40999m75326j039263j098716q58186o08366o26547
$$ 11342587 13648280 15264872 15805871 15330545 14291282 13192566 12334380 11726014 11099467
10815A1099467j004413j504081j763490j694941j515984j383654j229195r85127
$$ 11099467 10095054 8590973 6827483 5132542 3616558 2232904 1003709 18582
10807A8582p01369l51980J82795P96749J100862Q93215M60077K02314J80285K46839
$$ 18582 -682787 -1034767 -851972 -55223 1045639 1938854 2398931 2601245 2781530 3028369
10797C028369L82116N82411O03656J91992m92995j011660j181915j197252j214967
$$ 3028369 3410485 3992896 4596552 4788544 4295549 3283889 2101974 904722 -310245
10788c10245j114132p18182l5518P74113J490567J862964J739367J231746O35556
$$ -310245 -1424377 -2142559 -2178077 -1403964 86603 1949567 3688934 4920680 5556236
10779E556236J76677o2836m9963J61187L20984J35007m39750j195896j934652
$$ 5556236 5732913 5670077 5620114 5781301 6102285 6237292 5797542 4601646 2666994
10770B666994k515272k682557k152020r87178L05832J181140J435427J173519
$$ 2666994 151722 -2530835 -4682855 -5670033 -5364201 -4183061 -2747634 -1574115
10762a574115O13780L2933k87301k31170R7127N50891J058495J509844J690030
$$ -1574115 -960335 -927402 -1214703 -1445873 -1348746 -797855 260640 1770484 3460514
10753C460514J464564R49646L95733l2534k86585l33305j43075K30428O16981
$$ 3460514 4925078 5874724 6270457 6237923 5951338 5618033 5474958 5705386 6322367
10744F322367P92268O08481J24988m06162p44697q16569o14160q2013O95219J271203
$$ 6322367 7114635 7723116 7848104 7441942 6697245 5880676 5266516 5184503 5879722 7150925
10734G150925J113120K01419q36087j282627q83011J71521J518173K697787L179530
$$ 7150925 8264045 8465464 7629377 6346750 5463739 5635260 7153433 9851220 13030750
10725A3030750K645894J322717q6397q63145p55067j62960R5499o05672k132351
$$ 13030750 15676644 16999361 16912964 16049819 15294752 15131792 15227291 14621619 12489268
10716A2489268l636033m247869l734783k516867j205629k13843L13122L65333
$$ 12489268 8853235 4605366 870583 -1646284 -2851913 -3065756 -2752634 -2387301
10708b387301o1651r31105j969473k625859k452995j565981n40994J92218O79845
$$ -2387301 -2448952 -3380057 -5349530 -7975389 -10428384 -11994365 -12535359 -12343141 -11663296
10699a1663296J133437J543187J740790J642508J251588N69719l19724j192326
$$ -11663296 -10529859 -8986672 -7245882 -5603374 -4351786 -3782067 -4101791 -5294117
10691e294117j843667k195097k155167j598782o71015J05037L05313P0572j55297
$$ -5294117 -7137784 -9332881 -11488048 -13086830 -13757845 -13652808 -13347495 -13276923 -13432220
10682a3432220k20319k94796m09274l48257m2117K79585M43084N53291P02757
$$ -13432220 -13652539 -13947335 -14356609 -14704866 -14746983 -14467398 -14024314 -13471023 -12768266
10673a2768266P05600L59722j62652m41534l15654o4823j1777n5278K64194J202344
$$ -12768266 -12062666 -11702944 -11865596 -12307130 -12622784 -12687607 -12699384 -12754662 -12490468 -11288124
10663a1288124K397518L134447L037225K386923J689505J072600K93618p13581
$$ -11288124 -8890606 -5756159 -2718934 -332011 1357494 2430094 2723712 2010131
10655B010131j551211j725040j163625k49345N74672J070746J125941O61605j83785
$$ 2010131 458920 -1266120 -2429745 -2679090 -2104418 -1033672 92269 753874 570089
10646E70089q81395q13972R8942J215524J785632J688615J407290J344359J389447
$$ 570089 -311306 -1125278 -1026336 189188 1974820 3663435 5070725 6415084 7804531
10637G804531J163015M57697o20905j738380k462754k511385k006982j362101
$$ 7804531 8967546 9425243 8804338 7065958 4603204 2091819 84837 -1277264
10629a277264q30154l32684K03514N92329O58372N55454N61181O58463N48713
$$ -1277264 -2107418 -2440102 -2236588 -1644259 -985887 -430433 130748 789211 1337924
10620A337924L0202q00450j644081k132212j962918j113221J06395J336538K430532
$$ 1337924 1368126 567676 -1076405 -3208617 -5171535 -6284756 -6178361 -4841823 -2411291
10611b411291L303619L669595L197397J947751M89589m64972n38302M9701N83478
$$ -2411291 892328 4561923 7759320 9707071 10196660 9731688 9193386 9243087 9826565
10602I826565L84730n63654j622517k244356k515171k755784k855258k404740
$$ 9826565 10211295 9647641 8025124 5780768 3265597 509813 -2345445 -4750185
10594d750185j391752l39076K90708N03458N30197M70898K76142j43396q65516
$$ -4750185 -6141937 -6481013 -6190305 -5686847 -5156650 -4685752 -4409610 -4553006 -5418522
10585e418522j813893k609134k765842k131023j009580J49277J047826J581217
$$ -5418522 -7232415 -9841549 -12607391 -14738414 -15747994 -15598717 -14550891 -12969674
10577a2969674J833408K058765K433279K746246K511189J451186k32384k036624
$$ -12969674 -11136266 -9077501 -6644222 -3897976 -1386787 64399 -167985 -2204609
10569b204609l422214l958478l500625k330840r58063K90900J369894K243006
$$ -2204609 -5626823 -9585301 -13085926 -15416766 -16374829 -16083929 -14714035 -12471029
10561a2471029K742863K761173K419478J988556J729809J783719K059613K240323
$$ -12471029 -9728166 -6966993 -4547515 -2558959 -829150 954569 3014182 5254505
10553E254505K034013J423682O07627j87022p22129p85729m44836r6406n260L8382
$$ 5254505 7288518 8712200 9319827 9132805 8410676 7624947 7180111 7083705 7078445 7116827
10543G116827K99556N32999K45270n92412j512621k150085k438915k295053j624039
$$ 7116827 7416383 7949382 8194652 7602240 6089619 3939534 1500619 -794434 -2418473
10534b418473o88388O019K77400L20872J80322l38796j128703j638603j472086
$$ -2418473 -3106861 -3100842 -2823442 -2502570 -2322248 -2661044 -3789747 -5428350 -6900436
10525f900436p79907L4765O29940P07583J63441o04000r54185p18724l06291o3022
$$ -6900436 -7680343 -7645578 -7015638 -6308055 -6144614 -6748614 -7702799 -8421523 -8727814 -8790836
10515h790836M5951J13082J63245L98215J024138J762277K062582J835972J418385
$$ -8790836 -8744885 -8631803 -8468558 -8070343 -7046205 -5283928 -3221346 -1385374 33011
10506C3011Q77917P7419o47703p89800o96971j303854k693844l984188m829045
$$ 33011 910928 988347 340644 -449156 -1146127 -2449981 -5143825 -9128013 -13957058
10497a3957058n887619p589439r741522j2591775j6741540k1807190k7215709
$$ -13957058 -19844677 -27434116 -37175638 -49767413 -66508953 -88316143 -115531852
10490a15531852l4470759m5019051n3883086m9485941k5015887J0922958L9761343
$$ -115531852 -150002611 -195021662 -248904748 -298390689 -323406576 -312483618 -272722275
10483b72722275M9899441M5044818L5825389K8025201K1311192J5068464J0533932
$$ -272722275 -222822834 -177778016 -141952627 -113927426 -92616234 -77547770 -67013838
10476f7013838Q132409O522776M781934L371231K701009K466657K617918L505335
$$ -67013838 -58881429 -52358653 -47576719 -44205488 -41504479 -39037822 -36419904 -32914569
10468c2914569M786431N409816M994951M267939L912830L838824L749667L629947
$$ -32914569 -28128138 -22718322 -17723371 -13455432 -9542602 -5703778 -1954111 1675836
10460A675836L444632L020667K431569J985176J740138J498765J248982J096327
$$ 1675836 5120468 8141135 10572704 12557880 14298018 15796783 17045765 18142092
10452A8142092Q27750J38145p25782j153888j043836r05776j026024j090794p74779
$$ 18142092 18969842 19107987 18382205 17228317 16184481 15278705 14252681 13161887 12387108
10443A2387108k02552L29716O58907O56032K54480k61355l82029J1520M35275
$$ 12387108 12184556 12514272 13173179 13829211 14083691 13822336 13440307 13451827 13887102
10434A3887102L52875k82476j110616j749881k022805k000040j887680j755760
$$ 13887102 14239977 13957501 12846885 11097004 9074199 7074159 5186479 3430719
10426C430719j433840q23421j85347R9048p5017n89739j357409k225727k825726
$$ 3430719 1996879 1173458 988111 1087159 1012142 422403 -935006 -3160733 -5986459
10417e986459k869744k465454j840033r96072j9269N96465N26675L24139Q62763
$$ -5986459 -8856203 -11321657 -13161690 -14157762 -14177031 -13580566 -13053891 -12729752 -11866989
10408a1866989K102070L063971L100001K546568J994328J542450J027994M56788
$$ -11866989 -9764919 -6700948 -3600947 -1054379 939949 2482399 3510393 3967181
10400C967181r8200o25520r80982r62500p55400q46515j264780j366974o76954
$$ 3967181 3868981 3243461 2262479 1299979 544579 -301936 -1566716 -2933690 -3610644
10391c610644M59166J341032J644178J399071O89709k10777p53281o22383j28349
$$ -3610644 -3151478 -1810446 -166268 1232803 1922512 1711735 958454 336071 207722
10382B07722K46170M22675M97222K68691m82370j424333j912497j749401j274634
$$ 207722 453892 876567 1373789 1642480 1160110 -264223 -2176720 -3926121 -5200755
10373e200755p54623j51088M78100Q18154P09450L98270J98088J15918n7768m69746
$$ -5200755 -5955378 -6106466 -5628366 -4810212 -4100762 -3702492 -3504404 -3388486 -3446254 -3916000
10363c916000j113104j847736k426303k653757k596812k490439k377131k009005
$$ -3916000 -5029104 -6876840 -9303143 -11956900 -14553712 -17044151 -19421282 -21430287
10355b1430287j202628j34688Q32776J475959J714909J459896P35277m5779k21082
$$ -21430287 -22632915 -22767603 -21934827 -20458868 -18743959 -17284063 -16548786 -16594565 -16815647
10346a6815647N15054J750681K748892L124985K987460K528298J792755R18043
$$ -16815647 -16300593 -14549912 -11801020 -8676035 -5688575 -3160277 -1367522 -449479
10338d49479K76237J33056L33583N56369P26217R05601R29160N48069n6538k98349
$$ -449479 -173242 -40186 293397 849766 1575983 2481584 3410744 3958813 3902275 3603926
10328C603926J40775R49317J615120J913422J808293J211394J68797r04385j534334
$$ 3603926 3744701 4694018 6309138 8222560 10030853 11242247 11411044 10506659 8972325
10319H972325j695558j748778j899129j964903j714641j218688p64605n30802
$$ 8972325 7276767 5527989 3628860 1663957 -50684 -1269372 -2033977 -2564779
10311b564779m27249k28776J62968N92822Q15709P81285O74249O57959P08037
$$ -2564779 -2992028 -3220804 -3057836 -2465014 -1649305 -868020 -193771 464188 1172225
10302A172225P70110R39710J333682J844333K153563J973426J213177K75j342425
$$ 1172225 1942335 2882045 4215727 6060060 8213623 10187049 11400226 11400501 10058076
10293A0058076k406709k939362k987303k744856k319374j751916j204565r53655
$$ 10058076 7651367 4712005 1724702 -1020154 -3339528 -5091444 -6296009 -7249664
10285g249664j137904j562760j763422j275251J1537J612475K638284K458821
$$ -7249664 -8387568 -9950328 -11713750 -12989001 -12977464 -11364989 -8726705 -6267884
10277f267884J288141L8386m59761p0861P37693J418189J699894J580613J175161
$$ -6267884 -4979743 -4941357 -5401118 -5471979 -4734286 -3316097 -1616203 -35590 1139571
10268A139571O32345J15229k29766l13781j19160L04997Q34126J271758J425419
$$ 1139571 1771916 1887145 1657379 1343598 1224438 1529435 2363561 3635319 5060738
10259E060738J230012P93844L06815q5119l17008l77308l02883j88928j53407
$$ 5060738 6290750 7084594 7391409 7306290 6989282 6611974 6309091 6120163 5966756
10250E966756k63611m80595o70246p26445p41314r56307j377125j524445q97744
$$ 5966756 5703145 5222550 4552304 3825859 3084545 2128238 751113 -773332 -1671076
10241a671076K42181R36993O29080j41931n23269n31821q76075j707859k241530
$$ -1671076 -1428895 -491902 137178 -4753 -528022 -1059843 -1935918 -3643777 -5885307
10232e885307j806543p13469K59074Q07565J137510J378596J427067J232825Q73177
$$ -5885307 -7691850 -8405319 -8146245 -7338680 -6201170 -4822574 -3395507 -2162682 -1289505
10223a289505M21808K7314p899M44507J012386J147281P42439J62641k52403l87471
$$ -1289505 -867697 -840383 -848282 -403775 608611 1755892 2498331 2660972 2408569 2021098
10213B021098j49234M71505J054527R17702j13521j388037k129337k230733k100437
$$ 2021098 1871864 2343369 3397896 4315598 4202077 2814040 684703 -1546030 -3646467
10204c646467j938688j558378q85533k47613J6341L0003K45246Q73269J611056
$$ -3646467 -5585155 -7143533 -8029066 -8276679 -8260338 -8230335 -7985089 -7111820 -5500764
10195e500764J980978J854087J549493J428609J489437J442677J149533Q39763
$$ -5500764 -3519786 -1665699 -116206 1312403 2801840 4244517 5394050 6233813
10187F233813Q00472R35610Q29736L16809j85597j15303N00126R79355P39857
$$ 6233813 7034285 7969895 8799631 9116440 8930843 8815540 9315666 10295021 11034878
10178A1034878o7539q03053j046422q69193n45294k83464k26950m20296o72530
$$ 11034878 10967339 10164286 9117864 8248671 7703377 7419913 7192963 6772667 6100137
10169F100137o58768k85488J66218L36334J13726l57152q35009j099893j089137
$$ 6100137 5441369 5155881 5322099 5658433 5772159 5415007 4579998 3480105 2390968
10160B390968r81297r69781r04127m00076N69024J432598J567355R01524j87102
$$ 2390968 1409671 439890 -464237 -864313 -295289 1137309 2704664 3606188 3419086
10151C419086j336193k304636k838767k825685k525639k296438k058242j355237
$$ 3419086 2082893 -221743 -3060510 -5886195 -8411834 -10708272 -12766514 -14121751
10143a4121751o3255J220320J695079J191541L75875J25224O86389J406725J350268
$$ -14121751 -14185006 -12964686 -11269607 -10078066 -9702191 -9576967 -8890578 -7483853 -6133585
10134f133585K66991j106451j805377j601333j061762p63966p23603o16217k77362
$$ -6133585 -5866594 -6973045 -8778422 -10379755 -11441517 -12205483 -12929086 -13545303 -13822665
10125a3822665J89067O53988J124203J665175K250555K706062K793884K379030
$$ -13822665 -13633598 -12979610 -11855407 -10190232 -7939677 -5233615 -2439731 -60701
10117f0701J534935M90973n07760j299842j834322k133889k200375j976236j483424
$$ -60701 1474234 1965207 1457447 157605 -1676717 -3810606 -6010981 -7987217 -9470641
10108i470641r54760o35602m24735N6599R25570J787148K177620K041278J579469
$$ -9470641 -10425401 -11061003 -11485738 -11429139 -10503569 -8716421 -6538801 -4497523 -2918054
10099b918054Q84992K5531p35185j203422j613632k277710k925812k888470k015041
$$ -2918054 -2033062 -2007531 -2742716 -3946138 -5559770 -7837480 -10763292 -13651762 -15666803
10090a5666803r38102k40723J98624P42901J271901J367473J039637Q19575J110515
$$ -15666803 -16604905 -16845628 -16647004 -15904103 -14632202 -13264729 -12225092 -11405517 -10295002
10081a0295002J743943K225573K196968J599853N86245n94052j667735k382246
$$ -10295002 -8551059 -6325486 -4128518 -2528665 -1942420 -2536472 -4204207 -6586453
10073f586453k530456k029401j045529M2311R43227J712272K597214L612347M370279
$$ -6586453 -9116909 -11146310 -12191839 -12149528 -11206301 -9494029 -6896815 -3284468 1085811
10064A085811M401487L593709K261585Q19623n18346j675616k448298k494918
$$ 1085811 5487298 9081007 11342592 12162215 11643869 9968253 7519955 5025037
10056E025037j703433m89194M41546O85839M44612K16609K72568M71650N13527
$$ 5025037 3321604 2832410 3273956 3959795 4404407 4621016 4893584 5365234 5878761
10047E878761K66520j51998n31626p48374q30919r26416j190677j602076j845157
$$ 5878761 6145281 5993283 5461657 4713283 3882364 2955948 1765271 163195 -1681962
10038a681962j528586o67605J58566L52150m2496m74758o68771r12684j428463
$$ -1681962 -3210548 -3878153 -3719587 -3367437 -3409933 -3884691 -4553462 -5466146 -6894609
10029f894609j811147j433676k50597J107393J967918K110415J723395J153192
$$ -6894609 -8705756 -10139432 -10390029 -9282636 -7314718 -5204303 -3480908 -2327716
10021b327716O97664M49920L30037L39141O19708J105630J356483J070008N96327
$$ -2327716 -1630052 -1180132 -850095 -510954 108754 1214384 2570867 3640875 4237202
10012D237202N42000R40460J241641J110349P68414M57237M1704o01358j157146
$$ 4237202 4779202 5719662 6961303 8071652 8840066 9297303 9339007 8737649 7580503
10003G580503j154466n09811L93689J003037Q63209j34993j542194k566184k729941
$$ 7580503 6426037 5916226 6309915 7312952 8176161 8041168 6498974 3932790 1202849
9994A202849k233007j571549j003762n33151j67399Q2552L29095O73120J001385
$$ 1202849 -1030158 -2601707 -3605469 -4138620 -4306019 -4223467 -3894372 -3221252 -2219867
9985b219867J120415J042030R56694R65301J010795J065549J234465J629762K201978
$$ -2219867 -1099452 -57422 899272 1864573 2875368 3940917 5175382 6805144 9007122
9976I007122K702744K810731K359446J479413M72481m54183j273427k018123k712333
$$ 9007122 11709866 14520597 16880043 18359456 18831937 18377754 17104327 15086204 12373871
9967A2373871l370756l867686l827147k906496j269141M34441J631799K178156
$$ 12373871 9003115 5135429 1308282 -1598214 -2867355 -2432914 -801115 1377041
9959A377041K122595J466634L59828p21973j291757j272725r33867m91667P2655
$$ 1377041 3499636 4966270 5326098 4604125 3312368 2039643 1105776 614109 686764
9950F86764Q59695J819607K628421K799372K083000Q04895l69191j059375j387998
$$ 686764 1546459 3366066 5994487 8793859 10876859 11681754 11312563 10253188 8865190
9941H865190j570510j591685j402709j144535r72098q62043p70105p95553j038591
$$ 8865190 7294680 5702995 4300286 3155751 2183653 1321610 551505 -244048 -1282639
9932a282639j464104j997826k530121k749180k290027j208640j2170R25214J625376
$$ -1282639 -2746743 -4744569 -7274690 -10023870 -12313897 -13522537 -13534707 -12609493 -10984117
9923a0984117K034823J783376P87187k99211p04758l87961J20556M64803O30547
$$ -10984117 -8949294 -7165918 -6378731 -6677942 -7382700 -7770661 -7650105 -7185302 -6554755
9914f554755N93724K85145j80462o16059j030432j511581j978812k273977k282618
$$ -6554755 -5961031 -5675886 -5856348 -6472407 -7502839 -9014420 -10993232 -13267209 -15549827
9905a5549827j785262n66556J073636K407005L241953M294213O277836R413200
$$ -15549827 -17335089 -17901645 -16828009 -14421004 -11179051 -6884838 -607002 8806198
9897H806198J4219956K1265621K8575032L0578425K2536441O579992q803575j6437729
$$ 8806198 23026154 44291775 72866807 103445232 125981673 132561665 123758090 107320361
9889A07320361j6295097j3108376j0286786q022115n883499m446020m080630m085966
$$ 107320361 91025264 77916888 67630102 59607987 53724488 49278468 45197838 41111872
9881D1111872l828984l669380m133841m956943n476916n398809m722875l423710
$$ 41111872 37282888 33613508 29479667 24522724 19045808 13646999 8924124 5500414
9873E500414j674130o2423Q28463R25004N72828J60598l7934N8841K00954m9794
$$ 5500414 3826284 3763861 4592324 5517328 6090156 6250754 6212820 6271661 6472615 6422821
9863F422821q26892j727898k207462k099669j682322j350813j289971j354116
$$ 6422821 5595929 3868031 1660569 -439100 -2121422 -3472235 -4762206 -6116322
9855f116322j227050p71602j68815M06022J115965K215344L524353M444009M530122
$$ -6116322 -7343372 -8114974 -8283789 -7877767 -6761802 -4546458 -1022105 3421904 7952026
9846G952026L826512K646182J320227K01804m17531n73101o26279q97467j450017
$$ 7952026 11778538 14424720 15744947 15946751 15529220 14956119 14329840 13432373 11982356
9837A1982356k224570l095948l736033l765228l222897k607621k246101j886722
$$ 11982356 9757786 6661838 2925805 -839423 -4062320 -6669941 -8916042 -10802764
9829a0802764j160199j78822O55004J245870J814758K379509K617571K306954
$$ -10802764 -11962963 -12141785 -11486781 -10240911 -8426153 -6046644 -3429073 -1122119
9821a122119J606228Q14997J17463l33430l41488J15170P31823J131732J208337
$$ -1122119 484109 1299106 1416569 1083139 741651 856821 1588644 2720376 3928713
9812C928713J089238Q58053M91390L2392l69619o44512q95391j235272j606575
$$ 3928713 5017951 5876004 6367394 6399786 6030167 5385655 4490264 3254992 1648417
9803A648417j814300j672264j090914j46562Q24902J298213R21331j29391j237140
$$ 1648417 -165883 -1838147 -2929061 -3075623 -2250721 -952508 -31177 -160568 -1397708
9794a397708j825149j717859j090277k38598N39166J012679J161626J216204J401367
$$ -1397708 -3222857 -4940716 -6030993 -6269591 -5730425 -4717746 -3556120 -2339916 -938549
9785i38549J621639J526682R48412J80265k66654j43941L74244R63170J431242
$$ -938549 683090 2209772 3158184 3338449 3071795 2927854 3302098 4265268 5696510
9776E696510J690296J623295J202044P00082N06968N82860L12059q19083k447470
$$ 5696510 7386806 9010101 10212145 10912227 11419195 12002055 12314114 11495031 9047561
9767I047561l497881l177189j648613K53836J710410K265682J868032Q92309K627
$$ 9047561 5549680 2372491 723878 977714 2688124 4953806 6821838 7714147 7716774
9758G716774l13609j22505J59579K77136K78638K34498Q7006j55997l01990k03585
$$ 7716774 7403165 7280660 7440239 7717375 7996013 8230511 8317517 8161520 7859530 7655945
9748G655945J234K9925j96529m77087o30612p63340j114780j641811j914984j578308
$$ 7655945 7657179 7687104 7490575 7013488 6382876 5619536 4504756 2862945 947961 -630347
9738f30347q49798l58104m39055p90400r28786p87344o52771o49469n83289l13190
$$ -630347 -1480145 -1838249 -2277304 -3067704 -3996490 -4783834 -5436605 -6086074 -6669363 -6982553
9728f982553j9625L4356j11675r8332M04199J372992K431289L140217L297804
$$ -6982553 -7002178 -6967822 -7079497 -7177829 -6773630 -5400638 -2969349 170868 3468672
9719C468672K964496K256933J239625M9188j026580j720609j957840j767539j169516
$$ 3468672 6433168 8690101 9929726 9978914 8952334 7231725 5273885 3506346 2336830
9710B336830l22085L44481M14357q7630p48815j223531j423276j314055q88100
$$ 2336830 2014745 2359226 2773583 2685953 1937138 713607 -709669 -2023724 -2911824
9701b911824m51209n76996j452604k416728k463782j231744O65482K251589K962286
$$ -2911824 -3363033 -3940029 -5392633 -7809361 -10273143 -11504887 -10839405 -8587816 -5625530
9692e625530K849237K275682J564372Q45788Q9223p48706j542165j948280j629415
$$ -5625530 -2776293 -500611 1063761 1909549 1998772 1250066 -292099 -2240379 -3869794
9683c869794o14024O05030J471834J901935K277868K839168L257299L008768K046470
$$ -3869794 -4483818 -3878788 -2406954 -505019 1772849 4612017 7869316 10878084 12924554
9674A2924554Q44690j60021q68785j265030j246466q93629n97600o32350p74048
$$ 12924554 13769244 13609223 12740438 11475408 10228942 9335313 8737713 8105363 7331315
9665G331315o19490j60138K36299L24375J52422k35157r21559j830270k572500
$$ 7331315 6711825 6551687 6787986 7112361 7264783 7029626 6108067 4277797 1705297
9656A705297k769627k418815j829790j302115r55623p68640o49174m91759k29133
$$ 1705297 -1064330 -3483145 -5312935 -6615050 -7570673 -8339313 -8988487 -9480246 -9709379
9647i709379J86363Q36659J766288K820491L654235L946022L518691K278919K92597
$$ -9709379 -9523016 -8686357 -6920069 -4099578 -445343 3500679 7019370 9298289 9590886
9638I590886j928899l448943l553522k410268q88353K98084J097404J782640K381186
$$ 9590886 7661987 4213044 659522 -1750746 -2639099 -2341015 -1243611 539029 2920215
9629B920215K625607K356330J788716J366392J398140J783485K035388J654069
$$ 2920215 5545822 7902152 9690868 11057260 12455400 14238885 16274273 17928342
9621A7928342N99861o06709j321460j309076q27684k79054J16261L49147M83414
$$ 17928342 18528203 17921494 16600034 15290958 14463274 14184220 14300481 14649628 15133042
9612A5133042N31175L86126j39877j120384k294630l108327l083242k212342j004359
$$ 15133042 15664217 16050343 15910466 14790082 12495452 9387125 6303883 4091541 3087182
9603C087182j06832J84400R4099N6841K66720N89873Q62489J075842J192735J001682
$$ 3087182 2980350 3164750 3258849 3315690 3582410 4172283 5034772 6110614 7303349 8305031
9593H305031L79407m08636r09414r38123o17881m8519P32226J438830J578100
$$ 8305031 8684438 8275802 7366388 6428265 5810384 5761865 6494091 7932921 9511021
9584I511021J000050J45726m69638q08570j136032j523279j834004k064826k358618
$$ 9511021 10511071 10656797 10187159 9378589 8242557 6719278 4885274 2820448 461830
9575D61830k697527k852015k644701k057911j117983P1990J186311J843362K001375
$$ 461830 -2235697 -5087712 -7732413 -9790324 -10908307 -10836317 -9650006 -7806644 -5805269
9566e805269J980815K024890K042666J865305J531620J167274P48644J81843m48070
$$ -5805269 -3824454 -1799564 243102 2108407 3640027 4807301 5555945 5737788 5289718
9557E289718q69781q92964o28133m10587m57926n71161k86648N34353J359871
$$ 5289718 4419937 3526973 2898840 2488253 2030327 1459166 1172518 1706871 3066742
9548C066742J452255O52371n35075j613073k511856l246165l534322l070305k000214
$$ 3066742 4518997 5171368 4636293 3023220 511364 -2734801 -6269123 -9339428 -11339642
9539a1339642q46612l1823L45135L96749L57725N19364R89077J520473J770458
$$ -11339642 -12186254 -12218077 -11872942 -11476193 -11118468 -10599104 -9610027 -8089554 -6319096
9530f319096J683802J421762R77562J66713r36495j817814j944641j259707j85897
$$ -6319096 -4635294 -3213532 -2235970 -2069257 -3005752 -4823566 -6768207 -8027914 -8213811
9521h213811P17868J032948O10210l52801j370720j939648j820454j107356j16262
$$ -8213811 -7495943 -6462995 -5852785 -6205586 -7576306 -9515954 -11336408 -12443764 -12560026
9512a2560026P67969J266102J359855J250017J083796P55717N6850j002390k099584
$$ -12560026 -11792057 -10525955 -9166100 -7916083 -6832287 -6076570 -6019720 -7022110 -9121694
9503i121694k824918k937985k439412j522507n07957K80159P04069Q97217J120615
$$ -9121694 -11946612 -14884597 -17324009 -18846516 -19354473 -19074314 -18370245 -17473028 -16352413
9494a6352413J542686K169427K896426L514373L725944L360897K628259J968249
$$ -16352413 -14809727 -12640300 -9743874 -6229501 -2503557 857340 3485599 5453848
9486E453848J535363J004639Q6293r16354j370404j125120p51458q54056j371052
$$ 5453848 6989211 7993850 8080143 7163789 5793385 4668265 3916807 3062751 1691699
9477A691699j716813j463222p21435L2182L52019J36500k93898m69409k22520
$$ 1691699 -25114 -1488336 -2209771 -2177589 -1825570 -1689070 -1982968 -2452377 -2674897
9468b674897J79524L91482L34621J01112k67779o81774q27904l95600N38375J569391
$$ -2674897 -2495373 -2103891 -1769270 -1668158 -1935937 -2617711 -3445615 -3841215 -3302840 -1733449
9458a733449K380800K880956K978334K534576J613774N18313n28113j505904k304693
$$ -1733449 647351 3528307 6506641 9041217 10654991 11173304 10645191 9139287 6834594
9449F834594k572927k091492j144930k98768J05523N9039l77250j146060j976627
$$ 6834594 4261667 2170175 1025245 726477 832000 891039 513789 -632271 -2608898
9440b608898k357074j917096p99873M43219J333933J807766K080517K239579K071021
$$ -2608898 -4965972 -6883068 -7682941 -7239722 -5905789 -4098023 -2017506 222073 2293094
9431B293094J358581K88745n84745q21502m59215J15738N48858P24633P25151
$$ 2293094 3651675 3940420 3355675 2534173 2074958 2190696 2739554 3464187 4189338
9422D189338P00193P26805P15971M99523N8089m14051p40284r73636j280292j675763
$$ 4189338 4889531 5616336 6332307 6831830 6889919 6475868 5735584 4761948 3481656 1805893
9412A805893j979940j987407j593961q24454J39401J007467J601933K016734K420640
$$ 1805893 -174047 -2161454 -3755415 -4579869 -4440468 -3433001 -1831068 185666 2606306
9403B606306K701813K464735J457209o8359j461380k116414j870052j092402m01603
$$ 2606306 5308119 7772854 9230063 9161704 7700324 5583910 3713858 2621456 2219853
9394B219853j69364k57074k89430j39681J1016P7731K75890P70075J304755J431501
$$ 2219853 2050489 1793415 1503985 1364304 1375320 1453051 1728941 2499016 3803771 5235272
9384E235272J060548N74272L68274M48283N35295M21247J19290k40182n32787
$$ 5235272 6295820 6870092 7238366 7686649 8221944 8643191 8762481 8522299 7989512
9375G989512o81637o81717o20211o38011q41040j226826j661467j929441j879570
$$ 7989512 7307875 6626158 6005947 5367936 4526896 3300070 1638603 -290838 -2170408
9366b170408j578399j267157j086699q84376m09408L07417R27478J232788J427039
$$ -2170408 -3748807 -5015964 -6102663 -6987039 -7396447 -7089030 -6161552 -4928764 -3501725
9357c501725J827446K316258K320906J411025k18163j920531l124913l613774
$$ -3501725 -1674279 641979 2962885 4373910 4155747 2235216 -889697 -4503471
9349d503471l460458k910108k281098j776597j336327p83176j27247M09199O99430
$$ -4503471 -7963929 -10874037 -13155135 -14931732 -16268059 -17051235 -17178482 -16769283 -16069853
9340a6069853Q97115J234658J748763K284219K653123K692342K304364J635671
$$ -16069853 -15172738 -13938080 -12189317 -9905098 -7251975 -4559633 -2255269 -619598
9332f19598J156194J330909K132200K987406L261118K719928J542775N9789j391907
$$ -619598 536596 1867505 3999705 6987111 10248229 12968157 14510932 14570721 13178814
9323A3178814k450212k757041k121686p13551Q79695J873566J765096P14334n92178
$$ 13178814 10728602 7971561 5849875 5136324 6016019 7889585 9654681 10369015 9776837
9314I776837j510621j843098j722028j305329p14721j13422L79122Q06394J224625
$$ 9776837 8266216 6423118 4701090 3395761 2681040 2567618 2946740 3753134 4977759
9305D977759J468821J275803O50008r8472p18095j206122j572498j668829j427034
$$ 4977759 6446580 7722383 8372391 8273919 7555824 6349702 4777204 3108375 1681341
9296A681341j073891q80407q15823o74837m54238l39821l43628k22531J82802
$$ 1681341 607450 -272957 -1088780 -1763617 -2217855 -2557676 -2901304 -3123835 -2941033
9287b941033P31349J162931J305382J041514K97940p77042j775901k339574k418648
$$ -2941033 -2209684 -1046753 258629 1300143 1598083 821041 -954860 -3294434 -5713082
9278e713082k122679j459524m28151P05076J466530J584693J243277R06324R52362
$$ -5713082 -7835761 -9295285 -9723436 -9018360 -7551830 -5967137 -4723860 -3817536 -2865174
9269b865174J430765K045836K377933K240590J852026J579193J515747J408203
$$ -2865174 -1434409 611427 2989360 5229950 7081976 8661169 10176916 11585119
9261A1585119J000738L44439k58856n27052l99181p8194R3894q5112m68021p18294
$$ 11585119 12585857 12930296 12671440 12144388 11745207 11667013 11760907 11675795 11207774 10489480
9251A0489480p21930p20191r47227j247201j191770n42706N03483J491255K014402
$$ 10489480 9767550 9047359 8100132 6852931 5661161 5118455 5621938 7113193 9127595
9242I127595J881992J139588J6977j184493k210343k889302l111602k850493k218720
$$ 9127595 11009587 12149175 12166152 10981659 8771316 5882014 2770412 -80081 -2298801
9233b298801j446891p59152k59849O7468K64564L07833J31614k27732n38826n18456
$$ -2298801 -3745692 -4504844 -4764693 -4697225 -4432661 -4124828 -3993214 -4220946 -4759772 -5278228
9223e278228j02056N03970J079804J605556K141560K605553K821772K749933K510369
$$ -5278228 -5380284 -4876314 -3796510 -2190954 -49394 2556159 5377931 8127864 10638233
9214A0638233K187261J762762J271571Q58703O00482L83870N7453l76733p95948
$$ 10638233 12825494 14588256 15859827 16718530 17319012 17702882 17760335 17383602 16587654
9205A6587654j094116j199912j049740o76988k91935j39464k54648m31556m36862
$$ 16587654 15493538 14293626 13243886 12566898 12274963 12135499 11880851 11449295 11012433
9196A1012433j93892K24181O85217J052004J216551J146321R08638O44418M90898
$$ 11012433 10818541 11042722 11727939 12779943 13996494 15142815 16051453 16695871 17186769
9187A7186769M70944M46899K58998o2906l34966n28754q78579j491905j976428
$$ 17186769 17657713 18104612 18363610 18300704 17965738 17436984 16558405 15066500 13090072
9178A3090072j764328q41047J35705N63547M84616K69771j5406n84314j388484
$$ 13090072 11325744 10484697 10620402 11183949 11668565 11938336 11922930 11338616 9950132
9169I950132k005235k150032k021870k017522k306284k777737l166627l077854
$$ 9950132 7944897 5794865 3772995 1755473 -550811 -3328548 -6495175 -9573029
9161i573029k156459n36880J012284J721988J585427J219980J000913O92371L9702
$$ -9573029 -11729488 -12266368 -11254084 -9532096 -7946669 -6726689 -5725776 -5033405 -4993703
9152d993703o46083p94192k72491N18302J152624J500652J583677J405445R91367
$$ -4993703 -5639786 -6433978 -6706469 -6188167 -5035543 -3534891 -1951214 -545769 445598
9143D45598L81038m84421j669986k957378l838609l933805l299315k243810j014776
$$ 445598 826636 342215 -1327771 -4285149 -8123758 -12057563 -15356878 -17600688 -18615464
9134a8615464J95259J119090J551000J575440J463662J340299J087427N54554
$$ -18615464 -18420205 -17301115 -15750115 -14174675 -12711013 -11370714 -10283287 -9728733
9126i728733k64963j209380j933097j985191j169171J19564J129017J415294J122191
$$ -9728733 -9993696 -11203076 -13136173 -15121364 -16290535 -16170971 -15041954 -13626660 -12504469
9117a2504469N83481o6995p23259j018770n64564N51544J757600K529248K771375
$$ -12504469 -11920988 -11987983 -12711242 -13730012 -14294576 -13743032 -11985432 -9456184 -6684809
9108f684809K663468K303078J588317L94601j144607k510018l074123k682668
$$ -6684809 -4021341 -1718263 -129946 264655 -879952 -3389970 -6464093 -9146761
9100i146761j897983j450432j475301j544049j434826j477083j931928k375881
$$ -9146761 -11044744 -12495176 -13970477 -15514526 -16949352 -18426435 -20358363 -22734244
9092b2734244k090397r35244N18837J672338K366375K686130K708822K602909
$$ -22734244 -24824641 -25759885 -25241048 -23568710 -21202335 -18516205 -15807383 -13204474
9084a3204474K644843K886215L010668K743982K213801J659628R91226q465j142685
$$ -13204474 -10559631 -7673416 -4662748 -1918766 295035 1954663 2945889 2937424 1794739
9075A794739j868849j949866j694474j458804j233365q64591l62283K37735J031208
$$ 1794739 -74110 -2023976 -3718450 -5177254 -6410619 -7275210 -7637493 -7399758 -6368550
9066f368550J960173K582406K494103J890364J361328J172404J083920Q68655
$$ -6368550 -4408377 -1825971 668132 2558496 3919824 5092228 6176148 7044803
9058G044803O13610M08563J14545l37700p07001p70234o91562p77523r89583r90471
$$ 7044803 7658413 8066976 8181521 7843821 7136820 6366586 5675024 4897501 3907918 2917447
9048B917447o28026j15165K71279M49916M68563L69289J68770j60205o96048j409834
$$ 2917447 2289421 2174256 2445535 2895451 3364014 3733303 3902073 3741868 3045820 1635986
9038A635986k002399k092465j629194r69943n03193l52892m80825q13121j079837
$$ 1635986 -366413 -2458878 -4088072 -5058015 -5561208 -5914100 -6394925 -7208046 -8287883
9029h287883p47147N48723K471175M098007M644292L988839K537623Q08829p40129
$$ -8287883 -9035030 -8486307 -6015132 -1917125 2727167 6716006 9253629 10062458 9322329
9020I322329j696907j816293j228823l82430L19066P57793R36271P06473j19629
$$ 9322329 7625422 5809129 4580306 4197876 4516942 5274735 6211006 6917479 6797850
9011F797850j355736k354127k547832k043083j481807j280613j186456o95205
$$ 6797850 5442114 3087987 540155 -1502928 -2984735 -4265348 -5451804 -6147009
9003f147009K42237J126938J470585J241904P35914K15687j76636k97609k0068
$$ -6147009 -5904772 -4777834 -3307249 -2065345 -1329431 -1113744 -1290380 -1587989 -1608057
8994a608057O02146J319334J874006K116227J936874J264857K61947n87655p94960
$$ -1608057 -1005911 313423 2187429 4303656 6240530 7505387 7767334 7179679 6384719
8985F384719l38090K76322M88817K02236j76173j46365M40046J259384J761337
$$ 6384719 6046629 6322951 6811768 7014004 6837831 6691466 7131512 8390896 10152233
8976A0152233J549099N93607q22734k264519l247314l386151k673649j601058
$$ 10152233 11701332 12294939 11472205 9207686 5960372 2574221 -99428 -1700486
8968a700486p96395m59117k60577J83571R08417J686081K271141K444152K068235
$$ -1700486 -2496881 -2955998 -3216575 -3033004 -2124587 -438506 1832635 4276787 6345022
8959F345022J331629P43173O09000O45687M08741j3650j16250K32666N29902K84706
$$ 6345022 7676651 8419824 9028824 9674511 10083252 10069602 9953352 10186018 10715920 11000626
8949A1000626m17194j161462j701211j980449j942387j636776j381171j516062
$$ 11000626 10583432 9421970 7720759 5740310 3797923 2161147 779976 -736086
8941g36086k017807k513602k600388k021629p16439J034296K601817L441538L551957
$$ -736086 -2753893 -5267495 -7867883 -9889512 -10605951 -9571655 -6969838 -3528300 23657
8932B3657L326835L007517K511103J764688R33234K56912j38800k42876j79795
$$ 23657 3350492 6358009 8869112 10633800 11567034 11823946 11685146 11442270 11262475
8923A1262475k61333p67999j565759k123543k023476j318083l39625O19762J320110
$$ 11262475 11001142 10233143 8667384 6543841 4520365 3202282 2862657 3482419 4802529
8914D802529J509374J104600L66397k87083o10723n92420l10127R3443L63639
$$ 4802529 6311903 7416503 7782900 7495817 6885094 6292674 5982547 6075990 6439629
8905F439629K72975j44482o02330q44242q80243r51517j275577j767644k000228
$$ 6439629 6712604 6568122 5965792 5121550 4241307 3289790 2014213 246569 -1753659
8896a753659j565209n63475L75793O84810L91388k5462j74621K3514N11647J180247
$$ -1753659 -3318868 -3882343 -3506550 -2821740 -2430352 -2455814 -2630435 -2606921 -2095274 -915027
8886i15027J739108J779257J144421J48779o81714j027624q97629m64433Q2683
$$ -915027 824081 2603338 3747759 3896538 3214824 2187200 1289571 825138 907821
8877I07821N68894Q74586J024234J187369J495014J808979J746796J078063J23602
$$ 907821 1476715 2351301 3375535 4562904 6057918 7866897 9613693 10691756 10815358
8868A0815358l97553n2738Q46849J578662J687882J176114J66514j255969k796271
$$ 10815358 10417805 10365067 11211916 12790578 14478460 15654574 15821088 14565119 11768848
8859A1768848l869075m030608l394248k458015j609661r32335l58717K21590R70497
$$ 11768848 7899773 3869165 474917 -1983098 -3592759 -4525094 -4883811 -4662221 -3691724
8850c691724J965339K969436L496970L223472K276091J077590m27p68660j141248
$$ -3691724 -1726385 1243051 4740021 7963493 10239584 11317174 11316747 10548087 9406839
8841I406839j124972r17798q71165j218343j832852k308188k286299j701002p60399
$$ 9406839 8281867 7364069 6492904 5274561 3441709 1133521 -1152778 -2853780 -3614179
8832c614179K16322R60029J383808J624005J868306K082796K006870J503344P96888
$$ -3614179 -3397857 -2437828 -1054020 569985 2438291 4521087 6527957 8031301 8828189
8823H828189K23601j51430m75245p58555q61887q16894q40991r40829q20597l74684
$$ 8828189 9051790 8900360 8425115 7666560 6804673 5987779 5146788 4205959 3385362 3010678
8813C010678J8071k1747l13262l91097k19919k48307p60848j533070k174004k455660
$$ 3010678 3028749 3007002 2693740 2302643 2082724 1834417 1073569 -459501 -2633505 -5089165
8803e089165k200052j233216K65290J619698K200904K021914J550365J041850
$$ -5089165 -7289217 -8522433 -8257143 -6637445 -4436541 -2414627 -864262 177588
8795A77588L67467n21042j295988j572640j329935q58329m07033l7833K31547
$$ 177588 545055 24013 -1271975 -2844615 -4174550 -5032879 -5439912 -5477745 -5246198
8786e246198L04880P9520m12644r64143j287909j190322p09177r3387L85814O25521
$$ -5246198 -4941318 -4861798 -5274442 -6238585 -7526494 -8716816 -9425993 -9519380 -9133566 -8508045
8776h508045P02609P28122P34809P03842O37337N55458M49892K92761Q0288j84972
$$ -8508045 -7805436 -7077314 -6342505 -5638663 -5001326 -4445868 -3995976 -3703215 -3622927 -3807899
8766c807899n43431j028909j541232j838473j712359j144051k76440O90785J543390
$$ -3807899 -4351330 -5380239 -6921471 -8759944 -10472303 -11616354 -11892794 -11202009 -9658619
8757i658619K096646K291242K174726J714701P71599n55715j659162j802930q73972
$$ -9658619 -7561973 -5270731 -3096005 -1381304 -609705 -1165420 -2824582 -4627512 -5501484
8748e501484M30632J261439J326454R05910M02883P6070O5873M00601R16872J297059
$$ -5501484 -5070852 -3809413 -2482959 -1577049 -1174166 -1098096 -1032223 -631622 285250 1582309
8738A582309J259654P45367k874n39576n59887k43439j09748l99246p54665p03417
$$ 1582309 2841963 3587330 3584456 3044880 2484993 2241554 2131806 1732560 977895 274478
8728B74478k94351K9090R0792J49724L67570M76150J75090l75995o98766n18100
$$ 274478 -19873 9217 100009 249733 617303 1093453 1268543 892548 193782 -324318
8718c24318K4112N68833P86930N28143o0026n62311o06730k00315K96968N14798
$$ -324318 -300206 268627 1055557 1583700 1523674 961363 354633 154318 451286 966084
8708I66084L42102o7377m39767n66823m73580m05754n59981q44653j023043j087039
$$ 966084 1308186 1240809 801042 234219 -239361 -645115 -1205096 -2049749 -3072792 -4159831
8698d159831j331819j976037k805370l305541l124792k326527j206779J6050J246098
$$ -4159831 -5491650 -7467687 -10273057 -13578598 -16703390 -19029917 -20236696 -20220646 -18974548
8689a8974548K306376K860616K667836J885282R97908M17876K32946L36968O20884
$$ -18974548 -16668172 -13807556 -11139720 -9254438 -8256530 -7838654 -7605708 -7268740 -6647856
8680f647856R13095Q94849L38604n47684j213611j299459r69871o47331n22477
$$ -6647856 -5734761 -4839912 -4501308 -5048992 -6262603 -7562062 -8531933 -9179264 -9701741
8671i701741m30507j37345L76583R01269J169112J044247O32156K32424J22594
$$ -9701741 -10132248 -10269593 -9893010 -8991741 -7822629 -6778382 -6146226 -5913802 -5791208
8662e791208L44475P17868J059987J329596J524804J522514J150178M43187k83313
$$ -5791208 -5446733 -4728865 -3668878 -2339282 -814478 708036 1858214 2301401 2018088
8653B018088p26640r13496j092721j305895j232703n90228M02727J128838J157158
$$ 2018088 1291448 377952 -714769 -2020664 -3253367 -3843595 -3440868 -2312030 -1154872
8644a154872O26337M4931j73911M3692N10918R86091J337976J583473J771716
$$ -1154872 -528535 -483604 -657515 -613823 -102905 883186 2221162 3804635 5576351
8635E576351J849955J713750J382841J007594O68135L10414n0673k59778l35320
$$ 5576351 7426306 9140056 10522897 11530491 12198626 12509040 12458367 12198589 11863269
8626A1863269o85378j681215k999921l687995l029293j213846R02600K488843
$$ 11863269 11177891 9496676 6496755 2808760 -220533 -1434379 -531779 1957064
8618A957064L100911K672958J498492J58222q33207j386847j722099j927618j837337
$$ 1957064 5057975 7730933 9229425 9387647 8554440 7167593 5445494 3517876 1680539
8609A680539j344825o00501K12716J124379K240382L436502M302843M372043L390840
$$ 1680539 335714 -264787 -52071 1072308 3312690 6749192 11052035 15424078 18814918
8600A8814918J496269p65052k658019l628592l523063k541210j126932J13086
$$ 18814918 20311187 19546135 16888116 13259524 9736461 7195251 6068319 6181405
8592F181405O56697M41567j09186n90714j032718j634610k221415k275161j538684
$$ 6181405 6838102 7279669 7170483 6579769 5547051 3912441 1691026 -584135 -2122819
8583b122819l37225P83203J527845J858527J749558J182111L45252l41510m91213
$$ -2122819 -2460044 -1676841 -148996 1709531 3459089 4641200 4986452 4644942 4153729
8574D153729m7923O28658R71855O21141k56852j079591j353315j077048o45355
$$ 4153729 4105806 4734464 5706319 6327460 6070608 4991017 3637702 2560654 1915299
8565A915299m12057l92070l38525m3920M27883P72545P07883K15455m65441j019203
$$ 1915299 1503242 1111172 772647 728727 1156610 1929155 2637038 2852493 2387052 1367849
8555A367849j187640q51321j81349L06642J01158p74358j727980k202607k155740
$$ 1367849 180209 -671112 -852461 -545819 -444661 -1219019 -2946999 -5149606 -7305346
8546g305346j824307j246863l09578Q42090J784728K261465K381828K298774J951263
$$ -7305346 -9129653 -10376516 -10686094 -9844004 -8059276 -5797811 -3415983 -1117209 834054
8537H34054J301235O15381K35579J22038j25132p28999j391405j598530j186468
$$ 834054 2135289 2750670 2986249 3108287 2983155 2254156 862751 -735779 -1922247
8528a922247m87510N1689K64336K38936M1343l57766q62736j138181q88973k46844
$$ -1922247 -2409757 -2358068 -2093732 -1854796 -1813453 -2171219 -3033955 -4172136 -5061109 -5307953
8518e307953K65378K54845p9577r2803O33100J764567K442547K102936J039157
$$ -5307953 -5042575 -4787730 -4867307 -4960110 -4327010 -2562443 -119896 1983040 3022197
8509C022197P2300k89977k29653j92572l39191n35467o52249o13357k71613M34165
$$ 3022197 3094497 2804520 2574867 2382295 2043104 1507637 855388 242031 -29582 404583
8499D04583J171691J359191P67675j85269q73500j068617r96065r32508r43518
$$ 404583 1576274 2935465 3703140 3517871 2644371 1575754 579689 -352819 -1296337
8490a296337r69727r66102q85906o35533j44265N20990J140399J458165J345769
$$ -1296337 -2266064 -3232166 -4118072 -4753605 -4897870 -4376880 -3236481 -1778316 -432547
8481d32547Q86464L07029j89906n43349q02153r95320j053928q88661n53432k73359
$$ -432547 453917 760946 571040 27691 -774462 -1769782 -2823710 -3712371 -4265803 -4539162
8471d539162k26975l23531l18716j68695j14309l36020o88843r24612j033215
$$ -4539162 -4766137 -5089668 -5408384 -5577079 -5691388 -6027408 -6716251 -7640863 -8674078
8462h674078j157943j269554j168015p83269k66471J86368L97669J87864l75990
$$ -8674078 -9832021 -11101575 -12269590 -13052859 -13319330 -13132962 -12735293 -12547429 -12923419
8453a2923419p26357k10256J081580K242868K524749K095950J618712J401062
$$ -12923419 -13649776 -13860032 -12778452 -10535584 -8010835 -5914885 -4296173 -2895111
8445b895111J320124J318819J492097J736371J744411J420308R96507O78695M45277
$$ -2895111 -1574987 -256168 1235929 2972300 4716711 6137019 7133526 7812221 8257498
8436H257498K67939K61116M63436O32749L99316m11300j585468k542924k631052
$$ 8257498 8525437 8786553 9249989 9882738 10282054 9870754 8285286 5742362 3111310
8427C111310j645029j15192J084670J468032J194594P00603L09394J70064K67299
$$ 3111310 1466281 1351089 2435759 3903791 5098385 5798988 6108382 6278446 6545745
8418F545745L91643L22427J20342K9444M6529j24123n66910q99292p34542j97159
$$ 6545745 6937388 7259815 7380157 7409601 7456130 7332007 6765097 5865805 5131263 4934104
8408D934104K24739J75944l72126j198865j890599k051856j764319j667633k232123
$$ 4934104 5158843 5334787 4962661 3763796 1873197 -178659 -1942978 -3610611 -5842734
8399e842734l033042l108028k044795m02388R76129J740530K022173J986064J688525
$$ -5842734 -8875776 -11983804 -14028599 -14430987 -13454858 -11714328 -9692155 -7706091 -6017566
8390f017566J274188J046935J231593J676523J833317J147656l87024k071854
$$ -6017566 -4743378 -3696443 -2464850 -788327 1044990 2192646 1805622 -266232
8382b66232l031851k951699k233695j471892r13174m39233J03801O84206J137685
$$ -266232 -3298083 -6249782 -8483477 -9955369 -10868543 -11307776 -11203975 -10519769 -9382084
8373i382084J357655J415205J468024J537708J462501J150568P79755N93035N60462
$$ -9382084 -8024429 -6609224 -5141200 -3603492 -2140991 -990423 -210668 382367 942829
8364I42829M31094Q9101l49847p86558j224489j543905j465832r28766l19896
$$ 942829 1373923 1463024 1113177 326619 -897870 -2441775 -3907607 -4836373 -5156269
8355e156269j07407l20513n70836n29516k07500K05773N80170Q45056Q75294N28119
$$ -5156269 -5263676 -5584189 -6155025 -6684541 -6892041 -6686268 -6106098 -5261042 -4385748 -3857629
8345c857629j44912p61503q20275j95803N89894P56526J4272j157346k018585
$$ -3857629 -4002541 -4764044 -5584319 -5780122 -5190228 -4433702 -4419430 -5576776 -7595361
8336g595361k236051j982973j558155j109075o73806k79031Q3467M85567R89342
$$ -7595361 -9831412 -11814385 -13372540 -14481615 -15155421 -15434452 -15350985 -14865418 -13876076
8327a3876076J538321J922264J876736J305618M52931k16753l87210j31196K08162
$$ -13876076 -12337755 -10415491 -8538755 -7233137 -6780206 -6996959 -7384169 -7515365 -7307203
8318g307203K85155r8053r15446j851773k446551k496893k260030k083066j892815
$$ -7307203 -7022048 -7120101 -8035547 -9887320 -12333871 -14830764 -17090794 -19173860 -21066675
8309b1066675j283489j24966J154179J994761K238318K094674J736690J162631
$$ -21066675 -22350164 -22475130 -21320951 -19326190 -17087872 -14993198 -13256508 -12093877
8301a2093877M57136k0943J35039R69811K044795K760838K820392K395976J875638
$$ -12093877 -11636741 -11657684 -11522645 -10552834 -8508039 -5747201 -2926809 -530833 1344805
8292A344805J471798J084910N17705k26647q88787j193914j126270r33121q52602
$$ 1344805 2816603 3901513 4419218 4192571 3303784 2109870 983600 50479 -802123
8283h02123q82205q43777o17089k42786J43539L65557K47228k12304o77247o93159
$$ -802123 -1684328 -2528105 -3145194 -3387980 -3244441 -2878884 -2631656 -2843960 -3521207 -4214366
8273d214366j84026M27142P45919R14952J379688K212641K917122K954421K297187
$$ -4214366 -4398392 -3971250 -3225331 -2310379 -930691 1281950 4199072 7153493 9450680
8264I450680J388418O82665L27052K15803K19349K87327L29072Q0538p48450k104112
$$ 9450680 10839098 11521763 11848815 12064618 12283967 12571294 12900366 12980904 12232454 10128342
8254A0128342l458641m189072m087864l444411k692940k088743j659283j285587
$$ 10128342 6669701 2480629 -1607235 -5051646 -7744586 -9833329 -11492612 -12778199
8246a2778199p88949o4915P82282J461924J680274J333844O19080K905m0065N83316
$$ -12778199 -13567148 -13632063 -12849781 -11387857 -9707583 -8373739 -7754659 -7751754 -7791819 -7208503
8236g208503J474886K103453K222205J890115J256443N05069j17794m59859n89214
$$ -7208503 -5733617 -3630164 -1407959 482156 1738599 2243668 2125874 1666015 1076801
8227A076801n65819k01700O51092J628492K032496J556403N56509m49549j252423
$$ 1076801 510982 309282 960374 2588866 4621362 6177765 6734274 6284725 5032302
8218E032302j843376k181266k255019k135599j812172j206580m62108Q3937L79675
$$ 5032302 3188926 1007660 -1247359 -3382958 -5195130 -6401710 -6863818 -6779881 -6400206
8209f400206P78234J441327J958017J884791J374277Q74372M42743j76414r42525
$$ -6400206 -5621972 -4180645 -2222628 -337837 1036440 1910812 2353555 2177141 1234616
8200A234616j486532j661758j668205j586124j202869l99141O41456J685281K566590
$$ 1234616 -251916 -1913674 -3581879 -5168003 -6370872 -6770013 -6128557 -4443276 -1876686
8191a876686K993285K656441J714980Q02192L11238j6469n43660j097140j227993
$$ -1876686 1116599 3773040 5488020 6290212 6601450 6584981 6041321 4944181 3716188
8182C716188q99357n25363m05815m62392n23023n69658o50785p61076q60071q57551
$$ 3716188 2816831 2291468 1885653 1423261 900238 330580 -320205 -1081281 -1941352 -2798903
8172b798903n76030Q9954R38710J553561J706093J552666J364394J163104P12350
$$ -2798903 -3374933 -3284979 -2346269 -792708 913385 2466051 3830445 4993549 5705899
8163E705899j73071j363560k443362k997656k921476k475483k033331j790792
$$ 5705899 5532828 4169268 1725906 -1271750 -4193226 -6668709 -8702040 -10492832
8155a0492832j720467j708164j618662j275970n44615N12495J645325K611504
$$ -10492832 -12213299 -13921463 -15540125 -16816095 -17360710 -16848215 -15202890 -12591386
8147a2591386L255974L381287K748130J409128m5590q56268q19998m98502n72834
$$ -12591386 -9335412 -5954125 -3205995 -1796867 -1842457 -2698725 -3518723 -4017225 -4590059
8138d590059j100436j567179j582456j275211r63203o67806j29040Q01964J934532
$$ -4590059 -5690495 -7257674 -8840130 -10115341 -11078544 -11746350 -11875390 -11073426 -9138894
8129i138894K848106L133553K633746J620117O82168K50467K09327J18101j99272
$$ -9138894 -6290788 -3157235 -523489 1096628 1778796 2029263 2238590 2356691 2157419
8120B157419m68846l97748r4768L7611k99275j077867j958551k421179k056430
$$ 2157419 1688573 1290825 1196057 1233668 934393 -143474 -2102025 -4523204 -6579634
8111f579634r31950L76816J260873J559830J508685J332415J059683O55900J29535
$$ -6579634 -7511584 -7134768 -5873895 -4314065 -2805380 -1472965 -413282 242618 372153
8102C72153m85918j067750j315880r53189j24099N51885M64723m75309j815225
$$ 372153 -113765 -1181515 -2497395 -3450584 -3574683 -3022798 -2558075 -3033384 -4848609
8093d848609k915516l293080k830008j858558r61672m74785j74773L85127J242715
$$ -4848609 -7764125 -11057205 -13887213 -15745771 -16707443 -17182228 -17357001 -16971874 -15729159
8084a5729159J927675K051025J791010J638502J789993J988265J912778J522858
$$ -15729159 -13801484 -11750459 -9959449 -8320947 -6530954 -4542689 -2629911 -1107053
8076a107053R82687M25054r0935m62622n12320j27746N53847J124016J167986
$$ -1107053 -124366 300688 209753 -252869 -765189 -892935 -339088 784928 1952914
8067A952914O51622o50l25397k85819k05057l07450n36102q00847j111927j369062
$$ 1952914 2604536 2603886 2278489 1992670 1787613 1480163 944061 143214 -968713 -2337775
8057b337775j313605r08050n39567n73228q48602q94069n23000P4353P17177J338271
$$ -2337775 -3651380 -4559430 -5098997 -5672225 -6520827 -7414896 -7937896 -7863543 -7146366 -5808095
8047e808095J734566J638911J157681P82603P88365R02882P57806L87862N4683
$$ -5808095 -4073529 -2434618 -1276937 -494334 294031 1196913 1954719 2342581 2397264
8038B397264j69634l55097m50199l92601l50350m98896o08696k16852P35306J733833
$$ 2397264 2227630 1872533 1422334 1029733 679383 180487 -428209 -645061 90245 1824078
8028A824078K254178K238037J900410J325845M76308n53292j528113k275976k707850
$$ 1824078 4078256 6316293 8216703 9542548 10018856 9465564 7937451 5661475 2953625
8019B953625k658894j927080n74236R28867J998496K382683K260171J939221J567987
$$ 2953625 294731 -1632349 -2206585 -1277718 720778 3103461 5363632 7302853 8870840
8010H870840J153818P18369K88675k16458r16794j729900k320492k397133k020099
$$ 8870840 10024658 10743027 11031702 10815244 9898450 8168550 5848058 3450925 1430826
8001A430826j537171j228337j065697q12712l14590L21155Q22995J024161R98754
$$ 1430826 -106345 -1334682 -2400379 -3213091 -3527681 -3206526 -2383531 -1359370 -360616
7992c60616R04021P49589M15129j37023p84771j363989j720056j652341j030875
$$ -360616 543405 1292994 1708123 1571100 786329 -577660 -2297716 -3950057 -4980932
7983d980932q1242O20686O17477k4263q56074j456062j565697j012030J83295
$$ -4980932 -5062174 -4441488 -3824011 -3848274 -4704348 -6160410 -7726107 -8738137 -8554842
7974h554842J588697K504754K474316J611176M25606n66742j068385j029345o18350
$$ -8554842 -6966145 -4461391 -1987075 -375899 49707 -517035 -1585420 -2614765 -3233115
7965c233115j43476J06281R287l62151q32688j234704j444879j348219q53674
$$ -3233115 -3376591 -3270310 -3261023 -3623174 -4455862 -5690566 -7135445 -8483664 -9337338
7956i337338l7081P69216J184732J139250R16413P88657P39001O21931M36371
$$ -9337338 -9374419 -8605203 -7420471 -6281221 -5364808 -4576151 -3837150 -3215219 -2778848
7947b778848K77489J31327r3228l97346p50163j262411k065370k974494l472574
$$ -2778848 -2501359 -2370032 -2463260 -2860606 -3610769 -4873180 -6938550 -9913044 -13385618
7938a3385618l147358k075041p25806M37791J242205J766444K088366K086948
$$ -13385618 -16532976 -18608017 -19333823 -18896032 -17653827 -15887383 -13799017 -11712069
7930a1712069J556533N52301m79071j022203q97258k93223M41954Q97159O89728
$$ -11712069 -10155536 -9603235 -10082306 -11104509 -12001767 -12294990 -11853036 -10955877 -10266149
7921a0266149j93639j172448j522057j130962n47614j94981J52861R20429K016285
$$ -10266149 -10459788 -11632236 -13154293 -14285255 -14832869 -15027850 -14874989 -13954560 -11938275
7912a1938275K854221K968484K362914J344451K96932l89694m80368j53124O4690
$$ -11938275 -9084054 -6115570 -3752656 -2408205 -2111273 -2500967 -2981335 -3134459 -3069769
7903c069769j97789p61923j138110j101721q57837o36324l71276N3019M44798
$$ -3069769 -3267558 -4029481 -5167591 -6269312 -7127149 -7763473 -8134749 -8081730 -7636932
7894g636932N33592N33774J091721K465894M003309M687489M082345K553437P58657
$$ -7636932 -7103340 -6569566 -5477845 -3011951 991358 5678847 9761192 12314629 13073286
7885A3073286p75928j718294j990578j851529j670301j557586j378883j054191
$$ 13073286 12297358 10579064 8588486 6736957 5066656 3509070 2130187 1075996
7877A075996n75751J81412J259671K207439K332215J552461O08213J74598J11959
$$ 1075996 500245 681657 1941328 4148767 6480982 8033443 8641656 8816254 8928213
7868H928213r6800m86072o20184l13652Q7429J52079j96642p08769j071739j163393
$$ 8928213 8831413 8345341 7725157 7411505 7498934 7651013 7454371 6745602 5673863 4510470
$$ [...]
##END NTUPLES=NMR SPECTRUM
##END=
