##TITLE=31Pdec_DE-18kmshot-TFA
  CDCl3
  24 sc
 29.9.2023
##JCAMPDX= 6.0         $$ Bruker NMR JCAMP-DX V2.0
##DATA TYPE= NMR SPECTRUM
##DATA CLASS= NTUPLES
##ORIGIN= UXNMR, Bruker Analytische Messtechnik GmbH
##OWNER= root
$$ XWIN-NMR		Version 3.5
$$ Fri Sep 29 14:07:46 2023 Russian Standard Time (UT+4h)  she@DPX200
##.OBSERVE FREQUENCY= 81.013821
##.OBSERVE NUCLEUS= ^31P
##.ACQUISITION MODE= SIMULTANEOUS
##.ACQUISITION SCHEME= undefined
##.AVERAGES= 24
##.DIGITISER RES= 16
##SPECTROMETER/DATA SYSTEM= spect
##.PULSE SEQUENCE= zgpg30
##.SOLVENT NAME= DMSO
##.SHIFT REFERENCE= (INTERNAL, DMSO, 0, 248.564)
##AUDIT TRAIL= $$ (NUMBER, WHEN, WHO, WHERE, WHAT)
$$ ##TITLE= Audit trail, XWIN-NMR		Version 3.5
$$ ##JCAMPDX= 5.01
$$ ##ORIGIN= Bruker BioSpin GmbH
$$ ##OWNER= she
$$ F:/spectra/data/she/nmr/P31/1/pdata/1/auditp.txt
$$ ##AUDIT TRAIL=  $$ (NUMBER, WHEN, WHO, WHERE, WHAT)
(   1,<2023-09-29 14:06:37.23 +0400>,<she>,<DPX200>,
      <created by zg, POWCHK disabled, PULCHK disabled
       configuration hash MD5:
       00 E9 B6 7A A2 85 ED C7 34 08 36 98 17 FE 4E 26
       data hash MD5: 32K
       A3 65 D2 E6 05 BB 4A 15 02 F3 BA 99 EA 16 80 1D>)
(   2,<2023-09-29 14:06:45.26 +0400>,<she>,<DPX200>,
      <Start of raw data processing
       efp BC_mod = 2 LB = 5 FT_mod = 6 PKNL = 1 PHC0 = -10726.74 PHC1 = 268.6864 SI = 64K 
       data hash MD5: 64K
       13 E4 86 05 6A 24 7C 4F 07 D9 70 F2 8C 7D EC 44>)
(   3,<2023-09-29 14:06:57.31 +0400>,<she>,<DPX200>,
      <abs ABSG = 5 
       data hash MD5: 64K
       2D FD D8 B7 68 D6 28 9F 51 51 98 5F 6B 36 43 F3>)
$$ ##END=
$$ 
$$ hash MD5
$$ ED 43 1D 10 50 25 D1 3E C7 95 21 17 50 A5 9E 2E
##$RELAX= 
##$RELAX= 
##$RELAX= 
##$RELAX= 
##$RELAX= 
##$RELAX= 
##$RELAX= 
##$RELAX= 
##$RELAX= 
$$ Bruker specific parameters
$$ --------------------------
##$DU= <F:/spectra>
##$EXPNO= 1
##$NAME= <P31>
##$PROCNO= 1
##$TYPE= <nmr>
##$USER= <she>
##$AMP= (0..31)
100 100 100 100 100 100 100 100 100 100 100 100 100 100 100 100 100 100 
100 100 100 100 100 100 100 100 100 100 100 100 100 100 
##$AQSEQ= 0
##$AQ_mod= 1
##$AUNM= <au_zg>
##$AUTOPOS= <>
##$BF1= 81.014009
##$BF2= 200.13
##$BF3= 200.13
##$BF4= 200.13
##$BF5= 200.13
##$BF6= 200.13
##$BF7= 200.13
##$BF8= 200.13
##$BYTORDA= 1
##$CFDGTYP= 0
##$CFRGTYP= 5
##$CHEMSTR= <none>
##$CNST= (0..31)
1 1 145 1 1 1 1 1 1 1 1 1 1 1 1 1 1 1 1 1 1 1 1 1 1 1 1 1 1 1 1 1 
##$CPDPRG= <waltz16>
##$CPDPRG1= <>
##$CPDPRG2= <waltz16>
##$CPDPRG3= <>
##$CPDPRG4= <mlev>
##$CPDPRG5= <mlev>
##$CPDPRG6= <mlev>
##$CPDPRG7= <mlev>
##$CPDPRG8= <mlev>
##$CPDPRGB= <>
##$CPDPRGT= <>
##$D= (0..31)
0 1 0 0 0 0 0 0 0 0 0 0.03 2e-05 3e-06 0 0 0 0 0 0 0 0 0 0 0 0 0 0 0 0 
0 0 
##$DATE= 1695981996
##$DBL= (0..7)
120 120 120 11 120 120 24 19 
##$DBP= (0..7)
150 150 150 150 150 150 150 150 
##$DBP07= 0
##$DBPNAM0= <>
##$DBPNAM1= <>
##$DBPNAM2= <>
##$DBPNAM3= <>
##$DBPNAM4= <>
##$DBPNAM5= <>
##$DBPNAM6= <>
##$DBPNAM7= <>
##$DBPOAL= (0..7)
0.5 0.5 0.5 0.5 0.5 0.5 0.5 0.5 
##$DBPOFFS= (0..7)
0 0 0 0 0 0 0 0 
$$ [...]
##$SUBNAM3= <"">
##$SUBNAM4= <"">
##$SUBNAM5= <"">
##$SUBNAM6= <"">
##$SUBNAM7= <"">
##$SUBNAM8= <"">
##$SUBNAM9= <"">
##$SW= 501.771253377433
##$SWIBOX= (0..15)
0 1 3 0 0 0 0 0 0 0 0 0 0 0 0 0 
##$SW_h= 40650.406504065
##$TD= 32768
##$TD0= 1
##$TE= 0
##$TE2= 300
##$TE3= 300
##$TEG= 300
##$TL= (0..7)
0 120 53 12 22 120 120 120 
##$TP= (0..7)
150 150 150 150 150 150 150 150 
##$TP07= 0
##$TPNAME0= <>
##$TPNAME1= <>
##$TPNAME2= <>
##$TPNAME3= <>
##$TPNAME4= <>
##$TPNAME5= <>
##$TPNAME6= <>
##$TPNAME7= <>
##$TPOAL= (0..7)
0.5 0.5 0.5 0.5 0.5 0.5 0.5 0.5 
##$TPOFFS= (0..7)
0 0 0 0 0 0 0 0 
##$TUNHIN= 0
##$TUNHOUT= 0
##$TUNXOUT= 0
##$USERA1= <user>
##$USERA2= <user>
##$USERA3= <user>
##$USERA4= <user>
##$USERA5= <user>
##$V9= 5
##$VALIST= <valist>
##$VCLIST= <CCCCCCCCCCCCCCC>
##$VD= 0
##$VDLIST= <DDDDDDDDDDDDDDD>
##$VPLIST= <PPPPPPPPPPPPPPP>
##$VTLIST= <TTTTTTTTTTTTTTT>
##$WBST= 1024
##$WBSW= 4
##$XGAIN= (0..3)
0 0 0 0 
##$XL= 0
##$YL= 0
##$YMAX_a= 2924
##$YMIN_a= -1439
##$ZGOPTNS= <>
##$ZL1= 120
##$ZL2= 120
##$ZL3= 120
##$ZL4= 120
##$ABSF1= 248.5645
##$ABSF2= -253.2056
##$ABSG= 5
##$ABSL= 3
##$ALPHA= 0
##$AQORDER= 0
##$ASSFAC= 0
##$ASSFACI= 0
##$ASSFACX= 0
##$ASSWID= 0
##$AUNMP= <proc_1d>
##$AZFE= 0.1
##$AZFW= 0.5
##$BCFW= 0
##$BC_mod= 2
##$BYTORDP= 0
##$COROFFS= 0
##$CY= -3
##$DATMOD= 1
##$DC= 0
##$DFILT= <>
##$DTYPP= 0
##$F1P= 0
##$F2P= 0
##$FCOR= 1
##$FTSIZE= 65536
##$FT_mod= 6
##$GAMMA= 0
##$GB= 0
##$INTBC= 1
##$INTSCL= 6.047779e-11
##$ISEN= 30
##$LB= 5
##$LEV0= 0
##$LPBIN= 0
##$MAXI= 10000
##$MC2= 0
##$MEAN= 0
##$ME_mod= 0
##$MI= 50
##$NCOEF= 0
##$NC_proc= -10
##$NLEV= 6
##$NOISF1= 182.463
##$NOISF2= 159.3651
##$NSP= 0
##$NTH_PI= 0
##$NZP= 0
##$OFFSET= 248.5645
##$PC= 4
##$PHC0= -10726.74
##$PHC1= 268.6864
##$PH_mod= 1
##$PKNL= yes
##$PPARMOD= 0
##$PSCAL= 0
##$PSIGN= 0
##$REVERSE= no
##$SF= 81.0140089999694
##$SI= 65536
##$SIGF1= 159.3651
##$SIGF2= -187.1042
##$SINO= 113.3802
##$SIOLD= 16384
##$SREGLST= <1H.CDCl3>
##$SSB= 0
##$STSI= 65536
##$STSR= 0
##$SW_p= 40650.406504065
##$SYMM= 0
##$S_DEV= 0
##$TDeff= 32768
##$TDoff= 0
##$TI= <>
##$TILT= no
##$TM1= 0
##$TM2= 0
##$TOPLEV= 0
##$USERP1= <user>
##$USERP2= <user>
##$USERP3= <user>
##$USERP4= <user>
##$USERP5= <user>
##$WDW= 1
##$XDIM= 65536
##$YMAX_p= 340498902
##$YMIN_p= -200060490
$$ End of Bruker specific parameters
$$ ---------------------------------
##NTUPLES= NMR SPECTRUM
##VAR_NAME=  FREQUENCY,     SPECTRUM/REAL,   SPECTRUM/IMAG
##SYMBOL=    X,             R,               I
##VAR_TYPE=  INDEPENDENT,   DEPENDENT,       DEPENDENT
##VAR_FORM=  AFFN,          ASDF,            ASDF
##VAR_DIM=   65536,         65536,           65536
##UNITS=     HZ,            ARBITRARY UNITS, ARBITRARY UNITS
##FACTOR=    0.620285442955139, 1,           1
##FIRST=     20137.2065510682, 0,            0
##LAST=      -20513.1999529968, 0,           0
##MIN=       -20513.1999529968, -200060490,  0
##MAX=       20137.2065510682, 340498902,    0
$$ Real data points
##PAGE= N=1
##DATA TABLE= (X++(R..R)), XYDATA
$$ [...]
$$ plain form
43419 -13021964 -12684457 -11565970 -10372562 -9760418 -9692534 -9510165 -8652612 -7237287 -5905209
43410 -5905209 -5210586 -5274655 -5931796 -6946867 -7971825 -8478477 -8025212 -6704365 -5240404
43401 -5240404 -4522351 -4964845 -6267445 -7727154 -8750891 -9121255 -8901717 -8215132 -7147907
43392 -7147907 -5803136 -4375269 -3160417 -2490147 -2598205 -3483383 -4886079 -6403334 -7621482
43383 -7621482 -8205189 -8038485 -7391708 -6823232 -6719280 -6959985 -7221060 -7577880 -8550232
43374 -8550232 -10459709 -12978013 -15463496 -17514782 -18944692 -19414817 -18539035 -16423957
43366 -16423957 -13770854 -11241841 -8895680 -6391222 -3556643 -544652 2428828 5199884
43358 5199884 7526094 9150591 10144748 10992481 12113318 13339953 14024239 13672627 12392859
$$ packed form
43419a3021964L37507J118487J193408O12144O7884J82369Q57553J415325J332078
43410e905209O94623o4069o57141j015071j024958n06652M53265J320847J463961
43401e240404P18053m42494j302600j459709j023737l70364K19538O86585J067225
43392g147907J344771J427867J214852O70270j08058q85178j402696j517255j218148
43383g621482n83707J66704O46777N68476J03952k40705k61075l56820r72352
43374h550232j909477k518304k485483k051286j429910m70125Q75782K115078
43366a6423957K653103K529013K346161K504458K834579L011991K973480K771056
43358E199884K326210J624497R94157Q47733J120837J226635O84286l51612j279768
$$ plain form
43349 12392859 10754093 9351339 8505575 8176442 7989407 7402905 6011158 3747068 796786
43340 796786 -2582285 -6045150 -9050248 -11005399 -11630785 -11093605 -9755615 -7925548 -5921178
43331 -5921178 -4182215 -3099338 -2746167 -2897853 -3257221 -3513325 -3243999 -2039374 112155
43322 112155 2631538 4636395 5422806 4733128 2766783 84705 -2582062 -4630712 -5805245
43313 -5805245 -6153269 -5838262 -5057464 -4074814 -3174623 -2503550 -2010893 -1609339 -1372160
43304 -1372160 -1506470 -2122430 -3085441 -4125243 -5027216 -5645131 -5796635 -5335362 -4408070
43295 -4408070 -3504286 -3096970 -3272376 -3819815 -4604534 -5655895 -6882732 -7905769 -8277571
43286 -8277571 -7775607 -6448473 -4530127 -2393179 -424276 1219311 2656058 3957213
$$ packed form
43349A2392859j638766j402754q45764l29133j87035n86502j391747k264090k950282
43340G96786l379071l462865l005098j955151o25386N37180J337990J830067K004370
43331e921178J738963J082877L53171j51686l59368k56104K69326J204625K151529
43322A12155K519383K004857P86411o89678j966345k682078k666767k048650j174533
43313e805245l48024L15007P80798R82650R00191O71073M92657M01554K37179
43304a372160j34310o15960r63011j039802r01973o17915j51504M61273R27292
43295d408070R03784M07316j75406n47439p84719j051361j226837j023037l71802
43286h277571N01964J327134J918346K136948J968903J643587J436747J301155
$$ plain form
43278 3957213 4859854 4963048 4185447 2906036 1683167 943108 861427 1328223 1979204
43269 1979204 2412565 2457697 2180117 1657978 898574 -30953 -981171 -1878308 -2698341 -3165063
43259 -3165063 -2682250 -823268 2136521 5333938 7952271 9665961 10607011 11164006 11816421
43250 11816421 12870713 14172690 15203690 15608373 15545097 15390804 15200803 14653782 13500279
43241 13500279 11836632 9842836 7425438 4325763 590271 -3182697 -6127276 -7645675
43233 -7645675 -7704197 -6673960 -4918991 -2548657 419234 3690881 6601969 8476626
43225 8476626 9067628 8629415 7667717 6728776 6315824 6721888 7802688 9021705 9818744
43216 9818744 9876575 9030453 7150812 4329137 1087353 -1824712 -3873336 -4908850 -5021651
$$ packed form
43278C957213R02641J03194p77601j279411j222869p40059q1681M66796O50981
43269A979204M33361M5132k77580n22139p59404r29527r50218q97137q20033m66722
43259c165063M82813J858982K959789L197417K618333J713690R41050N56995O52415
43250A1816421J054292J301977J031000M04683o3276j54293j90001n47021j153503
43241A3500279j663647j993796k417398l099675l735492l772968k944579j518399
43233g645675n8522J030237J754969K370334K967891L271647K911088J874657
43225H476626N91002m38213r61698r38941m12952M06064J080800J219017P97039
43216I818744N7831q46122j879641k821675l241784k912065k048624j035514j12801
$$ plain form
43207 -5021651 -4478546 -3768315 -3380283 -3353046 -3187213 -2337903 -687256 1533331 4061506
43198 4061506 6609886 8667950 9589177 8966231 6850318 3668682 99590 -3004689
43190 -3004689 -4841974 -5022872 -3755739 -1700978 333809 1720660 2342173 2708993 3563281
43181 3563281 5191560 7173839 8873297 10063867 10983449 11915423 12927139 13982703
43173 13982703 15079435 16153310 16939520 17049467 16233410 14599719 12611844 10840237
43165 10840237 9623923 8900499 8332385 7580930 6503104 5221295 4101981 3578658 3817497
43156 3817497 4515248 5127258 5339996 5263059 5169547 5178543 5244835 5323935 5405451 5432298 5338375
43145 5338375 5214006 5351399 6028337 7190674 8335259 8767946 8100656 6562189 4777812
$$ packed form
43207e021651N43105P10231L88032K7237J65833Q49310J650647K220587K528175
43198D061506K548380K058064R21227o22946k115913l181636l569092l104279
43190c004689j837285j80898J267133K054761K034787J386851O21513L66820Q54288
43181C563281J628279J982279J699458J190570R19582R31974J011716J055564
43173A3982703J096732J073875P86210J09947q16057j633691j987875j771607
43165A0840237j216314p23424n68114p51455j077826j281809j119314n23323K38839
43156C817497O97751O12010K12738p6937r3512Q996O6292P9100Q1516K6847r3923
43145E338375j24369J37393O76938J162337J144585M32687o67290j538467j784377
$$ plain form
43136 4777812 3216157 1928148 854486 204172 295617 1042865 1846512 2138777 1944555
43127 1944555 1806248 2232972 3309902 4735274 6054971 6877605 7064441 6826867 6559221
43118 6559221 6481556 6478838 6345184 6129710 6148612 6665827 7636598 8766485 9752589 10462596
43108 10462596 10971917 11486325 12168472 12950069 13506415 13458674 12609889 10981614 8691487
43099 8691487 5910573 2972583 430585 -1123869 -1386893 -550765 774709 1896608
43091 1896608 2439662 2549696 2726465 3402510 4634039 6155730 7657304 8938415 9826972
43082 9826972 10073351 9431278 7854678 5577323 2984627 417306 -1912209 -3864982
43074 -3864982 -5301899 -6097523 -6223166 -5792347 -4992886 -3945930 -2631481 -994137 843490
$$ packed form
43136D777812j561655j288009j073662o50314R1445P47248Q03647K92265j94222
43127A944555j38307M26724J076930J425372J319697Q22634J86836k37574k67646
43118F559221p7665k718j33654k15474J8902N17215R70771J129887R86104P10007
43108A0462596N09321N14408O82147P81597N56346m7741q48785j628275k290127
43099H691487k780914k937990k541998j554454k63024Q36128J325474J121899
43091A896608N43054J10034J76769O76045J231529J521691J501574J281111Q88557
43082I826972K46379o42073j576600k277355k592696k567321k329515j952773
43074c864982j436917p95624j25643M30819P99461J046956J314449J637344J837627
$$ plain form
43065 843490 2521132 3703840 4444296 5196142 6386410 8027089 9823050 11568456 13255269
43056 13255269 14801686 15897227 16241940 15818649 14823201 13451055 11892486 10409876
43048 10409876 9183657 8094619 6873184 5517206 4394933 3867729 3965013 4522670 5488446
43039 5488446 6928388 8807382 10935490 13138296 15357347 17540086 19500191 20937378
43031 20937378 21584669 21326026 20180012 18192603 15408801 12016561 8471011 5309296
43023 5309296 2743607 516854 -1738054 -4042677 -6062892 -7491386 -8290682 -8528339
43015 -8528339 -8093867 -6695035 -4164258 -765155 2817692 5844241 7940313 9199175
43007 9199175 9916422 10286497 10330061 9970491 9099998 7694130 6014249 4644520 4163871
$$ packed form
43065H43490J677642J182708P40456P51846J190268J640679J795961J745406J686813
43056A3255269J546417J095541L44713m23291r95448j372146j558569j482610
43048A0409876j226219j089038j221435j355978j122273n27204R7284N57657R65776
43039E488446J439942J878994K128108K202806K219051K182739J960105J437187
43031B0937378O47291k58643j146014j987409k783802l392240l545550l161715
43023E309296k565689k226753k254908k304623k020215j428494p99296k37657
43015h528339M34472J398832K530777L399103L582847L026549K096072J258862
43007I199175P17247L70075M3564l59570q70493j405868j679881j369729m80649
$$ plain form
42998 4163871 4754614 6214703 8310716 10967120 14100109 17422563 20484976 22834671
42990 22834671 24147061 24369848 23815484 22970679 22083843 20995734 19452704 17517341 15598775
42981 15598775 14160193 13477618 13575428 14223480 14988281 15400474 15129993 14025980 12105550
42972 12105550 9622978 7089727 5052953 3773934 3135739 2822011 2519274 2019478 1300842
42963 1300842 566838 110196 69572 345220 754567 1214977 1775957 2541259 3563271
42954 3563271 4740492 5809868 6515977 6810594 6841504 6773645 6705047 6702566 6736110 6545569
42944 6545569 5775969 4395033 2895569 1984982 2126746 3374717 5410300 7567635 9054482
42935 9054482 9521846 9425859 9545384 10081832 10473674 10167957 9305295 8487183 8116288 8227261
$$ packed form
42998D163871N90743J460089K096013K656404L132989L322454L062413K349695
42990B2834671J312390K22787n54364q44805q86836j088109j543030j935363j918566
42981A5598775j438582o82575R7810O48052P64801M12193k70481j104013j920430
42972A2105550k482572k533251k036774j279019o38195l13728l02737m99796p18636
42963A300842p34004m56642m0624K75648M09347M60410N60980P65302J022012
42954C563271J177221J069376P06109K94617L0910o7859o8598k481L3544j90541
42944F545569p69600j380936j499464r10587J41764J247971K035583K157335J486847
42935I054482M67364r5987J19525N36448L91842l05717q62662q18112l70895J10973
$$ plain form
42925 8227261 8804189 9906787 11429877 12970523 14047194 14370434 13912402 12881638 11680388
42916 11680388 10715027 10107068 9640217 9061249 8377296 7812569 7564860 7689946 8143323
42907 8143323 8796335 9405939 9665312 9331931 8305316 6633061 4529486 2395420 727449
42898 727449 -93013 22059 873221 2160950 3697260 5453418 7412705 9426184 11266601
42889 11266601 12778111 13862060 14330741 13954245 12755004 11135895 9588350 8364180
42881 8364180 7571770 7470004 8371539 10166566 12128170 13348892 13365782 12381728 11020450
42872 11020450 9920316 9405131 9376924 9531765 9734338 10133072 10865283 11735682 12259944
42863 12259944 11945511 10469056 7753616 4126766 407578 -2402805 -3704477 -3609498
$$ packed form
42925H227261N76928J102598J523090J540646J076671L23240m58032j030764j201250
42916A1680388r65361o07959m66851n78968o83953n64727k47709J25086M53377
42907H143323O53012O09604K59373l33381j026615j672255k103575k134066j667971
42898G27449q20462J15072Q51162J287729J536310J756158J959287K013479J840417
42889A1266601J511510J083949M68681l76496j199241j619109j547545j224170
42881H364180p92410j01766R01535J795027J961604J220722J6890r84054j361278
42872A1020450j100134n15185k8207J54841K02573L98734P32211Q70399N24262
42863A2259944l14433j476455k715440l626850l719188k810383j301672R4979
$$ plain form
42855 -3609498 -2719264 -1679620 -893328 -435996 -106800 354703 980906 1529052 1765495
42846 1765495 1696300 1402826 745343 -555328 -2496790 -4607797 -6272139 -7165723 -7337752
42837 -7337752 -7004832 -6414328 -5850701 -5595607 -5811518 -6513592 -7647632 -9102083 -10623414
42828 -10623414 -11826208 -12381311 -12201843 -11460584 -10491897 -9674160 -9281652 -9345446 -9679623
42819 -9679623 -10078649 -10436470 -10650767 -10535115 -9951569 -8976959 -7816546 -6581766 -5275437
42810 -5275437 -3987143 -2966953 -2443701 -2403138 -2519843 -2249543 -1083051 1083360 3767566
42801 3767566 6210000 7924968 8891695 9249636 8996339 8025775 6252181 3568723 -131213
42792 -131213 -4677319 -9434497 -13564874 -16454980 -17785899 -17311431 -14851097 -10613320
$$ packed form
42855c609498Q90234J039644P86292M57332L29196M61503O26203N48146K36443
42846A765495o9195k93474o57483j300671j941462k111007j664342q93584j72029
42837g337752L32920N90504N63627K55094k15911p02074j134040j454451j521331
42828a0623414j202794n55103J79468P41259R68687Q17737L92508o3794l34177
42819i679623l99026l57821k14297J15652N83546R74610J160413J234780J306329
42810e275437J288294J020190N23252M0563j16705K70300J166492K166411K684206
42801C767566K442434J714968R66727L57941k53297r70564j773594k683458l699936
42792a31213m546106m757178m130377k890106j330919M74468K460334M237777
$$ plain form
42784 -10613320 -5420539 -510343 2961780 4417010 4097532 2864999 1595072 628168
42776 628168 -246354 -1375432 -2919835 -4838819 -6934706 -8819824 -10015173 -10268420 -9785101
42767 -9785101 -9097023 -8707852 -8830590 -9332745 -9844633 -9990383 -9641720 -9002647 -8452001
42758 -8452001 -8299444 -8632722 -9287890 -9929945 -10256653 -10231839 -10136216 -10352121 -11055866 -12056879
42748 -12056879 -12884715 -13078794 -12506496 -11437813 -10259260 -9108460 -7844300 -6348526
42740 -6348526 -4732833 -3218582 -1939864 -944888 -282952 43686 179105 341491 623859
42731 623859 923287 1079325 1036033 849490 567341 138853 -528817 -1410932 -2277165 -2791559
42721 -2791559 -2702470 -1939007 -589842 1129250 2903940 4412795 5439558 5905590 5863357
$$ packed form
42784a0613320N192781M910196L472123J455230l19478j232533j269927r66904
42776F28168q74522j129078j544403j918984k095887j885118j195349k53247M83319
42767i785101O88078L89171j22738n02155n11888j45750L48663O39073N50646
42758h452001J52557l33278o55168o42055l26708K4814R5623k15905p03745j001013
42748a2056879q27836j94079N72298J068683J178553J150800J264160J495774
42740f348526J615693J514251J278718R94976O61936L26638J35419J62386K82368
42731F23859K99428J56038m3292j86543k82149m28488o67670q82115q66233n14394
42721b791559Q9089P63463J349165J719092J774690J508855J026763M66032m2233
$$ plain form
42712 5863357 5521641 5171069 4907845 4460348 3487537 2071148 710690 -216772 -763162
42703 -763162 -1099003 -1207413 -1134563 -1289531 -2078513 -3264384 -4041833 -3830247 -2733350
42694 -2733350 -1141202 819588 3220044 5896966 8360961 10141770 11093493 11361576
42686 11361576 11137128 10444104 9147134 7254368 5272928 4110000 4380369 5776067
42678 5776067 7290157 8150414 8430475 8690765 9201584 9721666 9929278 9722876 8973126
42669 8973126 7300252 4489510 1107619 -1640159 -2837911 -2500871 -1241497 424681
42661 424681 2214541 3757319 4578149 4487648 3727363 2620769 1291178 -138273 -1266185
42652 -1266185 -1589709 -937627 449619 2294592 4585738 7396697 10450089 13008867
$$ packed form
42712E863357l41716l50572k63224m47497r72811j416389j360458r27462n46390
42703g63162l35841j08410P2850j54968p88982j185871p77449K11586J096897
42694b733350J592148J960790K400456K676922K463995J780809R51723K68083
42686A1361576k24448o93024j296970j892766j981440j162928K70369J395698
42678E776067J514090Q60257K80061K60290N10819N20082K07612k06402p49750
42669H973126j672874k810742l381891k747778j197752L37040J259374J666178
42661D24681J789860J542778Q20830r0501p60285j106594j329591j429451j127912
42652a266185l23524O52082J387246J844973K291146K810959L053392K558778
$$ plain form
42644 13008867 14350643 14398667 13785750 13181481 12616755 11636238 10095312 8552140 7720246
42635 7720246 7691703 7904007 7803959 7342715 6837106 6565544 6571258 6671644 6498588 5624329
42625 5624329 3851586 1443038 -1006904 -2958271 -4138667 -4391372 -3474434 -1194360
42617 -1194360 2236884 6115574 9630736 12315649 14084201 14931406 14776170 13623362
42609 13623362 11736580 9567370 7589436 6240394 5866687 6516074 7747458 8758826
42601 8758826 8820317 7699901 5828324 4130558 3546332 4443072 6354228 8317529 9519308
42592 9519308 9672453 8952983 7788953 6701807 6093020 5979024 5969796 5614990 4770694
42583 4770694 3617410 2429131 1426415 776664 581399 837497 1480318 2441042 3557364
$$ packed form
42644A3008867J341776M8024o12917o04269n64726r80517j540926j543172q31894
42635G720246k8543K12304j00048m61244n05609k71562N714J00386j73056q74259
42625E624329j772743k408548k449942j951367j180396k52705R16938K280074
42617a194360L431244L878690L515162K684913J768552Q47205j55236j152808
42609A3623362j886782k169210j977934j349042l73707O49387J231384J011368
42601H758826O1491j120416j871577j697766n84226Q96740J911156J963301J201779
42592I519308J53145p19470j164030j087146o08787j13996r228l54806q44296
42583D770694j153284j188279j002716o49751j95265K56098O42821R60724J116322
$$ plain form
42574 3557364 4432522 4524383 3482808 1407387 -1213367 -3771910 -5805065 -7164417 -8033965
42565 -8033965 -8711767 -9280270 -9532769 -9316692 -8921162 -9001438 -10055669 -11996800 -14235176
42556 -14235176 -16117842 -17266805 -17589849 -17130703 -16025399 -14591289 -13326809 -12671008
42548 -12671008 -12697454 -13072813 -13347954 -13283943 -12919847 -12414873 -11880142 -11299803 -10527910 -9386550
42538 -9386550 -7857700 -6189300 -4736998 -3657770 -2776674 -1759498 -402951 1207341
42530 1207341 2751159 3868322 4354720 4230144 3685805 3055904 2831500 3496456 5120940
42521 5120940 7133621 8704303 9439268 9591746 9551972 9296520 8469269 6904254 4912421
42512 4912421 3068350 1822194 1323684 1524224 2351432 3707530 5271615 6429699 6631164
$$ packed form
42574C557364Q75158R1861j041575k075421k620754k558543k033155j359352q69548
42565h033965o77802n68503k52499K16077L95530q0276j054231j941131k238376
42556a4235176j882666j148963l23044M59146J105304J434110J264480O55801
42548a2671008k6446l75359k75141O4011L64096N04974N34731N80339P71893J141360
42538i386550J528850J668400J452302J079228Q81096J017176J356547J610292
42530A207341J543818J117163M86398j24576n44339o29901k24404O64956J624484
42521E120940K012681J570682P34965J52478l9774k55452q27251j565015j991833
42512D912421j844071j246156m98510K00540Q27208J356098J564085J158084K01465
$$ plain form
42503 6631164 5912372 4961888 4593734 5227308 6853414 9226809 11877256 14106319 15308251
42494 15308251 15378146 14700868 13775339 12974288 12569113 12709807 13288379 13962017 14375053
42485 14375053 14292972 13593025 12349602 10966889 9994529 9659110 9682507 9650408 9431840
42476 9431840 9120259 8681505 7841266 6319010 4073855 1326435 -1564670 -4195551 -6111915
42467 -6111915 -6799675 -5838043 -3208530 540146 4516739 7899424 10149449 11015042 10566685
42458 10566685 9191814 7296263 4948273 2020809 -1260560 -4160509 -5974839 -6573838
42450 -6573838 -6325586 -5719643 -5228641 -5264787 -5916589 -6781694 -7315014 -7321315 -6932341 -6220369
42440 -6220369 -5132292 -3768271 -2381321 -1001709 658847 2753099 4925787 6576593
$$ packed form
42503F631164p18792r50484l68154O33574J626106K373395K650447K229063J201932
42494A5308251O9895o77278r25529q01051m05175J40694N78572O73638M13036
42485A4375053q2081o99947j243423j382713r72360l35419K3397l2099k18568
42476I431840l11581m38754q40239j522256k245155k747420k891105k630881j916364
42467f111915o87760R61632K629513L748676L976593L382685K250025Q65593m48357
42458A0566685j374871j895551k347990k927464l281369k899949j814330n98999
42450f573838K48252O05943M91002l6146o51802q65105n33320o301L88974P11972
42440f220369J088077J364021J386950J379612J660556K094252K172688J650806
$$ plain form
42432 6576593 7403712 7555331 7336858 6935592 6410765 5787680 5059252 4104101 2654225
42423 2654225 422018 -2644077 -6189388 -9583789 -12289066 -14139974 -15309912 -16051809
42415 -16051809 -16476839 -16536648 -16165586 -15401055 -14351201 -13086055 -11625319 -10014199 -8309571
42406 -8309571 -6476284 -4432726 -2291416 -459823 621017 815507 323837 -541109 -1526978
42397 -1526978 -2492173 -3410245 -4266560 -4860793 -4837624 -4096413 -3089882 -2480915 -2479878 -2681322
42387 -2681322 -2541136 -1819217 -558230 1075707 2727340 3766254 3535927 1844722 -744465
42378 -744465 -3155673 -4505123 -4750143 -4627089 -4834910 -5324342 -5507466 -5049963 -4209934
42369 -4209934 -3443691 -2995049 -2949476 -3392721 -4312359 -5488286 -6618510 -7443912 -7705721
$$ packed form
42432F576593Q27119J51619k18473m01266n24827o23085p28428r55151j449876
42423B654225k232207l066095l545311l394401k705277j850908j169938p41897
42415a6051809m25030n9809L71062P64531J049854J265146J460736J611120J704628
42406h309571J833287K043558K141310J831593J080840J94490m91670q64946r85869
42397a526978r65195r18072q56315n94233K3169P41211J006531O08967J037k01444
42387b681322J40186P21919J260987J633937J651633J038914k30327j691205k589187
42378g44465k411208j349450k45020J23054k07821m89432j83124M57503Q40029
42369d209934P66243M48642M5573m43245r19638j175927j130224q25402k61809
$$ plain form
42360 -7705721 -7210101 -6084438 -4774731 -3598014 -2444266 -1112513 198843 980516
42352 980516 942671 272779 -584070 -1218585 -1375042 -1006608 -311806 351355 636745 347646
42342 347646 -442261 -1311923 -1681919 -1264873 -290931 813318 1856643 2839027 3613206
42333 3613206 3881179 3563741 2963516 2474459 2241575 2140216 1964151 1569584 911309
42324 911309 -4780 -1213771 -2800531 -4754720 -6846770 -8714896 -10061451 -10764628 -10929377
42315 -10929377 -10914184 -11151871 -11754673 -12364188 -12547943 -12264069 -11777833 -11257085 -10711590
42306 -10711590 -10232626 -9930614 -9596887 -8773810 -7312593 -5614053 -4165971 -3062383 -2141247
42297 -2141247 -1367627 -827953 -472692 -129093 238060 444956 267699 -397843 -1509373
$$ packed form
42360g705721M95620J125663J309707J176717J153748J331753J311356P81673
42352I80516l7845o69892q56849o34515j56457L68434O94802O63161K85390k89099
42342C47646p89907q69662l69996M17046R73942J104249J043325R82384P74179
42333C613206K67973l17438o00225m89057k32884j01359j76065l94567o58275
42324I11309r16089j208991j586760j954189k092050j868126j346555p03177j64749
42315a0929377J5193k37687o02802o09515j83755K83874M86236N20748N45495
42306a0711590M78964L02012L33727Q23077J461217J698540J448082J103588R21136
42297b141247P73620N39674L55261L43599L67153K06896j77257o65542j111530
$$ plain form
42288 -1509373 -2888592 -4270299 -5424791 -6219724 -6541887 -6283568 -5540969 -4753477 -4452815
42279 -4452815 -4791467 -5353904 -5455311 -4649306 -3028337 -1083322 781439 2626574 4796991
42270 4796991 7336155 9718952 11269857 11716545 11178623 9753292 7422798 4435342
42262 4435342 1526840 -461474 -1191775 -1009467 -568397 -325281 -323280 -329584 -114874 370524
42252 370524 1017174 1682254 2270101 2709208 2886545 2643751 1889957 756185 -388274
42243 -388274 -1134457 -1266056 -791511 182787 1515296 3017047 4553710 6214768 8230351
42234 8230351 10599675 12879188 14444530 14921130 14307220 12789982 10585272 7915428
42226 7915428 5009576 2115208 -437263 -2262054 -3160037 -3338804 -3286512 -3410618 -3842834
$$ packed form
42288a509373j379219j381707j154492p94933l22163K58319P42599P87492L00662
42279d452815l38652n62437j01407Q06005J620969J945015J864761J845135K170417
42270D796991K539164K382797J550905M46688n37922j425331k330494k987456
42262D435342k908502j988314p30301J82308M41070K43116K001o304K14710M85398
42252C70524O46650O65080N87847M39107J77337k42794p53794j133772j144459
42243c88274p46183j31599M74545R74298J332509J501751J536663J661058K015583
42234H230351K369324K279513J565342M76600o13910j517238k204710k669844
42226G915428k905852k894368k552471j824791q97983j78767N2292j24106m32216
$$ plain form
42217 -3842834 -4502205 -5163086 -5456905 -5021846 -3815472 -2253182 -965745 -401362 -601664
42208 -601664 -1229688 -1762348 -1757996 -1057941 228281 1887108 3673665 5254434 6263984
42199 6263984 6570459 6448484 6362843 6526914 6684151 6320884 5112161 3257158 1473551
42190 1473551 619506 1143925 2738532 4477669 5368308 4908312 3281621 1153895 -684581
42181 -684581 -1607877 -1355319 -161216 1328755 2466238 3059145 3379487 3665512 3724827
42172 3724827 3160083 1925207 497957 -505897 -787345 -500816 -166619 -490426 -1994948
42163 -1994948 -4566987 -7410803 -9632393 -10899770 -11464417 -11626902 -11390788 -10674891 -9657217
42154 -9657217 -8727345 -8131279 -7771565 -7348573 -6615387 -5499573 -4080954 -2515582 -932680
$$ packed form
42217c842834o59371o60881k93819M35059J206374J562290J287437N64383k00302
42208f01664o28024n32660M352P00055J286222J658827J786557J580769J009550
42199F263984L06475j21975q5641J64071J57237l63267j208723j855003j783607
42190A473551q54045N24419J594607J739137Q90639m59996j626691k127726j838476
42181f84581r23296K52558J194103J489971J137483N92907L20342K86025N9315
42172C724827n64744j234876j427250j003854k81448K86529L34197l23807j504522
42163a994948k572039k843816k221590j267377n64647j62485K36114P15897J017674
42154i657217R29872N96066L59714M22992P33186J115814J418619J565372J582902
$$ plain form
42145 -932680 674586 2467227 4614384 7071404 9468377 11206032 11709966 10739913 8628277
42136 8628277 6258455 4648431 4325324 4990266 5815150 6120452 5800200 5147757 4363505
42127 4363505 3292380 1620373 -727439 -3400660 -5805847 -7455345 -8167591 -8002705
42119 -8002705 -7079842 -5480760 -3299387 -746919 1822874 4052664 5819308 7324420
42111 7324420 8837128 10269204 11068140 10641093 8900187 6354701 3718084 1523201
42103 1523201 77840 -433379 -17284 953169 1797337 1927904 1263215 226486 -685509
42094 -685509 -1311484 -1799881 -2283144 -2740984 -3195123 -3832608 -4768275 -5780217 -6468153
42085 -6468153 -6648283 -6424098 -5893390 -5019444 -3866010 -2738069 -1917064 -1391280 -1033439
$$ packed form
42145i32680J607266J792641K147157K457020K396973J737655N03934r70053k111636
42136H628277k369822j610024l23107O64942Q24884L05302l20252o52443p84252
42127D363505j071125j672007k347812k673221k405187j649498p12246J64886
42119h002705R22863J599082K181373K552468K569793K229790J766644J505112
42111G324420J512708J432076P98936m27047j740906k545486k636617k194883
42103A523201j445361n11219M16095R70453Q44168J30567o64689j036729r11995
42094f85509o25975m88397m83263m57840m54139o37485r35667j011942o87936
42085f468153j80130K24185N30708Q73946J153434J127941Q21005N25784L57841
$$ plain form
42076 -1033439 -944222 -1380303 -2344724 -3477634 -4431867 -5164711 -5714014 -5840806 -5152972
42067 -5152972 -3613787 -1742166 -203358 703611 1077082 1080657 790562 345553 3938
42058 3938 -64191 120460 591281 1620174 3401176 5592258 7458083 8571847 9173366
42049 9173366 9683026 10014223 9582153 7970281 5437677 2767901 741820 -245934 -251725
42040 -251725 333955 953922 1092705 514385 -603529 -1798516 -2636507 -2877152 -2336700
42031 -2336700 -788600 1737286 4580107 6703246 7552846 7556164 7613954 8189067 9014237
42022 9014237 9523187 9287426 8066385 5756345 2498994 -1204874 -4561918 -6694024
42014 -6694024 -6932800 -5154524 -1904541 1919727 5568044 8609861 10770075 11894974
$$ packed form
42076a033439Q9217m36081r64421j132910r54233p32844n49303j26792O87834
42067e152972J539185J871621J538808R06969L73471L575k90095m45009l41615
42058C938o8129J84651M70821J028893J781002K191082J865825J113764O01519
42049I173366N09660L31197m32070j611872k532604k669776k026081r87754n791
42040b51725N85680O19967J38783n78320j117914j194987q37991k40645N40452
42031b336700J548100K525886K842821K123139Q49600L318N7790N75113Q25170
42022I014237N08950k35761j221041k310040l257351l703868l357044k132106
42014f694024k38776J778276L249983L824268L648317L041817K160214J124899
$$ plain form
42006 11894974 12157869 12064832 12095014 12441593 13153545 14281596 15669610 16778250 17031103
41997 17031103 16346290 15117978 13657714 11851275 9424375 6382498 3095887 57940
41989 57940 -2359453 -4011541 -4971582 -5418306 -5478895 -5170852 -4479262 -3423118 -2009654
41980 -2009654 -180780 2105691 4694412 7136704 8839231 9427248 9053198 8332931 7912958
41971 7912958 8070053 8686304 9484397 10211346 10734412 11169656 11904793 13295161 15262439
41962 15262439 17303582 18922943 19938157 20392377 20433822 20407582 20805204 21822279 23027742
41953 23027742 23712946 23568379 22834830 21821365 20538175 18893705 17023402 15206442
41945 15206442 13513978 11715257 9594567 7323489 5475208 4611820 4796524 5530377
$$ packed form
42006A1894974K62895r3037L0182L46579P11952J128051J388014J108640K52853
41997A7031103o84813j228312j460264j806439k426900l041877l286611l037947
41989E7940k417393j652088r60041m46724o0589L08043O91590J056144J413464
41980b009654J828874K286471K588721K442292J702527N88017l74050p20267m19973
41971G912958J57095O16251P98093P26949N23066M35244P35137J390368J967278
41962A5262439K041143J619361J015214M54220M1445k6240L97622J017075J205463
41953B3027742O85204j44567p33549j013465j283190j644470j870303j816960
41945A5206442j692464j798721k120690k271078j848281q63388J84704P33853
$$ plain form
41937 5530377 6229554 6733136 7266683 7991819 8794903 9524428 10179008 10713818 10863437
41928 10863437 10401906 9497675 8560028 7712741 6620647 4910476 2625000 191786 -1923566
41919 -1923566 -3421965 -4135276 -3983487 -3055900 -1708459 -515865 -25145 -426121 -1405304
41910 -1405304 -2386365 -3002238 -3351506 -3792262 -4533497 -5460627 -6283192 -6736799 -6660492 -6055294
41900 -6055294 -5205019 -4659334 -4877714 -5766213 -6631511 -6708854 -5765940 -4190453 -2568269
41891 -2568269 -1264184 -346351 262139 632389 735645 428144 -409343 -1659195 -2946170
41882 -2946170 -3883219 -4313784 -4327294 -4157327 -4105542 -4398832 -4965369 -5448566 -5634559 -5839625
41872 -5839625 -6674875 -8354988 -10339495 -11706841 -11839240 -10794752 -9180402 -7721697
$$ packed form
41937E530377O99177N03582N33547P25136Q03084P29525O54580N34810J49619
41928A0863437m61531r04231r37647q47287j092094j710171k285476k433214k115352
41919a923566j498399p13311J51789R27587J347441J192594M90720m00976r79183
41910a405304r81061o15873l49268m40756p41235r27130q22565m53607P6307O05198
41900f055294Q50275N45685k18380q88499q65298p7343R42914J575487J622184
41891b568269J304085R17833O08490L70250J03256l07501q37487j249852j286975
41882b946170r37049m30565j3510J69967N1785k93290n66537m83197j85993k05066
41872e839625q35250j680113j984507j367346j32399J044488J614350J458705
$$ plain form
41864 -7721697 -6815817 -6354850 -5962055 -5418716 -4850385 -4523331 -4523701 -4633395 -4464905 -3742003
41854 -3742003 -2539455 -1264497 -357900 -23544 -236790 -827847 -1382287 -1246605 -38042
41845 -38042 1768874 3096623 3324461 2925305 2883532 3638352 4758464 5471964 5289040
41836 5289040 4253385 2881742 1827127 1339476 1014268 243704 -1071757 -2405618 -3158121
41827 -3158121 -3130263 -2477014 -1466569 -383195 569537 1479562 2764630 4841569 7730262
41818 7730262 10980854 13903285 15847044 16411887 15559834 13570191 10892702 8072939
41810 8072939 5738017 4418914 4223949 4762862 5541206 6431836 7675947 9440616 11489939
41801 11489939 13342907 14695561 15617258 16341785 16954761 17367460 17556403 17666338 17777707
$$ packed form
41864g721697R05880M60967L92795N43339N68331L27054l70j09694J68490P22902
41854c742003J202548J274958R06597L34356k13246n91057n54440J35682J208563
41845c8042J806916J327749K27838l99156m1773P54820J120112P13500j82924
41836E289040j035655j371643j054615m87651l25208p70564j315461j333861p52503
41827c158121K7858O53249J010445J083374R52732R10025J285068K076939K888693
41818G730262L250592K922431J943759N64843q52053j989643k677489k819763
41810H072939k334922j319103j94965N38913P78344Q90630J244111J764669K049323
41801A1489939J852968J352654R21697P24527O12976M12699J88943J09935J11369
$$ plain form
41792 17777707 17678434 17035884 15790722 14243890 12730631 11322850 9875558 8239195
41784 8239195 6378340 4422077 2719425 1781026 2036409 3591317 6168611 9181822
41776 9181822 11852967 13425394 13457400 11989814 9460260 6487431 3650879 1258565
41768 1258565 -780456 -2725664 -4532553 -5729336 -5923093 -5350834 -4741547 -4633640 -4955446
41759 -4955446 -5240586 -5080186 -4366683 -3328638 -2476676 -2402923 -3451301 -5518974 -8148959
41750 -8148959 -10732575 -12624323 -13271083 -12488632 -10671019 -8590470 -6857767 -5550777
41742 -5550777 -4373125 -3131792 -2004728 -1343723 -1273770 -1542254 -1773643 -1849397 -2018029
41733 -2018029 -2640101 -3846740 -5442250 -7080799 -8456951 -9317712 -9425138 -8701867 -7471543
$$ packed form
41792A7777707r9273o42550j245162j546832j513259j407781j447292j636363
41784H239195j860855j956263j702652r38399K55383J554908K577294L013211
41776I181822K671145J572427L2006j467586k529554k972829k836552k392314
41768A258565k039021j945208j806889j196783j93757N72259O09287J07907l21806
41759d955446k85140J60400P13503J038045Q51962P3753j048378k067673k629985
41750h148959k583616j891748o46760P82451J817613K080549J732703J306990
41742e550777J177652J241333J127064O61005O9953k68484k31389p5754j68632
41733b018029o22072j206639j595510j638549j376152q60761j07426P23271J230324
$$ plain form
41724 -7471543 -6407192 -6058670 -6407114 -6973390 -7374774 -7688876 -8260528 -9265497 -10526239
41715 -10526239 -11658898 -12294929 -12216295 -11428653 -10168000 -8771584 -7460991 -6237026 -5020017
41706 -5020017 -3908165 -3246197 -3345263 -4103834 -4991616 -5496237 -5547752 -5436351 -5403261 -5473047
41696 -5473047 -5632762 -5913554 -6192458 -6125868 -5488509 -4511594 -3733938 -3549134 -3980064 -4783652
41686 -4783652 -5597836 -6043261 -5917343 -5391721 -4935859 -4977491 -5614593 -6556588 -7248102 -7166693
41676 -7166693 -6233634 -4961285 -4016091 -3577733 -3270187 -2752451 -2163200 -1843380 -1788102
41667 -1788102 -1605243 -1003094 -156551 453103 488425 36101 -502602 -799791 -934026 -1347769
41657 -1347769 -2444641 -4223931 -6301483 -8221540 -9697870 -10617879 -10937637 -10620337 -9640662
$$ packed form
41724g471543J064351L48522l48444n66276m01384l14102n71652j004969j260742
41715a0526239j132659o36031P8634P87642J260653J396416J310593J223965J217009
41706e020017J111852O61968r9066p58571q87782n04621n1515J11401L3090o9786
41696e473047j59715k80792k78904O6590O37359R76915P77656J84804m30930q03588
41686d783652q14184m45425J25918N25622M55862m1632o37102r41995o91514Q1409
41676g166693R33059J272349R45194M38358L07546N17736N89251L19820N5278
41667a788102J82859O02149Q46543O09654L5322m52324n38703k97189j34235m13743
41657a347769j096872j779290k077552j920057j476330r20009l19758L17300R79675
$$ plain form
41648 -9640662 -8034845 -5986297 -3885027 -2258575 -1553601 -1895806 -3024727 -4490271
41640 -4490271 -5946552 -7231868 -8150344 -8294374 -7273962 -5179108 -2693520 -640476
41632 -640476 574379 1084697 1271170 1442164 1692001 1903636 1879645 1555434 1067493 535321
41622 535321 -173310 -1325496 -2972533 -4848026 -6647065 -8283909 -9818578 -11257370
41614 -11257370 -12546073 -13692843 -14753141 -15663333 -16158013 -15889891 -14631699 -12399721
41606 -12399721 -9446466 -6148969 -2857259 211361 2986014 5489528 7759762 9766514
41598 9766514 11365943 12331187 12414494 11380983 9087850 5697755 1837266 -1637669 -4186610
41589 -4186610 -5836150 -6793984 -6939503 -5930846 -3824624 -1365809 453525 1019126 260498
$$ packed form
41648i640662J605817K048548K101270J626452P04974l42205j128921j465544
41640d490271j456281j285316r18476j44030J020412K094854K485588K053044
41632f40476J214855N10318J86473J70994K49837K11635k3991l24211m87941n32172
41622E35321p08631j152186j647037j875493j799039j636844j534669j438792
41614a1257370j288703j146770j060298r10192m94680K68122J258192K231978
41606a2399721K953255L297497L291710L068620K774653K503514K270234K006752
41598I766514J599429R65244Q3307j033511k293133l390095l860489l474935k548941
41589d186610j649540r57834j45519J008657K106222K458815J819334N65601p58628
$$ plain form
41580 260498 -1549153 -3910424 -6118412 -7503556 -7847527 -7509259 -7042705 -6674702 -6160983
41571 -6160983 -5135619 -3609626 -2143500 -1478514 -1912549 -3024636 -4047692 -4489676 -4360586
41562 -4360586 -3905530 -3310873 -2687833 -2123949 -1565097 -701745 866455 3293517 6330751
41553 6330751 9478847 12255906 14357255 15638672 15989986 15257062 13354915 10497842
41545 10497842 7260790 4320428 2090194 574488 -488729 -1358008 -2047025 -2235708
41537 -2235708 -1463559 456858 3182319 6055887 8601475 10771838 12748048 14611698
41529 14611698 16251982 17488901 18178378 18222616 17597648 16449394 15134620 14076873 13518711
41520 13518711 13424264 13646934 14138859 14908473 15798952 16455246 16585436 16173790 15379518
$$ packed form
41580B60498j809651k361271k207988j385144l43971L38268M66554L68003N13719
41571f160983J025364J525993J466126O64986m34035j112087j023056m41984J29090
41562d360586M55056N94657O23040N63884N58852Q63352J568200K427062L037234
41553F330751L148096K777059K101349J281417L51314p32924j902147k857073
41545A0497842l237052k940362k230234j515706j063217q69279o89017j88683
41537b235708P72149J920417K725461K873568K545588K170363J976210J863650
41529A4611698J640284J236919O89477M4238o24968j148254j314774j057747n58162
41520A3518711r4447K22670M91925P69614Q90479O56294J30190m11646p94272
$$ plain form
41511 15379518 14330625 13110708 11835376 10576047 9256927 7800025 6365648 5273311
41503 5273311 4638537 4231321 3755991 3143699 2484475 1772712 825150 -593502 -2618913
41494 -2618913 -5185539 -7981600 -10518977 -12296384 -12910121 -12096091 -9863614 -6687085
41486 -6687085 -3418108 -794785 1016288 2353069 3577040 4729007 5611232 6074792
41478 6074792 6153716 5926330 5272345 3823986 1258642 -2303302 -6226169 -9710066 -12197635
41469 -12197635 -13512677 -13810751 -13505842 -13098429 -12883210 -12831171 -12820469 -12864055 -12962407 -12856099
41459 -12856099 -12197970 -11009460 -9769073 -8973470 -8730602 -8788335 -8759231 -8237429 -6919295
41450 -6919295 -4847891 -2514839 -577921 558073 887467 654512 176581 -236949 -332402
$$ packed form
41511A5379518j048893j219917j275332j259329j319120j456902j434377j092337
41503E273311o34774m07216m75330o12292o59224p11763r47562j418652k025411
41494b618913k566626k796061k537377j777407o13737Q14030K232477L176529
41486f687085L268977K623323J811073J336781J223971J151967Q82225M63560
41478F074792P8924k27386o53985j448359k565344l561944l922867l483897k487569
41469a2197635j315042k98074L04909M07413K15219N2039J0702m3586r8352J06308
41459a2856099O58129J188510J240387P95603K42868n7733K9104N21802J318134
41450f919295K071404K333052J936918J135994L29394k32955m77931m13530r5453
$$ plain form
41441 -332402 39918 871653 1913812 2670762 2663631 1854973 769193 95525 187991 944063
41431 944063 1973706 2717191 2559279 1166210 -1184357 -3750444 -5857381 -7203487 -7720821
41422 -7720821 -7419248 -6489303 -5350419 -4388595 -3700102 -3186101 -2768966 -2352365 -1673914
41413 -1673914 -438762 1364994 3426510 5405889 7137955 8533623 9455864 9814247
41405 9814247 9711385 9387242 9004397 8498041 7623976 6207418 4461912 3069277 2781319
41396 2781319 3799381 5559391 7175985 8071147 8195858 7831804 7348695 7065552 7104681
41387 7104681 7284336 7247962 6770354 5921682 4977321 4284717 4197372 4918393 6241795 7531879
41377 7531879 8138232 7873267 7031913 5986779 4869971 3625498 2217712 721411 -695910
$$ packed form
41441c32402L72320Q31735J042159P56950p131q08658j085780o73668R2466P56072
41431I44063J029643P43485j57912j393069k350567k566087k106937j346106n17334
41422g720821L01573R29945J138884R61824O88493N14001M17135M16601O78451
41413a673914J235152J803756K061516J979379J732066J395668R22241L58383
41405I814247j02862l24143l82845n06356q74065j416558j745506j392635k87958
41396B781319J018062J760010J616594Q95162J24711l64054m83109k83143L9129
41387G104681J79655l6374m77608q48672r44361o92604q7345P21021J323402J290084
41377G531879O06353k64965q41354j045134j116808j244473j407786j496301j417321
$$ plain form
41368 -695910 -1810134 -2450091 -2689059 -2904535 -3541536 -4760270 -6281866 -7489852 -7647921
41359 -7647921 -6198047 -3122473 908911 4905731 8195516 10675747 12474237 13577093
41351 13577093 13927150 13722686 13376431 13186098 13185729 13266941 13259162 12922638 12106809 10983959
41341 10983959 9930718 9090653 8231578 7130865 5904995 4811032 3918626 3207621 2854867
41332 2854867 3133181 4027074 5161132 6121739 6684277 6764747 6399638 5818501 5283396
41323 5283396 4716659 3666359 1822054 -502479 -2515984 -3544745 -3470001 -2737762 -2068760
41314 -2068760 -2049567 -2805234 -4000915 -5168373 -5990421 -6288176 -5913461 -4811194 -3135076
41305 -3135076 -1195325 664007 2083099 2741420 2614383 2156845 2042429 2659857 3932620
$$ packed form
41368f95910j114224o39957k38968k15476o37001j218734j521596j207986j58069
41359g647921J449874L075574M031384L996820L289785K480231J798490J102856
41351A3577093L50057k04464l46255j90333l69Q1212p779l36524q15829j122850
41341A0983959j053241q40065q59075j100713j225870j093963q92406p11005l52754
41332B854867K78314Q93893J134058R60607N62538Q0470l65109n81137n35105
41323E283396n66737j050300j844305k324533k013505j028761P4744P32239O69002
41314b068760J9193p55667j195681j167458q22048k97755L74715J102267J676118
41305c135076J939751J859332J419092O58321j27037m57538j14416O17428J272763
$$ plain form
41296 3932620 5568880 7301551 8881044 10069120 10782226 11112864 11073268 10417817 8894324
41287 8894324 6664303 4346197 2603852 1722725 1524060 1564563 1438516 1084232 940613
41278 940613 1722332 3852662 7033757 10416136 13229197 15249003 16711015 17899942
41270 17899942 18888507 19580518 19876277 19785882 19450246 19049168 18620715 17971541 16838672
41261 16838672 15151105 13072588 10811448 8519248 6410083 4813109 3936034 3595763
41253 3595763 3297736 2613611 1472103 153840 -917812 -1453712 -1523250 -1520242 -1789350
41244 -1789350 -2259846 -2566921 -2581059 -2671523 -3301808 -4430139 -5482155 -5934929 -5771083
41235 -5771083 -5282012 -4598165 -3647476 -2550284 -1765733 -1656775 -2055170 -2498202 -2859272
$$ packed form
41296C932620J636260J732671J579493J188076P13106L30638l9596o55451j523493
41287H894324k230021k318106j742345q81127j98665M0503j26047l54284j43619
41278I40613P81719K130330L181095L382379K813061K019806J462012J188927
41270A7899942R88565O92011K95759r0395l35636m01078m28453o49174j132869
41261A6838672j687567k078517k261140k292200k109165j596974q77075l40271
41253C595763k98027o84125j141508j318263j071652n35900o9538L008k69108
41244a789350m70496l07075j4138r0464o30285j128331j052016m52774J63846
41235e771083M89071O83847R50689J097192P84551J08958l98395m43032l61070
$$ plain form
41226 -2859272 -3495071 -4719527 -6373871 -8043768 -9465359 -10468324 -10673126 -9615184
41218 -9615184 -7255500 -4141476 -952561 1950683 4438713 6300344 7284808 7434137
41210 7434137 7162336 6915638 6838535 6823206 6791269 6803148 6882361 6842455 6408923 5535379
41200 5535379 4505464 3625682 2859863 1916745 742696 -247580 -638789 -689941 -1304236
41191 -1304236 -3151754 -5881971 -8351462 -9633795 -9702465 -9147451 -8427648 -7529968 -6211016
41182 -6211016 -4321320 -1865799 1037278 4085818 6729547 8314622 8377559 6861202
41174 6861202 4130890 813833 -2449459 -5192005 -7120526 -8009977 -7708888 -6281524
41166 -6281524 -4074379 -1607879 559192 1920180 2193975 1537957 466112 -603254
$$ packed form
41226b859272o35799j224456j654344j669897j421591j002965k04802J057942
41218i615184K359684L114024L188915K903244K488030J861631R84464J49329
41210G434137k71801k46698p7103j5329l1937J1879P9213l9906m33532q73544
41200E535379j029915q79782p65819r43118j174049r90276l91209n1152o14295
41191a304236j847518k730217k469491j282333o8670N55014P19803Q97680J318952
41182f211016J889696K455521K903077L048540K643729J585075O2937j516357
41174F861202k730312l317057l263292k742546j928521q89451L01089J427364
41166f281524K207145K466500K167071J360988K73795o56018j071845j069366
$$ plain form
41158 -603254 -1673918 -2948468 -4380356 -5629786 -6433078 -6824488 -6956850 -6866097 -6504532
41149 -6504532 -5918666 -5305692 -4903826 -4827991 -4976265 -5126266 -5188269 -5314986 -5650797 -6017166
41139 -6017166 -6029410 -5579121 -5062104 -5043111 -5772645 -7064381 -8503309 -9656065 -10173710
41130 -10173710 -9881030 -8866309 -7501802 -6360037 -5993296 -6596154 -7807795 -8976295
41122 -8976295 -9743961 -10324912 -11132270 -12212721 -13164331 -13561608 -13334585 -12757532 -12219128
41113 -12219128 -12029165 -12269277 -12664312 -12648414 -11753797 -10052038 -8150086 -6635821 -5531922
41104 -5531922 -4393631 -2936317 -1401711 -217559 542968 1168191 1848838 2441750 2718451
41095 2718451 2653888 2390072 2065659 1778970 1601168 1525383 1500538 1614164 2142763 3279850
$$ packed form
41158f03254j070664j274550j431888j249430q03292l91410j32362R0753L61565
41149f504532N85866O12974M01866P5835j48274j50001o2003j26717l35811l66369
41139f017166j2244M50289N17017J8993p29534j291736j438928j152756n17645
41130a0173710K92680J014721J364507J141765L66741o02858j211641j168500
41122h976295p67666n80951q07358j080451r51610l97277K27023N77053N38404
41113a2219128J89963k40112l95035J5898Q94617J701759J901952J514265J103899
41104e531922J138291J457314J534606J184152P60527O25223O80647N92912K76701
41095B718451o4563k63816l24413k86689j77802p5785k4845J13626N28599J137087
$$ plain form
41085 3279850 4837276 6306195 7208526 7378793 7014710 6562476 6493774 7061074 8224711
41076 8224711 9801532 11597237 13355780 14710348 15329412 15096800 14101025 12543190 10759604
41067 10759604 9238108 8428263 8499133 9325181 10624599 11995606 12915113 12931054 11921247
41058 11921247 10074334 7643257 4864454 2102423 -150606 -1548919 -2074470 -1869360
41050 -1869360 -992764 548872 2602334 4838745 6953730 8845759 10582184 12220139
41042 12220139 13688729 14860845 15723210 16411533 17038953 17553903 17846095 17935396 17925335
41033 17925335 17779835 17303009 16412552 15331219 14420200 13882880 13705995 13831556 14270152
41024 14270152 15017155 15910507 16631658 16913952 16811888 16730159 17043436 17588493 17590734 16213921
$$ packed form
41085C279850J557426J468919R02331J70267l64083m52234o8702N67300J163637
41076H224711J576821J795705J758543J354568O19064k32612r95775j557835j783586
41067A0759604j521496q09845P0870Q26048J299418J371007R19507J5941j009807
41058A1921247j846913k431077k778803k762031k253029j398313n25551K05110
41050a869360Q76596J541636K053462K236411K114985J892029J736425J637955
41042A2220139J468590J172116Q62365O88323O27420N14950K92192Q9301j0061
41033A7925335j45500m76826q90457j081333r11019n37320j76885J25561M38596
41024A4270152P47003Q93352P21151K82294j02064q1729L13277N45057K241j376813
$$ plain form
41014 16213921 13233044 9186731 4965674 1359535 -1061358 -1892631 -978569 1446040
41006 1446040 4884270 8955181 13521931 18278357 22301277 24353120 23868483 21575073
40998 21575073 18979962 17244097 16587884 16585127 16721270 16662629 16330460 15965893 16010181 16708113
40988 16708113 17819386 18795489 19180236 18766781 17514376 15553221 13277177 11224693
40980 11224693 9778079 9080210 9245034 10418617 12471543 14788033 16604317 17540432
40972 17540432 17627558 16880140 15171349 12682384 10226625 8841572 9095049 10923975 13961254
40963 13961254 17659924 21144212 23461059 24347127 24576696 25251420 26789172 28764970
40955 28764970 30546719 31719421 31927862 30766213 28118073 24476613 20751783 17795505
$$ packed form
41014A6213921k980877m046313m221057l606139k420893q31273R14062K424609
41006A446040L438230M070911M566750M756426M022920K051843m84637k293410
40998B1575073k595111j735865o56213k757J36143n8641l32169l64567M4288O97932
40988A6708113J111273R76103L84747m13455j252405j961155k276044k052484
40980A1224693j446614o97869J64824J173583K052926K316490J816284R36115
40972A7540432Q7126p47418j708791k488965k455759j385053K53477J828926L037279
40963A3961254L698670L484288K316847Q86068K29569O74724J537752J975798
40955B8764970J781749J172702K08441j161649k648140l641460l724830k956278
$$ plain form
40947 17795505 16109037 15784305 16556966 18027876 19975090 22364001 24964205 27140582
40939 27140582 28247429 28154836 27198837 25707538 23825233 21743014 19762225 18027428
40931 18027428 16467914 15172959 14611294 15239819 16980346 19262758 21512551 23434803
40923 23434803 24930504 26020785 26909447 27903513 29131408 30405841 31399297 31847023 31548102
40914 31548102 30343078 28259456 25655015 23128686 21285851 20556190 21055191 22454561
40906 22454561 24049864 25153740 25528205 25439898 25331956 25471404 25825943 26174048 26368097
40897 26368097 26569294 27163910 28358316 29964001 31749074 33890288 36772062 40288207
40889 40288207 43620906 45881951 46846025 46995455 47086016 47832157 49744680 52867076 56613593
$$ packed form
40947A7795505j686468l24732P72661J470910J947214K388911K600204K176377
40939B7140582J106847r2593r55999j491299j882305k082219j980789j734797
40931A8027428j559514j294955n61665O28525J740527K282412K249793J922252
40923B3434803J495701J090281Q88662R94066J227895J274433R93456M47726k98921
40914C1548102j205024k083622k604441k526329j842835p29661M99001J399370
40906B2454561J595303J103876L74465q8307j07942J39448L54539L48105J94049
40897B6368097K01197N94616J194406J605685J785073K141214K881774L516145
40889D0288207L332699K261045R64074J49430R0561P46141J912523L122396L746517
$$ plain form
40880 56613593 60091444 62702856 64435358 65703143 67102030 69250478 72571698 77080364
40872 77080364 82480610 88538335 95258763 102641606 110377655 117930193 124958025 131646139
40864 131646139 138587413 146264387 154606182 163129158 171577676 180334952 190109390 201335972
40856 201335972 214033178 228073639 243242007 259006120 274590269 289466749 303536987
40849 303536987 316594173 327776694 335856178 340071216 340498902 337643558 331912692 323594196
40841 323594196 313151518 301308109 288811671 276231773 264061267 252955479 243734406
40834 243734406 237051195 233046205 231330972 231273941 232310033 234119445 236672727 240087281
40826 240087281 244287712 248741428 252572882 254919047 255109478 252616867 247120993 238760724
$$ packed form
40880E6613593L477851K611412J732502J267785J398887K148448L321220M508666
40872G7080364N400246O057725O720428P382843P736049P552538P027832O688114
40864A31646139O941274P676974Q341795Q522976Q448518Q757276R774438J1226582
40856B01335972J2697206J4040461J5168368J5764113J5584149J4876480J4070238
40849C03536987J3057186J1182521Q079484M215038M27686k855344n730866q318496
40841C23594196j0442678j1843409j2496438j2579898j2170506j1105788r221073
40834B43734406o683211m004990j715233n7031J036092J809412K553282L414554
40826B40087281M200431M453716L831454K346165J90431k492611n495874q360269
$$ plain form
40818 238760724 228190430 216249276 203594539 190636153 177632037 164709989 151908143
40811 151908143 139343491 127300590 116079749 105848538 96734280 88939123 82596340
40804 82596340 77570192 73555822 70353070 67914085 66165190 64941913 64083806 63412772
40796 63412772 62574645 61064504 58528307 55010284 50894268 46681124 42817781 39579075
40788 39579075 36984896 34878810 33178463 32010374 31491665 31381739 31088194 30151279 28740521
40779 28740521 27605493 27483120 28535865 30310449 32113524 33359660 33688586 32984755
40771 32984755 31401881 29331996 27309768 25913447 25594750 26374842 27682163 28697681
40763 28697681 29003154 28851374 28819370 29352275 30625472 32535267 34626175 36251219 37094771
$$ packed form
40818B38760724j0570294j1941154j2654737j2958386j3004116j2922048j2801846
40811A51908143j2564652j2042901j1220841j0231211r114258p795157o342783
40804H2596340n026148m014370l202752k438985j748895j223277q58107o71034
40796F3412772q38127j510141k536197l518023m116016m213144l863343l238706
40788C9579075k594179k106086j700347j168089n18709j09926k93545r36915j410758
40779B8740521j135028j22373J052745J774584J803075J246136L28926p03831
40771C2984755j582874k069885k022228j396321l18697P80092J307321J015518
40763B8697681L05473j51780l2004N32905J273197J909795K090908J625044Q43552
$$ plain form
40754 37094771 37478113 37971627 38824112 39992348 41593648 43982777 47358421 51564944
40746 51564944 56329733 61449221 66678634 71702194 76374015 80852303 85414708 90304691
40738 90304691 95829765 102371279 110075667 118628936 127520510 136518062 145805250 155717995
40730 155717995 166412551 177663045 188800580 198846033 206830805 212103192 214451397
40723 214451397 214085572 211516629 207276840 201632835 194629667 186430418 177441135 168019268
40715 168019268 158271889 148334259 138668178 129774769 121635458 113715715 105597380 97421703
40707 97421703 89644007 82530290 75995402 69789949 63719285 57788612 52296288 47759013
40699 47759013 44596576 42801764 41893492 41157346 39946837 37890364 34969294 31429714
$$ packed form
40754C7094771L83342M93514Q52485J168236J601300K389129L375644M206523
40746E1564944M764789N119488N229413N023560M671821M478288M562405M889983
40738I0304691N525074O541514P704388Q553269Q891574Q997552R287188R912745
40730A55717995J0694556J1250494J1137535J0045453P984772N272387K348205
40723B14451397l65825k568943m239789n644005p003168q199249q989283r421867
40715A68019268r747379r937630r666081q893409q139311p919743q118335q175677
40707I7421703p777696p113717o534888o205453o070664n930673n492324m537275
40699D7759013l162437j794812r08272p36146j210509k056473k921070l539580
$$ plain form
40691 31429714 27547222 23443728 19170101 14973275 11399805 9031327 8068007 8180543
40683 8180543 8801409 9596734 10687642 12414315 14835231 17403314 19164357 19403440 18218315
40674 18218315 16481327 15207040 14935043 15652108 17104395 18982443 20854880 22206183
40666 22206183 22736013 22559506 21995137 21197931 20097205 18640630 16959244 15273269 13726885
40657 13726885 12336253 11031986 9743376 8501191 7443836 6636850 5911636 5040257
40649 5040257 4120411 3606303 3774760 4229119 4143516 3058470 1317862 -320051 -1364967
40640 -1364967 -1807713 -1825784 -1522375 -961303 -227460 690693 1945283 3551027 5073601
40631 5073601 5801033 5379595 4264573 3458833 3747641 5115686 6798517 7844310 7711847
$$ packed form
40691C1429714l882492m103494m273627m196826l573470k368478r63320J12536
40683H180543O20866P95325J090908J726673K420916K568083J761043K39083j185125
40674A8218315j736988j274287k71997P17065J452287J878048J872437J351303
40666B2206183N29830j76507n64369p97206j100726j456575j681386j685975j546384
40657A3726885j390632j304267j288610j242185j057355q06986p25214q71379
40649E040257r19846n14108J68457M54359q5603j085046j740608j637913j044916
40640a364967m42746j8071L03409N61072P33843R18153J254590J605744J522574
40631E073601P27432m21438j115022q05740K88808J368045J682831J045793j32463
$$ plain form
40622 7711847 6499246 4731623 2965932 1548486 631986 280586 472643 1027366 1622497
40613 1622497 1964570 1978607 1835118 1772166 1858801 1911895 1650448 954046 -9081 -906246
40603 -906246 -1519005 -1931894 -2427738 -3135546 -3778099 -3865774 -3219576 -2242516 -1566097 -1451938
40593 -1451938 -1655845 -1863372 -2075762 -2468670 -3014361 -3438996 -3551586 -3471504 -3477410 -3709806
40583 -3709806 -4061235 -4273239 -4057006 -3174733 -1556108 573851 2734484 4474702 5679289
40574 5679289 6581747 7487718 8546139 9772010 11124779 12427538 13314561 13491319 13095003
40565 13095003 12630996 12461355 12461051 12234701 11520441 10267692 8486372 6260675 3875733
40556 3875733 1697368 -141448 -1790902 -3366589 -4713153 -5557853 -5786475 -5474726 -4730673
$$ packed form
40622G711847j212601j767623j765691j417446r16500l51400J92057N54723N95131
40613A622497L42073J4037j43489o2952Q6635N3094k61447o96402r63127q97165
40603i06246o12759m12889m95844p07808o42553q7675O46198R77060O76419J14159
40593a451938k03907k07527k12390l92908n45691m24635j12590Q0082n906k32396
40583c709806l51429k12004K16233Q82273J618625K129959K160633J740218J204587
40574E679289R02458R05971J058421J225871J352769J302759Q87023J76758l96316
40565A3095003m64007j69641l04k26350p14260j252749j781320k225697k384942
40556C875733k178365j838816j649454j575687j346564q44700k28622L11749P44053
$$ plain form
40547 -4730673 -3601360 -2071144 -67236 2449466 5267036 7857338 9727959 10903651
40539 10903651 11935415 13360577 15248513 17334088 19434668 21530396 23482403 24936796
40531 24936796 25660062 25866569 26070121 26634447 27557371 28648925 29781128 30936336 32124305
40522 32124305 33326847 34475032 35421037 35949958 35859661 35056817 33647831 32034551 30897102
40513 30897102 30898555 32246733 34555397 37206029 39824561 42358354 44770386 46825952
40505 46825952 48246905 49001107 49350105 49587744 49748043 49600901 48961950 47970337 46958650
40496 46958650 46011341 44762025 42740049 39860154 36444854 32808674 29011391 25086958
40488 25086958 21361164 18377940 16493616 15571488 15045437 14285584 13012974 11460013
$$ packed form
40547d730673J129313J530216K003908K516702K817570K590302J870621J175692
40539A0903651J031764J425162J887936K085575K100580K095728J952007J454393
40531B4936796P23266K06507K03552N64326R22924J091554J132203J155208J187969
40522C2124305J202542J148185R46005N28921r0297q02844j408986j613280j137449
40513C0897102J453J348178K308664K650632K618532K533793K412032K055566
40505D6825952J420953P54202L48998K37639J60299j47142o38951r91613j011687
40496D6958650r47309j249316k021976k879895l415300l636180l797283l924433
40488B5086958l725794k983224j884324r22128n26051p59853j272610j552961
$$ plain form
40480 11460013 10112420 9259657 8842837 8756064 9153519 10297690 12140829 14228477 16077715
40471 16077715 17566706 18922827 20416927 22092794 23665276 24588004 24326389 22734198
40463 22734198 20184881 17259983 14331877 11545000 9151740 7634311 7335366 8046619
40455 8046619 9126208 10044672 10716013 11268590 11625796 11481452 10735861 9855038 9642978
40446 9642978 10561622 12271786 13861348 14497562 13865443 12146405 9830348 7603221 6162932
40437 6162932 5853472 6422903 7220625 7633474 7335997 6330326 5013142 4160414 4511229
40428 4511229 6177808 8595501 11162699 13777151 16605880 19510665 21991390 23707390
40420 23707390 24841564 25863017 27032907 28196861 28989082 29196707 28959695 28617661 28346420
$$ packed form
40480A1460013j347593q52763m16820q6773L97455J144171J843139K087648J849238
40471A6077715J488991J356121J494100J675867J572482R22728k61615j592191
40463B2734198k549317k924898k928106k786877k393260j517429k98945P11253
40455H046619J079589R18464O71341N52577L57206j44344p45591q80823k12060
40446I642978R18644J710164J589562O36214o32119j719038k316057k227127j440289
40437F162932l09460N69431P97722M12849k97477j005671j317184q52728L50815
40428D511229J666579K417693K567198K614452K828729K904785K480725J716000
40420B3707390J134174J021453J169890J163954P92221K07625k37012l42034k71241
$$ plain form
40411 28346420 28032378 27612719 27449871 28135772 29862637 32176653 34499895 36795834 39557422
40402 39557422 43140986 47202398 50793199 52970798 53371539 52323587 50503793 48524285
40394 48524285 46827119 45833898 45964370 47384337 49812975 52677535 55417473 57595816
40386 57595816 58862047 59021395 58156618 56534924 54355706 51693467 48690768 45628598
40378 45628598 42681761 39686859 36284206 32313211 28067979 24224955 21509617 20250028
40370 20250028 20075649 20083733 19453495 17968713 15967656 13916488 12161648 10976313 10547241
40361 10547241 10798428 11404836 12153924 13241816 15085640 17839357 21148079 24369238
40353 24369238 27030446 29151441 31182825 33592405 36477730 39620068 42871482 46286729
$$ packed form
40411B8346420l14042m19659j62848O85901J726865K314016K323242K295939K761588
40402C9557422L583564M061412L590801K177599M00741j047952j819794j979508
40394D8524285j697166r93221J30472J419967K428638K864560K739938K178343
40386E7595816J266231J59348q64777j621694k179218k662239l002699l062170
40378D5628598k946837k994902l402653l970995m245232l843024k715338j259589
40370B0250028j74379Q084o30238j484782k001057k051168j754840j185335m29072
40361A0547241K51187O06408P49088J087892J843824K753717L308722L221159
40353B4369238K661208K120995K031384K409580K885325L142338L251414L415247
$$ plain form
40345 46286729 49760738 52703035 54291780 54039867 52021098 48678183 44648706 40728737
40337 40728737 37678158 35854998 35077973 34858594 34683796 34161796 33182225 32045153 31225391
40328 31225391 30861425 30629771 30257780 29975482 30227221 31031728 31895811 32407498 32747941
40319 32747941 33536776 35223916 37627845 39991891 41488648 41751749 40995955 39712071
40311 39712071 38338416 37144119 36134132 34894936 32742929 29343886 25222914 21514859
40303 21514859 19198178 18614536 19544756 21460340 23713848 25773722 27417297 28610217
40295 28610217 29215869 29005599 27968810 26397859 24587427 22627953 20578839 18654529
40287 18654529 17087001 15915280 15042452 14429466 14140919 14268155 14863499 15841291 16861788
$$ packed form
40345D6286729L474009K942297J588745k51913k018769l342915m029477l919969
40337D0728737l050579j823160p77025k19379j74798n22000r79571j137072q19762
40328C1225391l63966k31654l71991k82298K51739Q04507Q64083N11687L40443
40319C2747941P88835J687140K403929K364046J496757K63101p55794j283884
40311C9712071j373655j194297j009987j239196k152007l399043m120972l708055
40303B1514859k316681n83642R30220J915584K253508K059874J643575J192920
40295B8610217O05652k10270j036789j570951j810432j959474k049114j924310
40287A8654529j567528j171721q72828o12986k88547J27236N95344R77792J020497
$$ plain form
40278 16861788 17426242 17216248 16314031 15063265 13820604 12886552 12499332 12709271 13292283
40269 13292283 13898008 14281112 14393595 14392929 14641779 15546456 17218511 19329379 21392708
40260 21392708 23143570 24609214 25963075 27430243 29197584 31252285 33389347 35470202
40252 35470202 37481526 39145169 39689077 38383466 35300932 31276388 27138214 23271593
40244 23271593 19922910 17514443 16410364 16548292 17470536 18609017 19473675 19752792 19368958
40235 19368958 18332507 16505777 13724850 10245770 6812675 4079869 2147421 869397
40227 869397 419570 1232966 3430403 6530527 9687748 12031626 12925918 12297063 10812723
40218 10812723 9466099 8816978 8749781 8992262 9626443 10935118 12904025 15060145 16759817
$$ packed form
40278A6861788N64454k09994r02217j250766j242661r34052l87220K09939N83012
40269A3292283O05725L83104J12483o66K48850R04677J672055K110868K063329
40260B1392708J750862J465644J353861J467168J767341K054701K137062K080855
40252C5470202K011324J663643N43908j305611l082534m024544m138174l866621
40244B3271593l348683k408467j104079J37928R22244J138481Q64658K79117l83834
40235A9368958j036451j826730k780927l479080l433095k732806j932448j278024
40227H69397m49827Q13396K197437L100124L157221K343878Q94292o28855j484340
40218A0812723j346624o49121o7197K42481O34181J308675J968907K156120J699672
$$ plain form
40209 16759817 17561768 17412912 16564222 15227806 13255369 10296372 6417082 2458065
40201 2458065 -426384 -1619161 -1392542 -534735 211649 449654 192735 -217557 -390473
40192 -390473 -212644 132342 458748 728407 833095 434997 -725392 -2389962 -3863052
40183 -3863052 -4601048 -4631656 -4400509 -4367248 -4794156 -5725328 -6983261 -8250152 -9304872
40174 -9304872 -10149439 -10777721 -10884168 -10025613 -8144212 -5776414 -3636728 -2074106 -981689
40165 -981689 -79420 863954 1970231 3181091 4224948 4802151 4836798 4452532 3744221
40156 3744221 2771704 1798527 1255065 1238568 1188879 352628 -1373846 -3219538 -4199543
40147 -4199543 -3879566 -2470081 -372749 2178314 5094860 8266767 11499030 14536206
$$ packed form
40209A6759817Q01951j48856q48690j336416j972437k958997l879290l959017
40201B458065k884449j192777K26619Q57807P46384K38005k56919m10292j72916
40192c90473J77829L44986L26406K69659J04688l98098j160389j664570j473090
40183c863052p37996l0608K31147L3261m26908r31172j257933j266891j054720
40174i304872q44567o28282j06447Q58555J881401K367798K139686J562622J092417
40165i81689R02269R43374J106277J210860J043857N77203L4647l84266p08311
40156C744221r72517r73177n43462j6497m9689q36251j726474j845692r80005
40147d199543L19977J409485K097332K551063K916546L171907L232263L037176
$$ plain form
40139 14536206 17098767 18976247 20180482 20980868 21691984 22419306 23112935 23898147 25193188
40130 25193188 27314976 29993981 32476458 34202213 35281912 36235028 37380066 38618364
40122 38618364 39731734 40686106 41590460 42478014 43201208 43491553 43086812 41838608 39720387
40113 39720387 36733191 32877708 28310258 23461713 18819998 14544875 10426526 6277171
40105 6277171 2227468 -1442374 -4613218 -7324555 -9580942 -11365362 -12804339 -14085637
40097 -14085637 -15125085 -15469170 -14677753 -12783957 -10302557 -7796699 -5491496 -3307934
40089 -3307934 -1198831 634810 1882708 2409735 2313088 1719433 665314 -743935 -2160126
40080 -2160126 -3123958 -3385895 -3039808 -2363459 -1591890 -807274 58633 1132088 2434042
$$ packed form
40139A4536206K562561J877480J204235Q00386P11116P27322O93629P85212J295041
40130B5193188K121788K679005K482477J725755J079699R53116J145038J238298
40122C8618364J113370R54372R04354Q87554P23194K90345m04741j248204k118221
40113C9720387k987196l855483m567450m848545m641715m275123m118349m149355
40105F277171m049703l669842l170844k711337k256387j784420j438977j281298
40097a4085637j039448l44085P91417J893796K481400K505858K305203K183562
40089c307934K109103J833641J247898N27027r6647n93655j054119j409249j416191
40080b160126r63832k61937L46087O76349P71569P84616Q65907J073455J301954
$$ plain form
40071 2434042 3784540 4912205 5667491 6109159 6418107 6770332 7239198 7740962 8105566
40062 8105566 8253965 8219165 7894640 6906783 5003056 2571042 505956 -561718 -750998
40053 -750998 -580953 -370192 -153152 27312 75094 77582 320844 974105 1911268 2925163
40043 2925163 3974578 5069478 5959225 6096951 5008985 2693065 -367363 -3540424
40035 -3540424 -6336671 -8422166 -9567106 -9790276 -9512836 -9335545 -9541279 -9904156 -10048487
40026 -10048487 -9883545 -9598402 -9337923 -9018424 -8424754 -7401547 -5995941 -4485384 -3190091
40017 -3190091 -2146636 -1006948 638230 2841716 5218397 7165267 8100670 7683521
40009 7683521 6038434 3716763 1240058 -1268297 -3781327 -5769465 -6290088 -4893435
$$ packed form
40071B434042J350498J127665P55286M41668L08948L52225M68866N01764L64604
40062H105566J48399l4800l24525r87857j903727k432014k065086j067674j89280
40053g50998J70045K10761K17040J80464M7782K488K43262O53261R37163J013895
40043B925163J049415J094900Q89747J37726j087966k315920l060428l173061
40035c540424k796247k085495j144940k23170K77440J77291k05734l62877j44331
40026a0048487J64942K85143K60479L19499N93670J023207J405606J510557J295293
40017c190091J043455J139688J645178K203486K376681J946870R35403m17149
40009G683521j645087k321671k476705k508355k513030j988138n20623J396653
$$ plain form
40001 -4893435 -2265739 246233 1725296 2244362 2499766 3089487 4138462 5460569 6949250
39992 6949250 8735725 10937950 13343195 15495257 17100934 18174146 18716125 18472258
39984 18472258 17233689 15321286 13561727 12718339 12988039 13987276 15078685 15707616 15588582
39975 15588582 14705599 13168840 11111630 8785151 6696257 5455676 5321987 5883496
39967 5883496 6286678 5878986 4692515 3330210 2388714 1990623 1851238 1714193 1620352
39958 1620352 1754054 2148873 2626477 2956599 2987231 2681768 2181575 1856929 2155851 3290064
39948 3290064 5105652 7324148 9842081 12662814 15549595 17945632 19393961 19954380
39940 19954380 20014039 19691059 18661305 16713572 14300266 12288007 11174409 10733411 10439383
$$ packed form
40001d893435K627696K511972J479063N19066K55404N89721J048975J322107J488681
39992F949250J786475K202225K405245K152062J605677J073212N41979k43867
39984A8472258j238569j912403j759559q43388K69700R99237J091409O28931j19034
39975A5588582q82983j536759k057210k326479k088894j240581j33689N61509
39967E883496M03182m07692j186471j362305r41496l98091j39385j37045r3841
39958A620352J33702L94819M77604L30122L0632l05463n00193l24646K98922J134213
39948C290064J815588K218496K517933K820733K886781K396037J448329N60419
39940A9954380N9659l22980j029754j947733k413306k012259j113598m40998k94028
$$ plain form
39931 10439383 10053628 9740471 9778701 10254167 10899851 11136726 10417317 8715904 6664152
39922 6664152 5097721 4455460 4586538 4949010 4859873 3748455 1527037 -1165655 -3257380
39913 -3257380 -3958474 -3265502 -1849252 -550572 58533 -183675 -1151995 -2638894 -4419325
39904 -4419325 -6148173 -7347778 -7662810 -7132127 -6119581 -4992416 -3946800 -3080682 -2451129
39895 -2451129 -2003370 -1552812 -900235 65846 1333069 2705154 3788996 4203217 3873614
39886 3873614 3055959 2068050 1091054 183293 -703187 -1729495 -2961440 -4060501 -4389416
39877 -4389416 -3577922 -1859753 224580 2237644 3819554 4562451 4304776 3489071 2888094
39868 2888094 2926607 3487252 4331679 5342463 6227943 6346034 5170483 2865770 166769
$$ packed form
39931A0439383l85755l13157L8230M75466O45684K36875p19409j701413k051752
39922F664152j566431o42261J31078L62472q9137j111418k221418k692692k091725
39913c257380p01094O92972J416250J298680O09105k42208r68320j486899j780431
39904d419325j728848j199605l15032N30683J012546J127165J045616Q66118O29553
39895b451129M47759M50558O52577R66081J267223J372085J083842M14221l29603
39886C873614q17655r87909r76996r07761q86480j026308j231945j099061l28915
39877d389416Q11494J718169K084333K013064J581910P42897k57675q15705o00977
39868B888094L8513N60645Q44427J010784Q85480J18091j175551k304713k699001
$$ plain form
39859 166769 -2317682 -4531194 -6692223 -8736166 -10140638 -10314468 -9145810 -7166634
39851 -7166634 -5195437 -3843243 -3313930 -3489035 -4029325 -4467498 -4439996 -3907794 -3034885
39842 -3034885 -1841680 -150795 2088609 4638073 7230902 9759359 11995506 13329488
39834 13329488 13144932 11484251 9098442 6761217 4688313 2662174 514213 -1661681
39826 -1661681 -3647419 -5260686 -6359357 -6789967 -6410849 -5196753 -3310627 -1007394
39818 -1007394 1581375 4503204 7732778 10908589 13448955 14934849 15274664 14518122
39810 14518122 12700399 9963992 6709453 3499367 841309 -917173 -1618592 -1358025
39802 -1358025 -473761 630471 1662629 2442463 2843394 2849514 2624492 2419505 2413456 2664601
$$ packed form
39859A66769k484451k213512k161029k043943j404472j73830J168658J979176
39851g166634J971197J352194N29313j75105n40290m38173K7502N32202Q72909
39842c034885J193205J690885K239404K549464K592829K528457K236147J333982
39834A3329488j84556j660681k385809k337225k072904k026139k147961k175894
39826a661681j985738j613267j098671m30610L79118J214096J886126K303233
39818a007394K588769K921829L229574L175811K540366J485894L39815p56542
39810A4518122j817723k736407l254539l210086k658058j758482p01419K60567
39802a358025Q84264J104232J032158P79834M00931O120k25022k04987o049K51145
$$ plain form
39792 2664601 3119646 3576213 3731140 3415319 2745328 1929069 999085 -93425 -1201432
39783 -1201432 -2068668 -2716543 -3456686 -4384187 -5106969 -5192924 -4698193 -3985165 -3158288 -2051398
39773 -2051398 -793405 -1752 -176530 -1089563 -2011008 -2462392 -2558904 -2686219 -3087669
39764 -3087669 -3793614 -4705025 -5580871 -6077809 -6012913 -5591917 -5237811 -5150794 -5126325 -4852535
39754 -4852535 -4312266 -3822358 -3712420 -4026989 -4524069 -4902909 -5034353 -5037403 -5176472 -5664722
39744 -5664722 -6525147 -7607050 -8697880 -9599219 -10150343 -10287287 -10121920 -9883911 -9695756
39735 -9695756 -9438648 -8947811 -8349675 -8075721 -8430062 -9171189 -9604617 -9096585 -7484932
39726 -7484932 -5094444 -2515919 -358001 1014400 1673512 1995218 2205880 2123676 1498798
$$ packed form
39792B664601M55045M56567J54927l15821o69991q16259r29984j092510j108007
39783a201432q67236o47875p40143r27501p22782q5955M94731P13028Q26877J106890
39773b051398J257993P91653j74778r13033r21445m51384r6512j27315m01450
39764c087669p05945r11411q75846m96938O4896M20996L54106Q7017K4469K73790
39754d852535N40269M89908J09938l14569m97080l78840j31444l050j39069m88250
39744e664722q60425j081903j090830r01339n51124j36944J65367K38009J88155
39735i695756K57108M90837N98136K73954l54341p41127m33428N08032J611653
39726g484932K390488K578525K157918J372401O59112L21706K10662q2204o24878
$$ plain form
39717 1498798 568635 69661 616463 2166249 4121651 5822455 6881413 7214859 6926233
39708 6926233 6126875 4773979 2743931 167578 -2385478 -4226513 -5076295 -5194920 -5015659
39699 -5015659 -4766644 -4441985 -3998841 -3510819 -3175410 -3182619 -3538847 -4078799 -4757160 -5850137
39689 -5850137 -7629396 -9764456 -11262840 -11215596 -9589009 -7202501 -4987137 -3345461
39681 -3345461 -2128553 -1010220 228072 1688906 3434373 5393902 7164269 8066767
39673 8066767 7614655 5946340 3673878 1323556 -894702 -2783121 -3956024 -4172093
39665 -4172093 -3685821 -3001598 -2338701 -1544130 -459664 884469 2449140 4318622 6571558
39656 6571558 9165102 11977365 14796234 17216460 18719407 18952621 17849210 15502355
$$ packed form
39717A498798r30163m98974N46802J549786J955402J700804J058958L33446k88626
39708F926233p99358j352896k030048k576353k553056j841035q49782j18625J79261
39699e015659K49015L24659M43144M88022L35409p209l56228n39952o78361j092977
39689e850137j779259k135060j498384M7244J626587K386508K215364J641676
39681c345461J216908J118333J238292J460834J745467J959529J770367R02498
39673H066767m52112j668315k272462k350322k218258j888419j172903k16069
39665d172093M86272O84223O62897P94571J084466J344133J564671J869482K252936
39656F571558K593544K812263K818869K420226J502947K33214j103411k346855
$$ plain form
39648 15502355 12162096 8442611 5265600 3326069 2646763 2760094 3189814 3586829 3561393
39639 3561393 2745516 1143438 -739969 -2238652 -2972691 -2991516 -2596507 -2057197 -1429741
39630 -1429741 -637931 234219 823082 835497 524691 618589 1643971 3390264 5105857
39621 5105857 6137922 6324004 5903655 5234060 4568534 3931520 3118791 1883218 186477
39612 186477 -1749104 -3660010 -5474311 -7278031 -9065444 -10599182 -11586614 -11991277 -12106932
39603 -12106932 -12291228 -12670339 -13136925 -13556673 -13865857 -14002210 -13899632 -13612057 -13335255
39594 -13335255 -13230019 -13299078 -13489491 -13792051 -14123944 -14238586 -13968908 -13539195 -13407075
39585 -13407075 -13713904 -14055626 -13903981 -13125814 -11981275 -10772527 -9707975 -9024369 -8940715
$$ packed form
39648A5502355l340259l719485l177011j939531o79306J13331M29720L97015k5436
39639C561393q15877j602078j883407j498683p34039j8825L95009N39310O27456
39630a429741P91810Q72150N88863J2415l10806R3898J025382J746293J715593
39621E105857J032065J86082m20349o69595o65526o37014q12729j235573j696741
39612A86477j935581j910906j814301j803720j787413j533738r87432m04663j15655
39603a2106932j84296l79111m66586m19748l09184j36353J02578K87575K76802
39594a3335255J05236o9059j90413l02560l31893j14642K69678M29713J32120
39585a3407075l06829l41722J51645P78167J144539J208748J064552O83606Q3654
$$ plain form
39576 -8940715 -9380155 -9911049 -10101321 -9851093 -9304639 -8578699 -7743161 -6978472 -6516835
39567 -6516835 -6378835 -6322400 -6113592 -5723523 -5205216 -4539765 -3744814 -3024811 -2622987 -2532442
39557 -2532442 -2488124 -2243613 -1747361 -1085342 -431590 -80910 -318391 -1097719 -1928668 -2210054
39547 -2210054 -1658523 -377836 1392037 3494558 5888122 8543190 11251455 13488818
39539 13488818 14613580 14375275 13185793 11763422 10570000 9709612 9218010 9144132 9342582
39530 9342582 9484646 9400943 9232075 9160639 9196087 9326538 9666363 10296155 11144965 12207478
39520 12207478 13682314 15645704 17726976 19396419 20518923 21364831 22123950 22697308
39512 22697308 22952100 22837707 22162843 20621133 18314404 16064809 14896313 15177235 16385393
$$ packed form
39576h940715m39440n30894j90272K50228N46454P25940Q35538P64689M61637
39567f516835J38000N6435K08808L90069N18307O65451P94951P20003M01824R0545
39557b532442M4318K44511M96252O62019O53752L50680k37481p79328q30949k81386
39547b210054N51531J280687J769873K102521K393564K655068K708265K237363
39539A3488818J124762k38305j189482j422371j193422q60388m91602p3878J98450
39530I342582J42064q3703j68868p1436L5448J30451L39825O29792Q48810J062513
39520A2207478J474836J963390K081272J669443J122504Q45908P59119N73358
39512B2697308K54792j14393o74864j541710k306729k249595j168496K80922J208158
$$ plain form
39503 16385393 17661670 18453590 18653225 18310603 17390840 15879349 14075028 12599747 11934582
39494 11934582 11971814 12196408 12301598 12398296 12559734 12442399 11586839 9950109 7920749
39485 7920749 5895963 4044309 2394020 891727 -640634 -2392705 -4341988 -6244194
39477 -6244194 -7793750 -8600504 -8072615 -5718569 -1830587 2298317 5158338 6146863 5902987
39468 5902987 5590471 5924649 6809307 7700687 8171728 8139720 7688272 6842499 5612328
39459 5612328 4196834 3015211 2492761 2854509 4089685 5976002 8071832 9787669
39451 9787669 10602515 10264847 8829277 6598824 4068516 1801170 196470 -660006 -892367
39442 -892367 -616622 98770 1069251 1908663 2229228 1980778 1563674 1511732 1971633 2491417
$$ packed form
39503A6385393J276277P91920J99635l42622r19763j511491j804321j475281o65165
39494A1934582L7232K24594J05190R6698J61438j17335q55560j636730k029360
39485G920749k024786j851654j650289j502293j532361j752071j949283j902206
39477f244194j549556q06754N27889K354046L887982M128904K860021R88525k43876
39468E902987l12516L34178Q84658Q91380M71041l2008m51448q45773j230171
39459E612328j415494j181623n22450L61748J235176J886317K095830J715837
39451I787669Q14846l37668j435570k230453k530308k267346j604700q56476k32361
39442h92367K75745P15392R70481Q39412L20565k48450m17104n1942M59901N19784
$$ plain form
39432 2491417 2382228 1300212 -558418 -2762435 -4960320 -6840560 -7998469 -8107308
39424 -8107308 -7237642 -5834216 -4312707 -2797644 -1327517 -187139 146775 -574652 -2093397
39415 -2093397 -3833383 -5334918 -6479424 -7341444 -7915780 -8038129 -7538037 -6406163 -4807351
39406 -4807351 -3000042 -1298724 -57735 463920 343048 70891 245346 1061764 2110147
39397 2110147 2749015 2704824 2271701 1937783 1904955 2010988 2021361 1877451 1675000 1509868
39387 1509868 1396549 1308896 1282321 1469878 2037519 2943098 3874186 4519390 4899615 5320812
39377 5320812 5971129 6653851 6942165 6508485 5302839 3581815 1871227 754285 475660
39368 475660 720291 882947 584306 -107070 -892563 -1557598 -2083540 -2591987 -3244726 -4109461
$$ packed form
39432B491417j09189j082016j858630k204017k197885j880240j157909j08839
39424h107308Q69666J403426J521509J515063J470127J140378L33914p21427j518745
39415b093397j739986j501535j144506q62020n74336j22349N00092J131874J598812
39406d807351J807309J701318J240989N21655j20872k72157J74455Q16418J048383
39397B110147O38868m4191m33123l33918l2828J06033J0373j43910k02451j65132
39387A509868j13319q7653k6575J87557N67641R05579R31088O45204L80225M21197
39377E320812O50317O82722K88314m33680j205646j721024j710588j116942k78625
39368D75660K44631J62656k98641o91376p85493o65035n25942n08447o52739q64735
$$ plain form
39358 -4109461 -5024014 -5606178 -5484430 -4592005 -3258725 -1985754 -1073808 -450420 111183
39349 111183 603346 667505 -110721 -1822638 -4124401 -6385744 -7938963 -8394794 -7935462
39340 -7935462 -7271952 -7145124 -7818023 -9080308 -10623972 -12228898 -13651385 -14628371 -15117975
39331 -15117975 -15367554 -15623537 -15902484 -16146948 -16430705 -16797617 -16973167 -16471249 -15046467
39322 -15046467 -12930379 -10605568 -8462550 -6699342 -5400805 -4565407 -4059939 -3652186
39314 -3652186 -3171847 -2661357 -2334914 -2334220 -2517119 -2544886 -2215286 -1668405 -1219094 -1006782
39304 -1006782 -832604 -316749 754732 2101197 2894072 2199462 -269692 -3767676 -6969451
39295 -6969451 -8855991 -9171935 -8202290 -6398384 -4279062 -2406233 -1158769 -514291 -166358
$$ packed form
39358d109461r14553n82164J21748Q92425J333280J272971R11946O23388N61603
39349A11183M92163O4159p78226j711917k301763k261343j553219m55831M59332
39340g935462O63510J26828o72899j262285j543664j604926j422487r76986m89604
39331a5117975k49579k55983k78947k44464k83757l66912j75550N01918J424782
39322a5046467K116088K324811K143018J763208J298537Q35398N05468M07753
39314c652186M80339N10490L26443O94j82899k7767L29600N46881M49311K12312
39304a006782J74178N15855J071481J346465P92875o94610k469154l497984l201775
39295f969451j886540l15944R69645J803906K119322J872829J247464O44478L47933
$$ plain form
39286 -166358 159559 577160 1133151 1838896 2563291 3017958 2939291 2260741 1092197 -400331
39276 -400331 -2043115 -3631853 -4935370 -5742203 -5915252 -5472877 -4696042 -4121302 -4263945
39267 -4263945 -5192099 -6371273 -7061184 -6969612 -6490838 -6243967 -6423972 -6696737 -6683193 -6372016
39257 -6372016 -5998376 -5679142 -5319843 -4800257 -4081107 -3154152 -2077081 -1106784 -613467
39248 -613467 -700660 -968305 -796417 109825 1500535 2851462 3733425 3919689 3318511
39239 3318511 2004179 346485 -1026292 -1544876 -1044678 191988 1701499 3103628
39231 3103628 4149059 4659288 4557881 3966305 3187409 2545744 2231607 2245080 2412309
39222 2412309 2464479 2202825 1659374 1094209 840888 1174873 2245635 3938601 5716584
$$ packed form
39286a66358L25917M17601N55991P05745P24395M54667p8667o78550j168544j492528
39276d00331j642784j588738j303517q06833j73049M42375P76835N74740j42643
39267d263945r28154j179174o89911R1572M78774K46871j80005k72765J3544L11177
39257f372016L73640L19234L59299N19586P19150R26955J077071R70297M93317
39248f13467q7193k67645J71888R06242J390710J350927Q81963J86264o01178
39239C318511j314332j657694j372777n18584N00198J236666J509511J402129
39231C103628J045431N10229j01407n91576p78896o41665l14137J3473J67229
39222B412309N2170k61654n43451n65165k53321L33985J070762J692966J777983
$$ plain form
39213 5716584 6770525 6585867 5445137 4290309 4028187 4955656 6759835 8883893 10811330
39204 10811330 12148514 12677514 12445847 11740360 10841323 9723053 8009152 5295613 1592333
39195 1592333 -2513220 -6118627 -8466415 -9264899 -8731303 -7420832 -5956136 -4783765
39187 -4783765 -4090183 -3891188 -4143075 -4764957 -5651863 -6744416 -8012898 -9262098 -10022263
39178 -10022263 -9846249 -8808438 -7602684 -7038179 -7449348 -8601199 -10068238 -11635956
39170 -11635956 -13411349 -15632874 -18326554 -21070999 -23156863 -24096219 -23991187 -23357860
39162 -23357860 -22627690 -21889869 -21054241 -20108925 -19179155 -18428702 -17938743 -17604922 -17131131
39153 -17131131 -16229801 -14900800 -13452905 -12194229 -11166551 -10250744 -9453049 -8947249 -8821324
$$ packed form
39213E716584J053941j84658j140730j154828k62122R27469J804179K124058J927437
39204A0811330J337184N29000k31667p05487q99037j118270j713901k713539l703280
39195A592333m105553l605407k347788p98484N33596J310471J464696J172371
39187d783765O93582J98995k51887o21882q86906j092553j268482j249200p60165
39178a0022263J76014J037811J205754N64505m11169j151851j467039j567718
39170a1635956j775393k221525k693680k744445k085864r39356J05032O33327
39162b3357860P30170P37821Q35628R45316R29770P50453M89959L33821M73791
39153a7131131R01330J329001J447895J258676J027678R15807P97695N05800J25925
$$ plain form
39144 -8821324 -8890334 -8827193 -8452817 -7879927 -7419271 -7378237 -7881362 -8746873 -9455772 -9316653
39134 -9316653 -7858893 -5227078 -2188451 366889 2024786 2977859 3613835 4065809 4185467
39125 4185467 3853781 3221756 2660689 2499980 2736097 2930906 2493257 1219534 -450995
39116 -450995 -1855345 -2798286 -3689917 -4959997 -6509445 -7867663 -8750070 -9244134 -9479243
39107 -9479243 -9356119 -8728566 -7746582 -6889825 -6662749 -7284480 -8612997 -10284635 -11927690
39098 -11927690 -13300430 -14267090 -14694464 -14472811 -13702216 -12787028 -12203612 -12119224 -12298388
39089 -12298388 -12422265 -12434154 -12501878 -12702054 -12886747 -12900999 -12791537 -12649501 -12297797 -11352257
39079 -11352257 -9714302 -7878578 -6553355 -5958245 -5641451 -5045792 -4125230 -3297007 -2895806
$$ packed form
39144h821324o9010O3141L74376N72890M60656M1034n03125q65511p08899J39119
39134i316653J457760K631815L038627K555340J657897R53073O35976M51974J19658
39125D185467l31686o32025n61067j60709K36117J94809m37649j273723j670529
39116d50995j404350r42941q91631j270080j549448j358218q82407m94064k35109
39107i479243J23124O27553R81984Q56757K27076o21731j328517j671638j643055
39098a1927690j372740r66660m27374K21653P70595R15188N83416Q4388j79164
39089a2298388j23877j1889o7724k00176j84693j4252J09462J42036L51704R45540
39079a1352257J637955J835724J325223N95110L16794N95659R20562Q28223M01201
$$ plain form
39070 -2895806 -2872282 -3041713 -3431460 -4224660 -5413264 -6648177 -7457720 -7529705 -6765855
39061 -6765855 -5194516 -2969319 -434910 1938825 3766994 4887903 5326872 5238509 4931150
39052 4931150 4819111 5181779 5946379 6782887 7412776 7767781 7903201 7910545 7934223 8086509
39042 8086509 8191587 7683058 5923714 2707283 -1527674 -5907659 -9531914 -11854788
39034 -11854788 -12917245 -13265572 -13497080 -13741418 -13559528 -12366380 -9964229 -6722522 -3335477
39025 -3335477 -433058 1651743 2850670 3197242 2773048 1817948 761093 -29299 -558290
39016 -558290 -1164721 -2130916 -3420032 -4830784 -6256913 -7634691 -8718959 -9165930 -8938901
39007 -8938901 -8456574 -8140659 -7867200 -7073042 -5449952 -3349525 -1391361 157911 1410550
$$ packed form
39070b895806K3524j69431l89747p93200j188604j234913q09543p1985P63850
39061f765855J571339K225197K534409K373735J828169J120909M38969q8363l07359
39052D931150j12039L62668P64600Q36508O29889L55005J35420P344K3678J52286
39042H086509J05078n08529j759344l216431m234957m379985l624255k322874
39034a1854788j062457l48327k31508k44338J81890J193148K402151L241707L387045
39025c335477K902419K084801J198927L46572m24194r55100j056855p90392n28991
39016e58290o06431r66195j289116j410752j426129j377778j084268m46971K27029
39007h938901M82327L15915K73459P94158J623090K100427J958164J549272J252639
$$ plain form
38998 1410550 2375192 2758180 2326497 1252958 -17879 -1080491 -1635809 -1467352 -597514
38989 -597514 631656 1884346 3208915 4853851 6686088 8023013 8152554 6916172
38981 6916172 4768247 2433418 545035 -604059 -1135772 -1355968 -1387149 -1137180 -671748
38972 -671748 -404969 -724004 -1524285 -2312325 -2735608 -2856313 -2940383 -3164911 -3567036 -4124660
38962 -4124660 -4792502 -5514051 -6241771 -6908686 -7385327 -7557503 -7506932 -7575151 -8179584 -9518443
38952 -9518443 -11402912 -13328336 -14722807 -15205687 -14689461 -13296658 -11239398 -8816115
38944 -8816115 -6490813 -4859618 -4380157 -5010998 -6134386 -6995372 -7347052 -7610210 -8287174
38935 -8287174 -9277324 -9925039 -9715426 -8737019 -7448450 -6217213 -5190553 -4415523 -3891844
$$ packed form
38998A410550R64642L82988m31683j073539j270837j062612n55318J68457Q69838
38989e97514J229170J252690J324569J644936J832237J336925J29541j236382
38981F916172k147925k334829j888383j149094n31713k20196l1181K49969M65432
38972f71748K66779l19035q00281p88040m23283j20705q4070k24528m02125n57624
38962d124660o67842p21549p27720o66915m76641j72176N0571o8219o04433j338859
38952i518443j884469j925424j394471m82880N16226J392803K057260K423283
38944h816115K325302J631195M79461o30841j123388q60986l51680k63158o76964
38935h287174r90150o47715K09613R78407J288569J231237J026660P75030N23679
$$ plain form
38926 -3891844 -3584408 -3506225 -3702585 -4054720 -4235473 -4032005 -3641268 -3491050 -3806077 -4440286
38916 -4440286 -5028273 -5179214 -4681251 -3752247 -3015021 -2981770 -3571599 -4311020 -4927822 -5489917
38906 -5489917 -6020608 -6346385 -6436643 -6593385 -7092619 -7783196 -8189106 -7918740 -6933665 -5610018
38896 -5610018 -4643711 -4685855 -5844239 -7573936 -9133512 -10061755 -10200109 -9518132 -8144158
38887 -8144158 -6429699 -4737770 -3197310 -1818321 -761609 -274436 -374093 -810117 -1409285
38878 -1409285 -2325427 -3856816 -6036479 -8397853 -10128383 -10555990 -9633264 -7960972 -6271004
38869 -6271004 -4900267 -3792201 -2871023 -2224789 -1946445 -1985481 -2229538 -2652937 -3362686
38860 -3362686 -4552845 -6354437 -8572652 -10565331 -11571516 -11301706 -10174281 -8926088
$$ packed form
38926c891844L07436P8183j96360l52135j80753K03468L90737J50218l15027o34209
38916d440286n87987j50941M97963R29004P37226L3251n89829p39421o16802n62095
38906e489917n30691l25777r0258j56742m99234o90577m05910K70366R85075J323647
38896e610018R66307m2144j158384j729697j559576r28243j38354O81977J373974
38887h144158J714459J691929J540460J378989J056712M87173r9657m36024n99168
38878a409285r16142j531389k179663k361374j730530m27607R22726J672292J689968
38869f271004J370737J108066R21178O46234K78344l9036k44057m23399p09749
38860c362686j190159j801592k218215j992679j006185K69810J127425J248193
$$ plain form
38852 -8926088 -8026812 -7462869 -6967761 -6371559 -5767163 -5401973 -5408906 -5651603 -5881375 -6031063
38842 -6031063 -6260432 -6695831 -7239694 -7695250 -7955864 -7936733 -7386310 -5959957 -3572113
38833 -3572113 -618892 2208436 4331500 5547793 6023610 6143163 6326856 6836714 7644210
38824 7644210 8514281 9292120 10089314 11107228 12285627 13245443 13650803 13571238 13432435
38815 13432435 13659080 14392308 15437050 16366077 16763753 16559666 16137899 15957943 16008873
38806 16008873 15758700 14713321 12934942 10955659 9284323 8060980 7064091 5937402
38798 5937402 4525081 3155810 2524705 3079981 4514137 6052364 7296384 8612077
38790 8612077 10604690 13369709 16353919 18767597 19969233 19653891 18035737 15902728
$$ packed form
38852h926088Q99276N63943M95108N96202O04396L65190o933k42697k29772j49688
38842f031063k29369m35399n43863m55556k60614J9131N50423J426353K387844
38833c572113K953221K827328K123064J216293M75817J19553J83693N09858Q07496
38824G644210Q70071P77839P97194J017914J178399R59816M05360p9565j38803
38815A3432435K26645P33228J044742R29027L97676k04087m21767j79956N0930
38806A6008873k50173j045379j778379j979283j671336j223343r96889j126689
38798E937402j412321j369271o31105N55276J434156J538227J244020J315693
38790H612077J992613K765019K984210K413678J201636l15342j618154k133009
$$ plain form
38782 15902728 14215284 13450217 13368879 13433793 13317819 12977849 12433389 11646582 10564916
38773 10564916 9181244 7583650 5960537 4436697 2875618 1053531 -829808 -2020635
38765 -2020635 -1858501 -483498 1326625 2959348 4358745 5663343 6777196 7395563
38757 7395563 7222094 6065495 3959488 1361234 -914482 -2138383 -2048700 -855299 911375
38748 911375 2525618 3372643 3393280 3095624 2944514 2867296 2515120 1819164 1041054 416247
38738 416247 27388 -84792 -34193 -291782 -1391815 -3279113 -5177902 -6262268 -6319452
38729 -6319452 -5677532 -4685696 -3447530 -1963554 -347069 1133771 2187075 2687242 2734262
38720 2734262 2465706 1828225 653988 -1007970 -2761727 -4156819 -5078397 -5829809 -6878216
$$ packed form
38782A5902728j687444p65067q1338O4914j15974l39970n44460p86807j081666
38773A0564916j383672j597594j623113j523840j561079j822087j883339j190827
38765b020635J62134J375003J810123J632723J399397J304598J113853O18367
38757G395563j73469j156599k106007k598254k275716j223901Q9683J193401J766674
38748I11375J614243Q47025K0637k97656j51110p7218l52176o95956p78110o24807
38738D16247l88859j12180N0599k57589j100033j887298j898789j084366n7184
38729f319452O41920R91836J238166J483976J616485J480840J053304N00167M7020
38720B734262k68556o37481j174237j661958j753757j395092r21578p51412j048407
$$ plain form
38711 -6878216 -8487312 -10457624 -12161585 -12922271 -12453587 -10968077 -8941830 -6876603
38703 -6876603 -5203618 -4163163 -3652896 -3297904 -2753578 -1882304 -645324 993405 2934400
38694 2934400 4807261 6082266 6313320 5311969 3256339 717262 -1553502 -3005272
38686 -3005272 -3475617 -3056789 -1946244 -439429 1180129 2883052 4818356 6812640
38678 6812640 8158390 8215153 7161187 5872805 5056925 4727101 4510882 4154542 3581624
38669 3581624 2682051 1293293 -614925 -2838164 -5020168 -6816363 -8026401 -8620876
38661 -8620876 -8660446 -8233323 -7483128 -6569087 -5461163 -3866025 -1571184 1149737 3708496
38652 3708496 5826368 7727035 9548997 10794891 10672187 8969614 6394851 4022528
$$ packed form
38711f878216j609096j970312j703961p60686M68684J485510K026247K065227
38703f876603J672985J040455N10267L54992N44326Q71274J236980J638729J940995
38694B934400J872861J275005K31054j001351k055630k539077k270764j451770
38686c005272m70345M18828J110545J506815J619558J702923J935304J994284
38678F812640J345750N6763j053966j288382q15880l29824k16219l56340n72918
38669C581624q99573j388758j908218k223239k182004j796195j210038n94475
38661h620876l9570M27123P50195R14041J107924J595138K294841K720921K558759
38652C708496K117872J900667J821962J245894j22704j702573k574763k372323
$$ plain form
38644 4022528 2544125 2028674 2164574 2560918 2908664 3058389 3041481 2986495 2967891 2935785
38634 2935785 2818047 2682647 2724354 3006685 3237274 2933182 1904604 518706 -620933
38625 -620933 -1246248 -1592373 -2016316 -2594217 -3175616 -3725829 -4441085 -5484355 -6704687
38616 -6704687 -7704031 -8187956 -8256660 -8408297 -9271308 -11204648 -13969518 -16737199 -18553527
38607 -18553527 -18966878 -18272106 -17157279 -16154292 -15425903 -14928259 -14579228 -14248105 -13751025
38598 -13751025 -12987093 -12041643 -11081838 -10178090 -9288080 -8393080 -7586691 -7028826 -6851826
38589 -6851826 -7106791 -7756608 -8681311 -9644200 -10216852 -9821188 -8067464 -5204588 -2144131
38580 -2144131 160135 1407794 1971307 2285205 2373987 1962082 807377 -1199374 -4069033
$$ packed form
38644D022528j478403n15451J35900L96344L47746J49725j6908n4986j8604l2106
38634B935785j17738j35400M1707K82331K30589l04092j028578j385898j139639
38625f20933o25315l46125m23943n77901n81399n50213p15256j043270j220332
38616f704687r99344m83925o8704j51637q63011j933340k764870k767681j816328
38607a8553527m13351O94772J114827J002987P28389M97644L49031L31123M97080
38598a3751025P63932R45450R59805R03748Q90010Q95000Q06389N57865J77000
38589f851826k54965o49817r24703r62889n72652L95664J753724K862876L060457
38580b144131K304266J247659N63513L13898Q8782m11905j154705k006751k869659
$$ plain form
38571 -4069033 -7594293 -11209295 -14163006 -15936003 -16485830 -16129893 -15247660 -14026810 -12376495
38562 -12376495 -10109472 -7324303 -4593443 -2636073 -1754739 -1639187 -1668973 -1286683 -165694
38553 -165694 1674359 3760066 5358121 6006323 5851789 5399021 5014871 4764201 4581509
38544 4581509 4401385 4176322 3975840 4085049 4824505 6194773 7792994 9117629 9865503
38535 9865503 9914316 9166489 7561890 5261570 2766121 792495 -65446 332804 1638469
38526 1638469 3307514 4904198 6139176 6794180 6811529 6434747 6083865 6047914 6395033
38517 6395033 7146235 8333403 9814415 11192077 12038806 12143879 11519950 10311570 8780661
38508 8780661 7256322 5987241 5107611 4760885 5046279 5694887 6002000 5388046 4032194
$$ packed form
38571d069033l525260l615002k953711j772997n49827L55937Q82233J220850J650315
38562a2376495K267023K785169K730860J957370Q81334J15552k9786L82290J120989
38553a65694J840053K085707J598055O48202j54534m52768l84150k50670j82692
38544D581509j80124k25063k00482J09209P39456J370268J598221J324635P47874
38535I865503M8813p47827j604599k300320k495449j973626q57941L98250J305665
38526A638469J669045J596684J234978O55004J7349l76782l50882l5951L47119
38517F395033P51202J187168J481012J377662Q46729J05073o23929j208380j530909
38508H780661j524339j269081q79630l46726K85394O48608L07113o13954j355852
$$ plain form
38499 4032194 2747343 2202828 2418337 2999582 3643974 4338823 5253133 6554799 8173530
38490 8173530 9577396 9914702 8650884 6133561 3379871 1219345 -284569 -1551929
38482 -1551929 -2795003 -3751598 -4018115 -3459527 -2292622 -957757 18504 231198 -310083
38473 -310083 -1104259 -1508045 -1208936 -376910 497811 795035 -30074 -2105325 -4936265
38464 -4936265 -7741296 -10072501 -11974909 -13544063 -14594513 -14890930 -14472296 -13550280 -12277172
38455 -12277172 -10870598 -9823421 -9617354 -10153342 -10735478 -10803222 -10575099 -10809954 -11929589
38446 -11929589 -13455702 -14342255 -13844973 -12064977 -9725313 -7595098 -6231357 -6062618
38438 -6062618 -7287031 -9493196 -11621754 -12599379 -12029963 -10226031 -7772270 -5269232
$$ packed form
38499D032194j284851n44515K15509N81245O44392O94849R14310J301666J618731
38490H173530J403866L37306j263818k517323k753690k160526j503914j267360
38482a551929j243074r56595k66517N58588J166905J334865R76261K12694n41281
38473c10083p94176m03786K99109Q32026Q74721K97224q25109k075251k830940
38464d936265k805031k331205j902408j569154j050450k96417M18634R22016J273108
38455a2277172J406574J047177K06067n35988n82136o7744K28123k34855j119635
38446a1929589j526113q86553M97282J779996K339664K130215J363741J68739
38438f062618j224413k206165k128558r77625N69416J803932K453761K503038
$$ plain form
38430 -5269232 -3310850 -2293567 -2113841 -2232658 -2129261 -1619920 -799442 99128 738150
38421 738150 789455 180236 -821167 -1820870 -2565226 -3021375 -3310479 -3573453 -3802272 -3807364
38411 -3807364 -3472321 -3051378 -3094432 -4045728 -5974673 -8619115 -11497753 -13978665 -15466978
38402 -15466978 -15683635 -14762241 -13140876 -11476215 -10522293 -10726716 -11802769 -12901740 -13349873
38393 -13349873 -13117423 -12568990 -12017189 -11638594 -11558372 -11758628 -12005498 -12054604 -11875886 -11590742
38383 -11590742 -11317796 -11175143 -11247761 -11390040 -11231125 -10571144 -9623102 -8660699 -7601630
38374 -7601630 -6220936 -4643680 -3267892 -2210781 -1167310 103754 1415773 2370848
38366 2370848 2728914 2481196 1778759 923111 261133 -63960 -179783 -247525 -294295 -339212
$$ packed form
38430e269232J958382J017283J79726j18817J03397N09341Q20478Q98570O39022
38421G38150N1305o09219j001403r99703p44356m56149k89104k62974k28819n092
38411c807364L35043M20943m3054r51296j928945k644442k878638k480912j488313
38402a5466978k16657R21394J621365J664661R53922k04423j076053j098971m48133
38393a3349873K32450N48433N51801L78595Q0222k00256k46870m9106J78718K85144
38383a1590742K72946J42653p2618j42279J58915O59981R48042R62403J059069
38374g601630J380694J577256J375788J057111J043471J271064J312019R55075
38366B370848L58066k47718p02437q55648o61978l25093j15823o7742m6770m4917
$$ plain form
38356 -339212 -471249 -611882 -343892 747589 2522497 4231143 5078618 4785625 3609651
38347 3609651 1960712 94575 -1887856 -3885781 -5708617 -7099502 -7813122 -7731875 -7004325
38338 -7004325 -6060241 -5355181 -5006091 -4727983 -4197114 -3424986 -2701964 -2238927 -1993150
38329 -1993150 -1843278 -1814692 -2069520 -2695826 -3497289 -3958675 -3475659 -1737699 1055025
38320 1055025 4326605 7402855 9655030 10597993 10139258 8758001 7216135 5966939
38312 5966939 4934522 3911134 3007455 2566702 2703277 3066229 3066832 2268642 564855
38303 564855 -1914717 -4946682 -8212275 -11230635 -13474015 -14671568 -14960893 -14693991 -14203219
38294 -14203219 -13839768 -14026413 -14944942 -16179407 -16975612 -16954799 -16342437 -15419285 -14071537
$$ packed form
38356c39212j32037j40633K67990J091481J774908J708646Q47475k92993j175974
38347C609651j648939j866137j982431j997925j822836j390885p13620Q1247P27550
38338g004325R44084P05060L49090K78108N30869P72128P23022M63037K45777
38329a993150J49872K8586k54828o26306q01463m61386M83016J737960K792724
38320A055025L271580L076250K252175R42963m58735j381257j541866j249196
38312E966939j032417j023388r03679m40753J36575L62952O03p98190j703787
38303E64855k479572l031965l265593l018360k243380j197553k89325K66902M90772
38294a4203219L63451j86645r18529j234465p96205K0813O12362R23152J347748
$$ plain form
38285 -14071537 -12133304 -9937373 -8156998 -7125372 -6573875 -6040880 -5289060 -4277320
38277 -4277320 -2983054 -1432443 203975 1713927 3045179 4328231 5673767 6955737
38269 6955737 7799193 7810380 6857281 5131241 2954025 603499 -1634711 -3347030 -4048672
$$ packed form
38285a4071537J938233K195931J780375J031626N51497N32995P51820J011740
38277d277320J294266J550611J636418J509952J331252J283052J345536J281970
38269F955737Q43456J1187r53099j726040k177216k350526k238210j712319p01642
$$ [...]
##END NTUPLES=NMR SPECTRUM
##END=
