##TITLE=31Pdec_DE-18km-TFA
  CDCl3
  24 sc
 29.9.2023
##JCAMPDX= 6.0         $$ Bruker NMR JCAMP-DX V2.0
##DATA TYPE= NMR SPECTRUM
##DATA CLASS= NTUPLES
##ORIGIN= UXNMR, Bruker Analytische Messtechnik GmbH
##OWNER= root
$$ XWIN-NMR		Version 3.5
$$ Fri Sep 29 14:15:07 2023 Russian Standard Time (UT+4h)  she@DPX200
##.OBSERVE FREQUENCY= 81.013821
##.OBSERVE NUCLEUS= ^31P
##.ACQUISITION MODE= SIMULTANEOUS
##.ACQUISITION SCHEME= undefined
##.AVERAGES= 24
##.DIGITISER RES= 16
##SPECTROMETER/DATA SYSTEM= spect
##.PULSE SEQUENCE= zgpg30
##.SOLVENT NAME= DMSO
##.SHIFT REFERENCE= (INTERNAL, DMSO, 0, 248.564)
##AUDIT TRAIL= $$ (NUMBER, WHEN, WHO, WHERE, WHAT)
$$ ##TITLE= Audit trail, XWIN-NMR		Version 3.5
$$ ##JCAMPDX= 5.01
$$ ##ORIGIN= Bruker BioSpin GmbH
$$ ##OWNER= she
$$ F:/spectra/data/she/nmr/P31/1/pdata/1/auditp.txt
$$ ##AUDIT TRAIL=  $$ (NUMBER, WHEN, WHO, WHERE, WHAT)
(   1,<2023-09-29 14:13:20.46 +0400>,<she>,<DPX200>,
      <created by zg, POWCHK disabled, PULCHK disabled
       configuration hash MD5:
       00 E9 B6 7A A2 85 ED C7 34 08 36 98 17 FE 4E 26
       data hash MD5: 32K
       D3 93 3B C0 1E 91 F0 E8 A4 46 E5 7E FD 35 7B D0>)
(   2,<2023-09-29 14:13:23.07 +0400>,<she>,<DPX200>,
      <Start of raw data processing
       efp BC_mod = 2 LB = 5 FT_mod = 6 PKNL = 1 PHC0 = -10726.74 PHC1 = 268.6864 SI = 64K 
       data hash MD5: 64K
       EF 51 57 27 8C 9F B0 87 AB 68 7D 1D 79 7A 57 4C>)
(   3,<2023-09-29 14:13:36.54 +0400>,<she>,<DPX200>,
      <pk PHC0 = 5.260241 PHC1 = 0 
       data hash MD5: 64K
       E9 88 F4 01 B6 C7 99 F7 84 C5 CD CC CA 43 43 7C>)
(   4,<2023-09-29 14:14:02.37 +0400>,<she>,<DPX200>,
      <pk PHC0 = 142.495 PHC1 = -361.4 
       data hash MD5: 64K
       7A D1 03 7C 81 74 E0 0B 17 6E 43 2A 32 4F 65 43>)
(   5,<2023-09-29 14:14:09.79 +0400>,<she>,<DPX200>,
      <abs ABSG = 5 
       data hash MD5: 64K
       F0 76 A6 7F 76 B3 47 38 90 8E 34 0D 2E A5 F0 65>)
$$ ##END=
$$ 
$$ hash MD5
$$ D3 5C 87 63 49 66 0A 28 1A F9 65 D7 BF 97 EB 84
##$RELAX= 
##$RELAX= 
##$RELAX= 
##$RELAX= 
##$RELAX= 
##$RELAX= 
##$RELAX= 
##$RELAX= 
##$RELAX= 
$$ Bruker specific parameters
$$ --------------------------
##$DU= <F:/spectra>
##$EXPNO= 1
##$NAME= <P31>
##$PROCNO= 1
##$TYPE= <nmr>
##$USER= <she>
##$AMP= (0..31)
100 100 100 100 100 100 100 100 100 100 100 100 100 100 100 100 100 100 
100 100 100 100 100 100 100 100 100 100 100 100 100 100 
##$AQSEQ= 0
##$AQ_mod= 1
##$AUNM= <au_zg>
##$AUTOPOS= <>
##$BF1= 81.014009
##$BF2= 200.13
##$BF3= 200.13
##$BF4= 200.13
##$BF5= 200.13
##$BF6= 200.13
##$BF7= 200.13
##$BF8= 200.13
##$BYTORDA= 1
##$CFDGTYP= 0
##$CFRGTYP= 5
##$CHEMSTR= <none>
##$CNST= (0..31)
1 1 145 1 1 1 1 1 1 1 1 1 1 1 1 1 1 1 1 1 1 1 1 1 1 1 1 1 1 1 1 1 
##$CPDPRG= <waltz16>
##$CPDPRG1= <>
##$CPDPRG2= <waltz16>
##$CPDPRG3= <>
##$CPDPRG4= <mlev>
##$CPDPRG5= <mlev>
##$CPDPRG6= <mlev>
##$CPDPRG7= <mlev>
##$CPDPRG8= <mlev>
##$CPDPRGB= <>
##$CPDPRGT= <>
##$D= (0..31)
$$ [...]
##$SUBNAM3= <"">
##$SUBNAM4= <"">
##$SUBNAM5= <"">
##$SUBNAM6= <"">
##$SUBNAM7= <"">
##$SUBNAM8= <"">
##$SUBNAM9= <"">
##$SW= 501.771253377433
##$SWIBOX= (0..15)
0 1 3 0 0 0 0 0 0 0 0 0 0 0 0 0 
##$SW_h= 40650.406504065
##$TD= 32768
##$TD0= 1
##$TE= 0
##$TE2= 300
##$TE3= 300
##$TEG= 300
##$TL= (0..7)
0 120 53 12 22 120 120 120 
##$TP= (0..7)
150 150 150 150 150 150 150 150 
##$TP07= 0
##$TPNAME0= <>
##$TPNAME1= <>
##$TPNAME2= <>
##$TPNAME3= <>
##$TPNAME4= <>
##$TPNAME5= <>
##$TPNAME6= <>
##$TPNAME7= <>
##$TPOAL= (0..7)
0.5 0.5 0.5 0.5 0.5 0.5 0.5 0.5 
##$TPOFFS= (0..7)
0 0 0 0 0 0 0 0 
##$TUNHIN= 0
##$TUNHOUT= 0
##$TUNXOUT= 0
##$USERA1= <user>
##$USERA2= <user>
##$USERA3= <user>
##$USERA4= <user>
##$USERA5= <user>
##$V9= 5
##$VALIST= <valist>
##$VCLIST= <CCCCCCCCCCCCCCC>
##$VD= 0
##$VDLIST= <DDDDDDDDDDDDDDD>
##$VPLIST= <PPPPPPPPPPPPPPP>
##$VTLIST= <TTTTTTTTTTTTTTT>
##$WBST= 1024
##$WBSW= 4
##$XGAIN= (0..3)
0 0 0 0 
##$XL= 0
##$YL= 0
##$YMAX_a= 2367
##$YMIN_a= -5180
##$ZGOPTNS= <>
##$ZL1= 120
##$ZL2= 120
##$ZL3= 120
##$ZL4= 120
##$ABSF1= 248.5645
##$ABSF2= -253.2056
##$ABSG= 5
##$ABSL= 3
##$ALPHA= 0
##$AQORDER= 0
##$ASSFAC= 0
##$ASSFACI= 0
##$ASSFACX= 0
##$ASSWID= 0
##$AUNMP= <proc_1d>
##$AZFE= 0.1
##$AZFW= 0.5
##$BCFW= 0
##$BC_mod= 2
##$BYTORDP= 0
##$COROFFS= 0
##$CY= -3
##$DATMOD= 1
##$DC= 0
##$DFILT= <>
##$DTYPP= 0
##$F1P= 0
##$F2P= 0
##$FCOR= 1
##$FTSIZE= 65536
##$FT_mod= 6
##$GAMMA= 0
##$GB= 0
##$INTBC= 1
##$INTSCL= 6.047779e-11
##$ISEN= 30
##$LB= 5
##$LEV0= 0
##$LPBIN= 0
##$MAXI= 10000
##$MC2= 0
##$MEAN= 0
##$ME_mod= 0
##$MI= 50
##$NCOEF= 0
##$NC_proc= -10
##$NLEV= 6
##$NOISF1= 182.463
##$NOISF2= 159.3651
##$NSP= 0
##$NTH_PI= 0
##$NZP= 0
##$OFFSET= 248.5645
##$PC= 4
##$PHC0= -10578.99
##$PHC1= -92.71359
##$PH_mod= 1
##$PKNL= yes
##$PPARMOD= 0
##$PSCAL= 0
##$PSIGN= 0
##$REVERSE= no
##$SF= 81.0140089999694
##$SI= 65536
##$SIGF1= 159.3651
##$SIGF2= -187.1042
##$SINO= 113.3802
##$SIOLD= 16384
##$SREGLST= <1H.CDCl3>
##$SSB= 0
##$STSI= 65536
##$STSR= 0
##$SW_p= 40650.406504065
##$SYMM= 0
##$S_DEV= 0
##$TDeff= 32768
##$TDoff= 0
##$TI= <>
##$TILT= no
##$TM1= 0
##$TM2= 0
##$TOPLEV= 0
##$USERP1= <user>
##$USERP2= <user>
##$USERP3= <user>
##$USERP4= <user>
##$USERP5= <user>
##$WDW= 1
##$XDIM= 65536
##$YMAX_p= 271024589
##$YMIN_p= -214034922
$$ End of Bruker specific parameters
$$ ---------------------------------
##NTUPLES= NMR SPECTRUM
##VAR_NAME=  FREQUENCY,     SPECTRUM/REAL,   SPECTRUM/IMAG
##SYMBOL=    X,             R,               I
##VAR_TYPE=  INDEPENDENT,   DEPENDENT,       DEPENDENT
##VAR_FORM=  AFFN,          ASDF,            ASDF
##VAR_DIM=   65536,         65536,           65536
##UNITS=     HZ,            ARBITRARY UNITS, ARBITRARY UNITS
##FACTOR=    0.620285442955139, 1,           1
##FIRST=     20137.2065510682, 0,            0
##LAST=      -20513.1999529968, 0,           0
##MIN=       -20513.1999529968, -214034922,  0
##MAX=       20137.2065510682, 271024589,    0
$$ Real data points
##PAGE= N=1
##DATA TABLE= (X++(R..R)), XYDATA
$$ [...]
44628 -5525380 -5920532 -5581867 -4823311 -3912028 -3084487 -2592471 -2520939 -2610232 -2440468 -1852995
44618 -1852995 -1119318 -658595 -649101 -974202 -1504021 -2299857 -3442587 -4698492 -5507701
44609 -5507701 -5421864 -4546114 -3500943 -2962572 -3238561 -4148406 -5127672 -5452852 -4595612
44600 -4595612 -2585711 -93628 1886043 2539752 1640475 -322756 -2416192 -3897227
44592 -3897227 -4758903 -5590999 -6814252 -8119764 -8741097 -8185922 -6594091 -4480448 -2300803
44583 -2300803 -232831 1801099 3931772 6044890 7673900 8325814 7951367 6973777 5819456
44574 5819456 4563609 3113803 1593413 374439 -239176 -241496 158219 753658 1448982
44565 1448982 2198335 2878497 3249948 3096867 2441944 1601192 991578 865906 1184851
44556 1184851 1667259 1963610 1886709 1553265 1273283 1264231 1486485 1708677 1587573 656186
44546 656186 -1524791 -4915129 -8677002 -11531590 -12623325 -12087465 -10792853 -9549024
44538 -9549024 -8497152 -7159223 -5059323 -2351336 175528 1777270 2422646 2718455
44530 2718455 3235170 4049589 4907385 5584857 5988472 6126021 6210703 6683404 7855951
44521 7855951 9487984 10901890 11596482 11634367 11376187 10976392 10262889 9041090 7392937
44512 7392937 5692162 4408570 3867801 4075740 4714331 5356560 5749576 5917994 6031194
44503 6031194 6226617 6559380 7029900 7562914 7961658 7977031 7513675 6793178 6287942 6451527
44493 6451527 7451079 9068328 10777875 11934363 12013263 10829375 8613840 5895312 3274549
44484 3274549 1216057 -103155 -846681 -1354348 -1774280 -1836495 -1115244 429160 2273349
44475 2273349 3761079 4606365 4892138 4738306 4209585 3507162 2955173 2646548 2252715
44466 2252715 1341907 -176201 -2007840 -3755893 -5092526 -5756683 -5638712 -4942465 -4109532
44457 -4109532 -3471521 -3026666 -2595502 -2112955 -1703949 -1533379 -1653647 -1973245 -2323944
44448 -2323944 -2559897 -2586433 -2262839 -1338814 347084 2534798 4532927 5666101 5690249
44439 5690249 4722161 2926703 481303 -2229969 -4679236 -6560580 -7940207 -8971653
44431 -8971653 -9641557 -9931305 -10065773 -10370477 -10918284 -11512889 -12033313 -12622408 -13490938
44422 -13490938 -14691812 -16159559 -17812095 -19462239 -20718456 -21161107 -20640079 -19287990
44414 -19287990 -17228576 -14401510 -10748634 -6485236 -2071355 2081706 5796724 9003152
44406 9003152 11495947 12911627 12990510 11856206 10000109 7965483 6055415 4352378
44398 4352378 2955705 2088934 1937882 2462127 3440209 4657526 5962414 7162844 8005010
44389 8005010 8337507 8242786 7922972 7461056 6749051 5651848 4191064 2548934 928234
44380 928234 -552862 -1826520 -2772331 -3215333 -3099046 -2669136 -2396843 -2618245 -3235430
44371 -3235430 -3816725 -3983373 -3648586 -2910398 -1848538 -526703 847906 1879171 2170205
44362 2170205 1609859 539704 -349199 -391662 622385 2301699 3917507 4829388 4745505
44353 4745505 3773595 2404626 1414136 1543619 3061790 5573764 8281899 10472901 11840733
44344 11840733 12465055 12538789 12093280 10996823 9284923 7453421 6232562 5935429 6114569
44335 6114569 5992774 5173388 3801738 2138756 265067 -1722503 -3491709 -4701990
44327 -4701990 -5385150 -5908080 -6554428 -7275670 -7850800 -8137588 -8113800 -7803903 -7281716 -6701151
44317 -6701151 -6230670 -5946899 -5810469 -5702884 -5442906 -4815732 -3669950 -1985938 207554
44308 207554 2964878 6356941 10188063 13806632 16289036 16899381 15463984 12420612
44300 12420612 8593795 4880943 1983384 266359 -176380 708903 3076565 6955266
44292 6955266 11784008 16300536 19190931 20044580 19599949 18904757 18266319 17159091 15096994
44283 15096994 12314983 9461724 6855374 4330955 1748616 -684800 -2717550 -4418616
44275 -4418616 -5990831 -7303168 -7858866 -7296521 -5798932 -3946417 -2252466 -903244
44267 -903244 118772 764859 832083 187403 -887304 -1639806 -1299757 311009 2662618
44258 2662618 5076778 7378482 9960996 13271811 17301198 21494688 25017374 27109103
44250 27109103 27369937 25870927 23027866 19371299 15464130 11971218 9578958 8630827
44242 8630827 8824310 9376883 9547470 9002848 7770166 6002469 3855211 1494090 -873506
44233 -873506 -2958931 -4366099 -4708470 -3891931 -2304509 -649140 472140 860104 728669
44224 728669 529871 703158 1380452 2217759 2612762 2221304 1250997 191391 -679377
44215 -679377 -1420081 -2134013 -2747424 -3133053 -3296414 -3303811 -3079620 -2382021 -963384 1301136
44205 1301136 4359915 7890770 11234943 13595688 14487401 14048634 12901170 11695146
44197 11695146 10745717 9981234 9117931 7888739 6216753 4256130 2265167 412599
44189 412599 -1290199 -2870715 -4260582 -5326062 -5999169 -6291207 -6153854 -5417035 -3965549
44180 -3965549 -1982830 28961 1478204 1940837 1309475 -141453 -1826772 -3167007
44172 -3167007 -3970844 -4449596 -4789785 -4827873 -4280763 -3195586 -1964669 -923799 -159719
44163 -159719 263299 165779 -471984 -1251410 -1581957 -1131866 42799 1694265 3529188
44154 3529188 5258206 6766046 8280261 10185432 12584279 15126313 17254260 18466798
44146 18466798 18367782 16759306 13901004 10561444 7603872 5472426 4066965 2978857
44138 2978857 1782529 298012 -1211084 -2185875 -2357654 -2193450 -2553406 -3833173 -5573280
44129 -5573280 -6961364 -7578403 -7567869 -7217152 -6591925 -5659161 -4675587 -4267662 -4947791
44120 -4947791 -6509230 -8027320 -8573931 -7889989 -6337385 -4408173 -2509212 -1066360
44112 -1066360 -410008 -415275 -532603 -383546 -180781 -404365 -1207162 -2304091 -3301996 -3920580
44102 -3920580 -3983698 -3446800 -2432254 -1038804 880860 3520981 6614314 9306905 10722861
44093 10722861 10668050 9765632 8959706 8882127 9556324 10562968 11450495 12012041 12219680
44084 12219680 12000570 11194499 9745727 7872889 6017356 4597732 3705670 2948419 1685300
44075 1685300 -384300 -2829921 -4812148 -5850491 -6212448 -6575747 -7455323 -8960743 -10878930
44066 -10878930 -12819440 -14380683 -15359200 -15824739 -15947484 -15799762 -15375740 -14720179 -13937655
44057 -13937655 -13122838 -12372731 -11823864 -11578183 -11616677 -11875811 -12384864 -13226664 -14362629
44048 -14362629 -15587586 -16675816 -17509909 -18072084 -18401432 -18591104 -18740474 -18818419 -18567478
44039 -18567478 -17591771 -15601972 -12644712 -9137577 -5662575 -2678410 -400443 1096857
44031 1096857 1769996 1659729 975735 9135 -1039262 -2057960 -2860149 -3158641 -2814247
44022 -2814247 -2071123 -1426010 -1187675 -1166954 -839281 155495 1658877 3118160 4036020
44013 4036020 4296452 4108387 3710261 3148518 2304161 1115016 -221664 -1297803 -1790645
44004 -1790645 -1680140 -1119241 -176735 1114730 2466704 3340397 3411743 2927768 2466812
43995 2466812 2413703 2753950 3239676 3568309 3465471 2793915 1607048 22589 -1853419
43986 -1853419 -3723618 -4958686 -4968192 -3747552 -1836747 269831 2399235 4335688 5529021
43977 5529021 5430184 3980740 1596256 -1196701 -3939260 -6222328 -7759871 -8480268 -8426443
43968 -8426443 -7648801 -6322367 -4813624 -3381434 -1872610 45751 2378262 4752074
43960 4752074 6838746 8541627 9736512 10144263 9615220 8320356 6519323 4358292
43952 4358292 2065630 100494 -1196050 -1985142 -2675131 -3330657 -3614598 -3306439 -2569474
43943 -2569474 -1626810 -483013 824540 1910910 2260533 1706675 505946 -992752 -2513048
43934 -2513048 -3692004 -4048751 -3300047 -1603638 639050 3129649 5677283 7927677
43926 7927677 9309861 9364617 8082032 5888917 3355919 910597 -1288440 -3304950
43918 -3304950 -5233867 -6981510 -8220325 -8594341 -8000273 -6711450 -5275343 -4246717
43910 -4246717 -3868856 -3916046 -3914954 -3621436 -3250692 -3169583 -3430774 -3730750 -3772089 -3490817
43900 -3490817 -2924466 -2065174 -941248 324210 1684295 3274139 5160391 7053427
43892 7053427 8483382 9277979 9671666 9857307 9578764 8315316 5840110 2513787 -954094
43883 -954094 -3968498 -6289410 -7909123 -8813795 -8978057 -8617403 -8303371 -8617734 -9607508
43874 -9607508 -10629607 -10741950 -9209167 -5749829 -605925 5432138 11209072 15692480
43866 15692480 18426746 19567096 19578197 18938619 17957615 16664078 14899248 12675162 10427320
43857 10427320 8769750 8009768 8025952 8536735 9209033 9451494 8431052 5623537 1366188
43848 1366188 -3246930 -7016254 -9203198 -9684059 -8825414 -7251958 -5563279 -4102745
43840 -4102745 -2896458 -1743946 -381653 1316514 3211986 5025438 6630201 8128437
43832 8128437 9569401 10724441 11296739 11277770 10911839 10331410 9435851 8205276 6984407
43823 6984407 6322907 6561745 7625315 9166290 10833798 12399054 13699203 14580563 14998094
43814 14998094 15141632 15300508 15507925 15431032 14741795 13502696 12011682 10334114 8237511
43805 8237511 5635648 2866276 384795 -1674521 -3471974 -5082746 -6322541 -6967002
43797 -6967002 -7031555 -6775902 -6452462 -6068022 -5409743 -4346438 -3111944 -2235476 -2150019
43788 -2150019 -2882880 -4123507 -5524535 -6891512 -8123915 -9047622 -9357715 -8777327 -7315884
43779 -7315884 -5351675 -3416514 -1922528 -1127944 -1249021 -2396702 -4355322 -6573328
43771 -6573328 -8482173 -9797991 -10527549 -10810493 -10796758 -10540125 -9927197 -8817133 -7319927
43762 -7319927 -5794146 -4445088 -3050469 -1259113 906966 3036105 4813793 6388703
43754 6388703 8237487 10748413 13883974 17081108 19456223 20288090 19469391 17521364
43746 17521364 15157816 12822348 10562130 8217549 5692401 3100386 690158 -1373904
43738 -1373904 -3128632 -4689721 -6084276 -7279968 -8298468 -9140409 -9604812 -9368391 -8359849
43729 -8359849 -6989303 -5913688 -5565831 -5902668 -6553784 -7211461 -7965921 -9305663 -11708303
43720 -11708303 -15132845 -18902616 -22111800 -24157707 -24939021 -24678312 -23654802 -22073059
43712 -22073059 -20081900 -17843443 -15537404 -13258297 -10923792 -8379036 -5685210 -3321386
43704 -3321386 -2060402 -2575280 -5041107 -8966318 -13357198 -17163082 -19739219 -20975603
43696 -20975603 -21015557 -19928192 -17742594 -14762696 -11670696 -9169453 -7515240 -6447564
43688 -6447564 -5534775 -4509414 -3335889 -2166644 -1320912 -1099986 -1365128 -1338262 -103567
43679 -103567 2543429 5846209 8756057 10743656 11909058 12515475 12663457 12372331 11737224
43670 11737224 10907358 9991173 9015180 7929864 6706644 5549050 4963548 5406757 6758255
43661 6758255 8259180 9085426 8938017 8039188 6702855 5096760 3389141 1886772 843417
43652 843417 158742 -601735 -1835488 -3599603 -5677322 -7811130 -9746596 -11140671 -11660748
43643 -11660748 -11232993 -10017405 -8074418 -5306594 -1957281 1002851 2340463 1493874
43635 1493874 -1089618 -4481699 -7876891 -10684669 -12431801 -12906841 -12323705 -11123500
43627 -11123500 -9601560 -7812141 -5766953 -3581994 -1436663 491163 2008758 2888935
43619 2888935 2934513 2118865 693576 -915637 -2447701 -4027499 -5885865 -7813944 -9077659
43610 -9077659 -9010284 -7588995 -5329122 -2764450 -209749 2114113 4053594 5691373
43602 5691373 7302353 8976454 10388623 11082876 10935011 10204983 9142238 7694026 5714992
43593 5714992 3393571 1281712 -192583 -1128005 -1913258 -2647289 -3007265 -2732139 -2021081
43584 -2021081 -1314729 -839075 -535668 -306976 -91670 242263 794807 1351919 1427156 735766
43574 735766 -477625 -1696461 -2627998 -3324167 -3889611 -4265350 -4367785 -4317306 -4369500 -4580200
43564 -4580200 -4628090 -4070573 -2774941 -1026947 778719 2445028 3940201 5207836 6146583
43555 6146583 6704907 6838889 6397679 5222579 3422118 1436778 -269899 -1586986 -2839693
43546 -2839693 -4562587 -7180188 -10787416 -15111981 -19615982 -23606564 -26333485 -27232584
43538 -27232584 -26318916 -24330740 -22286833 -20796908 -19832817 -19100583 -18438155 -17812214 -17139010
43529 -17139010 -16271715 -15084961 -13473315 -11358460 -8812267 -6106608 -3536347 -1246634
43521 -1246634 683186 2082343 2768222 2754811 2255746 1493089 602550 -319174 -1226401
43512 -1226401 -2180149 -3226712 -4173854 -4646652 -4488691 -4041804 -3926451 -4549949 -5837687
43503 -5837687 -7348695 -8572000 -9192560 -9230882 -8982060 -8763121 -8675598 -8615253 -8485798 -8337885
43493 -8337885 -8282906 -8339095 -8435116 -8557601 -8827912 -9395554 -10285506 -11381589 -12512193 -13466117
43483 -13466117 -13943628 -13664073 -12683779 -11576561 -11118592 -11661366 -12804928 -13703412 -13685106
43474 -13685106 -12633455 -10916470 -9055919 -7427875 -6179149 -5370203 -5143433 -5653242
43466 -5653242 -6778055 -7981677 -8575966 -8139414 -6661625 -4367705 -1532583 1556047
43458 1556047 4617411 7448378 9925604 11928089 13350312 14212486 14636598 14656491 14184501
43449 14184501 13277568 12323683 11794207 11838638 12249643 12778286 13300857 13651511 13468680
43440 13468680 12332128 10034656 6749181 3060144 -161544 -2125990 -2562667 -1796375
43432 -1796375 -354880 1418007 3332976 5140193 6570734 7557811 8212688 8531563 8280430
43423 8280430 7273012 5689697 4023136 2706788 1822058 1150276 487498 -94075 -314557
43414 -314557 -37393 486803 796282 627751 80003 -608407 -1303738 -1927489 -2285051 -2130697
43404 -2130697 -1464104 -699280 -478963 -1293698 -3214260 -5878244 -8668572 -10965462 -12379489
43395 -12379489 -12879620 -12734578 -12265487 -11562352 -10413535 -8573763 -6176203 -3871744 -2462424
43386 -2462424 -2300627 -3029322 -3929542 -4501010 -4688422 -4657460 -4559529 -4568026 -4914914 -5631513
43376 -5631513 -6291630 -6277247 -5428753 -4316036 -3764620 -4179311 -5365841 -6854476 -8243791
43367 -8243791 -9316909 -10028562 -10438740 -10591574 -10449632 -9976240 -9215191 -8206279 -6898938
43358 -6898938 -5293461 -3641509 -2354035 -1682198 -1577910 -1822875 -2112787 -2011456 -1094755
43349 -1094755 637773 2569159 3866099 4105263 3438800 2178540 349469 -2270594
43341 -2270594 -5703487 -9451468 -12717070 -14985063 -16337563 -17139082 -17496808 -17191566 -16136354
43332 -16136354 -14719196 -13599748 -13260611 -13786540 -14907372 -16132529 -16985224 -17293942 -17223805
43323 -17223805 -16935992 -16344780 -15376365 -14318565 -13582952 -13080135 -12136954 -10237164 -7715545
43314 -7715545 -5552170 -4536034 -4716873 -5540386 -6300303 -6469401 -5839542 -4556892 -3039894
43305 -3039894 -1754802 -962358 -623787 -535963 -547872 -622194 -697152 -585871 -115121 667468
43295 667468 1546762 2407098 3301692 4195954 4806202 4866010 4476618 3982217 3462682 2515319
43285 2515319 640161 -2225946 -5594686 -8727724 -10972817 -11945209 -11624313 -10376130
43277 -10376130 -8806921 -7483588 -6701962 -6404079 -6223323 -5673207 -4492537 -2940828 -1718570
43268 -1718570 -1502209 -2512078 -4480842 -6926487 -9402077 -11610650 -13460776 -15021227
43260 -15021227 -16294983 -17022209 -16854144 -15800803 -14389370 -13258714 -12649374 -12361216 -12072363
43251 -12072363 -11489072 -10243280 -7970120 -4684527 -948718 2517265 5343296 7519147
43243 7519147 9033176 9773405 9819697 9583815 9493299 9640063 9846525 9946116 9837201 9371825
43233 9371825 8443535 7209638 6014676 4995730 3911070 2480452 787291 -810866
43225 -810866 -2135952 -3409517 -4982004 -6909167 -8821790 -10174533 -10612030 -10129905 -8915539
43216 -8915539 -7063001 -4484952 -1117946 2812840 6734265 9899461 11688722 11951305
43208 11951305 11224091 10558107 10920027 12595143 15076005 17434384 18784357 18578165 16744515
43199 16744515 13667565 9958498 6171325 2731887 59605 -1441084 -1646069 -929390
43191 -929390 -5869 524707 562336 536327 1064190 2468468 4498771 6472386 7708898
43182 7708898 7934243 7442290 6969099 7283773 8650907 10579239 12151552 12640724 11827338
43173 11827338 9907973 7369687 4942011 3315968 2650752 2460455 2146150 1555295 925894
43164 925894 476561 280093 401296 838416 1324593 1479671 1271947 1153544 1649640 2949982
43154 2949982 4938456 7398281 10028519 12406318 14138223 15041094 15114319 14448001 13277359
43145 13277359 11996862 10904456 9962274 9003695 8159160 7824401 8108589 8536362 8510408
43136 8510408 7978665 7444428 7355081 7689012 8160059 8586870 8918634 9079893 9038629 8997600
43126 8997600 9299301 10076977 11125732 12148100 12976677 13503629 13586981 13191370 12491948
43117 12491948 11616420 10313481 8093826 4774080 777021 -3124129 -6241008 -8172230
43109 -8172230 -8836064 -8524406 -7863969 -7517198 -7810664 -8640436 -9688936 -10665258 -11364271
43100 -11364271 -11623433 -11354388 -10678796 -9994282 -9764057 -10089897 -10476069 -10119754 -8494017
43091 -8494017 -5628457 -1898242 2253597 6320744 9700252 11918625 12876670 12731128
43083 12731128 11607342 9639885 7267350 5183854 3814687 2964381 2136046 1129333
43075 1129333 189479 -397869 -726828 -1247069 -2341489 -3904534 -5335554 -6032593 -5938917
43066 -5938917 -5524980 -5203371 -4913822 -4393683 -3682431 -3115647 -2886910 -2891082 -3042800 -3507469
43056 -3507469 -4500664 -6021949 -7884466 -9843543 -11580204 -12731851 -13130053 -12927740 -12361437
43047 -12361437 -11505723 -10414131 -9338432 -8528953 -7876090 -7042449 -5963196 -4923680 -4082269
43038 -4082269 -3265626 -2468670 -2286286 -3439654 -5839834 -8368760 -9702548 -9295326 -7607915
43029 -7607915 -5575033 -3927962 -2863875 -2143594 -1430815 -598415 204032 718275 781009
43020 781009 364171 -550414 -2063319 -4234049 -6829831 -9267369 -10904618 -11415702 -10880580
43011 -10880580 -9606641 -7980239 -6416585 -5222474 -4414719 -3802686 -3333311 -3249895 -3844009
43002 -3844009 -5167204 -7038923 -9142452 -10960630 -11817639 -11301456 -9663816 -7618323
42994 -7618323 -5746537 -4253506 -3219632 -2778131 -2958672 -3618623 -4698216 -6361481 -8687743
42985 -8687743 -11335484 -13709554 -15416350 -16414588 -16819606 -16819359 -16817474 -17397128 -18908286 -21087249
42975 -21087249 -23174103 -24436751 -24624419 -24049585 -23336651 -22995627 -23010995 -22742422 -21367281
42966 -21367281 -18636435 -15261839 -12461793 -11009831 -10677649 -10566361 -9925607 -8668531
42958 -8668531 -7232706 -6098012 -5463493 -5266491 -5338211 -5420195 -5049776 -3610666 -718661
42949 -718661 3352015 7676098 11158804 13037250 13056186 11427813 8762828 5888903 3495849
42940 3495849 1881172 1053794 1000742 1749614 3225828 5169073 7176457 8763831 9477689
42931 9477689 9111087 7809814 5868982 3475306 774749 -1894325 -4078541 -5556590
42923 -5556590 -6418089 -6751630 -6472672 -5598519 -4543332 -3953795 -4256009 -5401111 -6962006
42914 -6962006 -8407825 -9389781 -9898263 -10153424 -10326436 -10420844 -10420768 -10420494 -10531792 -10754556 -11004369
42903 -11004369 -11174759 -11105568 -10591878 -9517154 -7927512 -5970184 -3908540 -2227304 -1460811
42894 -1460811 -1710319 -2506081 -3403839 -4603999 -6680820 -9731050 -13103334 -16029332 -18240522
42885 -18240522 -19843775 -20860393 -21123891 -20485946 -18886294 -16306904 -12945516 -9508823
42877 -9508823 -7126425 -6767913 -8680892 -12348435 -16870788 -21336681 -24992919 -27343802
42869 -27343802 -28249656 -27879580 -26471494 -24158064 -21092480 -17682837 -14533603 -12065646
42861 -12065646 -10228743 -8601076 -6709588 -4261481 -1206521 2302029 6007708 9626403
42853 9626403 12786347 14961597 15700289 15075808 13801286 12717856 12172568 11964420 11788370
42844 11788370 11554448 11302275 10972660 10293605 8818974 6176548 2500415 -1366612 -4328714
42835 -4328714 -5841847 -6212242 -6088778 -5802491 -5247491 -4214620 -2668272 -777488 1153861
42826 1153861 2780666 3842127 4220476 3855575 2662878 630812 -2001518 -4737491
42818 -4737491 -7038258 -8574213 -9339796 -9597398 -9692647 -9827311 -9924025 -9681864 -8785437
42809 -8785437 -7111622 -4778038 -2010662 1002814 4075260 6862567 8908097 9996196
42801 9996196 10414889 10705129 11113226 11388141 11128509 10212836 8865144 7431925 6153532
42792 6153532 5021557 3757055 2032544 -139815 -2256533 -3646302 -3957979 -3351574
42784 -3351574 -2352633 -1634704 -1827066 -3275632 -5839718 -8923644 -11741677 -13618054 -14198687
42775 -14198687 -13555070 -12108601 -10342393 -8503438 -6567645 -4455777 -2240454 -194246
42767 -194246 1268130 1717194 924185 -952658 -3420287 -5931106 -8110704 -9736648 -10594136
42758 -10594136 -10453214 -9225645 -7150354 -4821726 -2976032 -2118558 -2236906 -2846399 -3370006
42749 -3370006 -3564457 -3660970 -4134198 -5307030 -7096618 -9061975 -10671773 -11573904 -11699554
42740 -11699554 -11177267 -10142160 -8582877 -6365628 -3444711 -72629 3195683 5686043
42732 5686043 6801036 6177695 3873576 475034 -3128469 -6259203 -8779612 -10895122
42724 -10895122 -12705284 -14022556 -14553092 -14112591 -12669370 -10313127 -7249026 -3766247
42716 -3766247 -162579 3302754 6429229 9128969 11447309 13433759 14978124 15870266
42708 15870266 16058473 15756115 15228843 14553452 13683598 12723378 12028925 11983826 12677862
42699 12677862 13809913 14907084 15659605 16064768 16264197 16281545 15948577 15042613 13433801
42690 13433801 11158815 8510440 6097721 4652341 4585252 5688224 7292087 8695184
42682 8695184 9470754 9555886 9244908 9060148 9401989 10168592 10716679 10223984 8127479
42673 8127479 4366831 -560820 -5697374 -9926780 -12399002 -12799053 -11338861 -8639729
42665 -8639729 -5610671 -3172461 -1802024 -1276844 -959877 -377611 485553 1355468 1955439
42656 1955439 2110699 1731329 811644 -583282 -2356365 -4320431 -6057935 -6977695 -6699469
42647 -6699469 -5402220 -3681230 -2038986 -615830 570685 1313600 1329532 628921 -434400
42638 -434400 -1557680 -2803407 -4429785 -6536058 -9041461 -11932888 -15259775 -18774180
42630 -18774180 -21770903 -23504391 -23739666 -22756274 -20852804 -18045122 -14319393 -10032943
42622 -10032943 -5915432 -2668594 -589596 472211 861000 810647 350951 -499792 -1475528
42613 -1475528 -2056543 -1758594 -432619 1668574 4031068 6103539 7525738 8231195 8296087
42604 8296087 7699875 6372894 4537797 2828282 1867143 1746363 2048580 2350517 2579392
42595 2579392 2911649 3500310 4347941 5305500 6100283 6427155 6088314 5050981 3403396
42586 3403396 1331134 -882881 -2965254 -4831338 -6613354 -8473612 -10401408 -12156034
42578 -12156034 -13352450 -13692373 -13301404 -12851026 -13118871 -14245625 -15473505 -15723090 -14436487
42569 -14436487 -11903662 -8951720 -6426856 -4824048 -4180959 -4263637 -4895116 -6076675 -7771313
42560 -7771313 -9694247 -11442686 -12774520 -13659174 -14133959 -14242828 -14044164 -13516131 -12512218
42551 -12512218 -11017264 -9438575 -8401700 -8156740 -8348349 -8481272 -8492745 -8767656 -9702768
42542 -9702768 -11365062 -13478001 -15614838 -17468948 -19045006 -20525959 -21864651 -22630681
42534 -22630681 -22452467 -21548476 -20570854 -19861453 -19059265 -17557117 -15200284 -12394391 -9630727
42525 -9630727 -7072913 -4554251 -1792159 1404939 4942830 8328188 10858734 12101595
42517 12101595 12226261 11804512 11245413 10427451 8870227 6256036 2821962 -717071 -3662489
42508 -3662489 -5829729 -7585418 -9352776 -11058514 -12111160 -11973744 -10746428 -9137465
42500 -9137465 -7850544 -7045216 -6422530 -5755776 -5180792 -4908534 -4803954 -4468314 -3782947
42491 -3782947 -3227656 -3549881 -5143000 -7749256 -10642215 -13015114 -14320744 -14435283 -13553175
42482 -13553175 -11916978 -9738819 -7437252 -5745534 -5291422 -6047547 -7396519 -8772065
42474 -8772065 -10060795 -11373616 -12702430 -13947210 -15063107 -15967943 -16429694 -16247634 -15465515
42465 -15465515 -14223208 -12474314 -10076565 -7173953 -4313158 -2124484 -956868 -777947
42457 -777947 -1285629 -2125330 -3146353 -4471058 -6206289 -8101913 -9634110 -10416883 -10366330
42448 -10366330 -9477255 -7726127 -5367224 -3117030 -1728926 -1326934 -1304037 -949780 -142628
42439 -142628 553772 377449 -1071568 -3629430 -6767379 -9940870 -12822020 -15319455 -17449298
42430 -17449298 -19178961 -20366853 -20862906 -20676460 -20005843 -19069151 -17933544 -16531797 -14795199
42421 -14795199 -12739015 -10495787 -8333086 -6557779 -5293921 -4405781 -3743833 -3399165
42413 -3399165 -3577049 -4293587 -5404110 -6900656 -8905855 -11283703 -13511078 -15132109
42405 -15132109 -16190260 -17009643 -17651455 -17809625 -17206076 -15859077 -13915661 -11422299 -8409708
42396 -8409708 -5127344 -2044336 438081 2265752 3723566 5141392 6567973 7704603
42388 7704603 8183564 7975421 7559501 7640790 8578677 10024721 11167100 11391577 10690442
42379 10690442 9453273 8045678 6749823 5959856 6088293 7173308 8792335 10509661
42371 10509661 12280079 14286446 16486645 18440595 19500534 19102362 17057623 13789723
42363 13789723 10236003 7315172 5443049 4607101 4758095 5868996 7607949 9228911
42355 9228911 9988474 9656512 8587934 7363907 6384755 5700359 5117871 4441059 3599472
42346 3599472 2554852 1180619 -629438 -2721011 -4661711 -6030023 -6683226 -6724164 -6283867
42337 -6283867 -5414320 -4175837 -2739222 -1303051 138340 1875069 4170052 6794556
42329 6794556 8994155 10060391 9909700 9019649 7901146 6821303 5978530 5622015 5801724
42320 5801724 6145299 6104445 5426384 4265403 2855895 1250350 -530892 -2211436 -3312930
42311 -3312930 -3557952 -3124071 -2417692 -1672386 -893762 -138956 375039 524199 463762 429054
42301 429054 494622 704444 1298326 2499861 4030988 5076664 4898551 3452901 1403405
42292 1403405 -366319 -1270388 -1286391 -893535 -706691 -1044968 -1792408 -2611716 -3207791
42283 -3207791 -3427949 -3296411 -3065536 -3159403 -3959177 -5605590 -7944798 -10561717 -12895953
42274 -12895953 -14506942 -15319324 -15525218 -15207963 -14182311 -12269806 -9612046 -6621301
42266 -6621301 -3718794 -1210115 693180 1890448 2440848 2533392 2393666 2160277 1706322
42257 1706322 557636 -1815858 -5468849 -9810408 -14044936 -17669366 -20458449 -22189238
42249 -22189238 -22683197 -22102799 -20966321 -19798777 -18877728 -18293187 -18055565 -18076562 -18202172
42240 -18202172 -18390358 -18796628 -19583336 -20624022 -21400759 -21205949 -19542777 -16475897 -12651676
42231 -12651676 -8937017 -5988927 -4097871 -3283330 -3403664 -4224217 -5521614 -7132719
42223 -7132719 -8810659 -10059295 -10266974 -9103586 -6792740 -4030741 -1673861 -378912
42215 -378912 -316748 -1139124 -2308392 -3539686 -4934890 -6734110 -8990754 -11412464 -13402375
42206 -13402375 -14339178 -14045058 -13033373 -12126461 -11729974 -11559245 -11080024 -10042960 -8518083
42197 -8518083 -6620668 -4431124 -2129256 3704 1790449 3287063 4652163 5903167
42189 5903167 6828713 7160174 6828096 5999443 4831819 3288902 1332617 -749816 -2402330
42180 -2402330 -3245174 -3362976 -3158890 -3092089 -3555735 -4714491 -6264875 -7559167 -8245233
42171 -8245233 -8716004 -9684814 -11337660 -13131982 -14444188 -15169164 -15568555 -15715726 -15299346
42162 -15299346 -13978901 -11852535 -9558018 -7904725 -7335558 -7676233 -8371990 -8925261 -9104215
42153 -9104215 -8880411 -8377101 -7887460 -7713453 -7814869 -7708220 -6896873 -5431317 -3954374
42144 -3954374 -3170316 -3323583 -4181754 -5405253 -6836435 -8448122 -10089804 -11350363 -11744149
42135 -11744149 -11134717 -10017932 -9284601 -9543310 -10633351 -11877737 -12817459 -13565776 -14385614
42126 -14385614 -15099101 -15136124 -14144775 -12360347 -10317615 -8336712 -6358518 -4165893 -1670608
42117 -1670608 942130 3258328 4863377 5604596 5633568 5204821 4510008 3701228 2915527
42108 2915527 2172361 1353703 410551 -485158 -1135246 -1634838 -2368236 -3654576 -5431495
42099 -5431495 -7247453 -8513797 -8843670 -8268381 -7131118 -5737674 -4176970 -2521677
42091 -2521677 -1047963 -81337 307154 283466 -12050 -514193 -1051982 -1368372 -1416490 -1491411
42081 -1491411 -1980642 -3053225 -4575662 -6178590 -7406070 -8015475 -8214566 -8420472 -8694778
42072 -8694778 -8630786 -7960016 -7054864 -6535510 -6444870 -6108892 -4885434 -2857992 -699720
42063 -699720 989456 2075208 2739907 3184585 3576486 4157073 5168325 6555711 7840077
42054 7840077 8456062 8265608 7676021 7261794 7359671 8003626 9066591 10353725 11645623
42045 11645623 12751865 13498938 13666087 13059854 11723722 9977515 8189931 6620265
42037 6620265 5518111 5159382 5591876 6462896 7280569 7745086 7646749 6607661 4291361
42028 4291361 918305 -2696496 -5722839 -7781393 -8871865 -9189422 -9184774 -9505279 -10508871
42019 -10508871 -11843074 -12707514 -12560921 -11507118 -10102981 -8957816 -8420905 -8377098 -8273733
42010 -8273733 -7547890 -6167073 -4673624 -3637249 -3175632 -3088835 -3303635 -3966529 -5121670
42001 -5121670 -6516618 -7829621 -8972135 -10061089 -11175602 -12267002 -13262705 -14107992
41993 -14107992 -14677212 -14748979 -14107510 -12602818 -10141503 -6804113 -3066229 260300 2520955
41984 2520955 3669960 4148909 4370256 4444504 4366968 4263410 4336257 4629149 4923030 4891821
41974 4891821 4416112 3799685 3620280 4272809 5698392 7638574 10023632 12871122 15826370
41965 15826370 18093125 18948614 18173122 15941260 12584858 8652027 4923519 1982653
41957 1982653 -234924 -2245047 -4381413 -6513146 -8279764 -9310625 -9229310 -7809148
41949 -7809148 -5314847 -2476342 81663 2273173 4283833 6046014 7239100 7770226
41941 7770226 7991925 8340497 8899444 9432404 9762561 9974269 10218576 10421462 10280057
41932 10280057 9540769 8202694 6429009 4376993 2241348 396978 -727049 -1032022
41924 -1032022 -903903 -861540 -1088909 -1390391 -1528497 -1452333 -1194275 -709264 58245 984601
41914 984601 1758203 2139413 2243734 2516870 3338482 4590299 5626970 5709684 4505661
41905 4505661 2259065 -380356 -2665626 -4067234 -4482024 -4154154 -3332963 -2061996 -377519
41896 -377519 1408583 2836102 3690916 4050568 3873295 2754965 270616 -3504716 -7888162
41887 -7888162 -11892365 -14584188 -15398519 -14444852 -12555989 -10803598 -9767664 -9224841 -8506066
41878 -8506066 -7117437 -5103637 -2972151 -1296367 -293040 249454 586292 614830 -6002
41869 -6002 -1338458 -2938155 -4225991 -4974116 -5333545 -5485322 -5406441 -4957481 -4081009 -2871341
41859 -2871341 -1491270 -54946 1394574 2790614 3972440 4779270 5202886 5358340 5281123
41850 5281123 4824438 3771695 1979948 -561102 -3647449 -6780682 -9340132 -10986823
41842 -10986823 -11837529 -12176541 -12142069 -11826526 -11500336 -11436570 -11520426 -11287146 -10420052 -9028801
41832 -9028801 -7368535 -5484415 -3286231 -851534 1531575 3621951 5429959 7157726
41824 7157726 8964578 10745473 12098876 12586804 12135693 11184894 10359647 9937003 9602739
41815 9602739 8702243 6749444 3812496 549021 -2109591 -3453818 -3404483 -2571423 -1858951
41806 -1858951 -1833630 -2344330 -2745434 -2493752 -1498461 36794 1889404 3821435 5505438
41797 5505438 6702615 7474783 8006754 8233266 7867036 6829305 5434234 4074348 2918934
41788 2918934 1995140 1328653 846673 346154 -220873 -558188 -342207 351513 1152788
41779 1152788 1893202 2813818 4296036 6537464 9443797 12642495 15607815 17977560
41771 17977560 19818999 21486368 23232221 25082257 27009673 28958595 30638640 31552666
41763 31552666 31391417 30272462 28501869 26278664 23768102 21273310 19086163 17222548
41755 17222548 15494307 13806674 12212831 10719756 9273698 7997963 7253356 7321301
41747 7321301 8092050 9145638 10084228 10720855 11005058 10871162 10195897 8908393 7168715
41738 7168715 5424170 4190468 3691082 3716978 3849395 3747496 3177249 1905075 -189337
41729 -189337 -2797521 -5106976 -6228694 -5811191 -4289199 -2562280 -1385379 -941847 -901862
41720 -901862 -878228 -826129 -976440 -1422660 -1906065 -2060911 -1752818 -1076978 -134589 1021282
41710 1021282 2260301 3369166 4193463 4676156 4783594 4556034 4232830 4135057 4362434
41701 4362434 4760905 5217312 5749127 6192065 6078868 5125843 3733598 2716086 2518414
41692 2518414 2885388 3278498 3407576 3335775 3282894 3421252 3713061 3836809 3362461 2102292
41682 2102292 280751 -1638088 -3228648 -4240360 -4609340 -4429814 -3883243 -3153584 -2382409
41673 -2382409 -1603415 -625527 925892 3257637 6069411 8680536 10501185 11303282 11148279
41664 11148279 10314226 9302208 8615787 8378484 8341006 8363086 8659968 9399666 10278716
41655 10278716 10792001 10851666 10879291 11282399 12051656 12921974 13765803 14732522 16055771
41646 16055771 17755786 19501538 20790982 21326126 21196207 20672909 19920437 18993992 18017676
41637 18017676 17182642 16569014 16107740 15737436 15469984 15240730 14781683 13742528 11967438
41628 11967438 9657831 7249387 5079791 3156855 1288546 -581029 -2266772 -3553261
41620 -3553261 -4311291 -4339104 -3362622 -1465658 625727 2038951 2575512 2797144 3253055
41611 3253055 3851338 4059482 3480818 2099385 185847 -1788859 -3226563 -3627062 -2829809
41602 -2829809 -1017995 1468462 4287777 7154712 9837795 12076521 13501591 13775964
41594 13775964 12917876 11384630 9701862 8057202 6365605 4657973 3222475 2336395
41586 2336395 1981681 1860157 1596714 913993 -249941 -1671750 -2917877 -3591485 -3571952
41577 -3571952 -3052834 -2389670 -1911114 -1805135 -2104983 -2751463 -3654309 -4659065 -5453924
41568 -5453924 -5614833 -4896362 -3521328 -2070132 -974698 -161188 730766 1869013 3149287
41559 3149287 4542205 6205387 8078988 9598483 10102351 9457897 8043778 6201480
41551 6201480 4062534 1962847 600143 440814 1116288 1688334 1484012 516328 -789987
41542 -789987 -2005496 -2847509 -3248625 -3462543 -3969611 -5079309 -6567410 -7714316 -7722879
41533 -7722879 -6219107 -3529505 -527832 1899865 3354155 3951960 3976508 3639487 3146330
41524 3146330 2750181 2581298 2516525 2351135 2057369 1788002 1700440 1897287 2470490 3420488
41514 3420488 4505822 5317430 5578099 5315668 4748007 4111985 3612122 3353147 3202105
41505 3202105 2854010 2221028 1705285 1889311 2918094 4315888 5437645 5963879 5921978
41496 5921978 5430643 4615398 3701334 2989588 2694869 2891262 3614845 4902054 6678724
41487 6678724 8692005 10614855 12181659 13194270 13476781 12952360 11821055 10616314
41479 10616314 9977920 10246964 11197431 12144990 12355635 11433755 9453203 6848822 4189193
41470 4189193 1916560 183642 -1057407 -1794180 -1862569 -1175575 32678 1273085 2057352
41461 2057352 2059182 1211646 -148570 -1349790 -1909269 -2054895 -2522515 -3783787 -5671082
41452 -5671082 -7782345 -9923421 -11942964 -13409232 -13838043 -13226262 -12091438 -10930390
41444 -10930390 -9800443 -8458497 -6765889 -4920029 -3394097 -2653989 -2805365 -3472802
41436 -3472802 -4100740 -4397123 -4456368 -4537847 -4868566 -5614538 -6827492 -8328091 -9754378
41427 -9754378 -10814533 -11469210 -11890268 -12326861 -12957740 -13688202 -14057749 -13530706 -11985426
41418 -11985426 -9818506 -7515227 -5248417 -2952801 -601385 1748119 4046298 6200660
41410 6200660 7997218 9247428 9990163 10416433 10630593 10609460 10321792 9691804 8478960
41401 8478960 6460721 3851929 1376229 -227189 -709261 -286312 715342 2015181
41393 2015181 3276155 4107434 4286590 3896858 3163719 2194583 944680 -582830 -2196575
41384 -2196575 -3643873 -4859376 -6006793 -7218124 -8322703 -8904086 -8645125 -7607861
41376 -7607861 -6224047 -5082831 -4666390 -5089821 -5970246 -6633982 -6597168 -5859174 -4684698
41367 -4684698 -3181687 -1242510 1103447 3444074 5191189 5985337 5862499 5104819 4012868
41358 4012868 2799650 1637277 769634 524886 1123604 2450779 4101233 5691677 7052852
41349 7052852 8108324 8762222 9082961 9476692 10409895 11915833 13556087 14921357 15993091
41340 15993091 16923650 17642474 17865484 17426779 16439921 15129099 13586826 11685995 9191017
41331 9191017 6041277 2621229 -342065 -2319797 -3409383 -4081570 -4509379 -4329337 -3150522
41322 -3150522 -1183246 739310 1725510 1397239 32888 -1725780 -3326950 -4571898
41314 -4571898 -5514146 -6205800 -6663748 -7054877 -7689064 -8658217 -9572798 -9853810 -9328842
41305 -9328842 -8458701 -7978919 -8397409 -9802923 -11985890 -14638564 -17497424 -20372803 -23038089
41296 -23038089 -25108635 -26153171 -26023329 -25005037 -23511248 -21635732 -19154685 -16023805
41288 -16023805 -12741040 -10075624 -8465037 -7771945 -7565810 -7437849 -7001830 -5873580 -3992928
41279 -3992928 -1984406 -905345 -1392499 -3065014 -4852859 -5876316 -5963477 -5476573 -4914050
41270 -4914050 -4739250 -5326518 -6766173 -8676617 -10372009 -11335808 -11532106 -11277673 -10926407
41261 -10926407 -10745995 -10978899 -11799680 -13105816 -14420790 -15108130 -14718265 -13166969 -10695626
41252 -10695626 -7756550 -4861585 -2342948 -160045 1972808 4154773 6017749 6976706
41244 6976706 6782124 5766994 4544914 3541091 2821576 2216447 1435088 103272 -2079187
41235 -2079187 -5056298 -8344916 -11362649 -13827257 -15780210 -17279133 -18197270 -18319741
41227 -18319741 -17492524 -15634966 -12771307 -9210459 -5647915 -2931338 -1636225 -1826042
41219 -1826042 -3124658 -4940899 -6692478 -7954956 -8456229 -7969590 -6369361 -3926143
41211 -3926143 -1416245 346115 1163887 1499669 1860134 2376388 3076520 4239821 6102736
41202 6102736 8267233 9752635 9793059 8463359 6470392 4497282 2856234 1612788
41194 1612788 800542 460295 575704 1034592 1629065 2084611 2136397 1631059 588815
41185 588815 -813985 -2343498 -3862379 -5442952 -7293036 -9476111 -11654622 -13140439
41177 -13140439 -13262683 -11752632 -8858697 -5190539 -1484025 1593000 3603663 4454690
41169 4454690 4354300 3590803 2307508 491690 -1821425 -4362355 -6671313 -8346147
41161 -8346147 -9272625 -9642388 -9757545 -9790773 -9676741 -9187426 -8130119 -6555870 -4823760
41152 -4823760 -3388164 -2417908 -1659084 -806361 5357 286031 -147143 -822337 -1172886
41143 -1172886 -1326730 -2027379 -3747916 -6159357 -8551859 -10483276 -11817356 -12396413 -12066258
41134 -12066258 -11011829 -9760967 -8742227 -7997769 -7405549 -7017512 -7019766 -7405865 -7831770
41125 -7831770 -7872851 -7437168 -6908036 -6839480 -7499187 -8740102 -10260519 -11781684 -12868996
41116 -12868996 -12842105 -11259024 -8545435 -5861923 -4204045 -3788426 -4359718 -5759755 -7892660
41107 -7892660 -10313045 -12254570 -13147761 -12916337 -11783418 -10077048 -8312400 -7155034
41099 -7155034 -7017401 -7764771 -8986218 -10466049 -12213119 -14124441 -15881478 -17191178
41091 -17191178 -17885119 -17698798 -16193781 -13126615 -8853627 -4251610 -261194 2483161
41083 2483161 3784883 3904214 3434195 2949508 2669166 2475684 2197811 1771008 1212411
41074 1212411 650063 368004 583839 1101677 1390136 1136306 580775 199495 218807 572480
41064 572480 1129448 1715222 2034414 1878074 1415436 1047182 945229 942701 892596 890427
41054 890427 1073634 1470804 2236146 3826481 6631204 10383201 14086137 16608898 17388853
41045 17388853 16677651 15232482 13751205 12495309 11385465 10390557 9695786 9434567 9387155
41036 9387155 9116231 8411089 7507315 6864242 6791674 7267865 8009317 8691675 9206378 9782218
41026 9782218 10815028 12511964 14727596 17221040 20060590 23653095 28280089 33661703
41018 33661703 39113593 44158687 48877914 53632222 58601341 63721889 68934878 74239055
41010 74239055 79463249 84145263 87703239 89689477 89988378 88988370 87520396 86276962
41002 86276962 85084545 82923630 78863411 72895247 65777549 58322533 51109345 44705551
40994 44705551 39692151 36281315 34090603 32426577 30727311 28743725 26483031 24090021
40986 24090021 21704291 19369801 17130982 15190345 13818278 13057798 12657911 12386149
40978 12386149 12294392 12561530 13142953 13697808 13851256 13445878 12535856 11219100 9559227
40969 9559227 7719021 6138963 5430587 5913406 7225424 8495850 8963614 8427437 7201215
40960 7201215 5830408 4854762 4563769 4742750 4739700 4012672 2683678 1473979 1050212
40951 1050212 1438800 2042130 2190537 1727268 1102800 840996 859573 409400 -1177453
40942 -1177453 -3690784 -6103339 -7457204 -7646579 -7358924 -7351542 -7793772 -8191787 -7865763
40933 -7865763 -6555030 -4670073 -3001787 -2148545 -2139463 -2510715 -2682687 -2286755 -1220202
40924 -1220202 503015 2847999 5651362 8482794 10768225 12148954 12706881 12843113
40916 12843113 13022699 13628502 14844994 16492509 18079234 19259623 20273392 21784111
40908 21784111 24283842 27807639 32186530 37289456 42912330 48716564 54541211 60644409
40900 60644409 67396061 74825159 82724868 91127258 100317131 110277460 120404542 129943529
40892 129943529 138488283 145835753 151521225 154813049 155193355 152687769 147775589 141201127
40884 141201127 133870185 126642379 120022460 114094598 108766855 103926335 99325747 94567206
40876 94567206 89394741 83882453 78181805 72234483 65948771 59526064 53317353 47407307
40868 47407307 41671829 36292628 31881486 28939942 27448605 27131470 27801884 29149868
40860 29149868 30461566 31043788 30930121 30755100 30809158 30568186 29390248 27430415 25543542
40851 25543542 24345266 23644235 22847977 21715950 20561133 19781978 19361490 18918976 18220131
40842 18220131 17511629 17251274 17542033 17950835 17904529 17145471 15737661 13755961 11140236
40833 11140236 7866205 4157972 487067 -2622806 -4833760 -6135118 -6771522 -6957066
40825 -6957066 -6613112 -5438892 -3308021 -574813 2105379 4320320 6230369 8284148
40817 8284148 10614298 12809891 14322064 14981155 15004888 14590795 13704655 12303137 10598568
40808 10598568 9011404 7945739 7624412 7949263 8399156 8267736 7288807 6007314 5289431
40799 5289431 5404591 5763061 5606334 4749364 3520917 2185264 708349 -921068 -2390242
40790 -2390242 -3205190 -3028632 -1798587 351306 3092854 5844376 7964648 9225925
40782 9225925 10060128 11140861 12629931 13915411 14149684 12974044 10690560 7896264
40774 7896264 5129354 2785057 1110464 174952 -37476 555551 2104073 4519425 7297669
40765 7297669 9788252 11650204 13010163 14220485 15517302 16859171 17997492 18671362
40757 18671362 18749358 18206100 17052984 15426651 13728812 12464576 11803270 11424383 10952827
40748 10952827 10444326 10243607 10420432 10584405 10292348 9434963 8154663 6595859 4904687
40739 4904687 3350709 2241250 1704353 1668222 2076744 3063697 4886747 7671248 11146940
40730 11146940 14599078 17169869 18341136 18184789 17189367 15928000 14877037 14327368
40722 14327368 14236031 14203711 13834993 13223654 12957593 13520489 14717772 15764605 15939951
40713 15939951 15148435 13895422 12752803 11807632 10579509 8493105 5478180 2119231
40705 2119231 -783897 -2788864 -3976260 -4647464 -4946555 -4768663 -3969607 -2635113 -1165207
40696 -1165207 -93427 239979 -71882 -520940 -444997 635082 2780453 5598412 8404579
40687 8404579 10502082 11453332 11226753 10148472 8677906 7153393 5715749 4466819
40679 4466819 3645805 3556992 4293964 5593931 7006091 8167320 8899840 9148021 8953958
40670 8953958 8485876 7960892 7473237 6955488 6356972 5812733 5582857 5850963 6616364
40661 6616364 7737042 9006497 10193842 11072874 11465162 11322218 10878606 10759037 11749996
40652 11749996 14182696 17454387 20331123 21897940 22209980 21980816 21746291 21444779 20684480
40643 20684480 19155933 16741376 13483592 9689604 6019102 3264845 1934930 2039361
40635 2039361 3216349 4941949 6611865 7606075 7501541 6315586 4498153 2621325
40627 2621325 1052929 -91448 -759247 -834425 -245387 848697 2053999 2959761 3375123
40618 3375123 3387695 3224671 3044966 2830086 2463649 1906084 1249081 583811 -106490 -838908
40608 -838908 -1461575 -1713418 -1472766 -863324 -108200 616667 1173191 1473586 1637519 2070164
40598 2070164 3248646 5400107 8385289 11793398 15064789 17627410 19113541 19516520
40590 19516520 19096353 18140997 16852241 15386488 13885704 12476873 11313662 10554957
40582 10554957 10166391 9782862 8957200 7608473 6124728 5009490 4536418 4710114 5321166
40573 5321166 5943132 6111443 5747867 5343707 5537408 6511915 7897220 9179741 10040569
40564 10040569 10345429 10050266 9241112 8171992 7167306 6504599 6383581 6884707 7854416
40555 7854416 8887404 9577900 9887753 10228350 11041719 12199975 12888732 12278760 10405471
40546 10405471 8270830 6951918 6668491 6831439 6898254 6941842 7351121 8219517 9216477
40537 9216477 9955184 10273790 10136296 9438016 8057030 6075872 3841323 1744034 -39866
40528 -39866 -1569203 -2958937 -4262083 -5506719 -6714829 -7792228 -8457865 -8395097 -7507353
40519 -7507353 -6008607 -4281080 -2654871 -1254590 21878 1360395 2813962 4247042
40511 4247042 5527255 6707264 7935327 9228267 10409570 11207651 11309565 10412872 8450052
40502 8450052 5796632 3071865 649522 -1508363 -3497578 -5165400 -6310258 -7015740
40494 -7015740 -7530145 -7839920 -7592462 -6520746 -4807824 -2939871 -1281402 114068 1333352
40485 1333352 2388938 3243044 3984081 4858475 6067893 7597376 9336847 11342807 13846941
40476 13846941 16967816 20543262 24354227 28443183 33096847 38552773 44846611 51952973
40468 51952973 59959292 69037146 79283876 90620439 102799943 115466375 128182204
40461 128182204 140355238 151083038 159098281 163031028 161962691 155934607 146018705 133843073
40453 133843073 120882107 108026466 95698223 84239599 74060979 65415449 58189457
40446 58189457 52047922 46755665 42294583 38743182 36162334 34549859 33735295 33283453
40438 33283453 32660124 31619755 30383665 29351821 28661255 28079225 27279192 26122009 24666417
40429 24666417 23009209 21189526 19220487 17155473 15123083 13328873 11996411 11215639
40421 11215639 10798523 10346908 9569664 8568728 7777622 7599120 8114561 9125946 10420904
40412 10420904 11959068 13794964 15811346 17558122 18465875 18299217 17317148 15876887
40404 15876887 13986102 11455415 8432968 5473075 2980501 872524 -1021938 -2479449
40396 -2479449 -3082323 -2755918 -1818815 -595777 714504 1858097 2608507 3131196 3951616
40387 3951616 5378555 7146352 8754434 9969624 10865924 11590853 12308489 13217050 14357352
40378 14357352 15437953 16058072 16132147 15983522 16021488 16388969 16848422 16892067 16042788 14250205
40368 14250205 12046395 10205816 9182885 8879409 8907973 9012324 9261111 9891570 10921509
40359 10921509 11864621 11930684 10657011 8332835 5704831 3298828 1134428 -966656
40351 -966656 -3009042 -4827112 -6308799 -7490145 -8458431 -9219705 -9648876 -9558119 -8846812
40342 -8846812 -7599895 -6030237 -4346582 -2694476 -1163840 222056 1511310 2782541
40334 2782541 4145116 5788163 7860690 10134940 11893462 12416633 11667538 10393221
40326 10393221 9556486 9785530 11279078 13896117 17154387 20345206 22920225 24809183
40318 24809183 26344015 27988292 30175451 33159955 36763541 40353689 43355538 45855694
40310 45855694 48548688 52044839 56371623 61210809 66477067 72532195 79893098 88863490
40302 88863490 99470463 111661814 125451415 140795652 157284934 173929993 189225768
40295 189225768 201433330 208933227 210596099 206138454 196315658 182777929 167587041
40288 167587041 152584510 138876914 126688233 115680899 105512185 96148836 87701939
40281 87701939 80086870 72977807 66094396 59438815 53234088 47711643 42984025 39024155
40273 39024155 35676918 32735606 30121147 28019309 26768555 26542416 27151144 28190533
40265 28190533 29350104 30490964 31430465 31809576 31321209 30036434 28379692 26782416
40257 26782416 25458558 24462335 23726967 22950773 21667454 19675745 17360181 15421098
40249 15421098 14313208 14071126 14567726 15640350 16900106 17709572 17610584 16732808 15647677
40240 15647677 14852111 14466042 14323281 14172854 13793208 13073821 12070313 10929866 9743162
40231 9743162 8536007 7419171 6640821 6401200 6654185 7179457 7852430 8765151 10041536
40222 10041536 11590039 13117209 14378195 15319647 15917623 15954059 15100957 13272150 10801455
40213 10801455 8199251 5784529 3618998 1712881 119517 -1200074 -2425456 -3623632
40205 -3623632 -4492102 -4522367 -3491120 -1721428 192456 1851613 3173359 4126315 4539578
40196 4539578 4295171 3645328 3186111 3442957 4517517 6167309 8158212 10438446 12973704
40187 12973704 15528117 17698940 19156804 19826263 19886168 19668651 19521823 19640211 19957804
40178 19957804 20250476 20379809 20384852 20300062 19977204 19224026 18145293 17272916 17296783 18611140
40168 18611140 21000484 23651025 25532137 25999746 25205601 23919395 22896630 22412068
40160 22412068 22355444 22606579 23170736 24009097 24928919 25733740 26411346 27078010 27735857
40151 27735857 28165029 28142082 27786131 27606149 28077681 29130722 30129424 30410689 29792833
40142 29792833 28533548 26933061 25156061 23403807 22023848 21297946 21192794 21433751
40134 21433751 21792620 22211728 22688019 23191497 23753349 24505375 25499791 26538704 27320329
40125 27320329 27747188 27937476 27908784 27479757 26683244 26149854 26799650 29103419 32808332
40116 32808332 37371352 42393795 47549855 52429009 56799899 60955866 65519721 70899347
40108 70899347 77166282 84519112 93647238 105470297 120529232 138602253 158765655
40101 158765655 179778338 200553507 220385248 238675389 254376443 265780093 271024589
40094 271024589 269001112 259993778 245642876 228283660 210055293 192296111 175517842
40087 175517842 159769168 144956936 130965973 117748119 105453815 94437921 85072691
40080 85072691 77551380 71813451 67523637 64091613 60844783 57295367 53245588 48690419
40072 48690419 43781064 38930540 34767704 31786771 30018779 29068784 28398936 27548547
40064 27548547 26245067 24483671 22482605 20462874 18503505 16683355 15264933 14547624
40056 14547624 14500679 14653883 14421170 13525056 12139188 10696895 9572302 8871650 8449020
40047 8449020 8062176 7498610 6656879 5684177 5058802 5331758 6612208 8371660 9871769
40038 9871769 10718790 10913415 10537931 9695076 8771278 8468565 9342826 11307992 13649820
40029 13649820 15534036 16571789 17034273 17563528 18581445 19911952 20999206 21489047
40021 21489047 21559653 21750080 22596472 24390801 27035642 29953292 32245787 33194616 32751078
40012 32751078 31547372 30390433 29689823 29312957 28954145 28609154 28617541 29193766 30003182
40003 30003182 30357623 29877823 28891502 28156754 28260403 29276837 30862868 32565140 34084682
39994 34084682 35366545 36491925 37487822 38239479 38551038 38229835 37132928 35262901 32916761
39985 32916761 30689059 29190471 28655352 28769250 28864116 28336875 27006565 25186114 23446210
39976 23446210 22265508 21818378 22003903 22630494 23584847 24837099 26268512 27520221 28104267
39967 28104267 27715029 26383452 24316425 21714377 18840586 16139787 14083637 12884215
39959 12884215 12468510 12704681 13503080 14679688 15861892 16602962 16566213 15666999 14185929
39950 14185929 12742745 11989909 12225384 13298990 14802774 16215356 16960577 16632009 15291370
39941 15291370 13402496 11385795 9342862 7228141 5097447 3109903 1449940 308092
39933 308092 -265629 -585769 -1182548 -2267138 -3535330 -4670184 -5813886 -7264101 -8844567
39924 -8844567 -9901394 -9921282 -8938265 -7368862 -5686717 -4254914 -3210785 -2383927 -1415323
39915 -1415323 9320 2075600 4841004 8093189 11267680 13799749 15649529 17300471
39907 17300471 19177795 21230945 23115029 24546125 25356620 25416182 24729605 23560214 22305665
39898 22305665 21264349 20587524 20370808 20650410 21319511 22157272 22963829 23604204 23910570
39889 23910570 23635458 22619830 21044106 19414772 18150580 17162540 15989403 14420522
39881 14420522 12832845 11787280 11455450 11651363 12271947 13351479 14672343 15682695
39873 15682695 15975997 15646780 15041239 14368887 13727615 13302891 13272861 13578059 13983240
39864 13983240 14336308 14624521 14839302 14957649 15025189 15080709 14981639 14450898 13357545 11897018
39854 11897018 10502889 9644756 9658319 10615776 12286738 14264227 16168442 17772522 19048597
39845 19048597 20178715 21424753 22813778 23930733 24139753 23073732 20901352 18177852
39837 18177852 15528600 13416198 12013264 11184635 10645104 10217097 9965572 10111588 10826987
39828 10826987 12033374 13308440 14045851 13866758 12939183 11857746 11234337 11450731 12660402
39819 12660402 14739367 17155169 19125988 20136860 20270489 19955412 19505287 19025116 18607188
39810 18607188 18324553 17995627 17201190 15706595 13793290 12057837 10910643 10338371 10114379
39801 10114379 10140869 10547857 11473855 12759621 13888793 14314242 13902578 13025073 12167723
39792 12167723 11493283 10832931 10027148 9140257 8354777 7814956 7638118 7940742 8717864
39783 8717864 9761384 10837761 11930213 13173620 14538098 15717018 16396385 16523292
39775 16523292 16202548 15416392 14031707 12136769 10250149 9064211 8949959 9729783 10916309
39766 10916309 12136200 13339115 14671131 16196251 17708857 18765072 18932701 18123228
39758 18123228 16735133 15404473 14524352 13998844 13479333 12772197 11930103 11003319 9887833
39749 9887833 8517176 7099899 6003759 5376498 4981768 4477902 3806711 3222466 2954084
39740 2954084 2954167 3040753 3183331 3498228 3970349 4345635 4397372 4221594 4180491 4594707 5537860
39729 5537860 6842403 8202635 9331736 10133689 10685879 10961708 10669278 9570658 7948269
39720 7948269 6503882 5646700 4986360 3657249 1134738 -2252564 -5472107 -7378839
39712 -7378839 -7342071 -5543175 -2754914 195230 2793071 4813535 6167242 6889246 7153803
39703 7153803 7131060 6836440 6214052 5362299 4614793 4392993 4955366 6168013 7444803
39694 7444803 8027958 7502181 6080384 4371179 2918249 1977378 1584131 1666908 2106080
39685 2106080 2759868 3388267 3533931 2696003 859468 -1247766 -2721092 -3339684 -3633362
39676 -3633362 -4045969 -4300703 -3769918 -2303735 -487214 852788 1250747 818682 96989
39667 96989 -283454 14213 841870 1772125 2516119 3090589 3573185 3818306 3541605 2666081
39657 2666081 1465669 328658 -521704 -1010366 -1063052 -707026 -324307 -530376 -1577212
39648 -1577212 -2964404 -3852073 -3865027 -3355252 -2920199 -2892883 -3347407 -4317883 -5741973
39639 -5741973 -7257635 -8301997 -8497351 -7865212 -6677661 -5259020 -4006124 -3434055 -3940350
39630 -3940350 -5422357 -7235238 -8673511 -9521793 -10080939 -10668643 -11190926 -11230281 -10442542
39621 -10442542 -8780815 -6434033 -3730491 -1118160 940207 2213079 2850180 3234918
39613 3234918 3673610 4210135 4663198 4762134 4256527 2991666 986712 -1497851 -3971093
39604 -3971093 -5849530 -6680765 -6337614 -5078074 -3418810 -1828564 -386060 1289087
39596 1289087 3647672 6668061 9747520 12171662 13610866 14114578 13791711 12714449
39588 12714449 11096936 9320069 7653685 6057260 4360392 2591485 1037046 -32340
39580 -32340 -658440 -1192410 -1957347 -2879382 -3482615 -3297641 -2260684 -698881 983446
39571 983446 2523879 3832389 5003983 6272779 7726585 8994198 9397235 8544294 6691151
39562 6691151 4448013 2249094 182646 -1830166 -3877689 -5989085 -8005592 -9518416
39554 -9518416 -10126772 -9832523 -9053238 -8150985 -7032230 -5338956 -3036015 -711365 780676
39545 780676 987374 179489 -936640 -1762433 -2091322 -2010894 -1687220 -1251345 -758513 -153162
39535 -153162 696646 1848845 3141991 4219790 4733719 4563840 3873388 2949868 1999376
39526 1999376 1126848 488293 318140 685170 1280538 1593958 1334082 632227 -112453
39517 -112453 -498491 -343153 112104 170824 -910877 -3290741 -6339494 -9123963 -11034620
39508 -11034620 -11961943 -12081697 -11646599 -10886308 -9892960 -8550435 -6661764 -4186995 -1342366
39499 -1342366 1516556 4100097 6331343 8331517 10221506 11908727 13105904 13565852
39491 13565852 13246882 12274171 10862925 9308005 7912567 6822890 5968260 5177985 4282394
39482 4282394 3120035 1616740 -66803 -1581821 -2640450 -3111825 -2877678 -1810142
39474 -1810142 29321 2385208 5099397 8140423 11163561 13343261 14011549 13368319
39466 13368319 12288901 11540166 11443028 12083634 13328975 14578414 14987228 14228518 12839562
39457 12839562 11661501 11120073 11141979 11471162 11789180 11678205 10783935 9089070 6940659
39448 6940659 4815456 3087955 1931608 1343589 1281983 1777219 2799449 3997012 4758123
39439 4758123 4702272 4053930 3406064 3134536 3117039 2983199 2548410 1994928 1661243 1663653
39429 1663653 1772213 1736071 1689980 2091702 3234034 4960872 6902543 8818043 10604980
39420 10604980 12123756 13161325 13489557 12862033 11074806 8182374 4577432 712814
39412 712814 -3192256 -7030213 -10465350 -12909580 -13858600 -13165280 -11070117 -8169086 -5327983
39403 -5327983 -3335384 -2421777 -2140291 -1770907 -803487 910650 3214173 5643020 7477970
39394 7477970 8069445 7250438 5410794 3169703 1022101 -765085 -2115181 -3122069
39386 -3122069 -3969058 -4717389 -5183957 -5118451 -4452746 -3230968 -1338219 1422460 4826491
39377 4826491 8007650 10041264 10760346 10804790 10853702 11014743 11026171 10810524 10583518 10470000
39367 10470000 10236692 9509727 8194636 6606655 5194932 4201273 3621686 3423246 3643600
39358 3643600 4228913 4918452 5426684 5669671 5692123 5467888 4965825 4367948 3991903 3952343
39348 3952343 4067371 4127548 4086050 3968046 3805069 3705806 3756104 3761346 3333621 2361768
39338 2361768 1139473 -145455 -1764498 -4004735 -6589932 -8895743 -10603664 -11748179
39330 -11748179 -12177242 -11454642 -9510717 -7124958 -5528638 -5573694 -7275125 -9929056 -12564836
39321 -12564836 -14492426 -15637236 -16349095 -16865731 -17065045 -16748611 -15957920 -14869641 -13519878
39312 -13519878 -11822036 -9823124 -7797796 -6059112 -4714190 -3579218 -2317174 -751349
39304 -751349 872990 1997347 2222680 1671410 830349 70291 -602200 -1331655 -2054363
39295 -2054363 -2426815 -2117588 -1130270 219469 1663969 3257789 5232154 7635981 10243917
39286 10243917 12819205 15325314 17790679 20036170 21640703 22193880 21560288 19896362
39278 19896362 17424431 14251880 10546197 6940017 4539263 4171208 5514572 7190288
39270 7190288 7907794 7491173 6754982 6553797 7094423 8002422 8759702 9023594 8704074
39261 8704074 7867134 6579473 4880388 2938796 1143845 -95077 -625863 -554693 -57687
39252 -57687 641475 1174520 1192687 731765 210570 -71346 -252905 -542527 -700183 -196328
39242 -196328 1129865 2864649 4546001 6115625 7659281 8920396 9397651 8915468 7846845
39233 7846845 6701436 5673806 4694141 3773936 3143246 3090233 3782776 5246628 7436834
39224 7436834 10283367 13630851 17072920 19859659 21118995 20332651 17660816 13846882
39216 13846882 9882934 6716318 4997165 4821096 5695079 6914201 8054483 9103802
39208 9103802 10209506 11426305 12661727 13704640 14292780 14287292 13812163 13116617 12291246
39199 12291246 11238399 9919241 8457086 6938983 5293055 3509169 1901920 1024626
39191 1024626 1318906 2849706 5269599 7959532 10291303 11883399 12650244 12671820 12149511
39182 12149511 11476824 11104875 11147175 11214785 10802390 9783493 8420917 7012191 5713273
39173 5713273 4629576 3836138 3285559 2886892 2715382 2975362 3705965 4690283 5739201
39164 5739201 6925293 8428270 10235886 12070622 13518103 14171449 13805508 12582870
39156 12582870 11043726 9744563 8879622 8293066 7783718 7275873 6725672 6010746 4970922
39147 4970922 3507919 1648604 -414677 -2341945 -3788088 -4569255 -4670883 -4140447 -3082403
39138 -3082403 -1761745 -579434 137450 277843 -117890 -926082 -1864938 -2495083 -2490936
39129 -2490936 -1924586 -1183971 -620682 -352350 -338404 -474086 -598414 -587628 -526955 -671922
39119 -671922 -1147102 -1753649 -2115449 -1900962 -860860 1128939 3814714 6412374 7967906
39110 7967906 8017730 6901912 5476590 4557104 4473572 4906763 5129282 4619172 3559987
39101 3559987 2668564 2505116 3035132 3814112 4370309 4342669 3509427 1938353 58753
39092 58753 -1572642 -2565122 -2714269 -1895696 -141660 2228575 4745510 7065968 8991570
39083 8991570 10271971 10628359 10059970 8969383 7854152 6927162 6087825 5156459 4025178
39074 4025178 2647272 1032957 -706622 -2394900 -3918462 -5269937 -6404603 -7090472
39066 -7090472 -7010882 -6077175 -4577614 -2923452 -1277839 434570 2127541 3322951 3463739
39057 3463739 2412306 527494 -1719178 -4065754 -6369500 -8318224 -9365649 -9017716
39049 -9017716 -7211435 -4417610 -1348488 1440607 3650016 5030982 5299891 4392205
39041 4392205 2705451 933317 -341970 -857781 -630794 75556 786891 1069470 851739
39032 851739 405446 -235 -304161 -540595 -729387 -929861 -1204763 -1443151 -1420720 -1169445
39022 -1169445 -1087928 -1475481 -2087752 -2378195 -2100994 -1471531 -832982 -451655 -610335 -1539530
39012 -1539530 -3081521 -4635063 -5629987 -5966683 -5887422 -5566926 -5000446 -4190734 -3240866
39003 -3240866 -2284099 -1483962 -1090273 -1317703 -2114231 -3167410 -4191884 -5117604 -5954970
38994 -5954970 -6590018 -6814835 -6517948 -5770507 -4741495 -3570636 -2311149 -987137 259614
38985 259614 1102285 1220285 601082 -458704 -1722979 -3249112 -5100583 -6940958 -8177977
38976 -8177977 -8565166 -8468819 -8429623 -8568552 -8498347 -7694598 -5851262 -3004413 489974
38967 489974 4080601 7232095 9562097 10799251 10749791 9463423 7405404 5306560 3756516
38958 3756516 2927402 2609718 2422429 2074244 1627182 1552571 2363777 4073112 6075626
38949 6075626 7660362 8622401 9353676 10402984 12001559 13954813 15889539 17557177
38941 17557177 18893772 19818210 20085066 19465417 18062902 16322306 14696486 13423977
38933 13423977 12656758 12598060 13324361 14557785 15827200 16892542 17900041 19108918 20572315
38924 20572315 22096812 23389705 24195207 24400877 24120024 23645790 23269488 23164066 23457344
38915 23457344 24326367 25911244 28143910 30741285 33388701 35904742 38266274 40569509
38907 40569509 42981260 45618492 48383618 50958513 53054132 54686629 56185509 57966185
38899 57966185 60345723 63511882 67503345 72138283 77039303 81824493 86295381 90480351
38891 90480351 94606902 99052099 104141108 109807706 115484005 120471342 124438821 127483400
38883 127483400 129760188 131228197 131789472 131516313 130638739 129384317 127894280 126205816
38875 126205816 124206371 121630175 118201992 113863363 108927649 104062266 100046547 97365474
38867 97365474 95917100 95110571 94244777 92783359 90405641 87055165 83039186 78923945
38859 78923945 75185467 71982613 69252615 66851911 64531969 61978280 59050800 55885526
38851 55885526 52649401 49372363 46202325 43606631 41941666 40823498 39243540 36422776
38843 36422776 32408906 27882290 23685425 20608547 19258770 19800025 21886795 25019936
38835 25019936 28874399 33126746 37087547 39764507 40357986 38649584 35018623 30281435
38827 30281435 25497382 21661310 19330209 18466070 18652577 19488708 20807374 22539199
38819 22539199 24382351 25684462 25779875 24483240 22170810 19372500 16437293 13645424
38811 13645424 11385333 9917333 9003952 8050514 6705989 5179902 3913514 3095705
38803 3095705 2594858 2231618 1969595 1873640 1979490 2203746 2360530 2330944 2254888 2449277
38793 2449277 3016633 3585948 3588794 2827322 1692736 815357 592594 1073630 2142628
38784 2142628 3630568 5243493 6540179 7128735 6936407 6300225 5810799 6020937 7152817
38775 7152817 8937337 10733593 11917409 12227953 11741610 10573930 8752689 6412127
38767 6412127 3920000 1617346 -514316 -2726266 -4996708 -6797662 -7464951 -6748567
38759 -6748567 -4974607 -2793715 -887663 172993 35612 -1272277 -3252446 -5100344
38751 -5100344 -6121109 -6134810 -5516479 -4775811 -4052667 -3061725 -1555470 229935 1670865
38742 1670865 2298004 2220793 2045793 2400742 3476051 4941042 6291694 7317913 8242812
38733 8242812 9400520 10801018 12026713 12530765 12035722 10699156 8914917 6899963
38725 6899963 4477591 1388795 -2132350 -5259835 -7224550 -7996676 -8186818 -8381332 -8798181
38716 -8798181 -9498610 -10537028 -11732354 -12560427 -12531641 -11579061 -9925162 -7728004 -5097251
38707 -5097251 -2357195 15545 1784332 3101953 4212793 5150328 5777842 5984011 5753298
38698 5753298 5140294 4258308 3239772 2156560 1022899 -98452 -1043644 -1619572 -1702998
38689 -1702998 -1329583 -800192 -658317 -1366095 -2918699 -4872928 -6754475 -8250425 -8979126
38680 -8979126 -8428009 -6473393 -3860752 -1787580 -858842 -600243 -63004 1249209 3107655
38671 3107655 4969138 6420435 7294156 7611519 7522054 7186459 6609774 5634766 4189104
38662 4189104 2518897 1082762 190006 -194595 -285226 -238077 -159679 -219207 -532084 -908521
38652 -908521 -915758 -320729 625507 1456027 1952307 2201424 2261927 1993707 1299576 403741
38642 403741 -233534 -255095 385963 1491284 2772438 3918260 4611430 4625645 3991578
38633 3991578 3036978 2172896 1609495 1327924 1314861 1671368 2370083 3013091 3070043 2450573
38623 2450573 1725876 1665580 2569574 4094029 5670115 6993250 8107351 9133091 10040692
38614 10040692 10715786 11163683 11539284 11955293 12341508 12552267 12564581 12505009 12516208 12666449
38604 12666449 12953043 13291714 13502324 13413024 13028406 12538018 12127174 11820790 11505329
38595 11505329 11004470 10089862 8516027 6153017 3086180 -428578 -4035725 -7254912
38587 -7254912 -9493538 -10267258 -9478019 -7431295 -4579724 -1327351 1904229 4558199
38579 4558199 6069574 6182377 5119581 3430739 1705171 419094 -78428 365332 1545765
38570 1545765 2881411 3716002 3749203 3183375 2421119 1608070 485872 -1280841 -3623274
38561 -3623274 -5943864 -7523109 -8066070 -7829223 -7248071 -6554293 -5808588 -5190557 -5079928
38552 -5079928 -5790925 -7265756 -9041769 -10501807 -11206033 -11094858 -10452583 -9685259 -9086223
38543 -9086223 -8696178 -8244428 -7227331 -5250815 -2468986 398132 2660254 4258991
38535 4258991 5650839 7137243 8493788 9273550 9294937 8774802 8138002 7768671 7805178
38526 7805178 8075320 8310068 8453964 8642744 8864571 8874451 8581409 8319124 8496388 9054162
38516 9054162 9457806 9175368 8006771 6037826 3531007 893007 -1467026 -3358862
38508 -3358862 -4800534 -5757143 -6014053 -5363846 -3814002 -1557305 1145869 3960759 6453543
38499 6453543 8254772 9320267 9977120 10630160 11376870 11909614 11808036 10907083 9356281
38490 9356281 7391550 5188117 2952783 1001225 -368882 -1017223 -941357 -280575 545072
38481 545072 887766 337664 -863980 -2040355 -2684879 -2721550 -2281787 -1519417 -679549
38472 -679549 -85343 62476 -279322 -1187941 -2763374 -4839736 -6971223 -8886712 -10743446
38463 -10743446 -12701944 -14430040 -15336458 -15245916 -14582968 -13902475 -13486235 -13409723 -13695573
38454 -13695573 -14209823 -14562276 -14331313 -13402829 -11990255 -10288968 -8139806 -5075951 -788712
38445 -788712 4358152 9293011 12835295 14419291 14261678 12929788 10922104 8674434
38437 8674434 6706087 5469688 5028098 5040197 5142802 5271391 5561762 6049080 6609075
38428 6609075 7184068 7907793 8896850 9981668 10774432 11023151 10811746 10387966 9902522
38419 9902522 9402483 8997177 8869556 9081304 9456051 9718136 9712430 9455521 9022986 8460850
38409 8460850 7811025 7167749 6662866 6372034 6203473 5855572 4931246 3217061 951701
38400 951701 -1200449 -2561502 -2924707 -2632102 -2133597 -1484951 -342302 1536455 3858701
38391 3858701 5936872 7255464 7852790 8149339 8484815 8883355 9195817 9309796 9161273
38382 9161273 8656282 7693994 6206813 4079916 1142166 -2532425 -6313991 -9275998
38374 -9275998 -10916183 -11464065 -11354771 -10615777 -9026064 -6743858 -4438988 -2766561 -1934399
38365 -1934399 -1794958 -2086925 -2490078 -2690699 -2586340 -2336986 -2150320 -2171299 -2631299 -3820818
38355 -3820818 -5655131 -7395621 -8077655 -7251614 -5222900 -2683757 -299290 1442515
38347 1442515 2291467 2305714 1790483 1112949 598054 535126 1131275 2397760 4120394
38338 4120394 5944851 7496200 8525044 9024800 9113403 8702492 7426978 5109637 2220107
38329 2220107 -383936 -2218482 -3527369 -4899523 -6731119 -9038640 -11483397 -13418426
38321 -13418426 -14146251 -13423953 -11736221 -9956237 -8704794 -8016117 -7522942 -6918831 -6317996
38312 -6317996 -6183632 -6794924 -7767567 -8257901 -7713647 -6293704 -4504647 -2633878 -678591
38303 -678591 1371173 3428785 5408959 7216207 8674380 9639175 10125066 10141224 9487342
38294 9487342 7993524 5985142 4228008 3278198 3063186 3201982 3508051 3957259 4311026
38285 4311026 4090518 2998617 1210444 -818077 -2722048 -4365101 -5741809 -6875983
38277 -6875983 -7776549 -8369827 -8458320 -7864444 -6718002 -5571145 -5114211 -5696722 -7103631
38268 -7103631 -8770917 -10184976 -11122514 -11645740 -11958290 -12217060 -12405146 -12412872 -12297850
38259 -12297850 -12397892 -13041680 -14101964 -14917493 -14738773 -13293183 -10990019 -8654621 -7006567
38250 -7006567 -6217419 -5880921 -5480497 -4935259 -4609197 -4743162 -5019004 -4839094 -3985811
38241 -3985811 -2861342 -2104326 -2120277 -2950865 -4330980 -5716238 -6443230 -6149074 -5066125
38232 -5066125 -3749838 -2504936 -1247652 33778 932437 979065 285337 -406319 -398185
38223 -398185 351068 1329943 2037252 2333261 2382867 2509543 3144265 4691717 7231304
38214 7231304 10342703 13316046 15555964 16790995 17025897 16477560 15571044 14804709 14435631
38205 14435631 14270160 13800740 12553253 10356626 7449059 4466677 2266415 1562658
38197 1562658 2594696 5069205 8317060 11465436 13667268 14499150 14239515 13565707 12826559
38188 12826559 11697770 9647569 6639417 3265261 290411 -1790290 -2854628 -3064750
38180 -3064750 -2732940 -2130318 -1368614 -551449 -22338 -272435 -1480396 -3217301 -4692447
38171 -4692447 -5250367 -4621837 -2879586 -372004 2324566 4638726 6360912 7699549
38163 7699549 8857490 9623182 9597200 8879615 8304609 8755025 10288516 12127628 13482073
38154 13482073 14172347 14477149 14718315 15170350 16078807 17411811 18652440 19092190 18331538
38145 18331538 16373072 13396375 9756235 6144077 3368754 1824235 1341586 1582183
38137 1582183 2321643 3282720 3992720 4041177 3395833 2390732 1521183 1229264 1595635
38128 1595635 2099845 1914325 612919 -1550589 -4106980 -6791340 -9327002 -11170608
38120 -11170608 -11893088 -11677340 -11079218 -10354025 -9312143 -7777215 -5884670 -3940380 -2234715
38111 -2234715 -962944 -79294 730728 1677869 2522217 2880226 2815408 2766272 2878857 2794173
38101 2794173 2203084 1287873 498010 193991 619586 1857421 3576315 5093384 5930895
38092 5930895 6128818 5882071 5204885 4224222 3485171 3532467 4298937 5240600 5964348 6380130
38082 6380130 6347214 5632842 4318336 2903965 1846294 1192743 774886 565387 717287
38073 717287 1385389 2609573 4270594 6078172 7662233 8703516 8947532 8215337 6612766
38064 6612766 4681334 3051069 1859166 753243 -414146 -1146533 -773617 792983
38056 792983 2976691 5068686 6598509 7284176 6980541 5814134 4181465 2469114 847264
38047 847264 -618463 -1804821 -2615145 -3129493 -3492404 -3646510 -3319324 -2339220 -897446
38038 -897446 546597 1573963 2024982 2051439 2065040 2536883 3636299 4999235 5963331
38029 5963331 6103979 5483870 4382034 2963529 1359790 -72145 -872981 -976957 -945564
38020 -945564 -1553929 -3119718 -5240958 -7130401 -8165090 -8184993 -7401689 -6130188 -4645523
38011 -4645523 -3243659 -2302196 -2150888 -2871049 -4294704 -6211938 -8499393 -11017861 -13498321
38002 -13498321 -15669791 -17508918 -19258036 -21126947 -23020995 -24643885 -25860746 -26849197
37994 -26849197 -27806339 -28564074 -28634084 -27676963 -25832912 -23528468 -21056522 -18479142 -15911073
37985 -15911073 -13727504 -12375220 -11981560 -12169799 -12250442 -11632715 -10166242 -8187640 -6249740
37976 -6249740 -4743400 -3693149 -2846282 -1943054 -938620 3727 725428 1232364 1575115
37967 1575115 1618243 1115292 109028 -897580 -1356458 -1196821 -753590 -227765 533546
37958 533546 1666722 2935328 3897269 4307932 4254696 4037349 4056204 4657404 5816021
37949 5816021 6959889 7313614 6518110 4863111 2946504 1245297 11154 -635713 -681540
37940 -681540 -244491 460383 1149433 1442317 951744 -404192 -2152760 -3457386 -3665127
37931 -3665127 -2710586 -1059905 632197 1822429 2233294 1916123 1197149 460458 -92071
37922 -92071 -466063 -672066 -564227 66369 1253820 2747424 4133635 5062367 5414457
37913 5414457 5343758 5192465 5310890 5866857 6752543 7634912 8113315 7907976 6981629 5505988
37903 5505988 3697999 1699458 -359907 -2209687 -3425887 -3626089 -2698747 -873803
37895 -873803 1391818 3621048 5501909 6939418 7931968 8400191 8171254 7134272 5356003
37886 5356003 3018273 310118 -2542231 -5175299 -7145235 -8180566 -8392559 -8210881
37878 -8210881 -8084727 -8204354 -8445212 -8509196 -8084989 -6921499 -4888127 -2114913 892583
37869 892583 3385317 4754957 4856110 3980476 2571671 997277 -499741 -1819249 -3069944
37860 -3069944 -4510872 -6249174 -7945237 -8914089 -8610168 -7009511 -4506231 -1515928
37852 -1515928 1727127 5037705 8127617 10695411 12619705 13986445 14934022 15502870
37844 15502870 15604788 15108242 14001908 12513835 10994132 9594501 8130920 6397288
37836 6397288 4591524 3274397 2863945 3279368 4088330 4815194 5017700 4313768 2685448
37827 2685448 806436 -184652 541821 2913730 6103287 9154977 11453221 12774347
37819 12774347 13145138 12739695 11820905 10688382 9668148 9116608 9317550 10291501 11763394
37810 11763394 13419632 15171447 17044859 18810364 19901901 19851436 18749894 17148378
37802 17148378 15507242 13836638 11869083 9462810 6781005 4149669 1820568 -107716
37794 -107716 -1530167 -2119401 -1387839 893821 4339020 8097554 11351363 13580573 14463423
37785 14463423 13845686 11970402 9539524 7310177 5656323 4626220 4295208 4830313
37777 4830313 6213681 8087381 9915294 11197030 11557286 10826880 9139528 6872798
37769 6872798 4438301 2154984 254399 -1179709 -2334112 -3563617 -5014338 -6364332
37761 -6364332 -6980072 -6300044 -4116577 -690644 3271082 6868783 9437699 10771642
37753 10771642 10899013 9744081 7172314 3368789 -978789 -4969192 -7967587 -9861137
37745 -9861137 -10966892 -11730032 -12428450 -13086901 -13655113 -14230943 -15030466 -16110285 -17171927
37736 -17171927 -17686934 -17225744 -15732782 -13631258 -11734284 -10906313 -11537152 -13186300 -14794852
37727 -14794852 -15396051 -14732687 -13260291 -11647434 -10340695 -9532936 -9325066 -9725886 -10500639
37718 -10500639 -11170759 -11277888 -10664934 -9499643 -8056200 -6476865 -4690590 -2532423
37710 -2532423 4133 2569571 4538050 5378429 5019673 3879591 2552226 1456490
37702 1456490 702911 164014 -416696 -1359593 -2967109 -5354748 -8265854 -11063718 -13000548
37693 -13000548 -13593672 -12813873 -10997393 -8660893 -6364635 -4559801 -3385561 -2615398
37685 -2615398 -1914121 -1183620 -611115 -397303 -526791 -809688 -1046198 -1126816 -1101832 -1242985
37675 -1242985 -1928672 -3310712 -5105790 -6829170 -8224525 -9343493 -10212952 -10624851 -10387107
37666 -10387107 -9656126 -8813016 -8006929 -6999563 -5538930 -3739645 -1932011 -193092
37658 -193092 1771474 4208621 6915108 9368275 11172221 12219223 12444637 11647005 9688286
37649 9688286 6770522 3360783 -134754 -3496634 -6505929 -8811755 -10126053 -10532246
37641 -10532246 -10507775 -10576247 -10895521 -11154541 -10878593 -9861578 -8297457 -6503125 -4624499
37632 -4624499 -2725263 -1067112 -40885 285399 377744 836595 1873393 3304408 4921655
37623 4921655 6621149 8196158 9300806 9781143 9923447 10253558 11143548 12648688 14593621
37614 14593621 16701281 18721552 20561363 22256766 23739677 24704233 24824546 24069392
37606 24069392 22697857 21000780 19195542 17535769 16290292 15495426 14856920 14039444
37598 14039444 13026013 12136900 11766418 12157145 13282576 14736639 15768297 15702046 14521335
37589 14521335 12968885 11930707 11736162 12137797 12872963 14007098 15668212 17671979
37581 17671979 19624888 21327456 22868426 24301601 25399185 25796117 25268662 23824098
37573 23824098 21667944 19213076 17007945 15434735 14414611 13497402 12284918 10746888
37565 10746888 9188518 8050192 7739368 8433723 9814257 10995469 10944130 9195580 6236499
37556 6236499 3149154 846837 -360865 -565251 132289 1634330 3576277 5331601
37548 5331601 6439840 6935628 7167321 7409107 7782958 8437550 9534882 10976180 12285627
37539 12285627 12891843 12531352 11397283 9967766 8671305 7580873 6356626 4557164
37531 4557164 2081047 -714976 -3334567 -5499059 -7169920 -8351971 -9015624 -9189519
37523 -9189519 -9004145 -8597812 -8045172 -7435316 -6978422 -6912971 -7194191 -7277338 -6361465 -4030722
37513 -4030722 -715289 2532873 4759682 5636225 5405266 4497364 3246168 1832849 361423
37504 361423 -1027230 -2092992 -2572949 -2322342 -1339612 298181 2371610 4355083 5500250
37495 5500250 5267741 3684258 1251269 -1395344 -3686478 -5191548 -5757933 -5592799 -5051293
37486 -5051293 -4321581 -3406231 -2342335 -1239188 -80953 1312807 3044686 4989265
37478 4989265 6959177 8900642 10842648 12754402 14518747 15918598 16563019 16000485
37470 16000485 14123036 11415866 8624820 6172624 4033577 2139888 680933 -88484
37462 -88484 -167094 209001 810907 1506656 2158115 2582748 2645770 2302506 1546921 437938
37452 437938 -771417 -1654876 -1914168 -1661582 -1303698 -1122689 -1055121 -911651 -699900 -610006
37442 -610006 -715963 -818001 -610264 82546 1263358 2835923 4588425 6116965 6884798
37433 6884798 6457218 4738887 2056451 -929581 -3442827 -4888896 -5110405 -4425060 -3384317
37424 -3384317 -2403348 -1530806 -539260 732047 2090479 3054128 3225080 2598450 1524584
37415 1524584 455784 -209417 -135175 883253 2733230 4897620 6637003 7340611 6836069
37406 6836069 5511897 4137120 3367767 3262922 3304991 2967208 2218990 1425201 860460
37397 860460 463588 -1173 -730780 -1819250 -3192059 -4536066 -5491591 -6060180 -6693000
37388 -6693000 -7806984 -9280940 -10574759 -11273758 -11339444 -10898191 -10083730 -9199068 -8785838
37379 -8785838 -9261441 -10504902 -11957624 -13120147 -13801027 -13879565 -13049824 -11004312 -7865672
37370 -7865672 -4318257 -1250761 751131 1653004 1871685 1990151 2465116 3443664 4759519
37361 4759519 6082874 7085328 7509426 7186110 6099265 4468641 2712837 1240326
37353 1240326 198453 -611947 -1542161 -2730389 -3897058 -4584249 -4678528 -4643984 -5132895
37344 -5132895 -6373046 -8001803 -9428989 -10209559 -10119839 -9175662 -7769723 -6645683 -6507075
37335 -6507075 -7632756 -9927478 -13190525 -17086681 -20872480 -23445373 -23895049 -22039255
37327 -22039255 -18445945 -14051182 -9776539 -6300221 -3904303 -2411264 -1331282 -198049
37319 -198049 1158803 2657811 4272531 6212080 8672801 11418474 13803448 15370934
37311 15370934 16340194 17319171 18546769 19578289 19740228 18757682 16908962 14726674 12647264
37302 12647264 10845034 9264165 7791757 6430057 5304846 4547660 4243419 4466755
37294 4466755 5250712 6493901 7995360 9607178 11260402 12826416 14071966 14789809
37286 14789809 14864694 14196062 12738598 10725261 8692191 7101725 5988820 5097023 4295292
37277 4295292 3715316 3512760 3664651 4070015 4762745 5906223 7490449 9009404 9559953
37268 9559953 8492070 6078168 3449299 1766081 1445537 2111987 3059119 3659405 3571814
37259 3571814 2851306 1860757 930825 112522 -679457 -1402993 -1900589 -2051384 -1741901
37250 -1741901 -822320 645430 2143748 2970753 2792658 1755816 114161 -1950778 -4099924
37241 -4099924 -5774792 -6602681 -6724922 -6572213 -6441644 -6421727 -6566837 -6903471 -7271465
37232 -7271465 -7321740 -6742751 -5499379 -3912127 -2522385 -1772166 -1731777 -2179412 -2922632
37223 -2922632 -3850784 -4591450 -4378647 -2602938 481410 3806746 6317214 7629255 7883446
37214 7883446 7196768 5488541 2801476 -411240 -3422716 -5619754 -6752757 -6917231
37206 -6917231 -6389128 -5423408 -4083669 -2253703 93117 2643612 4896721 6586579
37198 6586579 7783815 8514005 8519477 7626282 6187677 4853760 3930945 3249430 2669154
37189 2669154 2397800 2682640 3433080 4315085 5055754 5529647 5727139 5800429 5992957 6362062
37179 6362062 6707404 6924891 7250961 7917727 8700469 9113129 9033289 8864485 9057588 9736253
37169 9736253 10877931 12599575 15034946 18004360 20961312 23242914 24286021 23673688
37161 23673688 21189308 16994754 11767008 6553210 2363612 -188280 -956623 -161929
37153 -161929 1655279 3724341 5417033 6668929 7868132 9234478 10525597 11521500
37145 11521500 12532048 14032842 15836171 16981137 16551494 14397441 11044401 7223291
37137 7223291 3651542 966981 -495326 -875521 -588524 25855 784103 1544585 2232625
37128 2232625 2942128 3805563 4736228 5461598 5844276 5997607 6003096 5682118 4822498 3565566
37118 3565566 2382192 1616006 1132206 428414 -994905 -3354774 -6464878 -9720107 -12290985
37109 -12290985 -13573883 -13559797 -12711957 -11496263 -10155560 -8923950 -8177985 -8117902 -8370730
37100 -8370730 -8173152 -7055114 -5255095 -3424731 -2014578 -969175 120431 1689373
37092 1689373 3946170 6739522 9536410 11558610 12116472 11032087 8845469 6526849
37084 6526849 4845743 3971929 3663682 3686900 3885442 3954661 3484926 2380077 1033307
37075 1033307 -103477 -985758 -1773548 -2243035 -1745196 83961 2757406 5301263 7152270
37066 7152270 8541112 9993998 11620388 12973942 13516361 13105807 12060387 10852583
37058 10852583 9782307 8897394 8165540 7672475 7612493 8092004 9009614 10166094 11425493
37049 11425493 12698331 13832419 14647987 15077384 15156130 14864361 14100923 12859740 11321379
37040 11321379 9706047 8127146 6644956 5350828 4306139 3498794 2972832 2905373 3392420
37031 3392420 4186712 4803675 4939809 4746318 4704227 5242319 6366660 7564297 8154439
37022 8154439 7840400 6819389 5249916 2833052 -751644 -5059180 -8903105 -11280252
37014 -11280252 -12041453 -11623874 -10512018 -9191265 -8278399 -8224095 -8894341 -9734180 -10352179
37005 -10352179 -10721580 -10851358 -10597122 -9931661 -9160346 -8647460 -8410415 -8141856 -7599588
36996 -7599588 -6865386 -6252658 -6075483 -6511233 -7567915 -9079191 -10706907 -11983229 -12436293
36987 -12436293 -11799365 -10184873 -8047414 -5922980 -4164687 -2871324 -1947651 -1141007
36979 -1141007 -99160 1405162 3202559 4753715 5529436 5320206 4140517 1993860
36971 1993860 -1044965 -4536551 -7707856 -9901123 -10897167 -10767952 -9618058 -7635347
36963 -7635347 -5256757 -3059050 -1496457 -856229 -1352528 -3006299 -5406422 -7792020
36955 -7792020 -9458432 -10014288 -9330325 -7520393 -5071085 -2752992 -1174081 -431855 -231324
36946 -231324 -202094 -30082 505222 1370451 2182178 2453453 1992142 1019021 -62579 -963160
36936 -963160 -1671305 -2443817 -3586018 -5135446 -6789589 -8200707 -9237374 -9837151 -9727531
36927 -9727531 -8540889 -6244020 -3302859 -388119 1971323 3470405 3986902 3591330
36919 3591330 2520176 1069858 -427788 -1543900 -1873082 -1378834 -534798 51665 176246
36910 176246 124970 265544 672816 1150121 1458065 1430662 980854 157399 -800584 -1594080
36900 -1594080 -2106038 -2442625 -2695909 -2756176 -2431519 -1659635 -482732 1090516 2965333
36891 2965333 4671497 5442155 4799718 3027775 945550 -754473 -1873156 -2517375 -2751331
36882 -2751331 -2491250 -1638631 -233174 1510967 3287569 4814809 5891891 6413283 6427130
36873 6427130 6164286 5844835 5369453 4362111 2712533 1009502 203445 758005 2226176
36864 2226176 3682472 4490107 4685607 4805834 5426322 6737288 8418893 9908505 10813582
36855 10813582 11081451 10862506 10335280 9622484 8693078 7319134 5324894 2960793 824047
36846 824047 -763233 -2139362 -3835928 -5802359 -7343886 -7825399 -7185113 -5695212 -3513787
36837 -3513787 -736152 2239797 4735142 6304289 7088636 7538873 7867228 7915955 7546628
36828 7546628 6976596 6594565 6497032 6356229 5800575 4854879 3958586 3612337 4055896 5190306
36818 5190306 6641563 7869231 8376333 7993010 6989997 5844075 4838776 3880704 2685461
36809 2685461 1122731 -599392 -2054933 -2920731 -3229264 -3313391 -3486293 -3819673 -4296840
36800 -4296840 -5104911 -6566307 -8680440 -10871175 -12370216 -12861401 -12689755 -12516251 -12879820
36791 -12879820 -13972463 -15541853 -16908782 -17288494 -16315601 -14272478 -11782901 -9372322
36783 -9372322 -7353797 -5949745 -5316140 -5469396 -6314906 -7719112 -9438346 -11015106 -11908146
36774 -11908146 -11791814 -10688728 -8840738 -6553873 -4175705 -2117098 -817532 -647532
36766 -647532 -1731634 -3741331 -5904631 -7409828 -7939616 -7846805 -7844272 -8524331 -10017574
36757 -10017574 -11901379 -13434763 -14076847 -13878024 -13292489 -12598239 -11632547 -10126896 -8130504
36748 -8130504 -6002317 -4129899 -2795989 -2193168 -2336482 -2936534 -3513863 -3717997 -3496379
36739 -3496379 -2971242 -2272302 -1549446 -1055410 -1074914 -1716250 -2805895 -4030538 -5176032
36730 -5176032 -6195914 -7076882 -7758811 -8281286 -8946827 -10184388 -12180320 -14679642 -17159796
36721 -17159796 -19158553 -20475765 -21211393 -21709509 -22415550 -23685863 -25656458 -28173254
36713 -28173254 -30703046 -32343768 -32202159 -30044862 -26622780 -23234327 -20876974 -19758096
36705 -19758096 -19485015 -19555707 -19621838 -19398170 -18513862 -16652485 -13975683 -11375255 -10079421
36696 -10079421 -10754870 -12892995 -15116892 -16167354 -15698714 -14283920 -12786853 -11711917
36688 -11711917 -10999913 -10289793 -9324703 -8174936 -7188467 -6768148 -7098904 -7974725 -8917609
36679 -8917609 -9569429 -9951862 -10243355 -10359198 -9956119 -8887877 -7447150 -6045870 -4823086
36670 -4823086 -3679980 -2485468 -1018806 1122167 4193378 7823365 11084774 13154454
36662 13154454 13839253 13521076 12797848 12168244 11770377 11254845 10073128 8064523 5686992
36653 5686992 3574466 1987117 823786 27518 -269665 11652 750667 1817309 3255251
36644 3255251 5120471 7186285 8967278 10117617 10765015 11371247 12233358 13158380 13661027
36635 13661027 13441163 12609362 11489630 10328306 9223474 8202389 7258365 6397145 5790937
36626 5790937 5839519 6860582 8592919 10101498 10349852 8964567 6483861 3929446 2171311
36617 2171311 1586001 2088058 3333050 4939036 6656520 8378017 9943188 10961563
36609 10961563 10970207 9870282 8148562 6546491 5485508 4847771 4255731 3436954 2320659
36600 2320659 962826 -469624 -1690059 -2420191 -2594317 -2400055 -2078980 -1688677 -1075611
36591 -1075611 -103404 1069722 1961564 2088052 1365398 169388 -1024447 -2010414 -2832774
36582 -2832774 -3484914 -3751935 -3361139 -2214088 -475603 1469171 3132358 4144001 4506475
36573 4506475 4636686 5067727 6029944 7252689 8097280 7896995 6337779 3695104 717488
36564 717488 -1844067 -3684202 -4954067 -5890391 -6522468 -6736837 -6521908 -6089267 -5788882
36555 -5788882 -5897633 -6385797 -6833048 -6658807 -5548503 -3693002 -1651396 -56690 597272
36546 597272 137719 -1114453 -2459614 -3350119 -3860264 -4525703 -5724775 -7313362 -8784967
36537 -8784967 -9569706 -9193675 -7469021 -4744026 -1823915 565516 2218441 3300170
36529 3300170 3927875 4102935 3966183 3835658 3892556 3963238 3693698 2875202 1578125 55154
36519 55154 -1457138 -2928772 -4570185 -6598529 -8922503 -11121651 -12784082 -13818177
36511 -13818177 -14410545 -14760073 -14919730 -14846478 -14525939 -14048016 -13579098 -13215193 -12828137
36502 -12828137 -12127449 -10971518 -9605375 -8498659 -7914749 -7683166 -7408406 -6845986 -6044590
36493 -6044590 -5185497 -4371529 -3578952 -2742898 -1830482 -836259 255846 1479470 2834740
36484 2834740 4204898 5326272 5902415 5826868 5319269 4815990 4700936 5113283 5936319
36475 5936319 6876824 7558507 7658257 7058157 5875689 4339192 2678291 1141917 2860
36466 2860 -595156 -788662 -879877 -1030659 -1140065 -1058584 -833032 -636650 -485794 -160295
36456 -160295 512221 1349783 1909092 1919884 1561431 1264380 1303821 1668004 2280676 3213199
36446 3213199 4606225 6406298 8186779 9221197 8848512 6983548 4358137 2136520
36438 2136520 1149387 1462139 2602783 4009188 5205834 5836225 5855320 5669215 5828129
36429 5828129 6504929 7417444 8280518 9129408 10085004 10960491 11293056 10741855 9327102
36420 9327102 7279300 4788067 1992170 -823691 -3138019 -4388953 -4292158 -2989129
36412 -2989129 -971700 1051991 2321942 2369322 1418433 345201 -15073 399222 902689
36403 902689 801277 -5343 -1133574 -2244865 -3346820 -4603581 -5921829 -6792924 -6648201
36394 -6648201 -5421215 -3659521 -2004343 -707514 186975 398833 -445922 -2185657 -3992101
36385 -3992101 -5067339 -5292656 -5072548 -4774794 -4528627 -4381550 -4355938 -4360081 -4217141 -3787208
36375 -3787208 -2995047 -1842473 -520820 579644 1106206 917500 -44368 -1830459 -4189119
36366 -4189119 -6354142 -7492546 -7408490 -6588713 -5584291 -4623333 -3807062 -3272769 -2963268
36357 -2963268 -2539430 -1814213 -1120235 -993567 -1608150 -2782885 -4452038 -6761991 -9584584
36348 -9584584 -12186775 -13616788 -13408416 -11861735 -9739704 -7790792 -6454822 -5790911
36340 -5790911 -5556126 -5394371 -5047853 -4460248 -3748433 -3145041 -2954484 -3432936 -4573599
36331 -4573599 -5998553 -7151724 -7657667 -7488346 -6809578 -5753862 -4370521 -2702617 -829895
36322 -829895 1106303 2820037 3854101 3780423 2525672 502974 -1594415 -3163071 -3976700
36313 -3976700 -4270188 -4578570 -5357040 -6596904 -7775356 -8252644 -7797006 -6754726 -5707633
36304 -5707633 -4951668 -4281957 -3231232 -1455906 1094989 4235776 7578540 10487724
36296 10487724 12174614 12032302 9971439 6490142 2490682 -1027291 -3359720 -4453545
36288 -4453545 -4893493 -5386507 -6167161 -6891345 -7037190 -6328384 -4838270 -2840148 -584506
36279 -584506 1865341 4577266 7456070 10077721 12013221 13330117 14535189 15875321
36271 15875321 16857250 16670603 15053686 12595262 10198339 8369211 7007285 5713755
36263 5713755 4211789 2542393 948958 -414889 -1672002 -3093691 -4766646 -6402936
36255 -6402936 -7498863 -7693286 -7014559 -5857519 -4770577 -4226448 -4476955 -5483135 -6899106
36246 -6899106 -8164221 -8764663 -8563409 -7928847 -7480857 -7614153 -8212238 -8823111 -9117349
36237 -9117349 -9138239 -9062403 -8764488 -7770192 -5757493 -3067857 -604077 818703 997436
36228 997436 295192 -738197 -1604975 -1866416 -1175034 544416 2957277 5440542 7409891
36219 7409891 8587522 9011372 8827666 8082625 6692314 4592920 1935348 -831767 -3087197
36210 -3087197 -4341604 -4515584 -3930912 -2993313 -1876429 -512148 1169182 3043509 4783802
36201 4783802 5951878 6131827 5132472 3169393 810402 -1361155 -3100222 -4552589
36193 -4552589 -5954395 -7243634 -7967496 -7657349 -6360725 -4732861 -3501681 -2887939 -2649749
36184 -2649749 -2593337 -2793198 -3276775 -3747559 -3794458 -3255230 -2244543 -958745 362478
36175 362478 1364049 1683491 1160475 -161967 -2189167 -4762700 -7530556 -10053277 -12112276
36166 -12112276 -13753511 -14963135 -15505360 -15258513 -14575685 -14044913 -13833623 -13406000 -11950504
36157 -11950504 -9026791 -4826288 944 4638780 8364761 10808017 12097773 12686437
36149 12686437 12913141 12725354 11850981 10209227 8109635 6082653 4576265 3793441 3728431
36140 3728431 4296774 5419145 6976858 8723608 10354416 11727217 12905428 13848999
36132 13848999 14180243 13526335 12113058 10718713 9868946 9305292 8495183 7489252 6905920
36123 6905920 7059424 7444475 7249032 6182426 4642500 3227009 2276652 1793634 1547526
36114 1547526 1204104 533010 -350361 -946329 -640458 917575 3583694 6710408 9317742
36105 9317742 10436209 9569243 7026038 3807806 1033486 -674114 -1371791 -1518460 -1609008
36096 -1609008 -2001117 -2877085 -4211394 -5790527 -7341028 -8650912 -9587740 -10110301 -10337126
36087 -10337126 -10507435 -10745873 -10905731 -10760526 -10313969 -9784603 -9294386 -8716569 -7855194
36078 -7855194 -6647577 -5158307 -3506123 -1865581 -456354 508776 793215 93767 -1758492
36069 -1758492 -4465968 -7318348 -9736207 -11654011 -13252927 -14500218 -15197700 -15381210
36061 -15381210 -15350444 -15242913 -14822986 -13816856 -12291286 -10563325 -8840693 -7079970 -5130050
36052 -5130050 -2894203 -397623 2166078 4426527 5957740 6477568 5969158 4674481
36044 4674481 3023208 1522127 581757 322835 488712 570817 127060 -905179 -2174903
36035 -2174903 -3220369 -3798743 -3895758 -3500502 -2540042 -1067061 649855 2331833 3885202
36026 3885202 5293155 6444045 7264749 7978501 9000018 10490834 12132201 13367483
36018 13367483 13729365 12911184 10783960 7597410 4079377 1060823 -1097630 -2615424
36010 -2615424 -3837848 -4838836 -5530260 -5968369 -6340381 -6684055 -6815177 -6605287 -6213161
36001 -6213161 -5919983 -5757870 -5408990 -4534776 -3192738 -1901211 -1287840 -1652004 -2780109
35992 -2780109 -4061191 -4748909 -4260456 -2461847 205872 2935391 5012727 6146691
35984 6146691 6397142 5876803 4615718 2698806 425206 -1743384 -3386896 -4279347 -4399345
35975 -4399345 -3854836 -2800087 -1378464 304251 2176677 4161201 6096631 7690239
35967 7690239 8613061 8733185 8266891 7638493 7161541 6878160 6675868 6448848 6109951
35958 6109951 5583830 4937047 4462066 4450538 4830785 5159470 5064020 4614031 4162029 3884741
35948 3884741 3610035 3080092 2254624 1325855 551683 138248 186051 636096 1290699 1957725
35938 1957725 2551684 3010917 3200858 3024592 2582467 2049551 1371805 266932 -1359722
35929 -1359722 -3117760 -4385563 -4812438 -4489394 -3729040 -2840086 -2071468 -1579790 -1384853
35920 -1384853 -1447227 -1803908 -2525717 -3529228 -4547180 -5327278 -5793605 -6041515 -6311341
35911 -6311341 -6945173 -8142128 -9659604 -10938671 -11656083 -12002027 -12277231 -12386588 -11943285
35902 -11943285 -10775137 -9130444 -7473331 -6276414 -5890706 -6305714 -7044273 -7581318 -7896121
35893 -7896121 -8339956 -8950411 -9276531 -9029661 -8534390 -8249354 -8120636 -7759522 -7068253
35884 -7068253 -6296157 -5579667 -4862012 -4292617 -4269509 -4883950 -5605184 -5739157 -5029163 -3644917
35874 -3644917 -1806139 278328 2169820 3232156 3086593 1983202 633424 -368814
35866 -368814 -1007660 -1758073 -3012036 -4582609 -5823427 -6232571 -5853955 -5089803 -4275226
35857 -4275226 -3521320 -2831612 -2195989 -1592446 -1013311 -489202 -25428 444179 961936
35848 961936 1434803 1675230 1508774 820398 -353271 -1637480 -2350913 -1953846 -458664
35839 -458664 1765181 4532225 7930397 11849797 15719004 18884825 21084007 22386706
35831 22386706 22845391 22427623 21225929 19527181 17674931 15985235 14726711 13971006
35823 13971006 13439155 12687285 11551326 10330138 9481875 9220101 9438210 9912831 10484218
35814 10484218 11092876 11736989 12405708 13036199 13566180 14044291 14629460 15423633 16322386
35805 16322386 17060257 17377189 17119432 16235151 14756314 12810945 10636422 8572961 7015301
35796 7015301 6276377 6393015 7039754 7685525 7898203 7548237 6773754 5797147 4780529
35787 4780529 3821425 3035048 2583832 2584320 2991681 3624342 4327496 5079187 5896636 6654644
35777 6654644 7053699 6819667 5970050 4891537 4106061 3871048 3963244 3887387 3336654 2441604
35767 2441604 1570754 945969 489642 -10982 -658424 -1315339 -1618177 -1140600 303420
35758 303420 2408822 4471126 5842244 6376264 6456633 6583187 6894592 7054507 6622675
35749 6622675 5589760 4535039 4165724 4635846 5337332 5391095 4338722 2393218 147339
35740 147339 -1854391 -3317582 -4163115 -4428387 -4207106 -3612995 -2721053 -1497666 179364
35731 179364 2329289 4635835 6483157 7373431 7373937 7092489 7141933 7627410 8170998 8390140
35721 8390140 8280571 8130928 8141569 8186732 7916764 7027102 5451393 3410439 1331081
35712 1331081 -391221 -1706392 -3001894 -4773864 -7158057 -9827507 -12320723 -14339899
35704 -14339899 -15718810 -16307267 -16057422 -15127028 -13714887 -11824226 -9364686 -6522589
35696 -6522589 -3902573 -2233836 -1955918 -3029207 -5014994 -7332460 -9553544 -11473909
35688 -11473909 -12844127 -13147886 -11904466 -9243446 -5961568 -2906973 -485547 1157978
35680 1157978 1799203 1304397 2181 -1491975 -2887440 -4412989 -6314775 -8336304
35672 -8336304 -9784424 -9979214 -8587276 -5712382 -1872869 2120512 5432722 7533073
35664 7533073 8421193 8608138 8775532 9281436 9976498 10575700 11121544 11883054 12837288
35655 12837288 13543876 13647378 13270066 12736559 12106139 11213984 10061416 8913860 8034897
35646 8034897 7505383 7260526 7108017 6758822 6109471 5542632 5689398 6742733 8155996
35637 8155996 9144995 9365148 9004411 8407245 7826493 7427981 7239071 7021097 6370369
35628 6370369 5047145 3142867 933209 -1281651 -3156453 -4336318 -4714972 -4591181
35620 -4591181 -4385355 -4208650 -3884478 -3423718 -3269852 -3899681 -5248668 -6672465 -7443567
35611 -7443567 -7163958 -5763018 -3372926 -375404 2571005 4800189 6020701 6399244
35603 6399244 6318203 6151033 6204988 6644446 7347759 7977077 8355402 8718055 9422276 10401830
35593 10401830 11066016 10810248 9541913 7676597 5765781 4236532 3341148 3091053 3180644
35584 3180644 3157387 2806267 2319885 2027674 2022041 2108549 2024213 1571923 584282 -1063480
35574 -1063480 -3294316 -5700227 -7621336 -8429951 -7895678 -6408231 -4781386 -3644909
35566 -3644909 -2951736 -2157903 -893334 664356 2082475 3128053 3801912 4092729 3932849
35557 3932849 3361302 2525093 1499814 289485 -945339 -1844832 -2172322 -2087094 -1977656
35548 -1977656 -2096037 -2479748 -3153673 -4186188 -5479412 -6671293 -7393849 -7563708 -7283591
35539 -7283591 -6508670 -5030143 -2901453 -738175 623919 821115 221682 -534095 -1169353
35530 -1169353 -1913770 -3121138 -4854879 -6819425 -8593292 -9908488 -10776823 -11394575 -11902167
35521 -11902167 -12209113 -12068389 -11348319 -10231583 -9123144 -8328496 -7795174 -7172315 -6150505
$$ [...]
##END NTUPLES=NMR SPECTRUM
##END=
