##TITLE=31Pdec_DE-18kTFA
  CDCl3
  24 sc
 25.9.2023
##JCAMPDX= 6.0         $$ Bruker NMR JCAMP-DX V2.0
##DATA TYPE= NMR SPECTRUM
##DATA CLASS= NTUPLES
##ORIGIN= UXNMR, Bruker Analytische Messtechnik GmbH
##OWNER= root
$$ XWIN-NMR		Version 3.5
$$ Wed Sep 27 14:57:37 2023 Russian Standard Time (UT+4h)  she@DPX200
##.OBSERVE FREQUENCY= 81.013821
##.OBSERVE NUCLEUS= ^31P
##.ACQUISITION MODE= SIMULTANEOUS
##.ACQUISITION SCHEME= undefined
##.AVERAGES= 24
##.DIGITISER RES= 16
##SPECTROMETER/DATA SYSTEM= spect
##.PULSE SEQUENCE= zgpg30
##.SOLVENT NAME= CDCl3
##.SHIFT REFERENCE= (INTERNAL, CDCl3, 0, 248.564)
##AUDIT TRAIL= $$ (NUMBER, WHEN, WHO, WHERE, WHAT)
$$ ##TITLE= Audit trail, XWIN-NMR		Version 3.5
$$ ##JCAMPDX= 5.01
$$ ##ORIGIN= Bruker BioSpin GmbH
$$ ##OWNER= she
$$ F:/spectra/data/she/nmr/P31/1/pdata/1/auditp.txt
$$ ##AUDIT TRAIL=  $$ (NUMBER, WHEN, WHO, WHERE, WHAT)
(   1,<2023-09-27 14:56:46.76 +0400>,<she>,<DPX200>,
      <created by zg, POWCHK disabled, PULCHK disabled
       configuration hash MD5:
       00 E9 B6 7A A2 85 ED C7 34 08 36 98 17 FE 4E 26
       data hash MD5: 32K
       08 4F BC 4D 60 4B 95 A9 DC 4A 25 C3 D3 05 9D 26>)
(   2,<2023-09-27 14:56:50.32 +0400>,<she>,<DPX200>,
      <Start of raw data processing
       efp BC_mod = 2 LB = 5 FT_mod = 6 PKNL = 1 PHC0 = -10647.5 PHC1 = 25.68629 SI = 64K 
       data hash MD5: 64K
       D6 9F 9F 80 11 B1 D8 F0 DB 7A DF C9 23 BF 8A ED>)
(   3,<2023-09-27 14:57:07.87 +0400>,<she>,<DPX200>,
      <pk PHC0 = 20.5169 PHC1 = 0 
       data hash MD5: 64K
       98 8E 7F 2C 36 56 46 CB 7B D3 27 1A EC 6D 37 AD>)
$$ ##END=
$$ 
$$ hash MD5
$$ B7 E8 5F BA 49 46 E5 92 F1 3E 5E CF E2 DE DF DF
##$RELAX= 
##$RELAX= 
##$RELAX= 
##$RELAX= 
##$RELAX= 
##$RELAX= 
##$RELAX= 
##$RELAX= 
##$RELAX= 
$$ Bruker specific parameters
$$ --------------------------
##$DU= <F:/spectra>
##$EXPNO= 1
##$NAME= <P31>
##$PROCNO= 1
##$TYPE= <nmr>
##$USER= <she>
##$AMP= (0..31)
100 100 100 100 100 100 100 100 100 100 100 100 100 100 100 100 100 100 
100 100 100 100 100 100 100 100 100 100 100 100 100 100 
##$AQSEQ= 0
##$AQ_mod= 1
##$AUNM= <au_zg>
##$AUTOPOS= <>
##$BF1= 81.014009
##$BF2= 200.13
##$BF3= 200.13
##$BF4= 200.13
##$BF5= 200.13
##$BF6= 200.13
##$BF7= 200.13
##$BF8= 200.13
##$BYTORDA= 1
##$CFDGTYP= 0
##$CFRGTYP= 5
##$CHEMSTR= <none>
##$CNST= (0..31)
1 1 145 1 1 1 1 1 1 1 1 1 1 1 1 1 1 1 1 1 1 1 1 1 1 1 1 1 1 1 1 1 
##$CPDPRG= <waltz16>
##$CPDPRG1= <>
##$CPDPRG2= <waltz16>
##$CPDPRG3= <>
##$CPDPRG4= <mlev>
##$CPDPRG5= <mlev>
##$CPDPRG6= <mlev>
##$CPDPRG7= <mlev>
##$CPDPRG8= <mlev>
##$CPDPRGB= <>
##$CPDPRGT= <>
##$D= (0..31)
0 1 0 0 0 0 0 0 0 0 0 0.03 2e-05 3e-06 0 0 0 0 0 0 0 0 0 0 0 0 0 0 0 0 
0 0 
##$DATE= 1695812206
##$DBL= (0..7)
120 120 120 11 120 120 24 19 
##$DBP= (0..7)
150 150 150 150 150 150 150 150 
##$DBP07= 0
##$DBPNAM0= <>
##$DBPNAM1= <>
##$DBPNAM2= <>
##$DBPNAM3= <>
##$DBPNAM4= <>
##$DBPNAM5= <>
##$DBPNAM6= <>
##$DBPNAM7= <>
##$DBPOAL= (0..7)
0.5 0.5 0.5 0.5 0.5 0.5 0.5 0.5 
##$DBPOFFS= (0..7)
$$ [...]
##$SUBNAM2= <"">
##$SUBNAM3= <"">
##$SUBNAM4= <"">
##$SUBNAM5= <"">
##$SUBNAM6= <"">
##$SUBNAM7= <"">
##$SUBNAM8= <"">
##$SUBNAM9= <"">
##$SW= 501.771253377433
##$SWIBOX= (0..15)
0 1 3 0 0 0 0 0 0 0 0 0 0 0 0 0 
##$SW_h= 40650.406504065
##$TD= 32768
##$TD0= 1
##$TE= 0
##$TE2= 300
##$TE3= 300
##$TEG= 300
##$TL= (0..7)
0 120 53 12 22 120 120 120 
##$TP= (0..7)
150 150 150 150 150 150 150 150 
##$TP07= 0
##$TPNAME0= <>
##$TPNAME1= <>
##$TPNAME2= <>
##$TPNAME3= <>
##$TPNAME4= <>
##$TPNAME5= <>
##$TPNAME6= <>
##$TPNAME7= <>
##$TPOAL= (0..7)
0.5 0.5 0.5 0.5 0.5 0.5 0.5 0.5 
##$TPOFFS= (0..7)
0 0 0 0 0 0 0 0 
##$TUNHIN= 0
##$TUNHOUT= 0
##$TUNXOUT= 0
##$USERA1= <user>
##$USERA2= <user>
##$USERA3= <user>
##$USERA4= <user>
##$USERA5= <user>
##$V9= 5
##$VALIST= <valist>
##$VCLIST= <CCCCCCCCCCCCCCC>
##$VD= 0
##$VDLIST= <DDDDDDDDDDDDDDD>
##$VPLIST= <PPPPPPPPPPPPPPP>
##$VTLIST= <TTTTTTTTTTTTTTT>
##$WBST= 1024
##$WBSW= 4
##$XGAIN= (0..3)
0 0 0 0 
##$XL= 0
##$YL= 0
##$YMAX_a= 1740
##$YMIN_a= -3014
##$ZGOPTNS= <>
##$ZL1= 120
##$ZL2= 120
##$ZL3= 120
##$ZL4= 120
##$ABSF1= 0
##$ABSF2= 0
##$ABSG= 0
##$ABSL= 0
##$ALPHA= 0
##$AQORDER= 0
##$ASSFAC= 0
##$ASSFACI= 0
##$ASSFACX= 0
##$ASSWID= 0
##$AUNMP= <proc_1d>
##$AZFE= 0.1
##$AZFW= 0.5
##$BCFW= 0
##$BC_mod= 2
##$BYTORDP= 0
##$COROFFS= 0
##$CY= -3
##$DATMOD= 1
##$DC= 0
##$DFILT= <>
##$DTYPP= 0
##$F1P= 0
##$F2P= 0
##$FCOR= 1
##$FTSIZE= 65536
##$FT_mod= 6
##$GAMMA= 0
##$GB= 0
##$INTBC= 1
##$INTSCL= 6.047779e-11
##$ISEN= 30
##$LB= 5
##$LEV0= 0
##$LPBIN= 0
##$MAXI= 10000
##$MC2= 0
##$MEAN= 0
##$ME_mod= 0
##$MI= 50
##$NCOEF= 0
##$NC_proc= -10
##$NLEV= 6
##$NOISF1= 182.463
##$NOISF2= 159.3651
##$NSP= 0
##$NTH_PI= 0
##$NZP= 0
##$OFFSET= 248.5645
##$PC= 4
##$PHC0= -10626.98
##$PHC1= 25.68629
##$PH_mod= 1
##$PKNL= yes
##$PPARMOD= 0
##$PSCAL= 0
##$PSIGN= 0
##$REVERSE= no
##$SF= 81.0140089999694
##$SI= 65536
##$SIGF1= 159.3651
##$SIGF2= -187.1042
##$SINO= 113.3802
##$SIOLD= 16384
##$SREGLST= <1H.CDCl3>
##$SSB= 0
##$STSI= 65536
##$STSR= 0
##$SW_p= 40650.406504065
##$SYMM= 0
##$S_DEV= 0
##$TDeff= 32768
##$TDoff= 0
##$TI= <>
##$TILT= no
##$TM1= 0
##$TM2= 0
##$TOPLEV= 0
##$USERP1= <user>
##$USERP2= <user>
##$USERP3= <user>
##$USERP4= <user>
##$USERP5= <user>
##$WDW= 1
##$XDIM= 65536
##$YMAX_p= 240722418
##$YMIN_p= -221923998
$$ End of Bruker specific parameters
$$ ---------------------------------
##NTUPLES= NMR SPECTRUM
##VAR_NAME=  FREQUENCY,     SPECTRUM/REAL,   SPECTRUM/IMAG
##SYMBOL=    X,             R,               I
##VAR_TYPE=  INDEPENDENT,   DEPENDENT,       DEPENDENT
##VAR_FORM=  AFFN,          ASDF,            ASDF
##VAR_DIM=   65536,         65536,           65536
##UNITS=     HZ,            ARBITRARY UNITS, ARBITRARY UNITS
##FACTOR=    0.620285442955139, 1,           1
##FIRST=     20137.2065510682, 0,            0
##LAST=      -20513.1999529968, 0,           0
##MIN=       -20513.1999529968, -221923998,  0
##MAX=       20137.2065510682, 240722418,    0
$$ Real data points
##PAGE= N=1
##DATA TABLE= (X++(R..R)), XYDATA
$$ [...]
43329B1826080j221310j405049j418315j454350j486849j313395p88835j01906
43321A2636071K40052j27558r75152j654518j777339j588633j604689j998872
43313C149362k436988k446911j867337r86324l31073k97891q68251j599146j910325
43304i594884j488471n18254M62801R82423R26019M34595l39331j190658j665360
43295a1991120j271238p3615J162346J693406J529264J200736R69667O52871J79069
43286e948614j45013q4816J70789L53587N32512Q84211J239828J212578P19926
43277a065012P4440m45515q39425j157295j303871j211069j020208r19825q89925
43268h777705p43625l76360J25949N89343Q80719R69698R39780R14666R07739
$$ y = [21826080, 20604770, 19199721, 17781406, 16327056, 14840207, 13526812, 12737977, 12636071, 12876123, 12748565, 11773413, 10118895, 8341556, 6752923, 5148234, 3149362, 712374, -1734537, -3601874, -4588198, -4919271, -5217162, -6085413, -7684559, -9594884, -11083355, -11601609, -11138808, -10156385, -9230366, -8795771, -9135102, -10325760, -11991120, -13262358, -13335973, -12173627, -10480221, -8950957, -7750221, -6780554, -6127683, -5948614, -6093627, -6178443, -6007654, -5654067, -5121555, -4237344, -2997516, -1784938, -1065012, -990572, -1436087, -2275512, -3432807, -4736678, -5947747, -6967955, -7887780, -8777705, -9521330, -9897690, -9771741, -9182398, -8301679, -7331981, -6392201, -5477535, -4569796]
43259d569796P66619L30923l63974j077754j528487j538810j112228m74367J8316
43250i549558J64375J22382K03982M57287O19444N27659L75109M14443N72251
43241f092626N79620M02556K93927M13300O21095P06634O24667M27723J59261
43232a863843o2253l8207K35708M06109J00692n89441j147798j163001o74720
43223d796754J1058O68457J227633J638259J812522J721076J490414J358464J476563
43214F607692J715792J728335J298867O14147O8900k00904m48432r13189j424447
43205I046761j566317j207874p13015n61214q43701j210907j271626r55936n03492
43196B12679k13500k48095n49003q10077o14530J80769J155826J620811J324355
$$ y = [-4569796, -3803177, -3472254, -3836228, -4913982, -6442469, -7981279, -9093507, -9567874, -9549558, -9385183, -9262801, -9058819, -8601532, -7982088, -7454429, -7079320, -6664877, -6092626, -5513006, -5110450, -4816523, -4403223, -3782128, -3075494, -2450827, -2023104, -1863843, -1926096, -1964303, -1728595, -1322486, -1221794, -1811235, -2959033, -4122034, -4796754, -4785696, -4117239, -2889606, -1251347, 561175, 2282251, 3772665, 5131129, 6607692, 8323484, 10051819, 11350686, 11964833, 12033733, 11832829, 11384397, 10471208, 9046761, 7480444, 6272570, 5559555, 4998341, 4154640, 2943733, 1672107, 716171, 212679, -821, -248916, -797919, -1607996, -2222526, -2041757, -885931, 734880, 2059235]
43187B059235P28666M30808M43708K85013k63133p54986n49529M72292J759212
43178D611286K549482K395430J374444j2644j137833j607778j479375j148412
43170E544600r93032j088545j229823j177659q37901k19003O75322J791036K862074
43161E327069L424303L096183J878036K10046j226721j860703j592342q85853
43153H370018l63833k21385j51149J05401L44040K03001k86837o93452o50932
43144F654872j49952N33945R89168Q74360K82323j61804R6042Q22917J203068
43135A1144939P82287j31570j037390j753363k183416k049818j260472k59455
43127C251742M04713P01530R51744J204912J215026R77197Q42780J017002J278799
$$ y = [2059235, 2787901, 3218709, 3662417, 3947430, 3684297, 2929311, 2379782, 2852074, 4611286, 7160768, 9556198, 10930642, 10917998, 9780165, 8172387, 6693012, 5544600, 4551568, 3463023, 2233200, 1055541, 217640, -1363, 673959, 2464995, 5327069, 8751372, 11847555, 13725591, 13935637, 12708916, 10848213, 9255871, 8370018, 8006185, 7784800, 7633651, 7739052, 8083092, 8286093, 7999256, 7305804, 6654872, 6504920, 7038865, 8028033, 8902393, 9184716, 9022912, 9118954, 9941871, 11144939, 11927226, 11795656, 10758266, 9004903, 6821487, 4771669, 3511197, 3251742, 3656455, 4357985, 5309729, 6514641, 7729667, 8706864, 9549644, 10566646, 11845445]
43118A1845445J295839R30670J52929j025410k340158l254377l398270k920002
43110A286666k241126j597267r98138n01904k37265j19533K14371J005916J972592
43101a215688K487590K247823J659614J388197J533610J488789P51027l49564
43093I991398j026984j048176r94619j438866k196182k614132k379130j751429
43085c458120j108309n67446j14543J32067m1061o80525j537323k224984k495098
43076a2095342k357041j954218j391667p37022j21390L03129N31633P21892J002752
43067a6097274J361130J735016K068415K206467J908717J127727J78339n30294
43059f041757q72360r77692r08177n60582J14562R71473J775073K329412K523711
$$ y = [11845445, 13141284, 14071954, 14224883, 13199473, 10859315, 7604938, 4206668, 1286666, -954460, -2551727, -3549865, -4051769, -4289034, -4408567, -4194196, -3188280, -1215688, 1271902, 3519725, 5179339, 6567536, 8101146, 9589935, 10340962, 9991398, 8964414, 7916238, 6921619, 5482753, 3286571, 672439, -1706691, -3458120, -4566429, -5133875, -5248418, -5116351, -5157412, -5837937, -7375260, -9600244, -12095342, -14452383, -16406601, -17798268, -18535290, -18656680, -18353551, -17821918, -17100026, -16097274, -14736144, -13001128, -10932713, -8726246, -6817529, -5689802, -5511463, -6041757, -6914117, -7891809, -8799986, -9360568, -9246006, -8274533, -6499460, -4170048, -1646337]
43050a646337K416024K260407K239062K128815J478771K52018r23566j355847
43042F849347j015430m62997j62411j14495j15854p0166M5657K71478N37084N87139
43032F349352K29712l85589q96617j139451j308367j662966k138837k299210j692304
43023d944277l09637J261220K191222K042394J123532K04168j59270l2158J25042
43014A502236K2796j87263k23540j60908m25276j215933k096436k405179k041726
43005g231229j545945j298580r79389j30053R58160J376888O59971o63741j712701
42996a0566619k120707k040093j580750o71660N43295J536085J804907J342501
42988a1753041O02389O8076q3370N0105L62118R01307J724176K620095L122187
$$ y = [-1646337, 769687, 3030094, 5269156, 7397971, 8876742, 9128760, 8205194, 6849347, 5833917, 5370920, 5208509, 5094014, 4978160, 4907994, 4953651, 5225129, 5762213, 6349352, 6579064, 6193475, 5296858, 4157407, 2849040, 1186074, -952763, -3251973, -4944277, -5253914, -3992694, -1801472, 240922, 1364454, 1568622, 1409352, 1377194, 1502236, 1525032, 1337769, 1114229, 953321, 528045, -687888, -2784324, -5189503, -7231229, -8777174, -10075754, -11055143, -11185196, -10227036, -8850148, -8190177, -8853918, -10566619, -12687326, -14727419, -16308169, -16979829, -16436534, -14900449, -13095542, -11753041, -11150652, -11082576, -11165946, -11115841, -10753723, -9852416, -8128240, -5508145, -2385958]
42979b385958K896006K068583J096022L61592j8429q4760J03387M98518J072209
42970E607170J790273K491414K839470K550176J673676N35257n66929j429806
42962A5490701j763345j281741j65475P94283Q08542j71345j479940k422049k739004
42953G070627k478003j728097o34813N04468J356611J747710J683727J256142
42945H778372O07468r7645p91634j544138k344996k871705k657388j583021j06551
42936b611238J098565J704138J890067K027178K284921K501210K334334J564776
42928A2793951L62984p20754j133779p57507M3356P85883J221728J369877J352474
42919A5318213J255309J036698N06615m78895j686231k480267k332793j373412
$$ y = [-2385958, 510048, 2578631, 3674653, 4036245, 4017816, 3933056, 4036443, 4534961, 5607170, 7397443, 9888857, 12728327, 15278503, 16952179, 17487436, 16920507, 15490701, 13727356, 12445615, 12280140, 13074423, 13882965, 13711620, 12231680, 9809631, 7070627, 4592624, 2864527, 2229714, 2734182, 4090793, 5838503, 7522230, 8778372, 9385840, 9288195, 8496561, 6952423, 4607427, 1735722, -921666, -2504687, -2611238, -1512673, 191465, 2081532, 4108710, 6393631, 8894841, 11229175, 12793951, 13156935, 12436181, 11302402, 10544895, 10588251, 11374134, 12595862, 13965739, 15318213, 16573522, 17610220, 18116835, 17637940, 15951709, 13471442, 11138649, 9765237]
42911I765237l13504J92401K3760n14077j069158j431007j505244j296574r30684
42902B921150n99374m45074m96268o55082o87230l00002N94026J626028K132176
42893D090350J761109R23199M55340P41766J298986J380771Q92953M75547O69684
42884A2689705J243181J457874Q30723n11787k069321l327407l946425l838323
42876B528220l144228k072479p81326N08514J402196J559525J062964L86446n9264
42867A390568k31088k90530l11805k46720o6626J56689K50603r335p28314j682171
42857a768729k368707k385697j758541q84250k17297o377j83781m01615k69719
42848a0244713K98274R75718J333358J263218J071144J182335J772706K620113
$$ y = [9765237, 9451733, 9644134, 9667894, 9153817, 8084659, 6653652, 5148408, 3851834, 2921150, 2321776, 1876702, 1380434, 725352, 38122, -261880, 332146, 1958174, 4090350, 5851459, 6774658, 7229998, 7971764, 9270750, 10651521, 11544474, 12020021, 12689705, 13932886, 15390760, 16221483, 15709696, 13640375, 10312968, 6366543, 2528220, -616008, -2688487, -3469813, -2961299, -1559103, 422, 1063386, 1449832, 1390568, 1159480, 868950, 557145, 310425, 243799, 400488, 651091, 641756, -86558, -1768729, -4137436, -6523133, -8281674, -9165924, -9383221, -9389598, -9573379, -9974994, -10244713, -9946439, -8970721, -7637363, -6374145, -5303001, -4120666, -2347960, 272153]
42840B72153L250533L251356K497049J128309n72544k198727l254029l452779
42832I21321l045556k627855k518742k505741k276163j816152j176831j51754
42824a5197473J380001K891631L483083K873270J786245J133431J043732R51807
42816C45727M85879n1327j01795M86577J328447J911368K014200J741273J250588
42807I410937N45275m25303j504336k285043k417459j939531j233383o44392k07588
42798g00823K15277N99740O78132K31066o21806j509593k166078k614220k994939
42789h883244l309157l385549l054013k302752j298059k85448N64445J248100
42781b0705677J838572K287794K388895J998487J252971M85283p3998m67447q78791
$$ y = [272153, 3522686, 6774042, 9271091, 10399400, 9826856, 7628129, 4374100, 921321, -2124235, -4752090, -7270832, -9776573, -12052736, -13868888, -15045719, -15197473, -13817472, -10925841, -7442758, -4569488, -2783243, -1649812, -606080, 345727, 831606, 780279, 678484, 1165061, 2493508, 4404876, 6419076, 8160349, 9410937, 9956212, 9530909, 8026573, 5741530, 3324071, 1384540, 151157, -493235, -700823, -485546, 114194, 792326, 1023392, 401586, -1108007, -3274085, -5888305, -8883244, -12192401, -15577950, -18631963, -20934715, -22232774, -22518222, -21953777, -20705677, -18867105, -16579311, -14190416, -12191929, -10938958, -10453675, -10527673, -10995120, -11873911]
42772a1873911j352346j657692j477374p93692o4335J11924m25901j204965j528380
42763b0266672j033259J18829J431824K385349K718970K560487K226602J857715
42755h000155J379918Q55755N90337O72654O55424N4333r39506j638748j747512
42746h117500j655352j725315j701089j132815j43672O07280O81174K86563q1248
42737a2981974j90238j42485m2705K03292P10785J348646J794579J873977J705890
42728e720233J441271J033302M61136L7730J66264P72102J281951J274141R04648
42719A652312N82255M93952O21731R47364J346902J452520R45661l8117r99320
42710G005260j513832j436408q44052p2971K90085j68845j195909k039169k180519
$$ y = [-11873911, -13226257, -14883949, -16361323, -17155015, -17219350, -17107426, -17533327, -18738292, -20266672, -21299931, -21181102, -19749278, -17363929, -14644959, -12084472, -9857870, -8000155, -6620237, -5764482, -5174145, -4501491, -3846067, -3791734, -4731240, -6369988, -8117500, -9772852, -11498167, -13199256, -14332071, -14475743, -13868463, -13187289, -12900726, -12981974, -13172212, -13314697, -13357402, -13154110, -12443325, -11094679, -9300100, -7426123, -5720233, -4278962, -3245660, -2784524, -2746794, -2580530, -1808428, -526477, 747664, 1652312, 2234567, 2728519, 3350250, 4297614, 5644516, 7097036, 8042697, 8004580, 7005260, 5491428, 4055020, 3210968, 3137997, 3428082, 3259237, 2063328, 24159, -2156360]
42701b156360j726677j096331n83528k67546p7039J64516N43043Q31213P05518
42692c663191K65846L2766K54327N14643K98853k93136p19476p04244m08624j2946
42682d435182M36130P35900N23468k22746r46439j025669m12009L77997P82806
42673d185744N84361o8088q20481j345230j555046j581229j498376j185134n62643
42664a2217610J65381P05168J035940J356617J665843J630268J003232O4960m91447
42655e081648j37792J006930K217914K719720K312118J471289P86119L66935n2349
42646E609236n22196o91099k93299M48996J091187J425210J464855J190869O48662
42637A0372421K00285K83873Q49942J348292J407199J274283J414449J869544
$$ y = [-2156360, -3883037, -4979368, -5562896, -5830442, -5907481, -5742965, -5199922, -4368709, -3663191, -3397345, -3364579, -3110252, -2595609, -2296756, -2589892, -3309368, -4013612, -4422236, -4435182, -3999052, -3263152, -2739684, -2962430, -3908869, -4934538, -5346547, -4968550, -4185744, -3601383, -3669471, -4489952, -5835182, -7390228, -8971457, -10469833, -11654967, -12217610, -12052229, -11347061, -10311121, -8954504, -7288661, -5658393, -4655161, -4590201, -5081648, -5219440, -4212510, -1994596, 725124, 3037242, 4508531, 5294650, 5661585, 5609236, 5087040, 4395941, 4102642, 4551638, 5642825, 7068035, 8532890, 9723759, 10372421, 10572706, 10856579, 11706521, 13054813, 14462012, 15736295, 17150744, 19020288]
42629A9020288K217632K045258J290748K33140o75936j057128q94726n92039o12167
42620B0975070j072920j761365k430268k912839l039029k689176j961779j113841
42612C993853l16526L64317P58165O18761k9736p83087j247415j386315j328435
42603F43582j010029k80816O89637J402129J518720J188664P84700M59412J10098
42594E506097l02758o03159o21717m52437l76951n45174p99610q27177m44910
42585E32204K49192R16743J142303O93639k23973j012779j159330p12848j60035
42576B65116K02658N73128J197636J833619J956878J472012R12224Q02745J014376
42567A0230392R19511J01775j226678k445708l014712k772541j935294r02716
$$ y = [19020288, 21237920, 23283178, 24573926, 24807066, 24131130, 23074002, 22179276, 21587237, 20975070, 19902150, 18140785, 15710517, 12797678, 9758649, 7069473, 5107694, 3993853, 3677327, 4041644, 4799809, 5418570, 5388834, 4605747, 3358332, 1972017, 643582, -366447, -647263, 42374, 1444503, 2963223, 4151887, 4936587, 5395999, 5506097, 5203339, 4600180, 3978463, 3526026, 3149075, 2603901, 1804291, 977114, 532204, 781396, 1698139, 2840442, 3534081, 3310108, 2297329, 1137999, 425151, 265116, 467774, 1040902, 2238538, 4072157, 6029035, 7501047, 8413271, 9216016, 10230392, 11149903, 11251678, 10025000, 7579292, 4564580, 1792039, -143255, -1045971]
42559a045971k5592N28802P81215R04627J167163J739924K428343K691545K115843
42550A1285899Q67390m68233j483152k209029k782670l113932l044412k645026
42542c593165k116902j475526n71684N68330J623964K257526K373988K072148
42534A138679J491288P84853J25402l72550o93474q54599q80282q62900r12729
42525a036312r64400p58333j48316O43566J207894J340262J141711P86649L51875
42516B564596j19276n39147q37628j020314j097716j002470o45184o6415M82780
42507b280774O51324K58741m92269j121549j266846r76411n88464l71080l25942
42498f513270k73753m1618L80031P56667P28354J53000o53693j133740r75617
$$ y = [-1045971, -1071563, -542761, 238454, 1143081, 2310244, 4050168, 6478511, 9170056, 11285899, 12153289, 11685056, 10201904, 7992875, 5210205, 2096273, -948139, -3593165, -5710067, -7185593, -7757277, -7188947, -5564983, -3307457, -933469, 1138679, 2629967, 3414820, 3540222, 3167672, 2474198, 1619599, 739317, -123583, -1036312, -2000712, -2759045, -2907361, -2263795, -1055901, 284361, 1426072, 2212721, 2564596, 2445320, 1906173, 1068545, 48231, -1049485, -2051955, -2697139, -2763554, -2280774, -1629450, -1370709, -1862978, -2984527, -4251373, -5227784, -5816248, -6187328, -6513270, -6787023, -6828641, -6448610, -5691943, -4963589, -4810589, -5464282, -6598022, -7573639]
42489g573639l29083M32382J037297J401958J536492J450053J120009N66164l788
42480c62155k32717J5559L60934K18866n33705j399263j827003j722453j304223
42471f786160p31174j03551L60321M56337K58753K6623j19706k29605k78034j27812
42461g274008K52680P45220J279233J859047K346150K457154K126229J697358
42453E489063J567914J728639J836835J712245J572987J710653K044520K121254
42445A9784110J553527L71480j079385k451503l458491l731935k956724j331595
42437F699484L15415J147796J011236L35134n12144j451750k325996k721071k363206
42428A34898j466769n00194K46543P32264R93328J096971J138948J099207P91829
$$ y = [-7573639, -7902722, -7470340, -6433043, -5031085, -3494593, -2044540, -924531, -358367, -362155, -594872, -579313, -218379, 487, -533218, -1932481, -3759484, -5481937, -6786160, -7517334, -7620885, -7260564, -6804227, -6545474, -6518851, -6638557, -6868162, -7146196, -7274008, -7021328, -6276108, -4996875, -3137828, -791678, 1665476, 3791705, 5489063, 7056977, 8785616, 10622451, 12334696, 13907683, 15618336, 17662856, 19784110, 21337637, 21709117, 20629732, 18178229, 14719738, 10987803, 8031079, 6699484, 7014899, 8162695, 9173931, 9509065, 8996921, 7545171, 5219175, 2498104, 134898, -1331871, -1832065, -1585522, -853258, 140070, 1237041, 2375989, 3475196, 4267025]
42419D267025J29181o50324j194246j411610j473355j503338j444907j191838
42411d473412o83964Q6517R86584J687648J888762J610670J131332O63443K69860
42402C167440N0374J46627M95955Q02998Q66568P72461O76437N76668M20597K60131
42392H236256J22707j53117p46742j534086k066250j886024q61376O69561K003746
42383C784675K495919K108350J513862J460808J998707K445899K123157J000427
42375A8931804l63002j337222j622325j316899p74573l66983k44293k61360j75263
42366A2469884M7397J44510j63682q07437j375702j582251j637584j953574k464028
42357B677533k511471j619327k17777O83248N27648l08672j062049j317772j106687
$$ y = [4267025, 4396206, 3745882, 2551636, 1140026, -333329, -1836667, -3281574, -4473412, -5157376, -5070859, -4084275, -2396627, -507865, 1102805, 2234137, 2897580, 3167440, 3217814, 3364441, 3860396, 4663394, 5529962, 6302423, 6978860, 7555528, 7976125, 8236256, 8358963, 8205846, 7459104, 5925018, 3858768, 1972744, 1111368, 1780929, 3784675, 6280594, 8388944, 9902806, 11363614, 13362321, 15808220, 17931377, 18931804, 18568802, 17231580, 15609255, 14292356, 13517783, 13150800, 12906507, 12645147, 12469884, 12517281, 12661791, 12498109, 11690672, 10314970, 8732719, 7095135, 5141561, 2677533, 166062, -1453265, -1671042, -987794, -460146, -768818, -1830867, -3148639, -4255326]
42348d255326n64974J96734R44996J311817J057684L07087n09951r56295q83985
42339c352213m98580j34823L4323M7594k9205k07244m70565p07486q29368q59121
42329g006688q31538p26202n89409n69808o73529o22329j84775M30467P71027
42320a0002784P01852M81480K46847k35484j112237j999133k288809j804832r02692
42311a6915792K9641R23645J858497K757004L372477L493403L095727K349537
42303I64139J516150Q01791K92863L2077P3537L62791O25075N47147J12658l61542
42293D966686n67650m83606k78980q7119L8133O1719R080J1320J62945L41884
42283D174412L00501k9861m15967n51904l59846l1845J79854J78196O4757J2942
$$ y = [-4255326, -4820300, -4623566, -3678570, -2366753, -1309069, -1001982, -1511933, -2468228, -3352213, -3850793, -3985616, -3951293, -3903699, -3932904, -4140148, -4610713, -5318199, -6147567, -7006688, -7838226, -8564428, -9153837, -9723645, -10397174, -11019503, -11204278, -10773811, -10002784, -9300932, -8819452, -8572605, -8808089, -9920326, -11919459, -14208268, -16013100, -16915792, -16886151, -15962506, -14104009, -11347005, -7974528, -4481125, -1385398, 964139, 2480289, 3282080, 3574943, 3607020, 3680557, 4043348, 4668423, 5215570, 5328228, 4966686, 4399036, 3915430, 3636450, 3549331, 3587464, 3649183, 3658263, 3669583, 3832528, 4174412, 4474913, 4445052, 4029085, 3477181, 3117335, 3085490, 3265344, 3443540, 3508297, 3521239]
42273C521239Q9775J82347J15190j35899l57064k56936K62815R96372J601447
42264F019286J880860J892027J782832J552576J011467j9877j471896k940626
42256I706649l806898l550100k163638l52169Q48574Q74580R0475o50177q73187
42247A24109p73697o79464n22196n4038N83855Q59240M99777r0524k57143J49301
42237a60780O11380N24392j88980j037275j392640r31494J83813J391087K039929
42228A039432J818807J009729K97682K28580P73715J387471J493476R59573J65090
42219I173555l48049k90563K35669Q87812J285130J137495L78180p07886j589446
42210A0161897j902047j781468j676269j800821j880287j498549o22042K97131
$$ y = [3521239, 3611014, 3793361, 3908551, 3772652, 3415588, 3158652, 3421467, 4417839, 6019286, 7900146, 9792173, 11575005, 13127581, 14139048, 14119171, 12647275, 9706649, 5899751, 2349651, 186013, -166156, 682418, 1556998, 1647473, 997296, 124109, -649588, -1329052, -1851248, -1905286, -1321431, -462191, 37586, -52938, -310081, -160780, 450600, 974992, 786012, -251263, -1643903, -2575397, -2391584, -1000497, 1039432, 2858239, 3867968, 4165650, 4394230, 5167945, 6555416, 8048892, 9008465, 9173555, 8825506, 8534943, 8770612, 9658424, 10943554, 12081049, 12459229, 11751343, 10161897, 8259850, 6478382, 4802113, 3001292, 1121005, -377544, -999586, -702455]
42202g02455P04421L91670l67732j048298j259937r83865m54618J66280R18908
42193b635626J809827K559916K747003K223379J290874M13367j81935n73947q90162
42184F762696j092585j060577q25353o14552o07704p11250o91968n29204m76736
42175A52767o73958q18942m16806O53030J963694K939323L272291K933236K019257
42166A2023892P95782k50741p02788o25786n12977p15767j050850j081612o77747
42157G201406j25921K77656N55722R12645J399739J811291J850786J347163L98704
42148A5629191o07456j202731j199113q23550m03672L144N04084R52243R02331
42139A3754471R6639j179552k360083l086156l320205l157150k767313k453059
$$ y = [-702455, 1966, 393636, 25904, -1022394, -2282331, -3266196, -3720814, -3554534, -2635626, -825799, 1734117, 4481120, 6704499, 7995373, 8408740, 8226805, 7652858, 6762696, 5670111, 4609534, 3784181, 3169629, 2561925, 1850675, 1158707, 629503, 152767, -521191, -1340133, -1756939, -1103909, 859785, 3799108, 7071399, 10004635, 12023892, 12819674, 12568933, 11866145, 11240359, 10727382, 10011615, 8960765, 7879153, 7201406, 7075485, 7353141, 7908863, 8821508, 10221247, 12032538, 13883324, 15230487, 15629191, 15021735, 13819004, 12619891, 11796341, 11392669, 11395813, 11899897, 12852140, 13754471, 13851110, 12671558, 10311475, 7225319, 3905114, 747964, -2019349, -4472408]
42131d472408k478473k758905k877541k482594j562659l15132J071345K388545
42123a3487822L319393L604035L319510K857466K556123K424787K295106K161736
42115I050334K198284K374724K233008J284946l53712j948698k881688l231667
42107H725531l470351l741609l703502l040437j878521o65902J43587K65419k67755
42098g633540r60704j061625j82175J283237K474215K790308K265690J349646
42090C25052M84164j23403m78035o57285p00284o21480m94939m44155n21385o64125
42080c895875p99468r09640r50968q09393m34406L5093L70899M65799L94826L01505
42070f231628K71295K86563K74125K31728L05691O54640J213942J705099J923311
$$ y = [-4472408, -6950881, -9709786, -12587327, -15069921, -16632580, -16947712, -15876367, -13487822, -10168429, -6564394, -3244884, -387418, 2168705, 4593492, 6888598, 9050334, 11248618, 13623342, 15856350, 17141296, 16787584, 14838886, 11957198, 8725531, 5255180, 1513571, -2189931, -5230368, -7108889, -7774791, -7631204, -7365785, -7633540, -8594244, -9655869, -9838044, -8554807, -6080592, -3290284, -1024594, 325052, 809216, 685813, 207778, -449507, -1149791, -1771271, -2266210, -2710365, -3231750, -3895875, -4695343, -5604983, -6555951, -7365344, -7799750, -7764657, -7393758, -6927959, -6533133, -6231628, -5960333, -5673770, -5399645, -5167917, -4862226, -4207586, -2993644, -1288545, 634766]
42061F34766J893596J689461J276963O89973K18204J98468O50071J279229J804666
42052A0335397K108314K101549J669812Q25701k19625j208311j985336k499532
42044A1127969k780832k936483l037933k973678k552605j822578j153842q83270
42036g013252r39187r26936n61040O8926O46212R55827J033528J030039J006864
42027d699019R40593R12144J137423J668760K140846K033025J256263L30580j32226
42018E588389l1028K39773L08053J58601k4392j51280k60895l72585m52688n15462
42008D486486o34895q23136r94555j103142j219858j386206j478939j353499j071130
41999e578874q38459p60957q21712j047314j427822j655427j297241m23945K30139
$$ y = [634766, 2528362, 4217823, 5494786, 6184759, 6402963, 6601431, 7251502, 8530731, 10335397, 12443711, 14545260, 16215072, 17040773, 16821148, 15612837, 13627501, 11127969, 8347137, 5410654, 2372721, -600957, -3153562, -4976140, -6129982, -7013252, -7952439, -8879375, -9440415, -9371489, -8725277, -7769450, -6735922, -5705883, -4699019, -3758426, -2846282, -1708859, -40099, 2100747, 4133772, 5390035, 5720615, 5588389, 5557361, 5797134, 6105187, 6263788, 6239396, 6088116, 5827221, 5454636, 5001948, 4486486, 3851591, 3028455, 2033900, 930758, -289100, -1675306, -3154245, -4507744, -5578874, -6417333, -7178290, -8000002, -9047316, -10475138, -12130565, -13427806, -13851751, -13621612]
41990a3621612N5488o44140r77370m99617L88591J034625J194541J070761J007282
41981a0991451J256659J796535K239078K116747J399904N92230K00668K26681
41973a162949K61900l4687o24632j129688j122310n00402L75771J026905J322706
41964a587386J441691J413741J017782K30474n23020p63280m10508K93008J085419
41955B197921J747023K110145K230790K332749K355994J819988M57855j227822
41947A4024643k427719k902204k995911k898550k395831j403021k77054N84319
41939f91328J125589J463182J636372J687667J698065J554536R58331j10611j175523
41930H146280j745927j804892j579121j090011l15967L59294L38459m81520j528363
$$ y = [-13621612, -13566124, -14210264, -15187634, -15687251, -15298660, -14264035, -13069494, -11998733, -10991451, -9734792, -7938257, -5699179, -3582432, -2182528, -1590298, -1389630, -1162949, -901049, -935736, -1560368, -2690056, -3812366, -4312768, -3936997, -2910092, -1587386, -145695, 1268046, 2285828, 2516302, 1993282, 1230002, 819494, 1112502, 2197921, 3944944, 6055089, 8285879, 10618628, 12974622, 14794610, 15252465, 14024643, 11596924, 8694720, 5698809, 2800259, 404428, -998593, -1275647, -691328, 434261, 1897443, 3533815, 5221482, 6919547, 8474083, 9432414, 9321803, 8146280, 6400353, 4595461, 3016340, 1926329, 1610362, 1969656, 2308115, 1826595, 298232]
41921B98232k170691k240093j872304j180186l17767L81858O64828O88354Q31422
41912d916347J169947J353590J047032L18028m77593j041135j270296j200490
41904e017264r66477p64501p08927p28792o94008o16806o32154q10341j099992
41895a2039262j416560j626580j453923o26777P57559K141095K898813K763912
41887h601723J851579M82252q46506j502061j068171K70182J831458K943304L260939
41878a378747K711418J432121j39481j350361j740160j382797p88722n07670p87023
41869c931422j434762j913917j699070p09009O03400J651046K187656K366302
41861b879776K408780K318803J918587J098372m622j062364j765648j960091j618306
$$ y = [298232, -1872459, -4112552, -5984856, -7165042, -7482809, -7100951, -6436123, -5747769, -4916347, -3746400, -2392810, -1345778, -1027750, -1505343, -2546478, -3816774, -5017264, -5983741, -6748242, -7457169, -8185961, -8879969, -9496775, -10128929, -10939270, -12039262, -13455822, -15082402, -16536325, -17163102, -16405543, -14264448, -11365635, -8601723, -6750144, -6267892, -7114398, -8616459, -9684630, -9414448, -7582990, -4639686, -1378747, 1332671, 2764792, 2625311, 1274950, -465210, -1848007, -2636729, -3144399, -3931422, -5366184, -7280101, -8979171, -9688180, -9084780, -7433734, -5246078, -2879776, -470996, 1847807, 3766394, 4864766, 4860144, 3797780, 2032132, 72041, -1546265]
41852a546265q13097J92830R48107J103241P11916J06019n08676j141387j705927
41843b653239j923945j718217j473116j607897j967428j925505j129653Q2266
41835a4316734J084895J589249J730789J686308J430695Q95966K16348k96270
41827e978754m01499j07448L80439Q31991J112387J189276J061688O82070j3177
41818a243027r07649j553740j415516m37296P15279J196614P92567N9193l28602
41809c122177j77153K80620P60209J074459J095320Q13141M04883Q9441p7748
41800A140995j83016k79167l15452j81717K40202R49529J637971J768324J050634
41791E828303j91526j275250j733920j535594q91915j27834L13469P9407p34991
$$ y = [-1546265, -2359362, -2166532, -1218425, -115184, 596732, 702751, 194075, -947312, -2653239, -4577184, -6295401, -7768517, -9376414, -11343842, -13269347, -14399000, -14316734, -13231839, -11642590, -9911801, -8225493, -6794798, -5898832, -5682484, -5978754, -6380253, -6487701, -6107262, -5275271, -4162884, -2973608, -1911920, -1229850, -1243027, -2150676, -3704416, -5119932, -5557228, -4841949, -3645335, -2852768, -2793575, -3122177, -3299330, -3018710, -2258501, -1184042, -88722, 724419, 1129302, 1218743, 1140995, 957979, 678812, 363360, 181643, 421845, 1371374, 3009345, 4777669, 5828303, 5636777, 4361527, 2627607, 1092013, 200098, 72264, 385733, 465140, -269851]
41782b69851j604536k040619j936152j461775q34834k49397J78255N10133Q83780
41773f824996J241241J347587J163138R70017R76359J008495Q07570M59488K77158
41764A426057L61336N24393N77982M54385R9585m80353j056648j317062j232148
41755f42473j083559j069564j074157q99719n40021j15282L01218O50796P88589
41746c684172N62112k1848p55682j323824j459758j138032o45831l50447l60511
41737i177993n21442p24423j008790j308843j356771j002630m26457J74064R19369
41728a4433916J976880L046433L463503K913763J854071J128837J256832K083354
41720C289757K963738L233712K651308J517093L77006l97191p56827q43137q33804
$$ y = [-269851, -1874387, -3915006, -5851158, -7312933, -8147767, -8397164, -8218909, -7708776, -6824996, -5583755, -4236168, -3073030, -2103013, -1126654, -118159, 689411, 1148899, 1426057, 1787393, 2311786, 2889768, 3344153, 3443738, 2963385, 1906737, 589675, -642473, -1726032, -2795596, -3869753, -4769472, -5309493, -5424775, -5123557, -4472761, -3684172, -3122060, -3143908, -3899590, -5223414, -6683172, -7821204, -8467035, -8817482, -9177993, -9699435, -10423858, -11432648, -12741491, -14098262, -15100892, -15527349, -15353285, -14433916, -12457036, -9410603, -5947100, -3033337, -1179266, -50429, 1206403, 3289757, 6253495, 9487207, 12138515, 13655608, 14032614, 13635423, 12878596, 12035459, 11201655]
41711A1201655q53672q98315q84107q74243j138450j798289k510592k753775k379099
41702b888887j620809o44320N14304J524720J768528J057141K8534m95734l55810
41693a112333O253K26340K88733K52191Q7315j98763n20123p70490p32328o9312
41683b542517J248895K562971K954460K163897Q21514k83409q72070j058083r36859
41674D058799n47920m4874L47909M98563M03661J76893M0628J23115J78217k44013
41664D990978j174575j987546k002988j173683J5182J119936J922101K208589
41656C917994J794288Q37314j46452o98752p07977k85963M10772J152251J632251
41647G905726J667607J348665R15657N38003K57603P9744N0856K44364O55635
$$ y = [11201655, 10347983, 9449668, 8565561, 7691318, 6552868, 4754579, 2243987, -509788, -2888887, -4509696, -5154016, -4639712, -3114992, -1346464, -289323, -260789, -756523, -1112333, -1106080, -879740, -591007, -338816, -251501, -450264, -970387, -1740877, -2473205, -2542517, -1293622, 1269349, 4223809, 6387706, 7209220, 6925811, 6053741, 4995658, 4058799, 3510879, 3466005, 3813914, 4312477, 4716138, 4893031, 4933659, 5056774, 5234991, 4990978, 3816403, 1828857, -174131, -1347814, -1332632, -212696, 1709405, 3917994, 5712282, 6549596, 6403144, 5704392, 4996415, 4710452, 5121224, 6273475, 7905726, 9573333, 10921998, 11837655, 12375658, 12633261, 12713005, 12763861, 13008225, 13663860]
41638A3663860J091034J230663Q94084K13845n21952j121088j478666j452460
41630A2519320r97880m18501k30226o77864j517847k290574k629269k326631j429844
41621F84m20596n087m44313j235520j680069j614891j335402r76654l76981M49049
41611g639780J106877J264756J054425Q54026Q37242Q89543Q25435N14932j10391
41602d02935r94227j906597k560766k777566k515882j842063r43416o0017P20533
41593a3282936J517246K364752K934669K731918J601919n1834j554272k394187
41585f132725k454545j995688j446400j085233q70448o25520l35031j22904J0397
41576a5058097K02009M35640M75541K32139l066R4679M12581N26281K85995M9288
$$ y = [13663860, 14754894, 15985557, 16879641, 17093486, 16571534, 15450446, 13971780, 12519320, 11521440, 11102939, 10872713, 10194849, 8677002, 6386428, 3757159, 1430528, 684, -419912, -424999, -869312, -2104832, -3784901, -5399792, -6735194, -7711848, -8088829, -7639780, -6532903, -5268147, -4213722, -3359696, -2522454, -1632911, -807476, -292544, -402935, -1397162, -3303759, -5864525, -8642091, -11157973, -13000036, -13943452, -14003469, -13282936, -11765690, -9400938, -6466269, -3734351, -2132432, -2184266, -3738538, -6132725, -8587270, -10582958, -12029358, -13114591, -13985039, -14610559, -14945590, -15068494, -15058097, -14856088, -14420448, -13944907, -13712768, -13715834, -13621155, -13208574, -12682293, -12396298, -12347010]
41566a2347010K46125Q56988J432736J566302J260782Q69394P53062R94245J368982
41557b998394J541111J310880P67226K55735J42361N12493J100172J567461J804954
41548F003999J851532J593114P87478n32457j887742k737638k903006k492030
41540c16750j607862l77323Q50770J652259J914152J875975J769469J610781J369358
41531H740829J125537R80454R75430J166926J603390K120247K302601J791699
41523B0807113N84365r96118k506530l534940l846263l535753k961420k432565
41515A577889k042418j841214j980508k510730l133336l336524k781335j511870
41507a7560046Q9773J433397J951271J462606L62166o73389j204203j227581r64775
$$ y = [-12347010, -12100885, -11243897, -9811161, -8244859, -6984077, -6114683, -5361621, -4367376, -2998394, -1457283, -146403, 620823, 876558, 1018919, 1531412, 2631584, 4199045, 6003999, 7855531, 9448645, 10236123, 9703666, 7815924, 5078286, 2175280, -316750, -1924612, -2301935, -1451165, 201094, 2115246, 3991221, 5760690, 7371471, 8740829, 9866366, 10846820, 11822250, 12989176, 14592566, 16712813, 19015414, 20807113, 21391478, 20395360, 17888830, 14353890, 10507627, 6971874, 4010454, 1577889, -464529, -2305743, -4286251, -6796981, -9930317, -13266841, -16048176, -17560046, -17470273, -16036876, -14085605, -12622999, -12260833, -12934222, -14138425, -15366006, -16330781]
41498a6330781o05939k45592Q3118L58665M99219L68551n7667n67464q69116q55472
41488a8222478o04121j53186N51676J455174K297264K810146K915016K657319
41480f293190K066246J211573L34715k57757m89097n83988p37033p74069l15418
41471e838018O71894J643974J965871J566857R40373N21935K86656L328l72762
41462A390108p37010j080448j454073j763295j826790j637917j385695j190782
41454i685902r62106n51847L5668N84998P42109K19439q96212k037679k523832
41445a5075364k097200j040539J83360J255365K013891K403146K514499K520439
41437g322403K456025K174137J596366Q84730K63943k13879o02931q47605p82995
$$ y = [-16330781, -16936720, -17182312, -17099194, -16740529, -16241310, -15872759, -15930426, -16497890, -17367006, -18222478, -18826599, -18979785, -18428109, -16972935, -14675671, -11865525, -8950509, -6293190, -4226944, -3015371, -2680656, -2938413, -3427510, -4011498, -4748531, -5522600, -5838018, -5166124, -3522150, -1556279, 10578, 950951, 1472886, 1759542, 1762870, 1390108, 653098, -427350, -1881423, -3644718, -5471508, -7109425, -8495120, -9685902, -10648008, -11199855, -11164187, -10579189, -9837080, -9617641, -10513853, -12551532, -15075364, -17172564, -18213103, -18029743, -16774378, -14760487, -12357341, -9842842, -7322403, -4866378, -2692241, -1095875, -211145, 52798, -161081, -764012, -1611617, -2394612]
41428b394612l46067K97539Q32492R74021O56599J44399r8514K09297Q65819J330175
41418B471148J221508O77209K13183K32168O63738J083699J175563J029624R58806
41409I726646J087507J229711J165642R12803O53964M67890K28252k11479p63354
41400A4497582j083841q83509k86885K24605L52690L86639Q53744J734910K257664
41391A8053599J648729L662j750899k732395k812640k471610k112413j656309
41383F169724q08801L92751J436897J794976J444267Q46378M43177K72104N2524
41374A2043997m74536j301691k120523k496306k203305j457627p37314l26276
41366I26419j15954J21913L94112M87055K12873m01234j066855j334232q99774
$$ y = [-2394612, -2740679, -2443140, -1610648, -636627, 19972, 164371, 65857, 275154, 1140973, 2471148, 3692656, 4369865, 4583048, 4815216, 5478954, 6562653, 7738216, 8767840, 9726646, 10814153, 12043864, 13209506, 14122309, 14776273, 15244163, 15472415, 15260936, 14497582, 13413741, 12530232, 12243347, 12467952, 12820642, 13207281, 14061025, 15795935, 18053599, 19702328, 19705990, 17955091, 15222696, 12410056, 9938446, 7826033, 6169724, 5360923, 5753674, 7190571, 8985547, 10429814, 11276192, 11719369, 11991473, 12043997, 11569461, 10267770, 8147247, 5650941, 3447636, 1990009, 1252695, 926419, 810465, 932378, 1326490, 1813545, 2026418, 1625184, 558329, -775903, -1675677]
41357a675677M6182Q59258R53328K53503q67581j944230k608704k619834j960642
41348i564397r11415J16774Q25989J055536O93060k40044j440310k436563k890150
41339a4791520k719165k020155j045095k02203J65104P4533j63111l46095n63678
41330b1611385r23865j257950j212508n80256M95649J576739K202942K254239
41322a9056395K071795K086412K302876K314802J861790J150716N20958L0978
41314f716068m15771p26068o90818l25088J51788O63856J321662K058211K494195
41305b184101K329007J701198J011493N25649L08794M04415Q07181J251871J267677
41296G423184N80608o12310j836048k733793l215387l309063l016661k355281
$$ y = [-1675677, -1629495, -770237, 183091, 436594, -430987, -2375217, -4983921, -7603755, -9564397, -10475812, -10359038, -9533049, -8477513, -7784453, -8024497, -9464807, -11901370, -14791520, -17510685, -19530840, -20575935, -20778138, -20613034, -20538501, -20701612, -21047707, -21611385, -22535250, -23793200, -25005708, -25585964, -25090315, -23513576, -21310634, -19056395, -16984600, -14898188, -12595312, -10280510, -8418720, -7268004, -6747046, -6716068, -7131839, -7857907, -8548725, -8873813, -8722025, -8058169, -6736507, -4678296, -2184101, 144906, 1846104, 2857597, 3383246, 3692040, 4096455, 4903636, 6155507, 7423184, 8003792, 7391482, 5555434, 2821641, -393746, -3702809, -6719470, -9074751]
41288i074751j470691o42300j60892j91108p10516j530193k359532k895075k924791
41279b1959849k408475j478707l64285O96017J508822J976318K138132K131502
41271a7760525K063806J939147J736104J503369J299385J071653P20262L12219
41263g114580J14882L16835P60396J045031R09283M79274J48922K30984O90037
41254b418936J179741J355804J166595Q18113M84368J54220k14305n26088o52518
41245A346994o36350o77272r38505j436575k045298k490773k426134j721714p15563
41236a1741190p214R8712j14786p1915N58182J583735K424527K526540J803779
41227b939630P38475m8420l45386l61461k37077J74386R06837J533366J528961
$$ y = [-9074751, -10545442, -11187742, -11348634, -11539742, -12250258, -13780451, -16139983, -19035058, -21959849, -24368324, -25847031, -26211316, -25515299, -24006477, -22030159, -19892027, -17760525, -15696719, -13757572, -12021468, -10518099, -9218714, -8147061, -7426799, -7114580, -6999698, -6682863, -5922467, -4877436, -3968153, -3488879, -3339957, -3108973, -2418936, -1239195, 116609, 1283204, 2101317, 2585685, 2739905, 2525600, 1999512, 1346994, 710644, 33372, -905133, -2341708, -4387006, -6877779, -9303913, -11025627, -11741190, -11748404, -11649692, -11764478, -11836393, -11278211, -9694476, -7269949, -4743409, -2939630, -2201155, -2249575, -2594961, -2956422, -3193499, -3019113, -2112276, -578910, 950051]
41218I50051R14168K78911J61122N96515J254177J740153J697485R24403l23406
41209H193579j284960j282258m33645M15016N69776J66175j11114J86906R41418
41200G360893J775503K402908K659959K485532K019214J527486J071404M04238
41192B1707137o34213j784467k636969l078513l209805k981180k304571j487605
41184C589814j105298j305080j596166j494205j038032m66785K42466J161179
41176b012107J996503K316790K091118J659600J255988R15346P86602J099263
41168A0109103J722068K106701J846793J078679K24159m30875p87755q28425o65342
41159A4375106n22206m55734k25698L50944J026824J356287J272262J180426J414094
$$ y = [950051, 1864219, 2143130, 2304252, 2900767, 4154944, 5895097, 7592582, 8516985, 8193579, 6908619, 5626361, 5192716, 5607732, 6177508, 6343683, 6232569, 6419475, 7360893, 9136396, 11539304, 14199263, 16684795, 18704009, 20231495, 21302899, 21707137, 21072924, 19288457, 16651488, 13572975, 10363170, 7381990, 5077419, 3589814, 2484516, 1179436, -416730, -1910935, -2948967, -3415752, -3173286, -2012107, -15604, 2301186, 4392304, 6051904, 7307892, 8223238, 9009840, 10109103, 11831171, 13937872, 15784665, 16863344, 17087503, 16656628, 15868873, 15040448, 14375106, 13852900, 13397166, 13171468, 13522412, 14549236, 15905523, 17177785, 18358211, 19772305]
41150A9772305J799699J897571J538687R44390L73181j34178o05727r51019j121153
41141B3513756j346615j938532k808891l436702l455227l087340k807150k708219
41133A925080k445807j743676p19576K89241J011954J341256J358622J314767
41125B331861J392050J419071J009941P7536r78827j722048k132823k437853k634660
41116c675752k458703j820488j040948n33058l43459j15366M97783J419657K155782
41107e914552K212255J532122N42228k11554m80397m24709l77744m83932n08372
41098d114655j2192J196499K742133L857367L938658K970122J468395P5992q35356
41089A1286963j299853j589445j898245k162897k177014j831879j208017m96981
$$ y = [19772305, 21572004, 23469575, 25008262, 25952652, 26325833, 26191655, 25585928, 24634909, 23513756, 22167141, 20228609, 17419718, 13983016, 10527789, 7440449, 4633299, 1925080, -520727, -2264403, -2983979, -2694738, -1682784, -341528, 1017094, 2331861, 3723911, 5142982, 6152923, 6230459, 5251632, 3529584, 1396761, -1041092, -3675752, -6134455, -7954943, -8995891, -9528949, -9872408, -9987774, -9489991, -8070334, -5914552, -3702297, -2170175, -1627947, -1839501, -2319898, -2744607, -3122351, -3606283, -4114655, -4126847, -2930348, -188215, 3669152, 7607810, 10577932, 12046327, 12122319, 11286963, 9987110, 8397665, 6499420, 4336523, 2159509, 327630, -880387, -1377368]
41081a377368Q4390L70723L86471L98142O71645J127823J362598J085305M59997
41072D569726m8500j08627K34566O74082R34261R75212R28326Q25141M67282l14259
41062I137210j309463k028571k217392k126123k161989k383498k458298k050997
41054g599121j134133L7325J122801J846404K051419J696336Q43536l13146j413745
41045b862324k000823j733495o31713Q37951J966232K241511J707943Q77382K58933
41036F61597K7779J33460N13922J051678J503045J717286J817579J908879J723769
41027A1058994R19843k94035j236736j560197j601548j764521j915309j670887
41019A935604j012419k86280K42497N54124P23220Q71222J163523J599242J881508
$$ y = [-1377368, -1292978, -922255, -535784, -137642, 534003, 1661826, 3024424, 4109729, 4569726, 4521226, 4412599, 4647165, 5321247, 6255508, 7230720, 8159046, 8984187, 9451469, 9137210, 7827747, 5799176, 3581784, 1455661, -706328, -3089826, -5548124, -7599121, -8733254, -8695929, -7573128, -5726724, -3675305, -1978969, -1135433, -1448579, -2862324, -4863147, -6596642, -7228355, -6390404, -4424172, -2182661, -474718, 402664, 661597, 689376, 822836, 1336758, 2388436, 3891481, 5608767, 7426346, 9335225, 11058994, 11978837, 11684802, 10448066, 8887869, 7286321, 5521800, 3606491, 1935604, 923185, 636905, 879402, 1433526, 2156746, 3027968, 4191491, 5790733, 7672241]
41010G672241J715150J138953L61534n63897j586007k290416k094418q87063P76084
41001D242161K155769K791422K529604J467867K8348j175921j783800j924594
40993H330856j922221j867333j579262r17036m1619O26242P33969L37257j49639
40984C551214m34359o72468j148856j747143k013803j742610j218812q25217o52934
40975f904988n79437m79874k33516K49397Q26702J114662Q68980K90570j73170
40966e020674k46112L8707M84107Q89608J167788J402478J704616J965776J920688
40957D306982J539364J154416J048352J110806J109503J110616J323442J608232
40949A4311713J469021O03290p45931k036964k860175l086260k770606k036320
$$ y = [7672241, 9387391, 10526344, 10887878, 10323981, 8737974, 6447558, 4353140, 3466077, 4242161, 6397930, 9189352, 11718956, 13186823, 13215171, 12039250, 10255450, 8330856, 6408635, 4541302, 2962040, 2045004, 2003385, 2629627, 3363596, 3700853, 3551214, 3116855, 2444387, 1295531, -451612, -2465415, -4208025, -5426837, -6252054, -6904988, -7484425, -7964299, -8197815, -7948418, -7121716, -6007054, -5138074, -4847504, -5020674, -5266786, -5228079, -4743972, -3854364, -2686576, -1284098, 420518, 2386294, 4306982, 5846346, 7000762, 8049114, 9159920, 10269423, 11380039, 12703481, 14311713, 15780734, 16384024, 15638093, 13601129, 10740954, 7654694, 4884088, 2847768]
40941B847768j014429J24712J072639J438964J083932L61448j62363k59981j67352
40932E325338j79488l45617o11326r99310j468025j756951j586959r58209j13443
40923b693990P10854J353626J665727J619638J472770J587490K010540K388705
40915A0115360K371971J961079J403326R35964P56565J040706J723745K331600
40907B2640316K297449J499085L14976q54130j887651k709822l040727k636355
40899A5623141j665752o15612J59393O27602Q73731R28781Q61015Q59563J099642
40890A8751504J565550K050817K309488K239176J998268J912370K146933K481148
40882C5455254K523171K116435J364570L02132j135822k677508l566349l220192
$$ y = [2847768, 1833339, 1958051, 3030690, 4469654, 5553586, 5915034, 5752671, 5492690, 5325338, 5145850, 4800233, 4188907, 3189597, 1721572, -35379, -1622338, -2580547, -2693990, -1983136, -629510, 1036217, 2655855, 4128625, 5716115, 7726655, 10115360, 12487331, 14448410, 15851736, 16787700, 17544265, 18584971, 20308716, 22640316, 24937765, 26436850, 26751826, 25897696, 24010045, 21300223, 18259496, 15623141, 13957389, 13341777, 13501170, 14128772, 15002503, 15931284, 16792299, 17651862, 18751504, 20317054, 22367871, 24677359, 26916535, 28914803, 30827173, 32974106, 35455254, 37978425, 40094860, 41459430, 41761562, 40625740, 37948232, 34381883, 31161691]
40874C1161691j981666q94434o56551j003768j216553j035879q75790j184055
40866B2312995j797536k055064j518756m67028M12478P64523Q50747J074430J437726
40857B1014515J663753J719973J902178K345425K727397K630666K023597J186677
40849C7214181L06341n86612j323125j557754j142754l38251M78209J141245J605896
40840C5797376J743749J500297J134453R65829Q85102M63454l40661r21507p18287
40831D0509805O8898P51090R71465R01829P05819K56160m58765r76210p02440
40822D2027651M62102K002509L244173L836702L875952L690306L519082L356982
40814F6015459L109783K848914K793386L037025L430474L763080L917048L810733
$$ y = [31161691, 29180025, 28285591, 27629040, 26625272, 25408719, 24372840, 23497050, 22312995, 20515459, 18460395, 16941639, 16474611, 16887089, 17651612, 18502359, 19576789, 21014515, 22678268, 24398241, 26300419, 28645844, 31373241, 34003907, 36027504, 37214181, 37520522, 36933910, 35610785, 34053031, 32910277, 32572026, 33050235, 34191480, 35797376, 37541125, 39041422, 40175875, 41141704, 42026806, 42490260, 42149599, 41228092, 40509805, 40578703, 41329793, 42301258, 43203087, 43908906, 44165066, 43706301, 42730091, 42027651, 42489753, 44492262, 47736435, 51573137, 55449089, 59139395, 62658477, 66015459, 69125242, 71974156, 74767542, 77804567, 81235041, 84998121, 88915169, 92725902]
40806I2725902L395497K835646K529086K783157L558500M628442N816819O897814
40798A25170863P443926P115183O138723N272730N182426N900027O854576P319771
40790A76398225O912360N865982M846720M350056M248413M029059L427034K658295
40782B12736144K076984J835587J890984K076838K071910J542309N02110n91938
40774B24140928j232026j241857p30274Q8272Q58492J132548Q06692M35101P64084
40765B25021960J887525L097554L626167L305518K432973J292553N8168j026010
40757B39696408j735814k177581k752799l698463m827705n841629o729190p647581
40749B04285646q489445q840976q447899p544499o618940n990956n715200n713034
$$ y = [92725902, 96121399, 98957045, 101486131, 104269288, 107827788, 112456230, 118273049, 125170863, 132614789, 139729972, 145868695, 151141425, 156323851, 162223878, 169078454, 176398225, 183310585, 189176567, 194023287, 198373343, 202621756, 206650815, 210077849, 212736144, 214813128, 216648715, 218539699, 220616537, 222688447, 224230756, 224732866, 224140928, 222908902, 221667045, 220936771, 221025043, 221883535, 223016083, 223822775, 224257876, 225021960, 226909485, 230007039, 233633206, 236938724, 239371697, 240664250, 240722418, 239696408, 237960594, 235783013, 233030214, 229331751, 224504046, 218662417, 211933227, 204285646, 195796201, 186955225, 178507326, 170962827, 164343887, 158352931, 152637731, 146924697]
40741A46924697n780245n565150m817279l708845k735933k252443k219987k391669
40733A17453146k547383k551993k448584k576486l308771m485101n357736n372404
40725H8804688m814479m351025m063590l369680j957715l92557M48745L26666
40717G0631053k03858m70781l31506k01917n78786j495642k371784k483618j690990
40708F0802171o18331l546M4901L535K52684O76953R38344Q77931N15403j40077
40698F3349968j031655j862611k195787j811461q40036M85098K016716L516766
40690F1626998M484138M457163L516668K280983J338556Q54472P67166J078145
40682H0404289J722813K362150K624740K495946K203098J795750J191375O35724
$$ y = [146924697, 141144452, 135579302, 130762023, 127053178, 124317245, 122064802, 119844815, 117453146, 114905763, 112353770, 109905186, 107328700, 104019929, 99534828, 94177092, 88804688, 83990209, 79639184, 75575594, 72205914, 70248199, 69855642, 70304387, 70631053, 70427195, 69956414, 69624908, 69422991, 68844205, 67348563, 64976779, 62493161, 60802171, 60183840, 60180294, 60225195, 60228730, 60481414, 61158367, 62096711, 62974642, 63490045, 63349968, 62318313, 60455702, 58259915, 56448454, 55608418, 56093516, 58110232, 61626998, 66111136, 70568299, 74084967, 76365950, 77704506, 78558978, 79326144, 80404289, 82127102, 84489252, 87113992, 89609938, 91813036, 93608786, 94800161, 95435885]
40674I5435885O90250J577267K862660M005058M907776N640257N931041N415758
40666A26465952M282982L202446K554982K099605J488240P63381J87347j35220
40658A40909715k55254k01556j7252J50724J73260O2928j48458n47317j211264
40649A38915526k021654k726503l137128l197439k975834k697433k666107k989453
40641A16503975l408004l490914k985592j989043r24845l81558p35622j774070
40633A00814327k870339l693762m530358n679617o783712p138547o554198n500455
40625E8063339m428825l375198k299307j384542p87557m01936j05317n102k09367
40616D5066188n52207p88011r10238j047557j169215j137503r80922q86937r35791
$$ y = [95435885, 96126135, 97703402, 100566062, 104571120, 109478896, 115119153, 121050194, 126465952, 130748934, 133951380, 136506362, 138605967, 140094207, 140857588, 141044935, 140909715, 140654461, 140452905, 140435653, 140586377, 140759637, 140822565, 140674107, 140126790, 138915526, 136893872, 134167369, 131030241, 127832802, 124856968, 122159535, 119493428, 116503975, 113095971, 109605057, 106619465, 104630422, 103705577, 103324019, 102588397, 100814327, 97943988, 94250226, 89719868, 84040251, 77256539, 70117992, 63563794, 58063339, 53634514, 50259316, 47960009, 46575467, 45787910, 45385974, 45280657, 45275555, 45066188, 44513981, 43725970, 42815732, 41768175, 40598960, 39461457, 38480535, 37593598, 36657807]
40607C6657807r94147q47695l53687M13861J033838R28552n5942j342547k143712
40598C3296328k226378j920375j493968r30282l42607j39565n21993j121635j427714
40589B3171811j358391j123803p29620k1402Q29854J310120J168795P56459N71662
40580B4575485O60379O57044K85366l96563j175277j865410k285231k253953j745204
40571A6456636r72863k36844K87577N72320O15743L79755j58085r20046j680888
40562A4343305k121506k038773j578243j178425j164141j413105j509114j184250
40554B155748n04955L16444J100290J665448J819863J515250R19873K64898k76778
40545H976081n17792k73607L65230R29806R97468O73676M22336M49708N26088
$$ y = [36657807, 35663660, 34815965, 34462278, 34876139, 35909977, 36838529, 36782587, 35440040, 33296328, 31069950, 29149575, 27655607, 26725325, 26382718, 26243153, 25721160, 24599525, 23171811, 21813420, 20689617, 19959997, 19938595, 20768449, 22078569, 23247364, 24003823, 24575485, 25235864, 25892908, 26178274, 25781711, 24606434, 22741024, 20455793, 18201840, 16456636, 15483773, 15246929, 15534506, 16106826, 16722569, 17102324, 16944239, 16024193, 14343305, 12221799, 10183026, 8604783, 7426358, 6262217, 4849112, 3339998, 2155748, 1650793, 1967237, 3067527, 4732975, 6552838, 8068088, 8987961, 9252859, 8976081, 8458289, 8184682, 8549912, 9479718, 10477186, 11150862, 11573198, 12022906, 12548994]
40536A2548994M40413L09548K83484K36600L5966p3501K71227R24770J235343
40527A6212844Q24004J07414j78168J72057O96552R17275Q56745Q49309J061909
40518B1519941J361376J532076J432520R70147J23746r18574j751067k008620
40510B2261545j653002r77206l41659P5105L09238M79128O62941Q76493J089660
40501B2782243J197979J011957L99974m90943j246205j527867j371960j054647
40493A9700531p39104m13039j09024Q1392K66779P38537J503188K060508J934751
40484B5024519J300030P55023N21685K34190l95490j069338j306180j106651q91792
40475B3065996q84122q85695o90513m02246j97964j2338L13512O93457Q64205
$$ y = [12548994, 12989407, 13298955, 13582439, 13819039, 13855005, 13781504, 14052731, 14977501, 16212844, 17036848, 17144262, 16966094, 17138151, 17834703, 18751978, 19608723, 20458032, 21519941, 22881317, 24413393, 25845913, 26816060, 26939806, 26021232, 24270165, 22261545, 20608543, 19631337, 19289678, 19364783, 19674021, 20153149, 20816090, 21692583, 22782243, 23980222, 24992179, 25392153, 24901210, 23655005, 22127138, 20755178, 19700531, 18961427, 18548388, 18439364, 18520756, 18787535, 19526072, 21029260, 23089768, 25024519, 26324549, 27079572, 27601257, 27835447, 27439957, 26370619, 25064439, 23957788, 23065996, 22181874, 21296179, 20605666, 20203420, 20005456, 19993118, 20306630, 21000087, 21864292]
40466B1864292P71600O40159N90133M15789r2389p71964j260868j462223j589918
40457A9104611j761988j807660j549760j048669m53295J64532O58101P14971K05704
40448A4226547m85497p85146n85324l28153m23261q24133j218301j365713j136197
40439G074822m75616M42523J186125J427369J297081J209859J366154J568739
40431A5097056J502032J048442L45635l03761n42727j44719P69548J724103K191246
40422B1686855J958846J238346M77644J05510L84192J331961K638235L690866
40414C3512455L906241L212501K164541J436545J195621J078778P48783K87511
40406D7542976P387Q3519N03771J214851K099292K855359L110173K728659J942813
$$ y = [21864292, 22635892, 23276051, 23866184, 24281973, 24189584, 23417620, 22156752, 20694529, 19104611, 17342623, 15534963, 13985203, 12936534, 12483239, 12647771, 13305872, 14020843, 14226547, 13741050, 12955904, 12370580, 12042427, 11619166, 10795033, 9576732, 8211019, 7074822, 6599206, 7041729, 8227854, 9655223, 10952304, 12162163, 13528317, 15097056, 16599088, 17647530, 17993165, 17689404, 17146677, 17001958, 17771506, 19495609, 21686855, 23645701, 24884047, 25361691, 25467201, 25851393, 27183354, 29821589, 33512455, 37418696, 40631197, 42795738, 44232283, 45427904, 46506682, 47255465, 47542976, 47550363, 47633882, 48137653, 49352504, 51451796, 54307155, 57417328, 60145987, 62088800]
40397F2088800J153925O39475M08056K53533l0823m06027n65111k48895M11750
40388F3704683R65477J088289Q94573P71017R79908J500955K208226L044952L911269
40379G9069349M436145M064328K541910L00647j771863l001193l350878l271501
40371G9016944l299284l782679m729565n732508o173839n714204m576251l269331
40363D1739283k127365j221134n58675j08811L37798J062328K091033L129752
40355D4344209L865983M193837M143220L816683L483472L510349M015245M714156
40347G6087154N265693N637565N933178N960994N269801L672536J519586o64428
40339A08682079k648116m428829n833450o493451o325838n819100n594133n734076
$$ y = [62088800, 63242725, 63882200, 64290256, 64543789, 64512966, 64106939, 63541828, 63292933, 63704683, 64670160, 65758449, 66653022, 67424039, 68403947, 69904902, 72113128, 75158080, 79069349, 83505494, 87569822, 90111732, 90412379, 88640516, 85639323, 82288445, 79016944, 75717660, 71934981, 67205416, 61472908, 55299069, 49584865, 45008614, 41739283, 39611918, 38390784, 37832109, 37723298, 38061096, 39123424, 41214457, 44344209, 48210192, 52404029, 56547249, 60363932, 63847404, 67357753, 71372998, 76087154, 81352847, 86990412, 92923590, 98884584, 104154385, 107826921, 109346507, 108682079, 106033963, 101605134, 95771684, 89278233, 82952395, 77133295, 71539162, 65805086]
40331F5805086n786919n439700m893963m429220l902040l026268j988732j334193
40323C5004051j203523j131090q00749o16457j152972k254797l092040l058518
40315B1693905k262837j140572K7090J077041J801414K123092K285823K584742
40307B8189698K921953K848098K111686J040801K88736K34420O82077J135216
40299C9452685J305141J296083J314408J331207J150165P24955J99660l80505
40291D6393799j136782j964624k294478j599074j59412R79372R92575P5343q76386
40282D0410333j243793j151338j050976j136991j292138j433090j684741k179713
40274B9237553k791337l146824k922018k124864j095145k36492K42274L65344
$$ y = [65805086, 60018167, 54578467, 49684504, 45255284, 41353244, 38326976, 36338244, 35004051, 33800528, 32669438, 31868689, 31252232, 30099260, 27844463, 24752423, 21693905, 19431068, 18290496, 18317586, 19394627, 21196041, 23319133, 25604956, 28189698, 31111651, 33959749, 36071435, 37112236, 37400972, 37635392, 38317469, 39452685, 40757826, 42053909, 43368317, 44699524, 45849689, 46574644, 46774304, 46393799, 45257017, 43292393, 40997915, 39398841, 39239429, 40218801, 41211376, 41286719, 40410333, 39166540, 38015202, 36964226, 35827235, 34535097, 33102007, 31417266, 29237553, 26446216, 23299392, 20377374, 18252510, 17157365, 16920873, 17163147, 17528491]
40266A7528491K95768K85658O08132J325657K092690K382064K026343J402154
40258B7946957R57823P19032M70111K82655N04423J167705J741844J693064J108452
40249C6592066N48611M14713P06047J312673K208175L241450L974080L942206
40241E2940021L042223J561589j01892j631680k766351l289620l163203k602299
40233D3988788j913717j266735o90446k56123j05988k37887m12062m39346m91797
40224C8174687r20198j748950k552294k907151k794979k454426k019761j482461
40216B1294467q86709l62184k2360J6151l81916j148475j849876k023616j698124
40207A2937358j339116j238576j187389q09166J8537J136962K205363K688957
$$ y = [17528491, 17824259, 18109917, 18718049, 20043706, 22136396, 24518460, 26544803, 27946957, 28904780, 29623812, 30093923, 30376578, 30881001, 32048706, 33790550, 35483614, 36592066, 37140677, 37555390, 38261437, 39574110, 41782285, 45023735, 48997815, 52940021, 55982244, 57543833, 57441941, 55810261, 53043910, 49754290, 46591087, 43988788, 42075071, 40808336, 40117890, 39861767, 39755779, 39517892, 39105830, 38666484, 38174687, 37254489, 35505539, 32953245, 30046094, 27251115, 24796689, 22776928, 21294467, 20407758, 20045574, 20023214, 20039365, 19657449, 18508974, 16659098, 14635482, 12937358, 11598242, 10359666, 9172277, 8363111, 8381648, 9518610, 11723973, 14412930]
40199A4412930K083856M88857j197801j983423j682523r40124m43074l25207k70944
40190A0142547P6428Q27187J722351K235986J979568J063511n4488j037833j804202
40181A5151055k264074k258854j851108j383681j069078p31806j50438N29103
40173E971119R57552J041867R95668R80818R35218P86149O55079P66381J214577
40164A4304428J840816K305769K328332J918296J335827P87932K74818j88273
40156B4907945l76448j11076L61072N02068L6133q09835j636948k242686k603515
40147A8026710k710418k581583k335439k128240k066197k198649k451749k507537
40139i53102j953785p43083O08085J467553J670737J501485J209260Q22185M33542
$$ y = [14412930, 16496786, 16985643, 15787842, 13804419, 12121896, 11181772, 10738698, 10413491, 10142547, 10218975, 11046162, 12768513, 15004499, 16984067, 18047578, 17993090, 16955257, 15151055, 12886981, 10628127, 8777019, 7393338, 6324260, 5592454, 5442016, 5971119, 6928671, 7970538, 8966206, 9947024, 10882242, 11668391, 12323470, 13089851, 14304428, 16145244, 18451013, 20779345, 22697641, 24033468, 24821400, 25096218, 24907945, 24531497, 24420421, 24781493, 25283561, 25319694, 24509859, 22872911, 20630225, 18026710, 15316292, 12734709, 10399270, 8271030, 6204833, 4006184, 1554435, -953102, -2906887, -3649970, -3041885, -1574332, 96405, 1597890, 2807150, 3629335, 4062877]
40130D062877L56930Q10062J581262K166444K190976J643758Q11703Q0378l11433
40121A3392957m64041p24312j300792k012684k487539k507673k057976j190557
40113F47383r0302P94443J016213O37607K56981L87096R62757J569521J955702
40104H137401K124304K082302J778136J272365P73395M85459N10813Q00350J039022
40095A9003547P25654l20054j542236k056177j565383o43901l7432O8445M040
40086A3636503J45959O76642J546718K411842K770683K418770J672605R76318
40078B6256040M42337l7502m52993p41007r97780j265162j252716p04320L1761
40069B1278658K91446l618k28385K3754M07409M88382M75625Q51914J571423K108080
$$ y = [4062877, 4419807, 5229869, 6811131, 8977575, 11168551, 12812309, 13624012, 13704390, 13392957, 12928916, 12204604, 10903812, 8891128, 6403589, 3895916, 1837940, 647383, 557081, 1351524, 2367737, 3005344, 3262325, 3649421, 4612178, 6181699, 8137401, 10261705, 12344007, 14122143, 15394508, 16167903, 16653362, 17164175, 17964525, 19003547, 19729201, 19409147, 17866911, 15810734, 14245351, 13601450, 13564018, 13632463, 13636503, 13782462, 14459104, 16005822, 18417664, 21188347, 23607117, 25279722, 26256040, 26698377, 26660875, 26207882, 25466875, 24469095, 23203933, 21951217, 21246897, 21278658, 21570104, 21566486, 21338101, 21361855, 21769264, 22257646, 22733271, 23585185, 25156608, 27264688]
40059B7264688K167452J919554J595386J279625J120123J329046J825737K159704
40051D0661315J950931J231782K63238p84055j838441k791215l518202l962578
40043C1212775m108863l968861l667386l421891l325148l234654k981439k601619
40035C902914k237899j889401j431461q81049m76481m12876n91053p26339o68449
40026e412094n14079m00599l09212j67519p0667k22783o13149r12792q35549n13909
40016i972352l39710m50561n57422l30291K06538P66058J163599J444245J694579
40007f375317J875882J873469J619833J128101M75734j68728n29719l54291L27661
39998a27375J065861J238165N91369m28546r85071n98903L95826J187468J300031
$$ y = [27264688, 29432140, 31351694, 32947080, 34226705, 35346828, 36675874, 38501611, 40661315, 42612246, 43844028, 44107266, 43323211, 41484770, 38693555, 35175353, 31212775, 27103912, 23135051, 19467665, 16045774, 12720626, 9485972, 6504533, 3902914, 1665015, -224386, -1655847, -2536896, -3013377, -3426253, -4017306, -4743645, -5412094, -5926173, -6326772, -6635984, -6803503, -6874170, -7096953, -7710102, -8622894, -9458443, -9972352, -10312062, -10762623, -11320045, -11650336, -11443798, -10677740, -9514141, -8069896, -6375317, -4499435, -2625966, -1006133, 121968, 597702, 428974, -100745, -455036, -127375, 938486, 2176651, 2768020, 2339474, 1354403, 755500, 1151326, 2338794, 3638825]
39989C638825J042973J115568J779807K504931K499248J558656K88297n30477
39981A3897828o90040o29419q71198j491863k085124k130645j433072l19108O01978
39972D849337R72187R76598J026781J219588J277438J001513N51204J87486n7829
39963A2004303k99342n26268n99213m44039q5819M36694R86781J188165O24057
39954A3285319o93087k173961l099924l188252k684571k000367j360460p47792
39946b663095n5954P52011J580145K234097K498959K202088J276828j25978j564358
39937F134743k461386k486010j819209r88236m04721p9036K31218O66040J098871
39928a07726J286056J117992P08533K61918j22941n02308r46457j380967j603708
$$ y = [3638825, 4681798, 5797366, 7577173, 10082104, 12581352, 14140008, 14428305, 13897828, 13207788, 12578369, 11707171, 10215308, 8130184, 5999539, 4566467, 4247359, 4849337, 5821524, 6798122, 7824903, 9044491, 10321929, 11323442, 11874646, 12062132, 12004303, 11704961, 11178693, 10579480, 10135441, 10049622, 10486316, 11473097, 12661262, 13285319, 12592232, 10418271, 7318347, 4130095, 1445524, -554843, -1915303, -2663095, -2719049, -1967038, -386893, 1847204, 4346163, 6548251, 7825079, 7699101, 6134743, 3673357, 1187347, -631862, -1620098, -2024819, -2103855, -1872637, -1206597, -107726, 1178330, 2296322, 3004855, 3266773, 3143832, 2641524, 1695067, 314100, -1289608]
39919a289608j448705q98424o4740Q47318J542147J732371J359487O77092J7065
39910B474003m87605q42277r30320n48480K24499Q97990R90241N03963j49087
39901B132927o09351p84722o77719k63429L67274R29674J181723J179570J165428
39892D621375J219731J146213P38677Q0987m87481o84246n11437j90801L9392
39883E972410K2141l16567r03820j453093j631217j397049j074645r82389j082527
39874b846756j137521j126817j291647j752054k280999k547657k443114k060117
39866a7486682j465095o41487L62996J347973K060295K364151K316415K084930
39858i056504J788475J431759J001830N52335J24363l19696p31789q28130l71044
$$ y = [-1289608, -2738313, -3636737, -3701477, -2854159, -1312012, 420359, 1779846, 2456938, 2474003, 1986398, 1144121, 213801, -334679, -110180, 787810, 1778051, 2282014, 2132927, 1523576, 738854, 61135, -202294, 164980, 1094654, 2276377, 3455947, 4621375, 5841106, 6987319, 7725996, 7806983, 7319502, 6635256, 6123819, 5933018, 5972410, 5994551, 5677984, 4774164, 3321071, 1689854, 292805, -781840, -1764229, -2846756, -3984277, -5111094, -6402741, -8154795, -10435794, -12983451, -15426565, -17486682, -18951777, -19593264, -19230268, -17882295, -15822000, -13457849, -11141434, -9056504, -7268029, -5836270, -4834440, -4282105, -4157742, -4477438, -5209227, -6037357, -6408401]
39849f408401L49003O03484J2922r23478j332223r24746k23736J24223n786l06955
39839i035693n08030n61866n09645l84070k40984j16552R0855N50208J206113
39830i509664J670008J590547J127058Q50934J077493J469553J484730J090631
39822H51290P77803Q92489J237142J394237J179328O43907j12459r06057j429135
39813D528545j523375j415703j441129j583326j536653j214530r49826j133292
39805f269289j828055k761904l496075l562078k693290j110358N39870J683405
39797a9497774K210404K316907K111697J556621P34187k7304l67501j63635M35234
39788a0691164J162017J755229J980117J669713Q67078r0979p70706r99315r52524
$$ y = [-6408401, -6059398, -5455914, -5442992, -6366470, -7698693, -8623439, -8847175, -8722952, -8728738, -9035693, -9543723, -10105589, -10615234, -10999304, -11240288, -11356840, -11265985, -10715777, -9509664, -7839656, -6249109, -5122051, -4271117, -3193624, -1724071, -239341, 851290, 1629093, 2521582, 3758724, 5152961, 6332289, 6976196, 6863737, 5957680, 4528545, 3005170, 1589467, 148338, -1434988, -2971641, -4186171, -5135997, -6269289, -8097344, -10859248, -14355323, -17917401, -20610691, -21721049, -21181179, -19497774, -17287370, -14970463, -12858766, -11302145, -10567958, -10595262, -10962763, -11126398, -10691164, -9529147, -7773918, -5793801, -4124088, -3257010, -3347989, -4118695, -5118010, -6070534]
39779f070534q38715o31863k38271K22585N39827P53442J109113J640627K027514
39770a486275J928003J257516J20813j247171k390438k831346k597571k278738
39762i525207k279300k272463j759457r30210m26928l03830J67935J449978K980896
39753a2898586L815262L679938L018289K262096J550260J048448R80691J194351
39745D650749J122869M70101l03481m59596J66633J024339J485802J407036J062049
39736A0626501P24518M02647q3402q03660j500713j756542j456726r79795p62535
39727D410293p54233n25699R7871P76432J097691J029993P91982M91847J12915
39718G529092k80868n55901o65430o25112m16410r6852R3725j9607k46040k43584
$$ y = [-6070534, -6909249, -7541112, -7779383, -7556798, -7016971, -6263529, -5154416, -3513789, -1486275, 441728, 1699244, 1820057, 572886, -1817552, -4648898, -7246469, -9525207, -11804507, -14076970, -15836427, -16766637, -17193565, -17497395, -17329460, -15879482, -12898586, -9083324, -5403386, -2385097, -123001, 1427259, 2475707, 3456398, 4650749, 5773618, 6243719, 5940238, 5480642, 5647275, 6671614, 8157416, 9564452, 10626501, 11351019, 11753666, 11670264, 10866604, 9365891, 7609349, 6152623, 5172828, 4410293, 3656060, 3130361, 3228232, 4004664, 5102355, 6132348, 6924330, 7416177, 7529092, 7248224, 6692323, 6026893, 5401781, 4985371, 4888519, 4982244, 4962637, 4716597, 4473013]
39708D473013l1466J464l24337o63817n75417r3899K80420P0173p72501j804467
39698E59166k357332k039294j111040k49403J52289L01824N54525Q93155J077443
39689b218667J110245J227326J475341J605944J446646J158848J040020J207504
39681H053207J545244J862173K046070K116779K147225K104735J819352J175693
39673B2870478K80338o34884j400693j924403k148503k152334k185968k397587
39665A0306444k585881k419760j847156j079987k51526O36350J458860J977004
39657F194348K133454K034844J597459N86326q38434j987083k344019k162841
39649E214054k072785k291753k530709k500573k142922j432985l38685R58311
$$ y = [4473013, 4441547, 4443011, 4118674, 3454857, 2879440, 2785541, 3065961, 3136134, 2363633, 559166, -1798166, -3837460, -4948500, -5197903, -5045614, -4743790, -4189265, -3296110, -2218667, -1108422, 118904, 1594245, 3200189, 4646835, 5805683, 6845703, 8053207, 9598451, 11460624, 13506694, 15623473, 17770698, 19875433, 21694785, 22870478, 23150816, 22515932, 21115239, 19190836, 17042333, 14889999, 12704031, 10306444, 7720563, 5300803, 3453647, 2373660, 2122134, 2758484, 4217344, 6194348, 8327802, 10362646, 11960105, 12546431, 11707997, 9720914, 7376895, 5214054, 3141269, 849516, -1681193, -4181766, -6324688, -7757673, -8096358, -7138047]
39641g138047K071698K728128K912329K704700K202081J627951J275094J229404
39633I613338J307708J329770J269730J062105M82105n74499j777997k518133
39625A0194127k407806j602249o61120j28157j71660n48831r01864j069330j086870
39616A616240r81554p34336m37557k83320k97631k40833Q2068M97753N96256J66196
39606a6718n87728j232627j447854j235029q85870p17061p52016o76729j90141
39597g741773N88610J116015Q72662j36940j275696j687952r55756N49998J979253
39588f691579K684717K580383J907923Q75848l51398j488092k209708k416147
39580e108053k262079j909688j389232p45173j86198L0696j41933m46768m99669
$$ y = [-7138047, -5066349, -2338221, 574108, 3278808, 5480889, 7108840, 8383934, 9613338, 10921046, 12250816, 13520546, 14582651, 15064756, 14490257, 12712260, 10194127, 7786321, 6184072, 5522952, 5394795, 5223135, 4674304, 3772440, 2703110, 1616240, 634686, -99650, -537207, -820527, -1118158, -1358991, -1276923, -779170, -182914, -16718, -604446, -1837073, -3284927, -4519956, -5405826, -6122887, -6874903, -7551632, -7741773, -7153163, -6037148, -5164486, -5301426, -6577122, -8265074, -9220830, -8670832, -6691579, -4006862, -1426479, 481444, 1357292, 1005894, -482198, -2691906, -5108053, -7370132, -9279820, -10669052, -11414225, -11600423, -11569727, -11711660, -12158428, -12658097]
39571a2658097q5471O83551J483589K038362K243302K081621J550760P39914j03543
39562b026012o64596o76335M1777J457496L091197M084484L788679K310548L49517
39553A1756755j420172k624687l013085k425089j048916N71747J929010K760202
39545F485765K853634K038532O03630o07608r18481n23723j80519l24902q17573
39536H608755j432532k124080k731148k845678k237475j196208k41472L67358
39528c832480O86268Q26372Q54592Q70426R74891J149705J271820J247225J083475
39519E132294Q80362P93822R20662J138692J140803P26262J3853o86188j124396
39510H936166j187505q94229m84268l77822p81498j335865j394264p38316J47287
$$ y = [-12658097, -12743568, -12060017, -10576428, -8538066, -6294764, -4213143, -2662383, -1922469, -2026012, -2690608, -3366943, -3325166, -1867670, 1223527, 5308011, 9096690, 11407238, 11756755, 10336583, 7711896, 4698811, 2273722, 1224806, 1796553, 3725563, 6485765, 9339399, 11377931, 11981561, 11373953, 10455472, 9931749, 9751230, 9426328, 8608755, 7176223, 5052143, 2320995, -524683, -2762158, -3958366, -4199838, -3832480, -3146212, -2319840, -1465248, -594822, 380069, 1529774, 2801594, 4048819, 5132294, 6012656, 6806478, 7727140, 8865832, 10006635, 10732897, 10746750, 10060562, 8936166, 7748661, 6854432, 6370164, 5992342, 5210844, 3874979, 2480715, 1742399, 1889686]
39501A889686O09845N13249K80479L45681P00464R75773Q80148N14481K57892
39492F967698L50325O24659P02131M26765J5762k30164k58613k48680l48740n29958
39482G471185o69321o81510n50758k95942N0914M41871Q12540J092189J208910
39473H880078J076924N94990k85574j438006k516655l098801k927961k068870
39465a783875q78269J84479Q30175J120327J325249J514080J360729N24092p85409
39456C411578j807663j892165j061972J10359J034396J423958J273810P58879
39448C251180J73813j73946j01743L87328J117053J787098K111439K010416J643039
39439A2205677J221012Q62144O26277N06813K84213l89178j511366k470788k570218
$$ y = [1889686, 2499531, 3012780, 3293259, 3638940, 4339404, 5315177, 6195325, 6709806, 6967698, 7318023, 7942682, 8644813, 9071578, 9087340, 8857176, 8598563, 8349883, 8001143, 7471185, 6801864, 6120354, 5569596, 5273654, 5324568, 5766439, 6578979, 7671168, 8880078, 9957002, 10551992, 10266418, 8828412, 6311757, 3212956, 284995, -1783875, -2662144, -2477665, -1647490, -527163, 798086, 2312166, 3672895, 4196987, 3411578, 1603915, -288250, -1350222, -1239863, -205467, 1218491, 2492301, 3251180, 3424993, 3251047, 3149304, 3536632, 4653685, 6440783, 8552222, 10562638, 12205677, 13426689, 14288833, 14915110, 15421923, 15706136, 15316958, 13805592, 11334804, 8764586]
39430H764586j793091p88913j19657J67531J98908p2222o19166j037145q49820
39421C851011p0868P63682J087896O82839l22915j573324k598544l019947k740537
39412c940707j894494o63161P45341J995994K696011K623380J829930N64810p93412
39403C163692j793027k096805j680194p79655L15410J315555J885687J817359
39395B148022J307892Q61288P95455R64092J023857Q25714M57536N4559k92049
39386H146366n20647o01961n06045j32044O00418J511022K152255K179730J646957
39377A4476051Q38732n8654r76965j779154k260666k308320j916914j116037n8517
39368D839556Q74017J287116J143823P71369M79790L19435K17424J59505J63575
$$ y = [8764586, 6971495, 6182582, 6062925, 6230456, 6429364, 6357142, 5737976, 4700831, 3851011, 3780143, 4543825, 5631721, 6314560, 5991645, 4418321, 1819777, -1200170, -3940707, -5835201, -6498362, -5753021, -3757027, -1061016, 1562364, 3392294, 3957104, 3163692, 1370665, -726140, -2406334, -3185989, -2870579, -1555024, 330663, 2148022, 3455914, 4317202, 5112657, 6076749, 7100606, 7926320, 8383856, 8438415, 8146366, 7625719, 7023758, 6517713, 6385669, 6986087, 8497109, 10649364, 12829094, 14476051, 15314783, 15256129, 14279164, 12500010, 10239344, 7931024, 6014110, 4898073, 4839556, 5713573, 7000689, 8144512, 8915881, 9395671, 9715106, 9932530, 10092035, 10255610]
39359A0255610K12217K66753K21776j56827j017911k049566k557902k139996j138046
39350A896108k01255M82618J225516K148563K817064K740551K016636J244836
39342A4370637Q89413R28666J085123J161202J072301P39959J38254n87499j180126
39333A8617930j476024j506001j420578j391141j553013j913971k270179k303478
39325D783545j836350r67718L9614R19492J444834J464221J007353K73370n72223
39316F556138j495282k397998k963849k872277k093460q26471P09194K166452
39308c217553K901275K373592Q51651o37585j292780j242527j083135j017119
39300b364181q00767l47965Q7896L72226P33924J360522J975808K035612J276523
$$ y = [10255610, 10467827, 10734580, 10956356, 10799529, 9781618, 7732052, 5174150, 3034154, 1896108, 1694853, 2177471, 3402987, 5551550, 8368614, 11109165, 13125801, 14370637, 15260050, 16188716, 17273839, 18435041, 19507342, 20247301, 20385555, 19798056, 18617930, 17141906, 15635905, 14215327, 12824186, 11271173, 9357202, 7087023, 4783545, 2947195, 1979477, 2019091, 2938583, 4383417, 5847638, 6854991, 7128361, 6556138, 5060856, 2662858, -300991, -3173268, -5266728, -6093199, -5384005, -3217553, -316278, 2057314, 2908965, 2271380, 978600, -263927, -1347062, -2364181, -3164948, -3512913, -3425017, -3052791, -2318867, -958345, 1017463, 3053075, 4329598]
39291D329598l5462j334271k151506k354146k090883j536300p20491L43362J417451
39282d132648K059604J935140J071018j70249j285975j850173j705421j018302
39274e097006j04728P83505J447191J637625J195640L05152o03758j268774j737286
39265c442439k058869k089922j748137j239009q12547m40695M4484O04649J021442
39256a0161043J202456J240749J218148J167231J181276J307439J335993R72244
39248e35507K79981l03022m99954n21025p27112j184478j723044k230465k634125
39239a0078751k704144k156242r78667M99827J867320K839037L280893L232897
39231d197830K941329K709628K649585K643404K517412K126949J324633Q4656
$$ y = [4329598, 4294136, 2959865, 808359, -1545787, -3636670, -5172970, -5893461, -5550099, -4132648, -2073044, -137904, 933114, 762865, -523110, -2373283, -4078704, -5097006, -5201734, -4418229, -2971038, -1333413, -137773, 167379, -436379, -1705153, -3442439, -5501308, -7591230, -9339367, -10578376, -11390923, -11831618, -11787134, -11182485, -10161043, -8958587, -7717838, -6499690, -5332459, -4151183, -2843744, -1507751, -535507, -255526, -558548, -1058502, -1579527, -2306639, -3491117, -5214161, -7444626, -10078751, -12782895, -14939137, -15917804, -15417977, -13550657, -10711620, -7430727, -4197830, -1256501, 1453127, 4102712, 6746116, 9263528, 11390477, 12715110, 12799766]
39223A2799766j268878k169141k305645j919447j489815j232973j030953p35268
39215F47646l55344q116J21200k07112j071831k098801k573011k027577o94072
39206h267018P14763J620882J919387J824015J579786J353830J223316J114474
39198C083435Q06137J50437o64067j172278j053224m68695Q8072K67567J16149
39189A153533j18073k77268l11392j45010K65813P34965Q90726N42705n7731m18926
39179B259342k60112K71056P78749R59134Q11820N99659N92545P97302R60775
39170G770270Q86775O88960O14697O43376M29741k64384j183680j749371j606154
39161F230230r37911k59761M5352l85r5241l2851O6890l0167k24311j8968R06937
$$ y = [12799766, 11530888, 9361747, 7056102, 5136655, 3646840, 2413867, 1382914, 647646, 292302, 284186, 405386, 198274, -873557, -2972358, -5545369, -7572946, -8267018, -7552255, -5931373, -4011986, -2187971, -608185, 745645, 1968961, 3083435, 3889572, 4040009, 3375942, 2203664, 1150440, 681745, 769817, 1037384, 1153533, 1035460, 758192, 446800, 301790, 567603, 1302568, 2193294, 2735999, 2678268, 2259342, 1999230, 2270286, 3049035, 4008169, 4819989, 5419648, 6012193, 6809495, 7770270, 8657045, 9346005, 9960702, 10604078, 11033819, 10769435, 9585755, 7836384, 6230230, 5292319, 5032558, 5077910, 5077525, 4982284, 4949433, 5016323, 4986156, 4761845, 4742877, 5649814]
39150E649814K137482K797259K475056J663948J137831J068080R74162M19026
39142A8322658n51576j647167k665783l439869l718571l371850k606356j755726
39134a434240r24761n8320O98737J003727P46390K37081j59205l82925n17733
39125g91249m48509N4185R26645J695499J840263J206446Q1495j029062j708179
39116A827534j849079j650953j371175j086057p32145l27795m4201n9546m25413
39107e718830j048190j684096j974926j666335q66953J4139O49303J035261J346312
39098i914315J686468K037850K297887K270745J775663R14767J24121k04950q2476
39089I05760K42076O86467J353726K175757K782877K813465K239871J374821O72236
$$ y = [5649814, 7787296, 10584555, 13059611, 14723559, 15861390, 16929470, 17903632, 18322658, 17771082, 16123915, 13458132, 10018263, 6299692, 2927842, 321486, -1434240, -2359001, -2417321, -1718584, -714857, 31533, 268614, 109409, -273516, -791249, -1239758, -1185573, -258928, 1436571, 3276834, 4483280, 4564775, 3535713, 1827534, -21545, -1672498, -3043673, -4129730, -4861875, -5189670, -5233871, -5293417, -5718830, -6767020, -8451116, -10426042, -12092377, -12959330, -12945191, -12295888, -11260627, -9914315, -8227847, -6189997, -3892110, -1621365, 154298, 1069065, 1193186, 988236, 905760, 1147836, 1834303, 3188029, 5363786, 8146663, 10960128, 13199999, 14574820, 15247056]
39080A5247056M74488P37813R76438P00675q184n66727o33259n46258q32280j490665
39070A4059097k066149k332662k556275l005159l461089l398501k558816j230651
39062f550205M728P45614J020436J122251J220716J187121Q37038K60380k19244
39053c71165l94212l40658k08939J0928M12883R34335J310016J298225R32438
39044C583851N28687M09009N89781P79306P24850N06879M15693O02028R75857
39035I115941J406294J841548K203265K334062K132998J626274Q49887j89452
39027B1320817j349305k304740k813175k925651k811844k507475k015322j532532
39019C060773j299329j225366r37028k95470L35641M86491J22765l49157n38143
$$ y = [15247056, 15721544, 16459357, 17435795, 18136470, 18128286, 17561559, 16928300, 16382042, 15549762, 14059097, 11992948, 9660286, 7104011, 4098852, 637763, -2760738, -5319554, -6550205, -6545477, -5799863, -4779427, -3657176, -2436460, -1249339, -412301, -151921, -371165, -765377, -1106035, -1314974, -1304046, -891163, 43172, 1353188, 2651413, 3583851, 4112538, 4521547, 5111328, 5890634, 6615484, 7122363, 7538056, 8140084, 9115941, 10522235, 12363783, 14567048, 16901110, 19034108, 20660382, 21510269, 21320817, 19971512, 17666772, 14853597, 11927946, 9116102, 6608627, 4593305, 3060773, 1761444, 536078, -400950, -696420, -360779, 125712, 248477, -100680, -638823]
39010f38823l92078j14340R1765J72150K23292L99615P62556J171536J366574
39001C042247J232664R84499J010626J469498K069298K323189K024647J398234
38993A5554902P76268K42282l30519r86836j582501j963645k129243k163709k072513
38984E344486j754156j154910m44578J4576k4550l86110n77864k92941K72046
38975I95999O86362P60503N99371K91893j79090o91051r21304p03998l05965j74448
38965C58272m61341r02598j103364q34908j25836P62158J411630J437557P45513
38956A287083l37254j216039j415382r21283j56820M29810P44720R77205J223585
38947F15625J327644J094986N16181k59186j023907j530267j559704j087840k97191
$$ y = [-638823, -1030901, -1145241, -1053476, -881326, -658034, -258419, 504137, 1675673, 3042247, 4274911, 5259410, 6270036, 7739534, 9808832, 12132021, 14156668, 15554902, 16331170, 16573452, 16242933, 15256097, 13673596, 11709951, 9580708, 7416999, 5344486, 3590330, 2435420, 1990842, 2005418, 1980868, 1594758, 1016894, 723953, 995999, 1682361, 2442864, 3042235, 3334128, 3155038, 2463987, 1542683, 838685, 532720, 358272, -103069, -1005667, -2109031, -2943939, -3069775, -2307617, -895987, 541570, 1287083, 949829, -266210, -1681592, -2602875, -2759695, -2329885, -1585165, -607960, 615625, 1943269, 3038255, 3554436, 3295250, 2271343, 741076, -818628, -1906468, -2203659]
38938b203659O20017J531509K189376K233181J602011Q18485N89235J099187J849940
38929A0329282K175955J774222P75317m68454j562525k168854k085029j324372
38921G445542k07345O48742O70472j20688r91096j162268n89516Q7741L03578
38912F085162L7204m24432q63553j176441j330958j460324j798967k336287k680901
38903e949497k450589j692866p83961n7736L03413K07374k13688m97782k32489
38894a1367821M13163Q38971Q03755P73470J270166K107902K594867K397036J855699
38885A687208J422769J131387P96341M37561J80842j09261p05830j499933j947670
38876A393414j681708r22392j12383O11657J330025J915386K053799J680409J119591
$$ y = [-2203659, -1583642, -52133, 2137243, 4370424, 5972435, 6790920, 7380155, 8479342, 10329282, 12505237, 14279459, 15054776, 14586322, 13023797, 10854943, 8769914, 7445542, 7238197, 7886939, 8557411, 8436723, 7445627, 6283359, 5693843, 5781584, 6085162, 6122366, 5697934, 4834381, 3657940, 2326982, 866658, -932309, -3268596, -5949497, -8400086, -10092952, -10876913, -10934649, -10631236, -10423862, -10637550, -11135332, -11367821, -10954658, -10115687, -9311932, -8538462, -7268296, -5160394, -2565527, -168491, 1687208, 3109977, 4241364, 5037705, 5475266, 5656108, 5546847, 4841017, 3341084, 1393414, -288294, -1210686, -1323069, -711412, 618613, 2533999, 4587798, 6268207, 7387798]
38867G387798P40830O56583P60857Q56438P17304K36057m25026r85890j359161
38858H585790j601105j550379q44041N16366J842186K274038J596059M30961l05717
38849A0944158j05076P88741J564167J481522M89578q10348j812156k351309k495755
38840G693522k228309j576051q11463j97094L39201R51686J392538J159805J76084
38831F899919r87515j669737j687025j280009p34634k01102K58640N89399O86147
38822A874083M38643n5615l85599j76523M07691P49468M82260q6120l98137l13877
38812B536274j47171j38529j30634J92431Q70002J530043J668775J075936P450
38803G464577j067839j864026k374556k653764k683694k484904k166089j743506
$$ y = [7387798, 8128628, 8785211, 9546068, 10402506, 11119810, 11355867, 10930841, 9944951, 8585790, 6984685, 5434306, 4590265, 5106631, 6948817, 9222855, 10818914, 11249875, 10944158, 10839082, 11627823, 13191990, 14673512, 15163090, 14352742, 12540586, 10189277, 7693522, 5465213, 3889162, 3077699, 2880605, 3219806, 4171492, 5564030, 6723835, 6899919, 5912404, 4242667, 2555642, 1275633, 540999, 339897, 598537, 1187936, 1874083, 2312726, 2257111, 1871512, 1694989, 2102680, 2852148, 3334408, 3248288, 2850151, 2536274, 2389103, 2250574, 2119940, 2312371, 3182373, 4712416, 6381191, 7457127, 7464577, 6396738, 4532712, 2158156, -495608, -3179302, -5664206, -7830295, -9573801]
38795i573801j049112K2325J238217K138703K406871K061873J361292O31019J35310
38786f27303n0557q4151j92579m33358o59652p18524o24232n24855n44705o78349
38776e138265q17233q69417q50468q33989q07100o21696j34337O17070J407112
38767h048323J992179K273658K299562K126431J726240J095394M47272J53651
38759D066064L62839P38908P44840K03635n28163r30238p34586j5727R11480J630613
38749F449665J875111J765116J646870J613447J386657Q07773J98206m5206o5259
38740A5632380m13819j305090k273623k640580k137056j051243K0359N16128K50903
38731F598359m18733q83643q40579m71798m4312M50605J095728J656926J661596
$$ y = [-9573801, -10622913, -10600588, -9362371, -7223668, -4816797, -2754924, -1393632, -762613, -627303, -677860, -762011, -954590, -1387948, -2047600, -2766124, -3390356, -3915211, -4459916, -5138265, -5955498, -6824915, -7675383, -8509372, -9316472, -9938168, -10072505, -9455435, -8048323, -6056144, -3782486, -1482924, 643507, 2369747, 3465141, 3912413, 4066064, 4428903, 5167811, 5912651, 6116286, 5588123, 4657885, 3923299, 3907572, 4819052, 6449665, 8324776, 10089892, 11736762, 13350209, 14736866, 15544639, 15742845, 15697639, 15632380, 15218561, 13913471, 11639848, 8999268, 6862212, 5810969, 5831328, 6347456, 6598359, 6179626, 5295983, 4455404, 3983606, 3939294, 4389899, 5485627, 7142553, 8804149]
38722H804149Q81371m06626j632965k293895k157233j344066l04163M37598O76371
38713B660541O73489Q49393J340905J884114K075201J683695P68612l84067j406109
38704A0145774k023488k172214j942737j421561o55792K11239Q80806J086461
38696D108488Q24212L43414m3032q8622L23725J062270J710227J843176J407366
38687A1491224P06309N727o64876j272851j591214j429128q97188k44420M49192
38678F552775J194728J800647J940043J539587Q82642K71710k31460o86527j101973
38669A2162172j489225j924270k406726k742905k693553k207742j461348p25668
38661c489265k20583J9944J99552N60009J055076J359572J314368J208071J419599
$$ y = [8804149, 9685520, 9278894, 7645929, 5352034, 3194801, 1850735, 1546572, 1984170, 2660541, 3334030, 4183423, 5524328, 7408442, 9483643, 11167338, 11935950, 11551883, 10145774, 8122286, 5950072, 4007335, 2585774, 1929982, 2141221, 3022027, 4108488, 4932700, 5276114, 5233082, 5144460, 5468185, 6530455, 8240682, 10083858, 11491224, 12197533, 12203260, 11538384, 10265533, 8674319, 7245191, 6348003, 6103583, 6552775, 7747503, 9548150, 11488193, 13027780, 13910422, 14182132, 13950672, 13264145, 12162172, 10672947, 8748677, 6341951, 3599046, 905493, -1302249, -2763597, -3489265, -3709848, -3689904, -3490352, -2930343, -1875267, -515695, 798673, 2006744, 3426343]
38652C426343J874921K094133J753994R62979m0518j162675k249686k843784k480378
38643A335329j248987J57406J027622J150451P44165Q6741o29617j210597j458935
38634d6422j293982p63612N0429J013138J833154K150497J799559Q90710l70986
38625E262485j766628k910222l271191k591862j192164L34827J662509K794806
38617a677440L705460M199114M148071L631140K791062J762693P82512J19908
38609A9462520k22718n40276j011045j421959j470636j200876r45354r11515r94630
38600A0743511r62291o85820k09288L07527P18934R92591J114116R15087K11541
38591A3145908p89952j472949j429368r28252n10813k84049K2960L88466L58633
$$ y = [3426343, 5301264, 7395397, 9149391, 10112370, 10071852, 8909177, 6659491, 3815707, 1335329, 86342, 243748, 1271370, 2421821, 3165986, 3252727, 2623110, 1412513, -46422, -1340404, -2104016, -2053587, -1040449, 792705, 2943202, 4742761, 5633471, 5262485, 3495857, 585635, -2685556, -5277418, -6469582, -6134755, -4472246, -1677440, 2028020, 6227134, 10375205, 14006345, 16797407, 18560100, 19342612, 19462520, 19239802, 18699526, 17688481, 16266522, 14795886, 13595010, 12649656, 11738141, 10743511, 9781220, 9095400, 8886112, 9193639, 9912573, 10905164, 12019280, 12934367, 13145908, 12355956, 10883007, 9453639, 8525387, 8014574, 7730525, 7753485, 8141951, 8500584]
38582H500584k80437j067395j365108j077196o20089l35068j86052K9270M01865
38573D000374Q41785J114715R47150K52301p11313j507578j871786j829738j518854
38564b82944j048377n63422k73031k68076l68358k92469m372K06128N4372l77852
38554c218401p04458o71167m41323l67186n15202n38726q0578P60983J453044
38545d323014J515290R33071Q2658o68354j197562j501292j503784j136406n48036
38536h347429m2776K52962N06211Q51750J098975R62670N18498J93455K70940
38527c734744O04704Q92532J031684J052705Q50832K16638q49702j987631k693238
38518d616220k667158j983001r71854O2493J021081J865000K342044K062529R76394
$$ y = [8500584, 8220147, 7152752, 5787644, 4710448, 4090359, 3755291, 3569239, 3598509, 4000374, 4842159, 5956874, 6904024, 7156325, 6445012, 4937434, 3065648, 1235910, -282944, -1331321, -1894743, -2167774, -2435850, -2804208, -3096677, -3101049, -2894921, -2840549, -3218401, -3922859, -4594026, -5035349, -5402535, -5917737, -6456463, -6537041, -5776058, -4323014, -2807724, -1874653, -1791995, -2460349, -3657911, -5159203, -6662987, -7799393, -8347429, -8390205, -8137243, -7631032, -6779282, -5680307, -4717637, -4199139, -4005684, -3734744, -3130040, -2237508, -1205824, -153119, 697713, 914351, 64649, -1922982, -4616220, -7283378, -9266379, -10238233, -10175740, -9154659, -7289659, -4947615, -2885086, -1908692]
38509a908692l79181j329472j713467j883765k085091k096155j580309n69725
38501a3545857N66877J490315K041127K151204J878520J545597J594766K154269
38493a23182K842125L104724K694756J765686O23041m64271j272415j657067j658309
38484E855088j464826j207751q65191m08597O9245M54287P32683Q92946Q03769
38475D861653L75159j77052m17258j06336N70006J207465J500596J359542R06257
38466A0080032M39945K29251J92248r5969r20641k027760k829028k914006k248678
38457i4606j046902K91492J212674J336731Q53474L65451K44180L29634L21439
38448C813567J95913O4743j39224n54385j082478j466724j649405j790745j886159
$$ y = [-1908692, -2287873, -3617345, -5330812, -7214577, -9299668, -11395823, -12976132, -13545857, -12978980, -11488665, -9447538, -7296334, -5417814, -3872217, -2277451, -123182, 2718943, 5823667, 8518423, 10284109, 10907150, 10442879, 9170464, 7513397, 5855088, 4390262, 3182511, 2317320, 1908723, 1977968, 2432255, 3164938, 4057884, 4861653, 5236812, 5059760, 4642502, 4536166, 5106172, 6313637, 7814233, 9173775, 10080032, 10519977, 10749228, 10941476, 10845507, 9924866, 7897106, 5068078, 2154072, -94606, -1141508, -850016, 362658, 1699389, 2552863, 2918314, 3162494, 3492128, 3813567, 4009480, 4074223, 3934999, 3380614, 2298136, 831412, -817993, -2608738, -4494897]
38439d494897j606524o89785N90680J494175J398413L34526j025205j910167k018700
38430g927484j580858r35989j89736O67760J483511J981481K036150J740418J231278
38421a493469O32440J65135P9779L59131O38245N58503J33604l22922n64646o26727
38411d40927p26669j000135j274711j101370j62975J258469K355382K477236J686742
38402C071042N79120k98984p21513o81188l34587k7034p8508m50341q09234r85102
38392g36329j166302j538942j925624j952196j456768n73559M90131J561788K421671
38383d876130K830289K738318K378832K052484J824784J485234Q36983J4520n58610
38374H726704n99739l08279j50793l05126m83460l81457j32456j39978n34069
$$ y = [-4494897, -6101421, -6791206, -6200526, -4706351, -3307938, -2973412, -3998617, -5908784, -7927484, -9508342, -10444331, -10634067, -9966307, -8482796, -6501315, -4465165, -2724747, -1493469, -861029, -695894, -616115, -256984, 381261, 939764, 1073368, 750446, 185800, -440927, -1167596, -2167731, -3442442, -4543812, -4706787, -3448318, -1092936, 1384300, 3071042, 3650162, 3351178, 2629665, 1948477, 1613890, 1586856, 1508348, 1058007, 248773, -736329, -1902631, -3441573, -5367197, -7319393, -8776161, -9349720, -8859589, -7297801, -4876130, -2045841, 692477, 3071309, 5123793, 6948577, 8433811, 9270794, 9285314, 8726704, 8126965, 7818686, 7667893, 7362767, 6879307, 6497850, 6365394, 6225416, 5691347]
38365E691347r69606r64096l36748O35174J362998J307728M01823q39827j760443
38356D528350k140617k224898k214225j993403j476917r84590r99891j593412
38348i099603k280406k464106j900974p63551N64144J686709K345534K519689
38340i392564K379806K097025J723947J289076R28067P99458Q54053P99799M04825
38331A883492j80171n13357l39434Q7025K52878m6474m78722n27396J2150R10011
38321A060002J749137K191856K091575J522752P43168J6750n90491j180446j758674
38312E845629k099330j979721j509872j100838j064235j317522j531191j496468
38304f253548j262657r47493n35119P8402Q92220J719894K308399K530456K471623
$$ y = [5691347, 4721741, 3757645, 3420897, 4056071, 5419069, 6726797, 7128620, 6288793, 4528350, 2387733, 162835, -2051390, -4044793, -5521710, -6506300, -7506191, -9099603, -11380009, -13844115, -15745089, -16508640, -15944496, -14257787, -11912253, -9392564, -7012758, -4915733, -3191786, -1902710, -974643, -175185, 678868, 1478667, 1883492, 1703321, 1189964, 850530, 937555, 1190433, 1143959, 665237, 137841, 149991, 1060002, 2809139, 5000995, 7092570, 8615322, 9358490, 9375240, 8784749, 7604303, 5845629, 3746299, 1766578, 256706, -844132, -1908367, -3225889, -4757080, -6253548, -7516205, -8463698, -8998817, -8920415, -8028195, -6308301, -3999902, -1469446, 1002177]
38295A002177K311180K072428J525305M65942q65717j803753j847719j168272
38287A691571l69523J93676O58569J228047J759796J900653J455507M92972p60402
38278H250866j973063k787934l045319k868226k400996j609943n61204K61171
38270f734648L06299l29119q89273q26585m16823l05770o59978j031457r42813
38261a1830167l45983M37907R83938R90494N07785J0006K6655N65334J003834
38252g650197O65619n18123j916837k692916k422593j401785m01398K794o5878
38243a6401314j2409N13378J286020J897483K217511K304761K096764J487294
38235d610512O31166j04694m87231m91264o8564Q37040J956637K685570K635098
$$ y = [1002177, 3313357, 5385785, 6911090, 7377032, 6511315, 4707562, 2859843, 1691571, 1322048, 1515724, 2174293, 3402340, 5162136, 7062789, 8518296, 9011268, 8250866, 6277803, 3489869, 444550, -2423676, -4824672, -6434615, -6995819, -6734648, -6428349, -6757468, -7646741, -8473326, -8890149, -9195919, -9855897, -10887354, -11830167, -12176150, -11738243, -10754305, -9763811, -9256026, -9246020, -9219365, -8654031, -7650197, -6984578, -7502701, -9419538, -12112454, -14535047, -15936832, -16338230, -16335436, -16401314, -16413723, -15900345, -14614325, -12716842, -10499331, -8194570, -6097806, -4610512, -3979346, -4084040, -4571271, -5062535, -5131099, -4294059, -2337422, 348148, 2983246]
38226B983246K042433J443245J067341P58111L65046p3356n42520j171315j992696
38217D879535k721984k935123k459044j516196m96473L54332J014715J531867
38209b348371J893456K095581K225455K302491K050001J064967o27338k327407
38201F328835l168531k843210j739561n10289K82434K52162o47475j887523k561378
38192f494536k068996n80617J203605K594798L176219K823894J777097O34913
$$ y = [2983246, 5025679, 6468924, 7536265, 8294376, 8659422, 8586066, 8043546, 6872231, 4879535, 2157551, -777572, -3236616, -4752812, -5249285, -4894953, -3880238, -2348371, -454915, 1640666, 3866121, 6168612, 8218613, 9283580, 8656242, 6328835, 3160304, 317094, -1422467, -1932756, -1650322, -1398160, -2045635, -3933158, -6494536, -8563532, -9144149, -7940544, -5345746, -2169527, 654367, 2431464, 3066377]
$$ [...]
##END NTUPLES=NMR SPECTRUM
##END=
