##TITLE=31Pdec_DE-17_PHGly
 D2O, 64 sc
 14.2.2025
##JCAMPDX= 6.0         $$ Bruker NMR JCAMP-DX V2.0
##DATA TYPE= NMR SPECTRUM
##DATA CLASS= NTUPLES
##ORIGIN= UXNMR, Bruker Analytische Messtechnik GmbH
##OWNER= root
$$ XWIN-NMR		Version 3.5
$$ Fri Feb 14 14:36:29 2025 Russian Standard Time (UT+4h)  she@DPX200
##.OBSERVE FREQUENCY= 81.013821
##.OBSERVE NUCLEUS= ^31P
##.ACQUISITION MODE= SIMULTANEOUS
##.ACQUISITION SCHEME= undefined
##.AVERAGES= 64
##.DIGITISER RES= 17
##SPECTROMETER/DATA SYSTEM= spect
##.PULSE SEQUENCE= zgpg30
##.SOLVENT NAME= D2O
##.SHIFT REFERENCE= (INTERNAL, D2O, 0, 198.062)
##AUDIT TRAIL= $$ (NUMBER, WHEN, WHO, WHERE, WHAT)
$$ ##TITLE= Audit trail, XWIN-NMR		Version 3.5
$$ ##JCAMPDX= 5.01
$$ ##ORIGIN= Bruker BioSpin GmbH
$$ ##OWNER= she
$$ F:/spectra/data/she/nmr/P31/2/pdata/1/auditp.txt
$$ ##AUDIT TRAIL=  $$ (NUMBER, WHEN, WHO, WHERE, WHAT)
(   1,<2025-02-14 14:34:32.17 +0400>,<she>,<DPX200>,
      <created by zg, POWCHK disabled, PULCHK disabled
       configuration hash MD5:
       00 E9 B6 7A A2 85 ED C7 34 08 36 98 17 FE 4E 26
       data hash MD5: 32K
       69 D4 FB 31 9B EC B4 20 F3 DF 77 A5 13 A7 C6 D0>)
(   2,<2025-02-14 14:34:44.45 +0400>,<she>,<DPX200>,
      <Start of raw data processing
       efp BC_mod = 2 LB = 1.5 FT_mod = 6 PKNL = 1 PHC0 = 1703.094 PHC1 = 150.6954 SI = 64K 
       data hash MD5: 64K
       05 FA 1D 7A 85 59 9B 78 4A D2 B9 E4 5E C8 44 56>)
(   3,<2025-02-14 14:35:24.73 +0400>,<she>,<DPX200>,
      <pk PHC0 = 16.12343 PHC1 = 0 
       data hash MD5: 64K
       DC 22 32 C6 CD 14 22 81 1B 10 82 07 FC 4E C3 02>)
$$ ##END=
$$ 
$$ hash MD5
$$ B2 AA 36 AB 20 1A FE 70 B9 6D E3 EE DC B1 E0 A2
##$RELAX= 
##$RELAX= 
##$RELAX= 
##$RELAX= 
##$RELAX= 
##$RELAX= 
##$RELAX= 
##$RELAX= 
$$ Bruker specific parameters
$$ --------------------------
##$DU= <F:/spectra>
##$EXPNO= 2
##$NAME= <P31>
##$PROCNO= 1
##$TYPE= <nmr>
##$USER= <she>
##$AMP= (0..31)
100 100 100 100 100 100 100 100 100 100 100 100 100 100 100 100 100 100 
100 100 100 100 100 100 100 100 100 100 100 100 100 100 
##$AQSEQ= 0
##$AQ_mod= 1
##$AUNM= <au_zg>
##$AUTOPOS= <>
##$BF1= 81.014009
##$BF2= 200.13
##$BF3= 200.13
##$BF4= 200.13
##$BF5= 200.13
##$BF6= 200.13
##$BF7= 200.13
##$BF8= 200.13
##$BYTORDA= 1
##$CFDGTYP= 0
##$CFRGTYP= 5
##$CHEMSTR= <none>
##$CNST= (0..31)
1 1 145 1 1 1 1 1 1 1 1 1 1 1 1 1 1 1 1 1 1 1 1 1 1 1 1 1 1 1 1 1 
##$CPDPRG= <waltz16>
##$CPDPRG1= <>
##$CPDPRG2= <waltz16>
##$CPDPRG3= <>
##$CPDPRG4= <mlev>
##$CPDPRG5= <mlev>
##$CPDPRG6= <mlev>
##$CPDPRG7= <mlev>
##$CPDPRG8= <mlev>
##$CPDPRGB= <>
##$CPDPRGT= <>
##$D= (0..31)
0 1 0 0 0 0 0 0 0 0.06 0 0.03 2e-05 3e-06 0 0 0.0002 0 0 0 0 0 0 0 0 0 
0 0 0 0 0 0 
##$DATE= 1739529271
##$DBL= (0..7)
120 120 120 11 120 120 24 19 
##$DBP= (0..7)
150 150 150 150 150 150 150 150 
##$DBP07= 0
##$DBPNAM0= <>
##$DBPNAM1= <>
##$DBPNAM2= <>
##$DBPNAM3= <>
##$DBPNAM4= <>
##$DBPNAM5= <>
##$DBPNAM6= <>
##$DBPNAM7= <>
##$DBPOAL= (0..7)
0.5 0.5 0.5 0.5 0.5 0.5 0.5 0.5 
##$DBPOFFS= (0..7)
$$ [...]
##$SUBNAM3= <"">
##$SUBNAM4= <"">
##$SUBNAM5= <"">
##$SUBNAM6= <"">
##$SUBNAM7= <"">
##$SUBNAM8= <"">
##$SUBNAM9= <"">
##$SW= 400.765351723535
##$SWIBOX= (0..15)
0 1 3 0 0 0 0 0 0 0 0 0 0 0 0 0 
##$SW_h= 32467.5324675325
##$TD= 32768
##$TD0= 1
##$TE= 0
##$TE2= 300
##$TE3= 300
##$TEG= 300
##$TL= (0..7)
0 120 53 12 22 120 120 120 
##$TP= (0..7)
150 150 150 150 150 150 150 150 
##$TP07= 0
##$TPNAME0= <>
##$TPNAME1= <>
##$TPNAME2= <>
##$TPNAME3= <>
##$TPNAME4= <>
##$TPNAME5= <>
##$TPNAME6= <>
##$TPNAME7= <>
##$TPOAL= (0..7)
0.5 0.5 0.5 0.5 0.5 0.5 0.5 0.5 
##$TPOFFS= (0..7)
0 0 0 0 0 0 0 0 
##$TUNHIN= 0
##$TUNHOUT= 0
##$TUNXOUT= 0
##$USERA1= <user>
##$USERA2= <user>
##$USERA3= <user>
##$USERA4= <user>
##$USERA5= <user>
##$V9= 5
##$VALIST= <valist>
##$VCLIST= <CCCCCCCCCCCCCCC>
##$VD= 0
##$VDLIST= <DDDDDDDDDDDDDDD>
##$VPLIST= <PPPPPPPPPPPPPPP>
##$VTLIST= <TTTTTTTTTTTTTTT>
##$WBST= 1024
##$WBSW= 4
##$XGAIN= (0..3)
0 0 0 0 
##$XL= 0
##$YL= 0
##$YMAX_a= 22929
##$YMIN_a= -25309
##$ZGOPTNS= <>
##$ZL1= 120
##$ZL2= 120
##$ZL3= 120
##$ZL4= 120
##$ABSF1= 0
##$ABSF2= 0
##$ABSG= 0
##$ABSL= 0
##$ALPHA= 0
##$AQORDER= 0
##$ASSFAC= 0
##$ASSFACI= 0
##$ASSFACX= 0
##$ASSWID= 0
##$AUNMP= <proc_1d>
##$AZFE= 0.1
##$AZFW= 0.5
##$BCFW= 0
##$BC_mod= 2
##$BYTORDP= 0
##$COROFFS= 0
##$CY= -3
##$DATMOD= 1
##$DC= 0
##$DFILT= <>
##$DTYPP= 0
##$F1P= 0
##$F2P= 0
##$FCOR= 1
##$FTSIZE= 65536
##$FT_mod= 6
##$GAMMA= 0
##$GB= 0
##$INTBC= 1
##$INTSCL= 9.790993e-09
##$ISEN= 30
##$LB= 1.5
##$LEV0= 0
##$LPBIN= 0
##$MAXI= 10000
##$MC2= 0
##$MEAN= 0
##$ME_mod= 0
##$MI= 50
##$NCOEF= 0
##$NC_proc= -7
##$NLEV= 6
##$NOISF1= 182.463
##$NOISF2= 159.3651
##$NSP= 0
##$NTH_PI= 0
##$NZP= 0
##$OFFSET= 198.0616
##$PC= 4
##$PHC0= 1719.217
##$PHC1= 150.6954
##$PH_mod= 1
##$PKNL= yes
##$PPARMOD= 0
##$PSCAL= 0
##$PSIGN= 0
##$REVERSE= no
##$SF= 81.0140089999434
##$SI= 65536
##$SIGF1= 159.3651
##$SIGF2= -187.1042
##$SINO= 113.3802
##$SIOLD= 16384
##$SREGLST= <1H.CDCl3>
##$SSB= 0
##$STSI= 65536
##$STSR= 0
##$SW_p= 32467.5324675325
##$SYMM= 0
##$S_DEV= 0
##$TDeff= 32768
##$TDoff= 0
##$TI= <>
##$TILT= no
##$TM1= 0
##$TM2= 0
##$TOPLEV= 0
##$USERP1= <user>
##$USERP2= <user>
##$USERP3= <user>
##$USERP4= <user>
##$USERP5= <user>
##$WDW= 1
##$XDIM= 65536
##$YMAX_p= 308136498
##$YMIN_p= -102651491
$$ End of Bruker specific parameters
$$ ---------------------------------
##NTUPLES= NMR SPECTRUM
##VAR_NAME=  FREQUENCY,     SPECTRUM/REAL,   SPECTRUM/IMAG
##SYMBOL=    X,             R,               I
##VAR_TYPE=  INDEPENDENT,   DEPENDENT,       DEPENDENT
##VAR_FORM=  AFFN,          ASDF,            ASDF
##VAR_DIM=   65536,         65536,           65536
##UNITS=     HZ,            ARBITRARY UNITS, ARBITRARY UNITS
##FACTOR=    0.49542278885378, 1,            1
##FIRST=     16045.7642231865, 0,            0
##LAST=      -16421.768244346, 0,            0
##MIN=       -16421.768244346, -102651491,   0
##MAX=       16045.7642231865, 308136498,    0
$$ Real data points
##PAGE= N=1
##DATA TABLE= (X++(R..R)), XYDATA
$$ [...]
$$ plain form
41621 5214827 4829186 4207687 3532653 2820656 2582572 3068798 3351205 2381094 730879
41612 730879 69196 937805 2192200 2725384 2630786 2434870 2226474 1946109 1717440 1502771
41602 1502771 1055631 434318 -58634 -538539 -1415933 -2528538 -3171728 -3067252 -2475620
41593 -2475620 -1353000 533579 2507874 3217587 2386018 1239150 754890 644723 572504
41584 572504 1011730 2001221 2324723 1148181 -497928 -1149992 -1015192 -1280397 -1966024
41575 -1966024 -1969892 -923622 419090 1510384 2397600 2827137 2298604 1226126 887459
41566 887459 1842171 3234473 3892370 3381389 1943411 310205 -322738 826803 2920108
41557 2920108 4012521 3158329 1324537 -9787 -363742 -106443 290657 381172 -84338
$$ packed form
41621E214827l85641o21499o75034p11997k38084M86226K82407r70111j650215
41612G30879o61683Q68609J254395N33184r4598j95916k08396k80365k28669k14669
41602A502771m47140o21313m92952m79905q77394j112605o43190J04476N91632
41593b475620J122620J886579J974295P09713q31569j146868m84260j10167p2219
41584E72504M39226R89491L23502j176542j646109o52064J34800k65205o85627
41575a966024l868J046270J342712J091294Q87216M29537n28533j072478l38667
41566H87459R54712J392302O57897n10981j437978j633206o32943J149541K093305
41557B920108J092413q54192j833792j334324l53955K57299L97100R0515m65510
$$ plain form
41548 -84338 -578499 -106727 1323763 2251252 1529966 16915 -383287 886193 2405279
41539 2405279 2538198 1160614 -567977 -1718644 -2488939 -3544187 -4707372 -4811699 -3209646
41530 -3209646 -994586 70844 -270189 -625092 -158279 147530 -945816 -3039566 -4704184
41521 -4704184 -5343726 -5398916 -5095971 -4210001 -3064733 -2600104 -3066483 -3523826 -3128696
41512 -3128696 -2231138 -1621698 -1268550 -591967 270174 360957 -721050 -1979557 -2029797
41503 -2029797 -705542 763814 1113834 208514 -1180920 -2338849 -3078323 -3507737 -3702663
41494 -3702663 -3613890 -3106453 -2117196 -902564 -166 261333 85421 -195606 -683699
41485 -683699 -1726899 -3251908 -4650258 -5311947 -4977032 -3689954 -1855885 -287297 330587
$$ packed form
41548h4338m94161M71772J430490R27489p21286j513051m00202J269480J519086
41539B405279J32919j377584j728591j150667p70295j055248j163185j04327J602053
41530c209646K215060J065430l41033l54903M66813L05809j093346k093750j664618
41521d704184o39542n5190L02945Q85970J145268M64629m66379m57343L95130
41512c128696Q97558O09440L53148O76583Q62141R0783j082007j258507n0240
41503b029797J324255J469356L50020r05320j389434j157929p39474m29414j94926
41494c702663Q8773N07437R89257J214632R02398K61499j75912k81027m88093
41485f83699j043200j525009j398350o61689L34915J287078J834069J568588O17884
$$ plain form
41476 330587 114457 -252786 -356003 -131588 696997 2336667 3918421 3869201 1984700
41467 1984700 314770 1007610 3669739 5801410 5698195 4062222 2723389 2586278 3133443
41458 3133443 3389195 2929677 2080236 1335267 665019 -411016 -1959936 -3206692 -3348894
41449 -3348894 -2521694 -1442615 -312309 1226724 3005613 3988337 3477915 2219816 1708660
41440 1708660 2443197 3335000 3072601 1836658 1248514 2469537 4695884 5987404 5444314
41431 5444314 3920817 2495780 1108173 -651335 -2082403 -1869697 -61958 1451184
41423 1451184 954612 -1122063 -2764282 -2645138 -1365602 -478455 -709176 -1384276 -1444351
41414 -1444351 -644068 413796 1129027 1368552 1209097 791848 550540 991818 1923776
$$ packed form
41476C30587k16130l67243j03217K24415Q28585J639670J581754m9220j884501
41467A984700j669930O92840K662129K131671j03215j635973j338833j37111N47165
41458C133443K55752m59518q49441p44969o70248j076035j548920j246756j42202
41449c348894Q27200J079079J130306J539033J778889R82724n10422j258099n11156
41440A708660P34537Q91803k62399j235943n88144J221023K226347J291520n43090
41431E444314j523497j425037j387607j759508j431068K12706J807739J513142
41423A451184m96572k076675j642219J19144J279536Q87147k30721o75100o0075
41414a444351Q00283J057864P15231K39525j59455m17249k41308M41278R31958
$$ plain form
41405 1923776 2422921 2019029 1472703 1830560 3038873 4066519 4161583 3443197 2473657
41396 2473657 1793603 1687346 1911038 1910831 1770667 2434554 4238198 5775089 5385179 3521050
41386 3521050 2313454 2713908 3409528 2936768 1587764 574270 409617 948446 2127642
41377 2127642 3718225 4975564 5430033 5549355 5854740 5923024 5130699 3897793 3178837
41368 3178837 2992612 2472167 1293026 109737 -483133 -585981 -472105 -226511 -150303
41359 -150303 -824159 -2358387 -4000129 -4828086 -4607050 -3811030 -3080170 -2786178 -2873206
41350 -2873206 -2960185 -2680702 -1899476 -572282 1237234 2860288 2984288 891749 -2308904
41341 -2308904 -4458688 -4555674 -3582072 -2932884 -2728360 -2156788 -905246 499132 1592046
$$ packed form
41405A923776M99145m03892n46326L57857J208313J027646R5064p18386r69540
41396B473657o80054j06257K23692k07j40164O63887J803644J536891l89910j864129
41386C521050j207596M00454O95620m72760j349004j013494j64653N38829J179196
41377B127642J590583J257339M54469J19322L05385O8284p92325j232906p18956
41368C178837j86225n20445j179141j183289n92870j02848J13876K45594P6208
41359a50303o73856j534228j641742q27957K21036P96020P30860K93992q7028
41350b873206q6979K79483P81226J327194J809516J623054J24000k092539l200653
41341b308904k149784r6986R73602O49188K04524N71572J251542J404378J092914
$$ plain form
41332 1592046 2534072 3641594 4777939 5430088 5227931 4284218 3122293 2294758 1942333
41323 1942333 1670606 959239 -241140 -1382826 -1844082 -1514812 -809308 -217319 4606
41314 4606 -163610 -438765 -128002 1417643 3890058 5932987 6451810 5741492 4772800
41305 4772800 3736287 2207543 575015 47066 924075 2072574 2713553 3502939 4886864
41296 4886864 5610448 4363887 2074100 771771 620937 55527 -1181554 -1369901 193927
41287 193927 1675399 1462152 673638 1137213 2140687 1384158 -1366451 -3783223 -4291315
41278 -4291315 -3955024 -4416863 -5516865 -5960339 -5301726 -4190400 -3250077 -2640547 -2337472
41269 -2337472 -2036333 -1072506 778725 2596563 3175734 2568438 2063713 2542420 3501131
$$ packed form
41332A592046R42026J107522J136345O52149k02157r43713j161925q27535l52425
41323A942333k71727p11367j200379j141686m61256L29270P05504N91989K21925
41314D606j68216k75155L10763J545645K472415K042929N18823p10318r68692
41305D772800j036513j528744j632528n27949Q77009J148499O40979P89386J383925
41296D886864P23584j246561k289787j302329j50834n65410j237081j88347J563828
41287A93927J481472k13247p88514M63575J003474p56529k750609k416772n08092
41278d291315L36291m61839j100002m43474O58613J111326R40323O09530L03075
41269b337472L01139R63827J851231J817838N79171o07296n04725M78707R58711
$$ plain form
41260 3501131 3899383 3358989 2185316 742510 -656522 -1554928 -1667052 -1397188 -1616999
41251 -1616999 -2807543 -4604604 -6134963 -6576540 -5564783 -3527165 -1645184 -973819
41243 -973819 -1377088 -1740850 -1478136 -1340222 -2264881 -3800800 -4394330 -3243946 -1279572
41234 -1279572 -123734 -489935 -1772648 -2822058 -2846914 -1832909 -428353 601598 966198
41225 966198 939685 972661 1399997 2399028 3799774 4871024 4807585 3745509 2897311 3240111
41215 3240111 4325623 4873259 4386513 3633899 3523112 4048443 4541477 4506778 3899365
41206 3899365 2924298 1979622 1611202 2064898 2890203 3388090 3509690 3860685 4588543
41197 4588543 4753097 3390456 1017225 -657630 -731866 -218812 -712524 -2367371 -3805888
$$ packed form
41260C501131L98252n40394j173673j442806j399032q98406j12124K69864k19811
41251a616999j190544j797061j530359m41577J011757K037618J881981O71365
41243i73819m03269l63762K62714J37914r24659j535919n93530J150384J964374
41234a279572J155838l66201j282713j049410k4856J014005J404556J029951L64600
41225I66198k6513L2976M27336R99031J400746J071250o3439j062076q48198L42800
41215C240111J085512N47636m86746p52614j10787N25331M93034l4699o07413
41206C899365r75067r44676l68420M53696Q25305M97887J21600L50995P27858
41197D588543J64554j362641k373231j674855p4236N13054m93712j654847j438517
$$ plain form
41188 -3805888 -3831843 -2580232 -985305 183879 508710 -214809 -1729441 -3182370 -3724115
41179 -3724115 -3220601 -2142738 -918688 301218 1397007 2207616 2720688 3037596 3142013
41170 3142013 2962264 2616016 2249359 1651451 498134 -887896 -1569396 -1196213 -715344
41161 -715344 -1203214 -2218402 -2213434 -754520 601688 278262 -1188288 -1962528 -1503429
41152 -1503429 -1142203 -1925412 -3048376 -3063626 -1805956 -299022 716833 1336369 1902301
41143 1902301 2605092 3400507 3708175 2673341 573139 -603435 741320 3429755 4759126
41134 4759126 4131176 3624617 4460033 4912600 3092202 158324 -1226216 -731138 -464367
41125 -464367 -1474403 -2299934 -1489133 187932 956724 301987 -882088 -1572990 -1240442
$$ packed form
41188c805888k5955J251611J594927J169184L24831p23519j514632j452929n41745
41179c724115N03514J077863J224050J219906J095789Q10609N13072L16908J04417
41170C142013j79749l46248l66657n97908j153317j386030o81500L73183M80869
41161g15344m87870j015188M968J458914J356208l23426j466550p74240M59099
41152a503429L61226p83209j122964j5250J257670J506934J015855O19536N65932
41143A902301P02791P95415L07668j034834k100202j176574J344755K688435J329371
41134D759126o27950n06559Q35416M52567j820398k933878j384540M95078K66771
41125d64367j010036q25531Q10801J677065P68792o54737j184075o90902L32548
$$ plain form
41116 -1240442 138813 1855892 2691506 2086663 846765 210915 570417 1517719 2626336
41107 2626336 3516353 3547647 2276745 183853 -1632390 -2501021 -2588916 -2467498 -2650172
41098 -2650172 -3246554 -3575349 -2512885 15910 2173302 1834616 -845019 -3404997 -3839938
41089 -3839938 -2503723 -963604 -27670 326725 -43419 -1304311 -2798483 -3439602 -3023374
41080 -3023374 -2352490 -2030075 -1926901 -1909585 -2172998 -2541786 -2339715 -1502587 -1037702 -1609965
41070 -1609965 -2260050 -1468767 785712 2951505 3798960 3523430 2908239 2295070 1721755
41061 1721755 1346436 1208394 992393 469754 -115022 -406963 -382763 -156993 302838 950183
41051 950183 1499726 1861109 2382656 3205285 3689380 3094444 1699972 605700 339360
$$ packed form
41116a240442J379255J717079Q35614o04843j239898o35850L59502R47302J108617
41107B626336Q90017L1294j270902k092892j816243q68631q7895J21418j82674
41098b650172n96382l28795J062464K528795K157392l38686k679635k559978m34941
41089c839938J336215J540119R35934L54395l70144j260892j494172o41119M16228
41080c023374O70884L22415J03174J7316k63413l68788K02071Q37128M64885n72263
41070a609965o50085P91283K254479K165793Q47455k75530o15191o13169n73315
41061A721755l75319j38042k16001n22639n84776k91941K4200K25770M59831O47345
41051I50183N49543L61383N21547Q22629M84095n94936j394472j094272k66340
$$ plain form
41042 339360 256425 -397510 -1312695 -1545808 -1005317 -911425 -2406269 -4958155 -6699805
41033 -6699805 -6477084 -5056517 -3953603 -3573882 -3185162 -2373423 -1543371 -950054 -250597
41024 -250597 640153 1144588 957864 570024 271974 -549309 -2348959 -4316812 -5154562
41015 -5154562 -4433177 -2499788 177418 2633300 3286110 1637733 -467288 -849922 112009
41006 112009 317418 -605220 -838337 343123 1172870 349158 -660822 55010 1728035
40997 1728035 2105642 912892 76111 736319 1860875 2011995 1005972 -597890 -2458370
40988 -2458370 -4288154 -5499167 -5600443 -4631427 -3039529 -1516447 -931964 -1792764 -3534445
40979 -3534445 -4788815 -4597905 -3188012 -1613983 -941530 -1602965 -3049618 -4035468 -3640391
$$ packed form
41042C39360q2935o53935r15185k33113N40491R3892j494844k551886j741650
41033f699805K22721J420567J102914L79721L88720Q11739Q30052N93317O99457
41024b50597Q90750N04435j86724l87840k98050q21283j799650j967853q37750
41015e154562P21385J933389K677206K455882O52810j648377k105021l82634R61931
41006A12009K05409r22638k33117J181460Q29747q23712j009980P15832J673025
40997A728035L77607j192750q36781O60208J124556J51120j006023j603862j860480
40988b458370j829784j211013j01276R69016J591898J523082N84483q60800j741681
40979c534445j254370J90910J409893J574029O72453o61435j446653r85850L95077
$$ plain form
40970 -3640391 -2030259 -44861 1577181 2164770 970059 -1892224 -4584178 -4857162
40962 -4857162 -2540536 195913 1405722 1285973 1055865 899670 41946 -1560193 -2690125
40953 -2690125 -2250847 -595082 832941 1007143 287710 -157624 163941 471796 -81606
40944 -81606 -900658 -426826 1693233 3715047 3684640 1742684 -200164 -887312 -998706
40935 -998706 -1828711 -3359189 -4239213 -3546323 -2036703 -1340105 -2074281 -3172133 -3266624
40926 -3266624 -2404327 -1892129 -2497779 -3400047 -3231187 -1736922 79708 1227099 1515869
40917 1515869 1048400 -354277 -2624852 -4674312 -4998454 -3355606 -1247583 -217313
40909 -217313 -127791 139606 666988 365121 -1055945 -2359481 -2723058 -3131308 -4569714
$$ packed form
40970c640391J610132J985398J622042N87589j194711k862283k691954k72984
40962d857162K316626K736449J209809j19749k30108j56195q57724j602139j129932
40953b690125M39278J655765J428023J74202p19433m45334L21565L07855n53402
40944h1606q19052M73832K120059K021814l0407j941956j942848o87148j11394
40935i98706q30005j530478q80024O92890J509620O96598p34176j097852r4491
40926c266624Q62297N12198o05650r02268J68860J494265J816630J147391K88770
40917A515869m67469j402677k270575k049460l24142J642848K108023J030270
40909b17313Q9522K67397N27382l01867j421066j303536l63577m08250j438406
$$ plain form
40900 -4569714 -5791423 -4669664 -1490444 973536 1013837 -23102 23560 1321224 2459090
40891 2459090 2553059 1786803 637210 -287478 -190684 1017689 2135986 1951154 724801
40882 724801 -531257 -1713233 -3291794 -4713100 -4739755 -3515965 -2756491 -3358950 -4129730
40873 -4129730 -3588182 -1890960 -76844 1584834 3295327 4409819 3769314 1331300
40865 1331300 -1478798 -3157929 -3254852 -2199568 -735185 404798 873378 929503 914391
40856 914391 635639 -158640 -865143 -490073 798606 1504133 679831 -773707 -1345165
40847 -1345165 -841534 -276130 -263250 -494606 -684336 -1035569 -1550904 -1684816 -1065368 2037
40837 2037 1080193 2129626 3156814 3846293 3951807 3623492 2991055 1941876 730692
$$ packed form
40900d569714j221709J121759L179220K463980M0301j036939M6662J297664J137866
40891B459090R3969p66256j149593r24688R6794J208373J118297j84832j226353
40882G24801j256058j181976j578561j421306k6655J223790P59474o02459p70780
40873d129730N41548J697222J814116J661678J710493J114492o40505k438014
40865A331300k810098j679131r6923J055284J464383J139983M68580N6125j5112
40856I14391k78752p94279p06503L75070J288679P05527q24302j453538n71458
40847a345165N03631N65404J2880k31356j89730l51233n15335j33912O19448J067405
40837B037J078156J049433J027188O89479J05514l28315o32437j049179j211184
$$ plain form
40828 730692 143374 374140 404153 -509412 -1262326 -185900 2227086 3414599 1980444
40819 1980444 -526008 -1810320 -1633684 -1383289 -1791614 -2408248 -2827347 -3054277 -2758286
40810 -2758286 -1442558 422933 1485624 1112854 146182 -269698 80794 736540 1339300
40801 1339300 1720590 1791686 1819975 2336211 3319250 3947949 3666881 3039647 2914815 3101523
40791 3101523 2642171 1300184 39415 -121497 795661 1950921 2564773 2330215 1277712
40782 1277712 -370255 -2127567 -3160558 -2581041 -258867 2571928 4062441 3561323
40774 3561323 2317424 1862992 2130513 1984197 1252822 962705 1422012 1492258 491480
40765 491480 -409016 135581 1457548 1829261 1080731 599609 830986 628229 -430242
$$ packed form
40828G30692n87318K30766L0013r13565p52914J076426K412986J187513j434155
40819A980444k506452j284312J76636K50395m08325o16634m19099k26930K95991
40810b758286J315728J865491J062691l72770r66672m15880L50492O55746O02760
40801A339300L81290P1096K8289N16236R83039O28699k81068o27234j24832J86708
40791C101523m59352j341987j260769j60912R17158J155260O13852k34558j052503
40782A277712j647967j757312j032991N79517K322174K830795J490513n01118
40774C561323j243899m54432K67521j46316p31375k90117M59307P0246j000778
40765D91480r00496N44597J321967L71713p48530m81122K31377k02757j058471
$$ plain form
40756 -430242 -893207 265175 1614953 1081021 -1095688 -2854832 -3255239 -3118329 -2824457
40747 -2824457 -1437932 1279816 3581502 3675136 2053528 705045 519983 626472 123350
40738 123350 -624750 -716821 -76776 376874 -178318 -1385977 -1884525 -821279 877918
40729 877918 1296330 -228115 -2252151 -3008538 -2390019 -1511753 -907170 -194810 661953
40720 661953 895907 52005 -1200539 -1806918 -1467577 -781108 -585256 -1298013 -2534084
40711 -2534084 -3216531 -2428078 -345668 1896585 3306109 3712726 3441507 2804673 1992876
40702 1992876 1001251 -455256 -2512616 -4547554 -5492058 -4929071 -3455325 -1892379 -680167
40693 -680167 -97234 -305651 -889468 -1100210 -934848 -1167175 -1842965 -1743574 -211068 1409395
$$ packed form
40756d30242m62965J158382J349778n33932k176709j759144m00407J36910K93872
40747b824457J386525K717748K301686R3634j621608j348483j85062J06489n03122
40738A23350p48100r2071O40045M53650n55192j207659m98548J063246J699197
40729H77918M18412j524445k024036p56387O18519Q78266O04583P12360Q56763
40720F61953K33954q43902j252544o06379L39341O86469J95852p12757j236071
40711b534084o82447P88453K082410K242253J409524M06617k71219o36834q11797
40702A992876r91625j456507k057360k034938r44504N62987J473746J562946J212212
40693f80167N82933k08417n83817k10742J65362k32327o75790R9391J532506J620463
$$ plain form
40683 1409395 1380926 -28036 -1214948 -1886171 -3220504 -5267126 -6109768 -4494769 -1751835
40674 -1751835 128800 1121008 2343147 3499898 3099705 1130902 -358174 55446 1335168
40665 1335168 1704297 1090127 733830 1098823 1462987 1327579 979880 562941 -249048
40656 -249048 -1231905 -1307690 -47976 1227886 867828 -883163 -2074384 -1515427 -116683
40647 -116683 560779 270933 -31239 275735 846535 1079550 765331 56820 -600422 -526347
40637 -526347 499724 1488399 1027897 -730208 -1683825 -222186 2468334 3613188 2207310
40628 2207310 30261 -839702 -306508 540293 1359148 2524077 3760013 4146014 3454345
40619 3454345 2394530 1388465 147892 -1190783 -1555422 -308851 1526807 2238025
$$ packed form
40683A409395k8469j408962j186912o71223j334333k046622q42642J614999K742934
40674a751835J880635R92208J222139J156751m00193j968803j489076M13620J279722
40665A335168L69129o14170l56297L64993L64164j35408l47699m16939q11989
40656b49048r82857p5785J259714J275862l60058j750991j191221N58957J398744
40647a16683O77462k89846l02172L06974N70800K33015l14219p08511o57242P4075
40637e26347J026071R88675m60502j758105r53617J461639K690520J144854j405878
40628B207310k177049q69963N33194Q46801Q18855J164929J235936L86001o91669
40619C454345j059815j006065j240573j338675l64639J246571J835658P11218
$$ plain form
40611 2238025 1308919 -288419 -1413557 -1714236 -1432804 -950681 -623034 -606463 -708603
40602 -708603 -628194 -320927 50861 375298 583330 624326 704653 1204494 1983244 2183884
40592 2183884 1287865 -41196 -930307 -1775245 -3677077 -6367950 -7831147 -6517549 -3230550
40583 -3230550 -296669 636320 -373567 -2103096 -3171538 -2917355 -1795074 -709543
40575 -709543 196689 1534313 3162507 3559489 1606177 -1457486 -2972588 -1854912 185017
40566 185017 690130 -899128 -3008355 -3840856 -2979924 -1258777 370002 1534129 2238051
40557 2238051 2395604 1777172 299127 -1759036 -3699879 -4548982 -3694742 -1752774 -364009
40548 -364009 -475621 -1081662 -464534 1473088 3104743 3328843 2741791 2228355 1652772
$$ packed form
40611B238025r29106j597338j125138l00679K81432M82123L27647J6571j02140
40602g08603Q0409L07267L71788L24437K08032M0996Q0327M99841P78750K00640
40592B183884q96019j329061q89111q44938j901832k690873j463197J313598L286999
40583c230550K933881R32989j009887j729529j068442K54183J122281J085531
40575g09543R06232J337624J628194L96982j953312l063663j515102J117676K039929
40566A85017N05113j589258k109227q32501Q60932J721147J628779J164127P03922
40557B238051J57553o18432j478045k058163j940843q49103Q54240J941968J388765
40548c64009j11612o06041O17128J937622J631655K24100n87052n13436n75583
$$ plain form
40539 1652772 715266 -35790 -179040 -565654 -2161188 -4208168 -4872075 -3582075 -1595412
40530 -1595412 -294007 40228 -175524 -321064 432086 2505413 4930937 5832732 4294301
40521 4294301 1233493 -1648059 -3188403 -3175433 -2324852 -1873339 -2336986 -2727185 -1963414
40512 -1963414 -855781 -1246166 -3087247 -4106244 -2982935 -1161923 -470146 -505127 144584
40503 144584 1359212 1986776 2091710 2773232 4012895 4513807 3797607 2891621 2600915
40494 2600915 2436215 1706009 534777 -708116 -2008037 -3182495 -3584288 -2912004 -1734029
40485 -1734029 -800660 -379715 -481642 -965553 -1093721 130026 2587395 4734426 5288049
40476 5288049 4585244 3682093 2899976 2130427 1825148 2410596 3036742 2241324 -27319
$$ packed form
40539A652772r37506p51056j43250l86614j595534k046980o63907J290000J986663
40530a595412J301405L34235k15752j45540P53150K073327K425524R01795j538431
40521D294301l060808k881552j540344J2970Q50581M51513m63647l90199P63771
40512a963414J107633l90385j841081j018997J123309J821012O91777l4981O49711
40503A44584J214628O27564J04934O81522J239663N00912p16200r05986k90706
40494B600915j64700p30206j171232j242893j299921j174458m01793O72284J177975
40485a734029R33369M20945j01927m83911j28168J223747K457369K147031N53623
40476E288049p02805r03151p82117p69549l05279N85448O26146p95418k268643
$$ plain form
40467 -27319 -2157989 -2881247 -2510737 -1866613 -1071170 -110451 341185 -302258 -1427720
40458 -1427720 -1912770 -1698592 -1691644 -2153318 -2223654 -1305472 -17348 709150 787527 698736
40448 698736 643910 588197 679024 948170 953098 396909 -219836 -329922 -391151 -1304353 -2840446
40437 -2840446 -3684271 -3186595 -2056975 -1011492 206430 1845659 3105813 2969494 1582303
40428 1582303 45909 -845749 -1116315 -1243819 -1780319 -2877982 -3758169 -3305296 -1740229
40419 -1740229 -870246 -1852364 -3581944 -4399912 -4493644 -5079144 -5945303 -5815451 -4882471
40410 -4882471 -4740235 -5504803 -5290116 -3393651 -1827033 -2267558 -3333197 -2725605 -699784
40401 -699784 654989 643453 310819 125444 -412651 -914867 -70279 2104005 3877963
$$ packed form
40467b7319k130670p23258L70510O44124P95443R60719M51636o43443j125462
40458a427720m85050K14178O948m61674p0336R18182J288124P26498P8377q8791
40448F98736n4826n5713R0827K69146M928n56189o16745j10086o1229r13202j536093
40437b840446q43825M97676J129620J045483J217922J639229J260154j36319j387191
40428A582303j536394q91658k70566j27504n36500j097663q80187M52873J565067
40419a740229Q69983r82118j729580q17968r3732n85500q66159J29852R32980
40410d882471J42236p64568K14687J896465J566618m40525j065639O07592K025821
40401f99784J354773j1536l32634j85375n38095n02216Q44588K174284J773958
$$ plain form
40392 3877963 4264738 4088442 3873878 2583114 -220012 -2573327 -2362157 -422844 570344
40383 570344 -80871 -407486 916260 2494463 2381121 983140 445299 1724606 3594505
40374 3594505 4565473 4671236 4818581 5064287 4414842 2326726 -280781 -1894492 -1969523
40365 -1969523 -1213048 -493236 13066 545492 1162034 1695358 1962962 1735209 808628
40356 808628 -527940 -1369613 -1029856 62359 708558 183284 -1190896 -2610044 -3439882
40347 -3439882 -3272098 -1950328 62363 1687351 2075671 1410709 637766 505737 1077173
40338 1077173 1969876 2693621 2811129 2186116 1176801 277463 -525293 -1693721 -3245591
40329 -3245591 -4275342 -3777838 -1849737 269551 1353762 1167055 388694 -92107 193089
$$ packed form
40392C877963L86775j76296k14564j290764k803126k353315K11170J939313R93188
40383E70344o51215l26615J323746J578203j13342j397981n37841J279307J869899
40374C594505R70968J05763J47345K45706o49445k088116k607507j613711p5031
40365a969523P56475P19812N06302N32426O16542N33324K67604k27753r26581
40356H08628j336568q41673L39757J092215O46199n25274j374180j419148q29838
40347c439882J67784J321770K012691J624988L88320o64962p72943j32029N71436
40338A077173Q92703P23745J17508o25013j009315q99338q02756j168428j551870
40329c245591j029751M97504J928101K119288J084211j86707p78361m80801K85196
$$ plain form
40320 193089 978931 1432079 917571 -225375 -909495 -476898 565654 1162662 839194
40311 839194 39871 -380284 249801 2006781 4107620 5225675 4591086 2838483 1432955
40302 1432955 1246804 1980113 2856865 3406089 3517627 3227043 2674396 2001222 1202482
40293 1202482 376469 89764 966319 2729731 4127241 4099208 2714734 812565 -831721
40284 -831721 -1805068 -2124797 -2382839 -3251693 -4346633 -4151592 -1815033 1345188 2944609
40275 2944609 2023303 -227748 -2074714 -2805952 -2690394 -2181225 -1496076 -581168 695896
40266 695896 2093547 2869378 2526094 1527977 760884 468633 352871 490020 1259607
40257 1259607 2410600 3180714 3482987 4002610 4880721 5311956 4806729 3830723 2754296
$$ packed form
40320A93089P85842M53148n14508j142946o84120M32597J042552N97008l23468
40311H39194p99323m20155O30085J756980K100839J118055o34589j752603j405528
40302A432955j86151P33309Q76752N49224J11538k90584n52647o73174p98740
40293A202482q26013k86705Q76555J763412J397510k8033j384474j902169j644286
40284h31721r73347l19729k58042q68854j094940J95041K336559L160221J599421
40275B944609r21306k251051j846966p31238J15558N09169O85149R14908J277064
40266F95896J397651P75831l43284r98117p67093k92251j15762J37149P69587
40257A259607J150993P70114L02273N19623Q78111M31235n05227r76006j076427
$$ plain form
40248 2754296 1298110 -336942 -997323 -232893 582462 -54740 -1765483 -3104294 -3519575
40239 -3519575 -3173925 -1747932 750727 2595099 1949497 -145034 -579878 1593556 3833289
40230 3833289 3794470 2314894 1446744 1321381 782133 -103105 -187638 702660 1716739
40221 1716739 2680553 4082981 5406270 5271739 3666888 2448862 2863994 3828792 3689503
40212 3689503 2768131 2884577 4668958 6552562 6695988 5145360 3551617 3079016 3177064
40203 3177064 2537076 826756 -962743 -1746675 -1368924 -292132 1139288 2729139 4147980
40194 4147980 5117367 5631985 5640311 4892536 3569933 2561246 2369912 2169626 935973
40185 935973 -730377 -1134934 77279 1354632 1593928 1743318 3042546 4667294 4576432
$$ packed form
40248B754296j456186j635052o60381P64430Q15355o37202j710743j338811m15281
40239c519575L45650J425993K498659J844372o45602k094531m34844K173434K239733
40230C833289l8819j479576q68150j25363n39248q85238q4533Q90298J014079
40221A716739R63814J402428J323289j34531j604851j218026M15132R64798j39289
40212C689503r21372J16446J784381J883604J43426j550628j593743m72601R8048
40203C177064o39988j710320j789499p83932L77751J076792J431420J589851J418841
40194D147980R69387N14618Q326p47775j322603j008687j91334k00286j233653
40185I35973j666350m04557J212213J277353K39296J49390J299228J624748r0862
$$ plain form
40176 4576432 2370080 -92354 -1071380 -770127 -351514 -162438 214662 723588 703375
40167 703375 11152 -588796 -542695 -405477 -981324 -1870682 -1710515 -1864 2095831
40158 2095831 3301826 3889265 4944562 6286508 6322789 4309420 1741632 680773 1218818
40149 1218818 1505776 164979 -2147807 -3741868 -3734636 -2491418 -745722 1022714 2390877
40140 2390877 2864631 2396092 1768177 1932704 2877429 3546204 3096987 1912916 1046424
40131 1046424 921242 1019756 719875 -52170 -1007172 -1839786 -2243398 -1976905 -1147787 -207816
40121 -207816 447613 680040 451706 -138925 -616555 -398637 482022 1308063 1550014 1434185
40111 1434185 1402330 1420194 1204636 851624 822417 1399107 2382110 3216018 3345259 2730063
$$ packed form
40176D576432k206352k462434r79026L01253M18613J89076L77100N08926k0213
40167G03375o92223n99948M6101J37218n75847q89358J60167J708651K097695
40158B095831J205995N87439J055297J341946L6281k013369k567788j060859N38045
40149A218818K86958j340797k312786j594061P232J243218J745696J768436J368163
40140B390877M73754m68539o27915J64527R44725O68775m49217j184071q66492
40131A046424j25182R8514k99881p72045r55002q32614m03612K66493Q29118R39971
40121b07816O55429K32427k28334n90631m77630K17918Q80659Q26041K41951j15829
40111A434185l1855J7864k15558l53012k9207N76690R83003Q33908J29241o15196
$$ plain form
40101 2730063 2094227 2241296 2942643 2977124 1555497 -752336 -2781523 -3891090 -3970663
40092 -3970663 -3101683 -1938668 -1777020 -3201407 -4945006 -5105760 -3438194 -1544032 -833190
40083 -833190 -1255031 -2101433 -2945717 -3356163 -2665613 -796681 1235740 2356969 2654560
40074 2654560 2976698 3552745 3685012 2891907 1834077 1691980 2673052 3518237 2849137
40065 2849137 879395 -770180 -1061423 -601816 -325981 -50806 719085 1389635 1190079
40056 1190079 1061752 2738503 5725844 7160829 5553415 2951651 2068127 2666098 2502150
40047 2502150 877281 -726053 -1163146 -866980 -492991 -51021 204345 -452542 -1822669
40038 -1822669 -2337332 -905386 1526311 2999771 2592055 886807 -971052 -2002768
$$ packed form
40101B730063o35836J47069P01347L4481j421627k307833k029187j109567p9573
40092c970663Q68980J163015J61648j424387j743599j60754J667566J894162P10842
40083h33190m21841q46402q44284m10446O90550J868932K032421J121229K97591
40074B654560L22138N76047J32267p93105j057830j42097R81072Q45185o69100
40065B849137j969742j649575k91243M59607K75835K75175P69891O70550j99556
40056A190079j28327J676751K987341J434985j607414k601764q83524N97971j63948
40047B502150j624869j603334m37093K96166L73989M41970K55366o56887j370127
40038a822669n14663J431946K431697J473460m07716j705248j857859j031716
$$ plain form
40030 -2002768 -1668346 -237459 1198473 1633936 1113595 593312 991574 2500603 4520878
40021 4520878 6079744 6628271 6575809 6655543 6703457 5759723 3692866 1896969 1651126
40012 1651126 2400721 2589675 1818266 1141532 1352175 2042633 2528924 2698651 2546793
40003 2546793 1762412 407843 -653272 -750413 -410181 -631410 -1446651 -2003984 -1967471
39994 -1967471 -1962752 -2451823 -2974284 -2977018 -2801986 -3187703 -4064296 -4476839 -3644075 -1597337
39984 -1597337 1133963 3835560 5536840 5387198 3614146 1697583 1060631 1779481 2954642
39975 2954642 3986041 4822907 5166381 4364230 2423623 458794 -393072 -137158 450814
39966 450814 1030017 1922073 3223793 4335756 4655912 4406226 4409231 5076572 5836467 5642884
$$ packed form
40030b002768L34422J430887J435932M35463n20341n20283L98262J509029K020275
40021D520878J558866N48527n2462P9734M7914r43734k066857j795897k45843
40012A651126P49595J88954p71409o76734K10643O90458M86291J69727j51858
40003B546793p84381j354569j061115r7141L40232k21229q15241n57333L6513
39994a967471M719m89071n22461k734J75032l85717q76593m12543Q32764K046738
39984a597337K731300K701597J701280j49642j773052j916563o36952P18850J175161
39975B954642J031399Q36866L43474q02151j940607j964829q51866K55914N87972
39966D50814N79203Q92056J301720J111963L20156k49686L005O67341P59895j93583
$$ plain form
39956 5642884 3978965 1323031 -1229454 -2603190 -2150827 -31748 2417360 3197913
39948 3197913 1442548 -1253852 -2176134 -588884 1201392 497847 -2616266 -5515330
39940 -5515330 -6027007 -4243047 -1533406 1042014 2936453 3706513 3260204 2220898 1454654
39931 1454654 1326425 1689062 2264144 2571818 1784140 -609952 -3813943 -5881992 -5266148
39922 -5266148 -2196742 1533119 4054105 4687971 3993147 2868978 1748437 563158
39914 563158 -775928 -2100412 -3154575 -3827988 -4129427 -4024636 -3340902 -1799385 706923
39905 706923 3609583 5544936 5242803 2808127 -153102 -1950375 -2169345 -1471267 -467928
39896 -467928 646241 1492398 1283809 -361643 -2630718 -3946606 -3300322 -1101667 1229691
$$ packed form
39956E642884j663919k655934k552485j373736M52363K119079K449108P80553
39948C197913j755365k696400r22282J587250J790276p03545l114113k899064
39940e515330n11677J783960K709641K575420J894439P70060m46309j039306p66244
39931A454654j28229L62637N75082L07674p87678k394092l203991k068049O15844
39922e266148L069406L729861K520986O33866o94824j124169j120541j185279
39914E63158j339086j324484j054163o73413l01439J04791O83734J541517K506308
39905G06923K902660J935353l02133k434676k961229j797273k18970O98078J003339
39896d67928J114169Q46157k08589j645452k269075j315888O46284K198655K331358
$$ plain form
39887 1229691 2411682 2128896 1022047 104886 118612 1118318 2469383 3372298 3570471
39878 3570471 3461055 3439288 3433748 3337988 3480437 4058503 4367186 3468550 1724749 781993
39868 781993 1643360 3484988 4852394 5341518 5523652 5876585 6505819 7323207 7691488
39859 7691488 6492617 3571815 637035 -473935 -126012 -189169 -1176157 -1605506 -423557
39850 -423557 1502189 2885580 3567721 3705344 2760746 557757 -1594243 -2213051 -1562235
39841 -1562235 -1042798 -1082961 -866302 86195 1312910 2356847 3143465 3313353 2358064
39832 2358064 814238 309102 1733738 3943485 4896277 3825638 1880132 764390
39824 764390 1038746 1769241 1777758 1081344 736422 1249252 1899034 2140145 2829271 4940237
$$ packed form
39887A229691J181991k82786j106849r17161J3726R99706J351065R02915J98173
39878C570471j09416k1767n540r5760J42449N78066L08683q98636j743801r42756
39868G81993Q61367J841628J367406M89124J82134L52933O29234Q17388L68281
39859G691488j198871k920802k934780j110970L47923o3157r86988m29349J181949
39850d23557J925746J383391O82141J37623r44598k202989k152000o18808O50816
39841a562235N19437m0163K16659R52497J226715J043937P86618J69888r55289
39832B358064j543826n05136J424636K209747R52792j070639j945506j115742
39824G64390K74356P30495Q517o96414l44922N12830O49782K41111O89126K110966
$$ plain form
39814 4940237 7538435 8501687 7361934 6042611 6272087 7465939 7964164 7402071 6777157
39805 6777157 6656861 6396872 5151734 2973802 761763 -554659 -730430 -270787 218622
39796 218622 692793 1482133 2596237 3654411 4441741 4991237 5154742 4766894 4266586
39787 4266586 4373724 5014901 5389262 5236684 5061656 4905712 4155249 3044245 2902114
39778 2902114 3983610 4469242 3004931 1043473 914865 2419754 3342272 2908821 2579117
39769 2579117 3340503 4344582 4771968 5120707 5724542 5645538 4270694 2758554 2529683
39760 2529683 3153850 3080609 1971026 1049369 1322139 2486001 3601212 4033322 3620965
39751 3620965 2506588 1021642 -454011 -1544521 -1865136 -1335097 -514114 -32740 427207
$$ packed form
39814D940237K598198R63252j139753j319323K29476J193852M98225n62093o24914
39805F777157j20296k59989j245138k177932k212039j316422j75771M59643M89409
39796B18622M74171P89340J114104J058174P87330N49496J63505l87848n00308
39787D266586J07138O41177L74361j52578j75028j55944p50463j111004j42131
39778B902114J081496M85632j464311j961458j28608J504889R22518m33451l29704
39769B579117P61386J004079M27386L48739O03835p9004j374844j512140k28871
39760B529683O24167p3241j109583r21657K72770J163862J115211M32110m12357
39751C620965j114377j484946j475653j090510l20615N30039Q20983M81374M59947
$$ plain form
39742 427207 1787975 3908179 5230812 4790438 3736486 3930628 5624008 7453933 8195284
39733 8195284 7495210 5406696 2509433 320131 256908 1973076 3651988 4046705 3378882
39724 3378882 2359331 1504618 1486945 2808970 4702327 5549173 4948184 4244163 4425487
39715 4425487 4752671 4352423 3898031 4354206 4996198 4318369 2448590 1005318 657706
39706 657706 454077 -178490 -323256 865399 2699834 3918253 4260786 4266665 4193654 4019357
39696 4019357 4014354 4402718 4731540 4408448 3703388 3439779 3777339 4078421 4004206 3952410
39686 3952410 4201136 4331957 3883929 3048592 2281960 1613076 798315 -73929 -576746
39677 -576746 -468013 96115 842977 1665887 2648213 3911784 5344476 6413471 6455209
$$ packed form
39742D27207J360768K120204J322633m40374j053952J94142J693380J829925P41351
39733H195284p00074k088514k897263k189302o3223J716168J678912L94717o67823
39724C378882j019551q54713j7673J322025J893357Q46846o00989p04021J81324
39715D425487L27184m00248m54392M56175O41992o77829j869779j443272l47612
39706F57706k03629o32567j44766J188655J834435J218419L42533N879p3011j74297
39696D019357n003L88364L28822l23092p05060k63609L37560L01082p4215n1796
39686C952410K48726J30821m48028q35337p66632o68884q14761q72244n02817
39677e76746J08733N64128P46862Q22910R82326J263571J432692J068995M1738
$$ plain form
39668 6455209 5292219 3376761 1233388 -921516 -2832423 -3938183 -3922071 -3234267 -2512273
39659 -2512273 -1673165 -234860 1530860 2576215 2465731 2063638 2322659 2934871 2907212
39650 2907212 2196677 1891010 2571718 3219549 2356591 54878 -1811066 -1529544 563044
39641 563044 2505029 2889871 2186762 1768393 2098689 2393086 1916414 983916 423670
39632 423670 446477 461633 -68741 -898063 -1215295 -520556 797910 1851540 2232646 2405966
39622 2405966 2965902 3802206 4413833 4786593 5234268 5381474 4275521 2024966 497780
39613 497780 1397842 3931373 5369336 4061637 1181489 -735861 -388815 1438244 3056967
39604 3056967 3386196 2510739 1251059 348868 -12379 -791 292034 779223 1008957
$$ packed form
39668F455209j162990j915458k143373k154904j910907j105760J6112O87804P21994
39659b512273Q39108J438305J765720J045355j10484m02093K59021O12212k7659
39650B907212p10535l05667O80708O47831q62958k301713j865944K81522K092588
39641E63044J941985L84842p03109m18369L30296K94397m76672r32498n60246
39632D23670K2807J5156n30374q29322l17232O94739J318466J053630L81106J73320
39622B405966N59936Q36304O11627L72760M47675J47206j105953k250555j527186
39613D97780R00062K533531J437963j307699k880148j917350L47046J827059J618723
39604C056967L29229q75457j259680r02191l61247J1588K92825M87189K29734
$$ plain form
39595 1008957 416930 -791338 -1410233 -361373 2018687 4171750 4830533 4076868 2860181
39586 2860181 1822100 912726 -5066 -713388 -1083846 -1593090 -2790660 -4223638 -4510550
39577 -4510550 -2884767 -299529 1489679 1775956 1402211 1552925 2542371 3783975 4461253
39568 4461253 4115709 2980360 1894904 1607754 2089676 2788718 3443115 4148962 4709040
39559 4709040 4671620 4195800 4051809 4316843 3899749 2133369 164229 -309414 673916
39550 673916 1503413 1381629 1221085 1783168 2241492 1581329 535275 774222 2414150
39541 2414150 3632418 3040380 1391735 353186 383879 707683 927043 1512769 2502992
39532 2502992 2724133 1111753 -1562437 -3126537 -2294825 67940 2227059 3590803
$$ packed form
39595A008957n92027j208268o18895J048860K380060K153063O58783p53665j216687
39586B860181j038081r09374r17792p08322l70458n09244j197570j432978k86912
39577d510550J625783K585238J789208K86277l73745J50714R89446J241604O77278
39568D461253l45544j135349j085456k87150M81922O99042O54397P05847N60078
39559D709040l7420m75820j43991K65034m17094j766380j969140m73643R83330
39550F73916Q29497j21784j60544N62083M58324o60163j046054K38947J639928
39541B414150J218268n92038j648645j038549L0693L23804K19360N85726R90223
39532B502992K21141j612380k674190j564100Q31712K362765K159119J363744
$$ plain form
39524 3590803 4898283 6684977 8348469 8990159 8622487 8004952 7490574 6601836 4851568
39515 4851568 2573396 698506 -62131 395357 1763610 3557266 5195657 6190359 6412544
39506 6412544 6094061 5564637 5119379 5087907 5720775 6826498 7709890 7734165 6926046 5824005
39496 5824005 4699120 3168317 834804 -1735638 -3070317 -2201063 61669 1724419
39488 1724419 1645328 566954 -133179 -167433 -175238 -274872 129264 960791 967585 -749933
39478 -749933 -3367268 -5191179 -5467849 -4716849 -3664989 -2584653 -1480799 -251763 1231345
39469 1231345 2672191 3236333 2556198 1569424 1481858 2024538 1754070 205191 -1282537
39460 -1282537 -1288090 -28709 1134227 1256654 421060 -621473 -956798 -192094 925139
$$ packed form
39524C590803J307480J786694J663492O41690l67672o17535n14378q88738j750268
39515D851568k278172j874890p60637M57488J368253J793656J638391R94702K22185
39506F412544l18483n29424m45258l1472O32868J105723Q83392K4275q08119j102041
39496E824005j124885j530803k333513k570442j334679Q69254K262732J662750
39488A724419p9091j078374p00133l4254p805r9634M04136Q31527O794j717518
39478g49933k617335j823911k76670P51000J051860J080336J103854J229036J483108
39469A231345J440846N64142o80135r86774q7566N42680k70468j548879j487728
39460a282537n553J259381J162936J22427q35594j042533l35325P64704J117233
$$ plain form
39451 925139 1090068 51811 -929177 -691545 373292 1049492 898986 452967 258639
39442 258639 411167 655436 360753 -1127070 -3439459 -5030320 -4893268 -3918066 -3543115
39433 -3543115 -3531673 -2393737 100031 2219547 2446732 1287414 439493 931698 2510286
39424 2510286 4211174 5089432 4815787 3862348 2861172 1874622 760730 -23807 167394
39415 167394 1059923 1698120 1786985 1790896 1714669 1057680 185541 305358 1520962 2310711
39405 2310711 1725095 729444 337460 -195303 -1836719 -3528275 -3266284 -907329 1744460
39396 1744460 3348232 4006715 4098796 3776402 3676726 4602528 6203164 7203498 7101349
39387 7101349 6434129 5401126 3797525 2500664 3154798 5628002 7468346 6969199 5344673
$$ packed form
39451I25139J64929j038257r80988K37632J064837O76200j50506m46019j94328
39442B58639J52528K44269k94683j487823k312389j590861J37052R75202L74951
39433c543115J1442J137936K493768K119516K27185j159318q47921M92205J578588
39424B510286J700888Q78258k73645r53439j001176r86550j113892p84537J91201
39415A67394Q92529O38197Q8865L911p6227o56989q72139J19817J215604P89749
39405B310711n85616r95651l91984n32763j641416j691556K61991K358955K651789
39396A744460J603772O58483R2081l22394r9676R25802J600636J000334j02149
39387G101349o67220j033003j603601j296861O54134K473204J840344m99147j624526
$$ plain form
39378 5344673 4651648 4935365 5009680 4938265 5758328 7235987 7863933 7172518 6426883 6713812
39368 6713812 7637903 8248991 8081381 6897690 4580434 1884720 313837 489083 1312046
39359 1312046 1388445 690172 189960 427952 1165278 2030399 2745963 2952201 2500634 1831827
39349 1831827 1544296 1742921 2282695 3332874 4963248 6364593 6434633 5295738 4310742
39340 4310742 4159084 3755220 1882095 -660737 -1607867 108024 3174351 5620633 6881577
39331 6881577 7606069 8108936 7983627 7155317 6420001 6558985 7396943 8130197 8309654
39322 8309654 8130512 7919319 7737103 7535356 7437135 7669246 8172640 8336158 7385925 5384091
39312 5384091 3731939 4064178 6331322 8454415 8374936 6139240 3449841 1532748 297533
$$ packed form
39378E344673o93025K83717P4315p1415Q20063J477659O27946o91415p45635K86929
39368F713812R24091O11088j67610j183691k317256k695714j570883J75246Q22963
39359A312046P6399o98273n00212K37992P37326Q65121P15564K06238m51567o68807
39349A831827k87531J98625N39774J050179J630374J401345P0040j138895r84996
39340D310742j51658m03864j873125k542832r47130J715891L066327K446282J260944
39331F881577P24492N02867j25309q28310p35316J38984Q37958P33254J79457
39322H309654j79142k11193j82216k01747r8221K32111N03394J63518r50233k001834
39312E384091j652152L32239K267144K123093p9479k235696k689399j917093j235215
$$ plain form
39303 297533 -484186 -263849 1457159 4052075 6237952 7337899 7488831 6820455 5167204
39294 5167204 2732804 451857 -721525 -679928 -32900 736615 1637753 2697510 3552847
39285 3552847 3865467 3942984 4439522 5357836 5851037 5300527 4135093 3153329 2502479
39276 2502479 1989477 1966403 2858246 3901583 3595909 1808832 337534 721873 2448122
39267 2448122 4096888 5272453 6272216 6770259 6464099 6548466 8588965 11731802 12934436
39258 12934436 10773012 7438841 5792990 5757650 5222644 3690335 3033772 4528682 6789188
39249 6789188 7413241 5771951 3432660 2298106 2899504 4239601 4833019 3991194 2391412
39240 2391412 1376290 1599103 2478304 3056997 3172250 3522930 4629741 6000207 6558134
$$ packed form
39303B97533p81719K20337J721008K594916K185877J099947J50932o68376j653251
39294E167204k434400k280947j173382M1597O47028P69515R01138J059757Q55337
39285C552847L12620P7517M96538R18314M93201n50510j165434r81764o50850
39276B502479n13002k3074Q91843J043337l05674j787077j471298L84339J726249
39267B448122J648766J175565R99763M98043l06160Q4367K040499L142837J202634
39258A2934436k161424l334171j645851l5340n35006j532309o56563J494910K260506
39249F789188O24053j641290k339291j134554O01398J340097N93418q41825j599782
39240B391412j015122K22813Q79201N78693J15253L50680J106811J370466N57927
$$ plain form
39231 6558134 5914596 4961085 4931410 5982893 7078859 7263885 6579235 5631001 4897654
39222 4897654 4808642 5806097 7621143 8975559 8869575 7909999 7492717 7867875 8028744
39213 8028744 7460046 6780391 6361839 5573944 4142013 3239013 4156767 6427832 8264412
39204 8264412 8601392 7887800 7080087 6663866 6576306 6390631 5655550 4672108 4707011 6572308
39194 6572308 9042304 9676842 7555755 4471916 3020900 4047664 6279880 7866411
39186 7866411 7784759 6192764 4052628 2403433 1689851 1704615 2036476 2279103 1964608
39177 1964608 916528 -231595 -496630 286250 1406383 2563762 4263975 6383817
39169 6383817 7384921 6104924 3744520 2746202 3847320 5501029 6276479 6483178 6941566
$$ packed form
39231F558134o43538r53511k9675J051483J095966J85026o84650r48234p33347
39222D897654q9012R97455J815046J354416j05984r59576m17282L75158J60869
39213H028744n68698o79655m18552p87895j431931r03000R17754K271065J836580
39204H264412L36980p13592q07713m16221q7560j85675p35081r83442L4903J865297
39194F572308K469996O34538k121087l083839j451016J026764K232216J586531
39186G866411q1652j591995k140136j649195p13582J4764L31861K42627l14495
39177A964608j048080j148123k65035P82880J120133J157379J700213K119842
39169F383817J001104j279997k360404r98318J101118J653709P75450K06699M58388
$$ plain form
39160 6941566 7392639 7096876 6266624 5846211 6172216 6753026 7275943 8003939 9029489
39151 9029489 9786480 9651335 8724374 7741738 7309157 7333651 7172665 6354427 5193741
39142 5193741 4609455 5267714 7005959 9082520 10714185 11338125 10851258 9927101 9646226
39133 9646226 10278155 10740909 9886683 8090561 6805763 6609608 6563043 5737740 4585756
39124 4585756 4313105 5412968 7269643 8828368 9314123 8732592 8047658 8427788 9927084
39115 9927084 11393946 12064837 12528396 13437663 14094310 13521182 12436433 12597587 14126183
39106 14126183 15053879 14086064 12469674 12236596 13649608 15404379 16473486 16548696 15358802
39097 15358802 13039995 10960415 10710721 12064805 13109290 12686188 11648318 11333588
$$ packed form
39160F941566M51073k95763q30252m20413L26005N80810N22917P27996J025550
39151I029489P56991j35145r26961r82636m32581K4494j60986q18238j160686
39142E193741n84286O58259J738245K076561J631665O23940m86867r24157k80875
39133I646226O31929M62754q54226j796122j284798j96155m6565q25303j151984
39124D585756k72651J099863J856675J558725M85755n81531o84934L80130J499296
39115I927084J466862O70891M63559R09267O56647n73128j084749J61154J528596
39106A4126183R27696r67815j616390k33078J413012J754771J069107P5210j189894
39097A5358802k318807k079580k49694J354084J044485m23102j037870l14730
$$ plain form
39089 11333588 11863723 12547949 13055954 13432734 13634181 13827123 14647080 16428930 18560693
39080 18560693 20178453 21021746 21040056 19892667 17788829 16181617 16320571 17386173 17426670
39071 17426670 16120660 15170439 15717510 16919496 17772622 18851452 20980465 23191079
39063 23191079 23539979 21629309 19056062 17461216 17185036 17786242 18792346 19713480 20181881
39054 20181881 20395988 20841080 21450540 21674033 21440202 21301524 21467119 21490380 21199490
39045 21199490 21140226 21680204 22430679 23079797 24052684 25625497 27020671 27323023 26953996
39036 26953996 27246145 28580994 29846736 29990732 29420357 29397669 30356353 31284426 30890362
39027 30890362 29254074 28063333 28933816 31570425 34010809 34734615 34027257 33175198 33073526
$$ packed form
39089A1333588N30135O84226N08005L76780K01447J92942Q19957J781850K131763
39080A8560693J617760Q43293J8310j147389k103838j607212J38954J065602M0497
39071A7426670j306010r50221N47071J201986Q53126J078830K129013K210614
39063B3191079L48900j910670k573247j594846k76180O01206J006104R21134M68401
39054B0181881K14107M45092O09460K23493k33831j38678J65595K3261k90890
39045B1199490n9264N39978P50475O49118R72887J572813J395174L02352l69027
39036B6953996K92149J334849J265742J43996n70375k2688R58684R28073l94064
39027C0890362j636288j190741Q70483K636609K440384P23806p07358q52059j01672
$$ plain form
39018 33073526 34011061 35989739 38469788 40390566 41328651 42201188 43951803 46040918
39010 46040918 47333981 48045014 49377128 51352238 52582096 52525460 52514096 53910126 56473796
39001 56473796 59269594 62040437 64812817 67156982 68886321 70790940 73750872 77677460
38993 77677460 81991529 86339258 90121506 92430421 93613146 95873163 100804118 107064847
38985 107064847 112138104 115810235 120045064 125734286 131699424 137133802 142968770 150081911
38977 150081911 157838430 165339331 172779514 180662168 188830454 197155381 206100059 215708258
38969 215708258 225040648 233496361 241684330 250058052 257747731 263861192 268970386 274055407
38961 274055407 278835796 282521185 285476939 288643954 291873912 294430315 296741278 299935568
$$ packed form
39018C3073526R37535J978678K480049J920778R38085Q72537J750615K089115
39010D6040918J293063P11033J332114J975110J229858n6636j1364J396030K563670
39001E6473796K795798K770843K772380K344165J729339J904619K959932L926588
38993G7677460M314069M347729L782248K308915J182725K260017M930955O260729
38985A07064847N073257L672131M234829N689222N965138N434378N834968P113141
38977A50081911P756519P500901P440183P882654Q168286Q324927Q944678R608199
38969B15708258R332390Q455713Q187969Q373722P689679O113461N109194N085021
38961B74055407M780389L685389K955754L167015L229958K556403K310963L194290
$$ plain form
38953 299935568 303729740 306456114 307361842 307367374 307320865 307055105 306601713 306769699 307706481
38944 307706481 308136498 306986851 304896251 303297491 302752362 302900605 303271947 303311078 302195240
38935 302195240 299489827 295718298 291794488 288265169 285401702 283364520 281826111 280153893
38927 280153893 278525778 278126260 279546337 281652668 282787787 282509477 281452751 280164012
38919 280164012 278914751 277981452 277073557 275015232 271090487 266306217 262252438 259127386
38911 259127386 256094692 253224295 251591538 251419515 251513921 250813100 249322362 247270483
38903 247270483 244568349 241498773 238758647 236281721 233115904 229083513 225491119 223412699
38895 223412699 222224890 220741582 218968847 217734704 217281493 217353008 218175799 220120642
$$ packed form
38953B99935568L794172K726374R05728N532m6509k65760m53392J67986R36782
38944C07706481M30017j149647k090600j598760n45129J48243L71342L9131j115838
38935C02195240k705413l771529l923810l529319k863467k037182j538409j672218
38927B80153893j628115l99518J420077K106331J135119k78310j056726j288739
38919B80164012j249261r33299r07895k058325l924745m784270m053779l125052
38911B59127386l032694k870397j632757j72023R4406p00821j490738k051879
38903B47270483k702134l069576k740126k476926l165817m032391l592394k078420
38895B23412699j187809j483308j772735j234143m53211P1515Q22791J944843
$$ plain form
38887 220120642 222566274 224236622 224726765 224764013 224885382 224808148 224358045 224076644 224278761
38878 224278761 224073586 222113542 218324338 214400250 212267432 212077034 211978734 210175696
38870 210175696 207112504 205097858 205538766 207119364 207291626 205227623 202597820 201538609
38862 201538609 202558752 204551600 206220209 207151950 207878636 209247588 211624208 214549720
38854 214549720 217214602 219179940 220448670 221029293 220911900 220489113 220454198 221007125 221529892
38845 221529892 221353192 220532141 219468385 217998555 215435619 211602042 207302049 203396134
38837 203396134 199708470 195349225 189985666 184138453 178104953 171408892 163892815 156624893
38829 156624893 150672359 145325258 138808841 130801422 122884759 116099182 109513406 102138415
$$ packed form
38887B20120642K445632J670348M90143L7248J21369p7234m50103k81401K02117
38878B24278761k05175j960044l789204l924088k132818j90398r8300j803038
38870B10175696l063192k014646M40908J580598J72262k064003k629803j059211
38862B01538609J020143J992848J668609R31741P26686J368952K376620K925512
38854B14549720K664882J965338J268730N80623j17393m22787l4915N52927N22767
38845B21529892j76700q21051j063756j469830k562936l833577m299993l905915
38837B03396134l687664m359245n363559n847213o033500o696061p516077p267922
38829A56624893n952534n347101o516417q007419p916663o785577o585776p374991
$$ plain form
38821 102138415 94913041 89290082 84711199 79276785 72668714 66665613 62546101 59535579
38813 59535579 56385904 53200728 50845455 49382099 47928071 45661103 42469027 38962798
38805 38962798 36107190 34400129 33286567 31905079 30343726 29292602 28477214 26725092
38797 26725092 24024866 22190960 22593103 24279782 25372353 25380472 24938580 24088086 22386232
38788 22386232 20375260 19367657 19602016 19796053 18790495 16749235 14625495 13344641
38780 13344641 13577662 15234308 16842677 16473424 13942958 11404673 11057180 12680795
38772 12680795 14061104 13608139 11963553 10968675 11432235 12255372 11900430 10493139 9844196
38763 9844196 11125539 13242296 14248636 13830731 13310117 13460709 13663156 13399542 13227023
$$ packed form
38821A02138415p225374n622959m578883n434414o608071o003101m119512l010522
38813E9535579l149675l185176k355273j463356j454028k266968l192076l506229
38805C8962798k855608j707061j113562j381488j561353j051124q15388j752122
38797B6725092k700226j833906M02143J686679J092571Q119m41892q50494j701854
38788B2386232k010972j007603K34359J94037j005558k041260k123740j280854
38780A3344641K33021J656646J608369l69253k530466k538285l47493J623615
38772A2680795J380309m52965j644586r94878M63560Q23137l54942j407291o48943
38763I844196J281343K116757J006340m17905n20614J50592K02447k63614j72519
$$ plain form
38754 13227023 13622936 13946059 13402949 12253585 11178091 10115522 8716682 7455269
38746 7455269 7209161 7973200 8996014 10044752 11456919 12928896 13478655 13044261 13031116
38737 13031116 14456216 16261484 16410109 14289967 11134531 8296963 6175493 4966978
38729 4966978 5288638 7201658 9234243 9428988 7416984 4808750 3436873 3724151 4833025
38720 4833025 5783713 6121602 5972583 5859745 6237811 7004095 7763634 8630823 10121587
38711 10121587 11917694 12525859 10999509 8559806 7510880 8578287 10164133 10374056
38703 10374056 9066017 7625795 7255352 7832257 8226155 7587146 6408674 6130342 7430392
38694 7430392 9244989 9953491 9185845 7824934 6620110 5722088 5323871 5583645 5857650
$$ packed form
38754A3227023L95913L23123n43110j149364j075494j062569j398840j261413
38746G455269k46108P64039J022814J048738J412167J471977N49759m34394j3145
38737A3031116J425100J805268J48625k120142l155436k837568k121470j208515
38729D966978L21660J913020K032585J94745k012004k608234j371877K87278J108874
38720D833025R50688L37889j49019j12838L78066P66284P59539Q67189J490764
38711A0121587J796107O08165j526350k439703j048926J067407J585846K09923
38703A0374056j308039j440222l70443N76905L93898o39009j178472k78332J300050
38694G430392J814597P08502p67646j360911j204824q98022l98217K59774K74005
$$ plain form
38685 5857650 5187770 3799905 2973898 3096348 3105620 2426531 2092449 2977415 4149674
38676 4149674 4361980 4306750 5743376 8690423 11034848 11069200 9214549 7011613 5483072
38667 5483072 4855163 4946479 5232403 5108467 4654269 4820973 6419439 9053222 11326633
38658 11326633 12068678 11253328 9797461 8593482 7873320 7560637 7880004 9016196 10198545
38649 10198545 9930198 7561214 4114150 1193044 -349578 -356323 1065440 3094791 4108893
38640 4108893 3203385 1444474 618709 1122632 2136269 3382431 5217722 7104088 7672714
38631 7672714 6729385 5739751 5634390 5398828 3779672 1397660 40749 427603 1703193
38622 1703193 2842365 3648321 4474646 5692693 7445649 9417673 10861804 11254366 10880280
$$ packed form
38685E857650o69880j387865q26007J22450R272o79089l34082Q84966J172259
38676D149674K12306n5230J436626K947047K344425L4352j854651k202936j528541
38667E483072o27909R1316K85924j23936m54198J66704J598466K633783K273411
38658A1326633P42045q15350j455867j203979p20162l12683L19367J136192J182349
38649A0198545k68347k368984l447064k921106j542622o745J421763K029351J014102
38640D108893r05508j758911q25765N03923J013637J246162J835291J886366N68626
38631G672714r43329r89634j05361k35562j619156k382012j356911L86854J275590
38622A703193J139172Q05956Q26325J218047J752956J972024J444131L92562l74086
$$ plain form
38613 10880280 10459048 10285931 10037880 9335331 8224808 7148548 6568702 6485138 6263832
38604 6263832 5268241 3852829 3333275 4543351 6643120 7859433 7407533 6247340 5774351
38595 5774351 6097997 5998558 4554099 2384678 969463 986513 1846827 2765281 3499478
38586 3499478 3780457 2970293 1138395 -153867 679517 3093621 4747887 4133860 2060356
38577 2060356 411575 246517 1312238 2609309 3082559 2402002 1416296 1367171 2497905
38568 2497905 3934107 4920616 5468738 5763482 5763094 5494005 4937637 3661796 1603515
38559 1603515 133433 846009 3012266 3936962 2552023 895187 883916 1411277 443992
38550 443992 -1416788 -1814694 -388569 798745 610490 391543 1589173 3614591 4985076
$$ packed form
38613A0880280m21232j73117k48051p02549j110523j076260n79846q3564k21306
38604F263832r95591j415412n19554J210076K099769J216313m51900j160193m72989
38595E774351L23646r9439j444459k169421j415215J7050Q60314R18454P34197
38586C499478K80979q10164j831898j292262Q33384K414104J654266o14027k073504
38577B060356j648781j65058J065721J297071M73250o80557r85706m9125J130734
38568B497905J436202R86509N48122K94744l88k69089n56368j275841k058281
38559A603515j470082P12576K166257R24696j384939j656836j1271N27361r67285
38550D43992j860780l97906J426125J187314j88255k18947J197630K025418J370485
$$ plain form
38541 4985076 5304586 5127578 4723646 3931913 2818240 1798591 1279903 1442027 2100072
38532 2100072 2685216 2755919 2607224 2971666 4084736 5426843 6307356 6288471 5270895
38523 5270895 3767361 2851552 3067739 3538754 2970184 1406891 87467 -316761 -210143
38514 -210143 204660 1434075 3531064 5549938 6712537 7170588 7091397 6015186 3866589
38505 3866589 1705802 570691 222267 -138842 -559714 -646647 -576354 -686036 -440149
38496 -440149 943752 2854055 3490191 2142863 408187 488502 2701405 5228818 6168833
38487 6168833 5357601 4088190 3406329 3109586 2496090 1644274 1381091 2030722 2854449
38478 2854449 3057322 2855092 3024429 3668203 4023359 3504889 2474797 1813752 2014859
$$ packed form
38541D985076L19510j77008m03932p91733j113673j019649n18688J62124O58045
38532B100072N85144P0703j48695L64442J113070J342107Q80513j8885j017576
38523E270895j503534r15809K16187M71015n68570j563293j319424m04228J06618
38514b10143M14803J229415K096989K018874J162599M58051p9191j076211k148597
38505C866589k160787j135111l48424l61109m20872q6933P0293j09682K45887
38496d40149J383901J910303O36136j347328j734676Q0315K212903K527413R40015
38487F168833q11232j269411o81861k96743o13496q51816k63183O49631Q23727
38478B854449K02873k02230J69337O43774L55156n18470j030092o61045K01107
$$ plain form
38469 2014859 2878886 3890726 4584982 4523786 3292331 980834 -1328880 -2141977 -1073900
38460 -1073900 509734 911660 -20586 -1033126 -1330420 -1438991 -1988260 -2491375 -2025478
38451 -2025478 -716408 169885 -373489 -1995448 -3338541 -3314840 -2068526 -797796 -614600
38442 -614600 -1598855 -3019371 -4214668 -4859812 -4569992 -2982556 -473294 1789143 2902406
38433 2902406 2977160 2547988 1777997 828669 599722 2115632 4924356 6877583 6260523
38424 6260523 3933943 2511622 3153004 4057880 2998611 647184 -190653 1329619 2673422
38415 2673422 1545014 -832327 -1801182 -1323479 -1511803 -2622774 -2329933 413722 3278860
38406 3278860 3708336 2368836 1794466 2780078 3896270 4026490 3748295 4121339 5160349
$$ packed form
38469B014859Q64027J011840O94256o1196j231455k311497k309714q13097J068077
38460a073900J583634M01926r32246j012540k97294j08571n49269n03115M65897
38451b025478J309070Q86293n43374j621959j343093K3701J246314J270730J83196
38442f14600r84255j420516j195297o45144K89820J587436K509262K262437J113263
38433B902406P4754m29172p69991r49328k28947J515910K808724J953227o17060
38424F260523k326580j422321O41382R04876j059269k351427q37837J520272J343803
38415B673422j128408k377341r68855M77703j88324j110971K92841K743655K865138
38406C278860M29476j339500n74370R85612J116192J30220k78195L73044J039010
$$ plain form
38397 5160349 5802940 5029894 3000501 1028332 5781 -923641 -3163824 -6249142 -8065573
38388 -8065573 -7759460 -6767241 -6301952 -5641483 -4047298 -2556647 -2176858 -1805898 44492
38379 44492 2587801 3918577 3932073 3916116 3967437 3195144 2076360 2123370 3253466 3883438
38369 3883438 3739510 4077801 4754171 3779902 805335 -1401812 -491116 2308236 4147738
38360 4147738 4219706 3861827 4123433 4804867 5259567 4931370 3604708 1943059 1100843
38351 1100843 1153139 835746 -475924 -1650111 -1499094 -421831 610763 1440476 1919138
38342 1919138 1090423 -1192073 -2930152 -2203274 -80322 612503 -941676 -2943050 -3975773
38333 -3975773 -4529158 -5135857 -4947126 -3213788 -934233 143430 -398991 -1399512 -1650476
$$ packed form
38397E160349O42591p73046k029393j972169j022551r29422k240183l085318j816431
38388h065573L06113R92219M65289O60469J594185J490651L79789L70960J850390
38379D4492K543309J330776J3496j5957N1321p72293j118784M7010J130096O29972
38369C883438j43928L38291O76370r74269k974567k207147R10696K799352J839502
38360D147738P1968l57879K61606O81434M54700l28197j326662j661649q42216
38351A100843N2296l17393j311670j174187J51017J077263J032594Q29713M78662
38342A919138q28715k282496j738079P26878K122952O92825j554179k001374j032723
38333c975773n53385o06699J88731J733338K279555J077663n42421j000521k50964
$$ plain form
38324 -1650476 -1085545 -507011 -480249 -674299 -434067 115997 130645 -582980 -1057930 -645600
38314 -645600 -182025 -684160 -1540343 -1290512 146927 1428573 1878208 2172597 2708625
38305 2708625 2685599 1433320 -352762 -1346143 -898608 719572 2636446 3669728 3186714
38296 3186714 2034840 1720744 2285308 2031884 -54190 -2699652 -4016073 -3818272 -3192725
38287 -3192725 -2564397 -1573641 -465896 -123599 -622448 -977666 -618751 -90818 101376
38278 101376 390989 1278376 2316291 2748329 2700705 2921984 3551110 3951519 3770757 3365184
38268 3365184 2908026 1803364 -413720 -2998250 -4514266 -4359621 -3217473 -2012393
38260 -2012393 -1024907 -164329 534513 1068762 1625743 2126792 2029281 1129528 217255 257538
$$ packed form
38324a650476N64931N78534K6762j94050K40232N50064J4648p13625m74950M12330
38314f45600M63575n02135q56183K49831J437439J281646M49635K94389N36028
38305B708625k3026j252279j786082r93381M47535J618180J916874J033282m83014
38296C186714j151874l14096N64564k53424k086074k645462j316421J97801O25547
38287c192725O28328R90756J107745L42297m98849l55218L58915N27933J92194
38278A01376K89613Q87387J037915M32038m7624K21279O29126M00409j80762m05573
38268C365184m57158j104662k217084k584530j516016J54645J142148J205080
38260b012393R87486Q60578O98842N34249N56981N01049r7511q99753r12273M0283
$$ plain form
38250 257538 1131281 1953374 2567925 3784214 5809432 7304623 6732245 4251638 1586325
38241 1586325 152369 -101364 -81733 -474012 -1483681 -3057709 -4848658 -6213289 -6781058
38232 -6781058 -7001535 -7645013 -8646379 -8921868 -7635508 -5267683 -3009942 -1403248 -136203
38223 -136203 962443 1411474 697198 -1082327 -3348620 -5420170 -6647645 -6573914 -5127452
38214 -5127452 -2504782 861702 3785449 4399073 2013769 -1207531 -2016874 2926
38206 2926 1815771 1031508 -1000665 -1592376 -739891 -661817 -2112746 -3509897 -3729431
38197 -3729431 -3634755 -4293322 -5378309 -6051767 -6108221 -5594978 -4462905 -3169690 -2513569
38188 -2513569 -2348109 -1619350 -170102 840041 972974 1449681 2994691 4203929 3554780
$$ packed form
38250B57538Q73743Q22093O14551J216289K025218J495191n72378k480607k665313
38241A586325j433956k53733J9631l92279j009669j574028j790949j364631n67769
38232f781058k20477o43478j001366k75489J286360K367825K257741J606694J267045
38223a36203J098646M49031p14276j779525k266293k071550j227475P3731J446462
38214e127452K622670L366484K923747O13624k385304l221300q09343K019800
38206B926J812845p84263k032173n91711Q52485P8074j450929j397151k19534
38197c729431R4676o58567j084987o73458n6454N13243J132073J293215O56121
38188b513569J65460P28759J449248J010143J32933M76707J545010J209238o49149
$$ plain form
38179 3554780 1889797 1122760 1250898 646755 -953718 -1833796 -1071178 -183604 -1077860
38170 -1077860 -3481721 -5465463 -5945376 -5690915 -5908678 -6538920 -6345641 -4585807 -2173661
38161 -2173661 -726637 -524019 -153276 1422086 3164599 3137551 960788 -1840808 -3787677
38152 -3787677 -4773954 -5357535 -5723078 -5885840 -6292720 -7478474 -9187687 -10310785 -9912428
38143 -9912428 -8237725 -6497755 -5546947 -5005396 -4045322 -2802015 -2239618 -2543159 -2607765
38134 -2607765 -1620212 -245247 544199 992601 1807113 2462868 1654366 -639146 -2791385
38125 -2791385 -3429857 -2702264 -1459544 -180393 918920 1554497 1660654 1485676 1120864
38116 1120864 429979 -426928 -1020468 -1357458 -1911207 -2770284 -3419775 -3573296 -3564296 -3703546
$$ packed form
38179C554780j664983p67037J28138o04143j600473q80078P62618Q87574q94256
38170a077860k403861j983742m79913K54461k17763o30242J93279J759834K412146
38161b173661J447024K02618L70743J575362J742513k7048k176763k801596j946869
38152c787677r86277n83581l65543j62762m06880j185754j709213j123098L98357
38143i912428J674703J739970R50808N41551R60074J243307N62397l03541o4606
38134b607765R87553J374965P89446M48402Q14512O55755q08502k293512k152239
38125b791385o38472P27593J242720J279151J099313O35577J06157j74978l64812
38116A120864o90885q56907n93540l36990n53749q59077o49491j53521R000j39250
$$ plain form
38106 -3703546 -3905142 -4119208 -4406687 -4421102 -3683014 -2645112 -2521486 -3567204 -4419345
38097 -4419345 -3765438 -1895057 14602 1356738 2139448 2387554 2395192 2919841 4146554
38088 4146554 4946095 4157822 2281661 947096 912692 1455554 1582592 1036675 192846
38079 192846 -372514 -351743 -288737 -1308214 -3582580 -5579498 -5767299 -4582103 -3508053
38070 -3508053 -2572695 -306422 3681086 7601926 9526250 9335429 8024809 6180086
38062 6180086 4053281 2339516 1779857 2224134 2818336 3007111 2881618 2692397 2413888
38053 2413888 1730362 297102 -1830977 -4018249 -5575749 -6402197 -6726813 -6469259 -5581825
38044 -5581825 -4846959 -5270712 -6540806 -7215624 -6797067 -6391808 -6685634 -6574031 -4925184
$$ packed form
38106c703546k01596k14066k87479j4415P38088J037902J23626j045718q52141
38097d419345O53907J870381J909659J342136P82710K48106P638N24649J226713
38088D146554P99541p88273j876161j334565l4404N42862J27038n45917q43829
38079A92846n65360K0771O3006j019477k274366j996918j87801J185196J074050
38070c508053R35358K266273L987508L920840J924324j90821j310620j844723
38062F180086k126805j713765n59659M44277N94202J88775j25493j89221k78509
38053B413888o83526j433260k128079k187272j557500q26448l24616K57554Q87434
38044e581825P34866m23753j270094o74818M18557M05259k93826J11603J648847
$$ plain form
38035 -4925184 -2627301 -1367180 -971056 367005 3202812 5648088 5548431 2973658 62012
38026 62012 -1123486 -291807 1198494 1936224 1867141 1838702 1878124 899419 -1414062 -3539421
38016 -3539421 -3924561 -2963026 -1933476 -844987 1023055 3061846 3803962 3295145 2990874
38007 2990874 3177490 2581133 932433 -279655 -382013 -620154 -1514998 -1343055 987695
37998 987695 3477002 3681132 2390011 2213439 3513510 4399271 4243466 4385199 5180744
37989 5180744 5021406 3055095 685352 -647191 -1318764 -2021841 -2095437 -857490 587852
37980 587852 566089 -639148 -919620 966760 3785887 5161593 4136204 2208403 1701775
37971 1701775 3003845 3939041 2535126 -180910 -1433723 -477970 588725 96764 -927298
$$ packed form
38035d925184K297883J260121L96124J338061K835807K445276r9657k574773k911646
38026F2012j185498Q31679J490301P37730o9083k8439L9422r78705k313481k125359
38016c539421l85140R61535J029550J088489J868042K038791P42116n08817l04271
38007B990874J86616n96357j648700j212088j02358k38141q94844J71943K330750
37998I87695K489307K04130j291121j76572J300071Q85761j55805J41733P95545
37989E180744j59338j966311k369743j332543o71573p03077p3596J237947J445342
37980E87852k1763j205237k80472J886380K819127J375706j025389j927801n06628
37971A701775J302070R35196j403915k716036j252813R55753J066695m91961j024062
$$ plain form
37962 -927298 -706490 573969 1314328 781134 -386003 -1234882 -1053536 402616 2275316
37953 2275316 2973510 2123905 1258699 1542888 1927227 955753 -657040 -1055753 -108434
37944 -108434 706013 805239 865875 928318 306613 -534223 -218265 1025568 1267296 -14190
37934 -14190 -892252 -112196 852764 357473 -702270 -714748 -418848 -1724709 -4182819
37925 -4182819 -5109060 -3327301 -715595 489706 259886 -89699 50881 449145 1079960
37916 1079960 2153147 3313965 3677835 2826931 1390162 474459 602369 1224801 1295422
37907 1295422 408160 -679177 -812571 280505 1672704 2253933 1908866 1557337 2098424
37898 2098424 3499690 5032261 6245237 7361660 8622289 9639455 9765907 8867714
$$ packed form
37962i27298K20808J280459P40359n33194j167137q48879J81346J456152J872700
37953B275316O98194q49605q65206K84189L84339r71474j612793l98713R47319
37944a08434Q14447R9226O0636O2443o21705q40836L15958J243833K41728j281486
37934a4190q78062P80056R64960m95291j059743j2478K95900j305861k458110
37925d182819r26241J781759K611706J205301k29820l49585J40580L98264O30815
37916A079960J073187J160818L63870q50904j436769r15703J27910O22432P0621
37907A295422q87262j087337j33394J093076J392199N81229l45067l51529N41087
37898B098424J401266J532571J212976J116423J260629J017166J26452q98193
$$ plain form
37890 8867714 7333486 5526366 3691189 2196858 1272233 601483 -225921 -1018330 -1454346
37881 -1454346 -2028031 -3437875 -4991724 -4932491 -2844453 -515931 354665 175801 186320
37872 186320 270924 -462136 -1607843 -1746302 -771403 -308764 -1359727 -2872147 -3450501
37863 -3450501 -3482586 -4422852 -6341914 -7379985 -6014104 -3147762 -1169704 -1071804 -1408209
37854 -1408209 -566569 802564 768679 -877902 -2164178 -1712979 -395805 517410 1256088
37845 1256088 2246649 2246401 -251874 -4302839 -7119295 -7355337 -6139908 -4806027 -3333696
37836 -3333696 -1482673 120114 851172 959224 841850 333334 -667589 -1642165 -2085603
37827 -2085603 -2053280 -1749361 -1355301 -1507770 -2873685 -4754218 -5223419 -3428370 -824332
$$ packed form
37890H867714j534228j807120j835177j494331r24625o70750q27404p92409m36016
37881a454346n73685j409844j553849N9233K088038K328522Q70596j78864J0519
37872A86320Q4604p33060j145707j38459R74899M62639j050963j512420n78354
37863c450501l2085r40266j919062j038071J365881K866342J978058R7900l36405
37854a408209Q41640J369133l3885j646581j286276M51199J317174R13215P38678
37845A256088R90561k48k498275m050965k816456k36042J215429J333881J472331
37836c333696J851023J602787P31058J08052j17374n08516j000923r74576m43438
37827b085603L2323L03919L94060j52469j365915j880533m69201J795049K604038
$$ plain form
37818 -824332 700850 1056177 1369260 2002516 2348582 2181047 2079150 2590634 3721568
37809 3721568 5074466 5877390 5237162 3125970 872141 -35470 574728 1845285 3235467
37800 3235467 4766438 6217745 7025791 7007252 6485445 5697349 4661883 3547668 2565554
37791 2565554 1605719 609852 150066 831871 2049635 2123495 74390 -3083817 -5081514
37782 -5081514 -4362825 -1465607 1353208 2108477 981840 -49217 332525 1306229 1347280
37773 1347280 365349 -494744 -606836 -267887 328540 1260905 2068673 2018256 1345700 1070375
37763 1070375 1302802 927345 -548110 -1951461 -1979861 -892247 102227 402600 118500
37754 118500 -755447 -2205759 -3439904 -3244227 -1376723 882293 1880560 1224054 142556
$$ packed form
37818h24332J525182L55327L13083O33256L46066j67535j01897N11484J130934
37809C721568J352898Q02924o40228k111192k253829r07611O10198J270557J390182
37800C235467J530971J451307Q08046j8539n21807p88096j035466j114215r82114
37791B565554r59835r95867m59786O81805J217764P3860k049105l158207j997697
37782e081514P18689K897218K818815P55269j126637j031057L81742R73704M1051
37773A347280r81931q60093j12092L38949N96427R32365Q07768n0417o72556k75325
37763A070375K32427l75457j475455j403351k8400J087614R94474L00373k84100
37754A18500q73947j450312j234145J95677J867504K259016R98267o56506j081498
$$ plain form
37745 142556 98192 1006052 1236048 -253313 -2295948 -2851220 -1618861 -172792 465396
37736 465396 981146 2093774 3155558 3305524 2868411 2493591 1808735 212603 -1585194
37727 -1585194 -2121355 -1009132 833906 2461194 3362642 3068341 1583895 85341 -82563
37718 -82563 883651 1707608 2154660 3279215 5311212 6769370 6339839 4459053 2315357
37709 2315357 391835 -1115799 -1457910 -108632 2164900 4033264 4987252 5121302 4121122
37700 4121122 1690857 -1239573 -3003877 -3067724 -2420997 -1915110 -1217356 152281 1658369
37691 1658369 2371772 2237923 1981933 1989484 1950530 1563351 973401 332850 -604389 -2065489
37681 -2065489 -3633574 -4472137 -4269070 -3654538 -3451116 -3701932 -3739987 -3069707 -1745993
$$ packed form
37745A42556m4364R07860K29996j489361k042635n55272J232359J446069O38188
37736D65396N15750J112628J061784J49966m37113l74820o84856j596132j797797
37727a585194n36161J112223J843038J627288R01448k94301j484446j498554j67904
37718h2563R66214Q23957M47052J124555K031997J458158m29531j880786k143696
37709B315357j923522j507634l42111J349278K273532J868364R53988J34050j000180
37700D121122k430265k930430j764304o3847O46727N05887O97754J369637J506088
37691A658369P13403j33849k55990P551l8954l87179n89950o40551r37239j461100
37681b065489j568085q38563K03067O14532K03422k50816l8055O70280J323714
$$ plain form
37672 -1745993 64778 2276188 4401128 5496387 5107615 3863486 2572456 1111154
37664 1111154 -1064197 -3578425 -5246831 -5551478 -5097482 -4399192 -3166154 -1265397 498258
37655 498258 1323512 1480739 1575852 1275594 -122290 -2010522 -2550299 -783341 2118206
37646 2118206 4103400 4168211 2746168 875274 -456762 -635070 172083 1040945 1282008
37637 1282008 1356882 2305661 4246249 6015168 6580794 6357015 6557737 7389885 7605124
37628 7605124 6211312 4074600 3007375 3366143 3542483 2240673 306030 -622381 -579851
37619 -579851 -1041820 -2381587 -3047391 -1721545 916443 3277644 4703829 5397214 5430197
37610 5430197 4890352 4367559 4206701 3784562 2624376 1673817 2088320 3099798 2753602
$$ packed form
37672a745993J810771K211410K124940J095259l88772j244129j291030j461302
37664A111154k175351k514228j668406l04647M53996O98290J233038J900757J763655
37655D98258Q25254J57227R5113l00258j397884j888232n39777J766958K901547
37646B118206J985194O4811j422043j870894j332036j78308Q07153Q68862K41063
37637A282008P4874R48779J940588J768919N65626k23779K00722Q32148K15239
37628G605124j393812k136712j067225L58768J76340j301810j934643r28411M2530
37619e79851m61969j339767o65804J325846K637988K361201J426185O93385L2983
37610E430197n39845n22793j60858m22139j160186r50559M14503J011478l46196
$$ plain form
37601 2753602 830760 -661601 -385684 527069 378717 -772723 -1759561 -2160673 -2286574
37592 -2286574 -2126176 -1571979 -1135100 -1238667 -1257887 -484928 311607 -366760 -2518041
37583 -2518041 -4402595 -4637557 -3447101 -1753887 -192049 734905 683091 154094 232202
37574 232202 1177779 2135193 2622507 3262097 4373204 4868457 3579705 1041988 -1051242
37565 -1051242 -1747593 -1296439 -182428 1174739 1923197 1152958 -958549 -3147543 -4451130
37556 -4451130 -4988075 -5216996 -5093657 -4277238 -2689087 -610134 1353487 2229943 1176941
37547 1176941 -1544189 -4412853 -5905722 -5833910 -5253460 -5246026 -6006913 -6971338 -7555930
37538 -7555930 -7691086 -7613015 -7190427 -5824686 -3391767 -988802 -33379 -577657 -1218436
$$ packed form
37601B753602j922842j492361K75917R12753j48352j151440r86838m01112j25901
37592b286574J60398N54197M36879j03567j9220P72959P96535o78367k151281
37583b518041j884554k34962J190456J693214J561838R26954n1814n28997P8108
37574B32202R45577R57414M87314O39590J111107M95253j288752k537717k093230
37565a051242o96351M51154J114011J357167P48458p70239k111507k188994j303587
37556d451130n36945k28921J23339Q16419J588151K078953J963621Q76456j053002
37547A176941k721130k868664j492869P1812N80450P434p60887r64425n84592
37538g555930j35156P8071M22588J365741K432919K402965R55423n44278o40779
$$ plain form
37529 -1218436 -870425 109975 891320 1385527 1801600 1722835 677321 -727604 -1346230
37520 -1346230 -1122744 -1150870 -1990042 -2938610 -3289048 -3294474 -3320289 -2951415 -1813769 -665224
37510 -665224 -649818 -1684811 -2468350 -2072096 -838369 282403 631083 89767 -857807
37501 -857807 -1207914 -284132 1239643 1788694 727111 -763287 -1058822 89311 1603897
37492 1603897 2589414 3134315 3651695 4027545 3758565 2768724 1791092 1724477 2535514 3009040
37482 3009040 1954528 -306051 -2024145 -1797179 -32572 1506404 1405439 -247126
37474 -247126 -2115801 -2836516 -2194781 -1239467 -1090857 -1738912 -2405349 -2892463 -3703511
37465 -3703511 -4667420 -4573693 -2957569 -1336261 -1450818 -2755570 -3053050 -1606844 -203337
$$ packed form
37529a218436L48011R80400P81345M94207M16073p8765j045514j404925o18626
37520a346230K23486k8126q39172r48568l50438n426k5815L68874J137646J148545
37510f65224J5406j034993p83539L96254J233727J120772L48680n41316r47574
37501h57807l50107R23782J523775N49051j061583j490398k95535J148133J514586
37492A603897R85517N44901N17380L75850k68980r89841r77632o6615Q11037M73526
37482C009040j054512k260579j718094K26966J764607J538976j00965j652565
37474b47126j868675p20715O41735R55314J48610o48055o66437m87114q11048
37465c703511r63909R3727J616124J621308j14557j304752k97480J446206J403507
$$ plain form
37456 -203337 -614825 -2178677 -2837785 -1959886 -1096350 -1972844 -4410502 -6449031 -6218116
37447 -6218116 -3492286 474661 4340966 7578405 10033756 11229290 10702239 8808896
37439 8808896 6524072 4411648 2326001 171625 -1584407 -2297110 -1676868 -9578
37431 -9578 1681180 1918809 79633 -2517426 -3702570 -2851750 -1320912 -252197 890641
37422 890641 2866378 4772967 4849364 2764201 26111 -1793422 -2378144 -2220371 -1700497
37413 -1700497 -931321 -87186 429372 147505 -1059196 -2672295 -3869783 -4233692 -3841667
37404 -3841667 -2773680 -1185432 115470 144059 -850092 -1480221 -1323568 -1749859 -3624277
37395 -3624277 -5301538 -4469405 -1347181 1631097 3014684 3493106 3919022 4069300 3860356
$$ packed form
37456b03337m11488j563852o59108Q77899Q63536q76494k437658k038529K30915
37447f218116K725830L966947L866305L237439K455351J195534n27051j893343
37439H808896k284824k112424k085647k154376j756032p12703O20242J667290
37431i578J690758K37629j839176k597059j185144Q50820J530838J068715J142838
37422H90641J975737J906589P6397k085163k738090j819533n84722J57773N19874
37413a700497P69176Q44135N16558k81867j206701j613099j197488l63909L92025
37404c841667J067987J588248J300902K8589r94151o30129J56653m26291j874418
37395c624277j677261Q32133L122224K978278J383587M78422M25916J50278k08944
$$ plain form
37386 3860356 4084202 5002797 5479702 4556746 2994242 2239842 2508029 2779252 2216958
37377 2216958 808414 -958165 -2309077 -2468915 -1495909 -599137 -947369 -2298929 -3349888
37368 -3349888 -3258811 -2270241 -977745 350179 1523956 1987390 1099508 -1013430 -3113011
37359 -3113011 -3816759 -3128757 -2563756 -3282782 -4555886 -4833541 -3952724 -3146297 -2944406
37350 -2944406 -2433388 -1004732 434063 780127 316215 114715 590227 1474151 2590614
37341 2590614 3778730 4517031 4451227 3956917 3535350 3076307 2320737 1497599 786900
37332 786900 -267841 -1945955 -3421971 -3574980 -2423981 -975018 13594 387269 220857
37323 220857 -32869 486888 1948182 3159907 3067451 2413134 2614265 3388000 3073900
$$ packed form
37386C860356K23846R18595M76905r22956j562504p54400K68187K71223n62294
37377B216958j408544j766579j350912j59838R73006Q96772l48232j351560j050959
37368c349888R1077R88570J292496J327924J173777M63434q87882k112938k099581
37359c113011p03748O88002N65001p19026j273104k77655Q80817Q06427K01891
37350b944406N11018J428656J438795L46064m63912k01500M75512Q83924J116463
37341B590614J188116P38301o5804m94310m21567m59043p55570q23138p10699
37332G86900j054741j678114j476016j53009J150999J448963R88612L73675j66412
37323B20857k53726N19757J461294J211725r2456o54317K01131P73735l14100
$$ plain form
37314 3073900 1296645 -302876 -346668 678346 1628983 2281613 2992513 3732791 4196439
37305 4196439 4244634 3754484 2631874 1322295 619180 597952 413407 -495797 -1659110
37296 -1659110 -2314848 -2186982 -1268292 319962 1856567 2278304 1488224 713466 1003383
37287 1003383 1983794 2597615 2447775 1885975 1378368 1301384 1767641 2150424 1437773 -339637
37277 -339637 -1658051 -1185333 540980 1759324 1403359 -190449 -2028302 -3215850 -3247780
37268 -3247780 -2205873 -702821 549476 959541 35511 -2091275 -4061918 -4252287 -2782397
37259 -2782397 -1593672 -1976409 -3076000 -3595459 -3793668 -4577185 -5533044 -5399702 -4098310
37250 -4098310 -2899972 -2673884 -3087146 -3443732 -3306078 -2403000 -914704 220701 204454
$$ packed form
37314C073900j777255j599521m3792J025014R50637O52630P10900P40278M63648
37305D196439M8195m90150j122610j309579p03115k1228j84545r09204j163313
37296a659110o55738J27866R18690J588254J536605M21737p90080p74758K89917
37287A003383R80411O13821j49840n61800n07607p6984M66257L82783p12651j777410
37277c39637j318414M72718J726313J218344l55965j593808j837853j187548l1930
37268c247780J041907J503052J252297M10065r24030k126786j970643j90369J469890
37259b782397J188725l82737j099591n19459j98209p83517r55859J33342J301392
37250d098310J198338K26088m13262l56586J37654R03078J488296J135405j6247
$$ plain form
37241 204454 -495771 -759046 -374721 -92268 -329392 -853512 -1583257 -2560827 -3134831 -2357942
37231 -2357942 -434481 1206501 1520251 723490 -449325 -1377363 -1389536 -137834 1537328
37222 1537328 2152276 1398801 505979 437581 721038 549167 54368 -204893 -221275 -224655
37212 -224655 25461 852322 1873387 2205487 1348902 -380179 -2060828 -2716540 -2045076
37203 -2045076 -692523 554482 1691942 3021102 4042143 3870411 2744632 1914911
37195 1914911 1762319 1261038 -195806 -1661868 -2085482 -1830277 -1853082 -2236158 -2472561
37186 -2472561 -2497565 -2531488 -2504270 -2441431 -2780347 -3514684 -3735128 -2869494 -1621077 -753289
37176 -753289 170937 1644016 2686019 2048983 424803 -257193 461256 1267530 1495218
$$ packed form
37241B04454p00225k63275L84325K82453k37124n24120p29745r77570n74004P76889
37231b357942J923461J640982L13750p96761j172815r28038j2173J251702J675162
37222A537328O14948p53475q92822o8398K83457j71871m94799k59261j6382l380
37212b24655K50116Q26861J021065L32100q56585j729081j680649o55712O71464
37203b045076J352553J247005J137460J329160J021041j71732j125779q29721
37195A914911j52592n01281j456844j466062m23614K55205k2805l83076k36403
37186b472561k5004l3923K7218O2839l38916p34337k20444Q65634J248417Q67788
37176g53289R24226J473079J042003o37036j624180o81996P18449Q06274K27688
$$ plain form
37167 1495218 1997228 3129254 3616520 2471172 802880 477018 1628842 2619196 2186138
37158 2186138 760078 -350618 -498342 -270708 -703277 -1975802 -3054576 -2898127 -1800762
37149 -1800762 -995407 -1047178 -1369256 -1352038 -1084068 -660852 313775 1900980 3155597
37140 3155597 3055762 1777236 387561 -506805 -1192560 -2045538 -2891305 -3263614 -2937714
37131 -2937714 -2116309 -1277113 -815782 -696737 -576579 -424697 -780496 -2068706 -3817489
37122 -3817489 -4980346 -5059570 -4559663 -4231762 -4192111 -4006109 -3419604 -2661260 -2006958 -1352046
37112 -1352046 -462228 435346 607652 -463201 -2390967 -4042403 -4373383 -3103003 -761763
37103 -761763 1646289 3035778 2708380 913965 -979410 -1333001 232796 2234204 2818112
$$ packed form
37167A495218N02010J132026M87266j145348j668292l25862J151824R90354m33058
37158B186138j426060j110696j47724K27634m32569j272525j078774J56449J097365
37149a800762Q05355n1771l22078J7218K67970M23216R74627J587205J254617
37140C155597r9835j278526j389675q94366o85755q52978q45767l72309L25900
37131b937714Q21405Q39196M61331J19045J20158J51882l55799j288210j748783
37122c817489j162857p9224M99907L27901L9651J86002N86505P58344O54302O54912
37112a352046Q89818Q97574J72306j070853j927766j651436l30980J270380K341240
37103g61763K408052J389489l27398j794415j893375l53591J565797K001408N83908
$$ plain form
37094 2818112 1997560 1727784 3318157 5492426 5913306 4120303 1708230 -202976 -2060469
37085 -2060469 -4057288 -4934832 -3800439 -1950598 -1374909 -2104863 -2539590 -2008792 -1441210
37076 -1441210 -1533617 -1787738 -1668187 -1394867 -1117412 -458365 536819 988444 366317 -760818
37066 -760818 -1772925 -2913135 -4375974 -5316402 -4850574 -3574485 -2979046 -3514058 -4240198
37057 -4240198 -4422069 -4466273 -4936998 -5450426 -5163986 -3925003 -2297187 -665016 967983
37048 967983 2223589 2219630 818746 -510367 -53211 1962050 3534292 3512657 2959278
37039 2959278 3193311 3525524 2235470 -697972 -3251346 -3741826 -2419480 -611509 618078
37030 618078 772670 -16315 -823270 -639364 448300 1484078 2063406 2546068 2818889
$$ packed form
37094B818112q20552k69776J590373K174269M20880j793003k412073j911206j857493
37085b060469j996819q77544J134393J849841N75689p29954m34727N30798N67582
37076a441210r2407k54121J19551K73320K77455O59047R95184M51625o22127j127135
37066g60818j012107j140210j462839r40428M65828J276089N95439n35012p26140
37057d240198j81871m4204m70725n13428K86440J238983J627816J632171J632999
37048I67983J255606l959j400884j329113M57156K015261J572242k1635n53379
37039B959278K34033L32213j290054k933442k553374m90480J322346J807971J229587
37030F18078J54592p88985q06955J83906J087664J035778N79328M82662K72821
$$ plain form
37021 2818889 2126982 475055 -1083049 -2025228 -2910054 -3785620 -3594638 -2136555 -1123634
37012 -1123634 -1919029 -3469688 -4033012 -3854292 -4311899 -5253677 -5279599 -4283893 -3575753
37003 -3575753 -3427235 -2567332 -589372 959718 697050 -776794 -1965463 -2220895 -1649354
36994 -1649354 -377585 1163445 2009820 1583169 335553 -1044624 -2399501 -3561744
36986 -3561744 -3871502 -2997881 -1606656 -435693 733610 2365416 3932025 4353972 3475189
36977 3475189 2273132 1700939 2027562 3176884 4869125 6320315 6573260 5487174 3964584
36968 3964584 2942874 2504201 2157252 1610885 1003307 672045 977293 2066448 3447773
36959 3447773 4013495 2967206 723259 -1486761 -2853922 -3386034 -3167125 -2069125 -529172
$$ packed form
37021B818889o91907j651927j558104r42179q84826q75566J90982J458083J012921
37012a123634p95395j550659n63324J78720m57607r41778k5922R95706P08140
37003c575753J48518Q59903J977960J549090k62668j473844j188669k55432N71541
36994a649354J271769J541030Q46375m26651j247616j380177j354877j162243
36986c561744l09758Q73621J391225J170963J169303J631806J566609M21947q78783
36977C475189j202057n72193L26623J149322J692241J451190K52945j086086j522590
36968C964584j021710m38673l46949n46367o07578l31262L05248J089155J381325
36959C447773N65722j046289k243947k210020j367161n32112K18909J098000J539953
$$ plain form
36950 -529172 309143 68567 76664 1703819 4171386 5353895 4621686 3341898 2373821
36941 2373821 851437 -1767726 -4123385 -4723425 -4034505 -3397474 -2938276 -2112549 -1377341
36932 -1377341 -1536123 -2101951 -2127863 -2034454 -2583018 -2598992 -240535 3504739 5315309
36923 5315309 4142393 2756279 3618920 5584626 6215946 5305130 4189906 3159984 1639839
36914 1639839 -44053 -992974 -1203475 -1155025 -581902 890678 2522402 3261495 3160255
36905 3160255 2766351 1992647 992279 1051998 2716597 3929451 2300979 -1262284 -3513215
36896 -3513215 -3199059 -2014985 -1243670 -176772 1459226 2150566 1037988 -328936 -240761
36887 -240761 707473 904706 171080 -637971 -1411522 -2509501 -3376269 -3015496 -1608525
$$ packed form
36950e29172Q38315k40576Q097J627155K467567J182509p32209j279788r68077
36941B373821j522384k619163k355659o00040O88920O37031M59198Q25727P35208
36932a377341j58782n65828k5912R3409n48564j5974K358457L745274J810570
36923E315309j172916j386114Q62641J965706O31320r10816j115224j029922j520145
36914A639839j683892r48921k10501M8450N73123J472580J631724P39093j01240
36905C160255l93904p73704j000368N9719J664599J212854j628472l563263k250931
36896c513215L14156J184074P71315J066898J635998O91340j112578j366924Q8175
36887b40761R48234J97233p33626q09051p73551j097979q66768L60773J406971
$$ plain form
36878 -1608525 -421821 -191133 -477578 -460245 321000 1721243 2881286 2760479 1359993
36869 1359993 -41370 -372484 137390 843119 1719034 2686100 2899240 1909960 754684
36860 754684 505963 369299 -1182697 -3743075 -5198642 -4685358 -3642637 -3541705 -4084738
36851 -4084738 -4297448 -4086607 -3851773 -3560653 -3123350 -2956299 -3347256 -3853191 -4074961
36842 -4074961 -4432178 -5315998 -5967242 -5238162 -3349909 -1942197 -2174820 -3441065 -4242048
36833 -4242048 -3847604 -2724069 -1645724 -936730 -672922 -1119288 -2403696 -3865676 -4472566
36824 -4472566 -4199593 -4260206 -5278604 -5903548 -4379201 -1169521 1368495 1997400 1810669
36815 1810669 2036199 2246016 1701281 983651 819114 442164 -1020621 -2285299 -1178713
$$ packed form
36878a608525J186704K30688k86445J7333P81245J400243J160043j20807j400486
36869A359993j401363l31114N09874P05729Q75915R67066K13140r89280j155276
36860G54684k48721j36664j551996k560378j455567N13284J042721J00932n43033
36851d084738k12710K10841K34834K91120M37303J67051l90957n05935k21770
36842d074961l57217q83820o51244P29080J888253J407712k32623j266245q00983
36833d242048L94444J123535J078345P08994K63808m46366j284408j461980o06890
36824d472566K72973o0613j018398o24944J524347L209680K538016O28905j86731
36815A810669K25530K09817n44735p17630j64537l76950j462785j264678J106586
$$ plain form
36806 -1178713 1989562 4490492 4910641 4665462 5040079 4959909 3265785 1397078 1596846
36797 1596846 3422508 4358013 3573883 2820363 3371823 4255488 4321468 4194431 4830377
36788 4830377 5473105 4665335 2596422 903001 396391 355949 63694 -254745 -316711
36779 -316711 -510115 -1186359 -1994666 -2477410 -2720241 -2826550 -2277282 -590789 1579723
36770 1579723 2742084 2075071 227416 -1419341 -1887542 -1017357 641876 1981941 1807787
36761 1807787 -158113 -2642121 -3660010 -2330810 281783 2316567 2889131 2448275
36753 2448275 1648913 531380 -1037395 -2733909 -4076514 -5020639 -5750944 -6076718 -5561177
36744 -5561177 -4206522 -2588205 -1369097 -1035718 -1841435 -3349768 -4211662 -3330585 -1399858
$$ packed form
36806a178713L168275K500930M20149k45179L74617q0170j694124j868707J99768
36797A596846J825662R35505p84130p53520N51460Q83665O5980j27037O35946
36788D830377O42728q07770k068913j693421n06610m0442k92255l18439o1966
36779c16711j93404o76244q08307m82744k42831j06309N49268J686493K170512
36770A579723J162361o67013j847655j646757m68201Q70185J659233J340065j74154
36761A807787j965900k484008j017889J329200K612593K034784N72564m40856
36753B448275p99362j117533j568775j696514j342605r44125p30305l25774N15541
36744e561177J354655J618317J219108L33379q05717j508333q61894Q81077J930727
$$ plain form
36735 -1399858 -339029 -835837 -1407548 -512073 1359281 2610611 2742575 2426934 1974287
36726 1974287 1185273 501340 734804 1499979 1447168 466068 68860 819524 1015713 -726273
36716 -726273 -2912896 -3009695 -1023983 733591 1088112 1036241 1198161 530428 -1460803
36707 -1460803 -3146185 -2920118 -1589952 -964428 -1016006 -319123 1176394 1825516 884296
36698 884296 -376442 -733173 -686619 -1229501 -2163239 -2734601 -3069488 -3724585 -4289239 -3715364
36688 -3715364 -2021159 -597694 -519774 -1254147 -1402187 -318631 1279401 2099683 1566482
36679 1566482 483115 323920 1603215 3077355 2948056 800516 -2028936 -3926782
36671 -3926782 -4374292 -3888542 -3192276 -2656751 -2148170 -1202391 345952 1814836 2166270
$$ packed form
36735a399858J060829m96808n71711Q95475J871354J251330J31964l15641m52647
36726A974287p89014o83933K33464P65175n2811r81100l97208P50664J96189j741986
36716g26273k186623r6799J985712J757574L54521n1871J61920o67733j991231
36707a460803j685382K26067J330166O25524n1578O96883J495517O49122r41220
36698H84296j260738l56731M6554n42882r33738n71362l34887o55097n64654N73875
36688c715364J694205J423465P7920p34373j48040J083556J598032Q20282n33201
36679A566482j083367j59195J279295J474140j29299k147540k829452j897846
36671c926782m47510M85750O96266N35525N08581R45779J548343J468884L51434
$$ plain form
36662 2166270 1185934 -292135 -1526080 -2648020 -3916933 -4807301 -4603693 -3631904 -3077949
36653 -3077949 -3540831 -4472878 -5257641 -6162311 -7697318 -9396617 -9894047 -8336324 -5401958
36644 -5401958 -2733665 -1457916 -1375360 -1559562 -1565785 -1830530 -2816276 -4019623 -4242041
36635 -4242041 -2974834 -1190504 -384599 -893543 -1544184 -1086141 384265 1708395 2080127
36626 2080127 1705512 1165186 728284 474678 525773 732121 542647 -293406 -1192750 -1504228
36616 -1504228 -1574034 -2257883 -3363193 -3466656 -1698954 925780 2531002 2394908 1482282
36607 1482282 1203995 2082288 3525670 4562344 4752634 4421609 3895517 2757428 492921
36598 492921 -2124550 -3240574 -2027337 193950 1636183 2133621 2637318 3285492 3256909
$$ packed form
36662B166270r80336j478069j233945j121940j268913q90368K03608R71789N53955
36653c077949m62882r32047p84763r04670j535007j699299m97430J557723K934366
36644e401958K668293J275749Q2556j84202o223k64745r85746j203347k22418
36635d242041J267207J784330Q05905n08944o50641M58043J470406J324130L71732
36626B080127l74615n40326m36902k53606N1095K06348j89474q36053q99344l11478
36616a504228o9806o83849j105310j03463J767702K624734J605222j36094r12626
36607A482282k78287Q78293J443382J036674J90290l31025n26092j138089k264507
36598D92921k617471j116024J213237K221287J442233M97438N03697O48174k8583
$$ plain form
36589 3256909 2301563 1117658 142595 -867334 -1907330 -2520063 -2728707 -2974044 -2831487
36580 -2831487 -1178129 1747387 3842111 3642958 2120942 919876 98055 -926110
36572 -926110 -1410768 -338547 1234369 1182774 -360619 -916242 677459 2638429 3115072
36563 3115072 2682570 2669993 2736419 1900326 793146 875174 1937513 2232732 981654
36554 981654 -808710 -2046441 -2643438 -2754688 -2261821 -1342967 -472330 383566 1503597
36545 1503597 2229839 1407929 -587566 -1728089 -1048387 -182237 -1040361 -3004066 -3855603
36536 -3855603 -2878208 -1530967 -1214167 -1718436 -2057590 -1763712 -1020936 -263982 57275
36527 57275 -179752 -549863 -651741 -820645 -1683636 -3095436 -4205982 -4535965 -4235100
$$ packed form
36589C256909r55346j183905r75063j009929j039996o12733k08644k45337J42557
36580b831487J653358K925516K094724j99153j522016j201066q21821j024165
36572i26110m84658J072221J572916n1595j543393n55623J593701J960970M76643
36563C115072m32502j2577O6426q36093j107180Q2028J062339K95219j251078
36554I81654j790364j237731n96997j11250M92867R18854Q70637Q55896J120031
36545A503597P26242q21910j995495j140523O79702Q66150q58124j963705q51537
36536c855603R77395J347241L16800n04269l39154K93878P42776P56954L21257
36527E7275k37027l70111j01878j68904q62991j411800j110546l29983L00865
$$ plain form
36518 -4235100 -3334448 -1704786 98095 1001566 863262 812266 1582927 2410088 2319928
36509 2319928 1636282 1140062 403181 -1616395 -4414337 -5764879 -4200453 -787714 2100616
36500 2100616 3148046 2725214 1790870 986008 638152 860602 1356110 1501667 943387
36491 943387 13853 -589568 -475141 172713 874606 1252837 1197048 815441 287547 -291262
36481 -291262 -910106 -1445245 -1605416 -1292111 -911912 -988576 -1484146 -1921913 -2190122 -2599325
36471 -2599325 -2940493 -2302617 -466254 1195427 1145574 -366540 -1743910 -2108062 -1790756
36462 -1790756 -989461 559544 2286814 2693643 1338672 -275190 -730497 -582870 -1149893
36453 -1149893 -2326424 -2928367 -2616573 -2075173 -1552137 -583604 821105 1908233 2262962
$$ packed form
36518d235100R00652J629662J802881R03471j38304n0996P70661Q27161r0160
36509B319928o83646m96220p36881k019576k797942j350542J564426L412739K888330
36500B100616J047430m22832r34344q04862l47856K22450M95508J45557n58280
36491I43387r29534o03421J14427O47854P01893L78231n5789l81607n27894n78809
36481b91262o18844n35139j60171L13305L80199p6664m95570m37767k68209m09203
36471b599325l41168O37876J836363J661681m9853j512114j377370l64152L17306
36462a790756Q01295J549005J727270M06829j354971j613862m55307J47627n67023
36453a149893j176531o01943L11794N41400N23036R68533J404709J087128L54729
$$ plain form
36444 2262962 2241469 2252946 2476171 3219733 4504659 5249362 4066247 1184100 -1487309
36435 -1487309 -2565913 -2424801 -1887374 -1043804 -151603 -386092 -2283637 -4174607 -3719924
36426 -3719924 -875549 1968009 2889385 2299075 1618831 1309242 1020333 865134 1314535
36417 1314535 1927895 1344585 -906636 -3287257 -3773987 -2300639 -857629 -1068302 -2467646
36408 -2467646 -3514375 -3484128 -2677105 -1422350 113518 1406092 1867299 1651147 1347848
36399 1347848 945889 25714 -1018828 -1074071 58787 1144187 1124747 362012 -294553
36390 -294553 -788372 -1417048 -1810371 -1292429 53149 1418071 2142574 1996268 918019
36381 918019 -870401 -2666568 -3760011 -4032771 -3793668 -3308000 -2852859 -2879474 -3617815
$$ packed form
36444B262962k1493J1477K23225P43562J284926P44703j183115k882147k671409
36435a487309j078604J41112N37427Q43570Q92201k34489j897545j890970M54683
36426c719924K844375K843558R21376n90310o80244l09589k88909j55199M49401
36417A314535O13360n83310k251221k380621m86730J473348J443010k10673j399344
36408b467646j046729L0247Q07023J254755J535868J292574M61207k16152l03299
36399A347848m01959r20175j044542n5243J132858J085400j9440p62735o56565
36390b94553m93819o28676l93323N17942J345578J364922P24503j46306j078249
36381I18019j788420j796167j093443k72760K39103M85668M55141k6615p38341
$$ plain form
36372 -3617815 -4673996 -5312506 -4960569 -3430592 -1205948 429953 448593 -386019 -41573
36363 -41573 2133614 4393158 5081491 4890382 5248983 5607194 4373348 2037288 1014461
36354 1014461 2106459 3286747 2840668 1804037 1927571 2711507 2333557 835804 398114
36345 398114 2178903 4423194 4637344 2885098 1783837 3150923 5560957 5962798 3391687
36336 3391687 112853 -1160314 -280614 755491 527357 -518258 -1178252 -833748 386021
36327 386021 1944378 3194152 3853705 4211793 4455845 4102661 2743673 972504 -314285
36318 -314285 -1180447 -2126475 -2653372 -1805819 -115521 636569 -8798 -399146 800438
36309 800438 2807962 4167621 4637720 4604727 3848668 2215967 657035 235192 598934
$$ packed form
36372c617815j056181o38510L51937J529977K224644J635901J8640q34612L44446
36363d1573K175187K259544O88333j91109L58601L58211j233846k336060j022827
36354A014461J091998J180288m46079j036631J23534P83936l77950j497753m37690
36345C98114J780789K244291K14150j752246j101261J367086K410034M01841k571111
36336C391687l278834j273167Q79700J036105k28134j045615o59994L44504J219769
36327C86021J558357J249774O59553L58088K44052l53184j358988j771169j286789
36318c14285q66162r46028n26897Q47553J690298P52090o45367l90348J199584
36309H00438K007524J359659M70099l2993p56059j632701j558932m21843L63742
$$ plain form
36300 598934 564414 -176450 -837895 -573305 1025864 3770427 6354861 6847311 4820968
36291 4820968 2240365 1050931 781073 10109 -791508 -83612 1530106 1486506 -866911
36282 -866911 -2867709 -2064721 601719 2383872 2106639 617851 -1027110 -2263906 -2509807
36273 -2509807 -1512859 -180785 87937 -909912 -1895712 -1621363 -110455 1682874 2968912
$$ packed form
36300E98934l4520p40864o61445K64590J599169K744563K584434M92450k026343
36291D820968k580603j189434k69858p70964q01617P07896J613718m3600k353417
36282h66911k000798Q02988K666440J782153k77233j488788j644961j236796k45901
36273b509807R96948J332074K68722r97849r85800K74349J510908J793329J286038
$$ [...]
##END NTUPLES=NMR SPECTRUM
##END=
