##TITLE=31Pdec_DE-178rm_3h
 CCl4_, 24 sc
25.8.2026
##JCAMPDX= 6.0         $$ Bruker NMR JCAMP-DX V2.0
##DATA TYPE= NMR SPECTRUM
##DATA CLASS= NTUPLES
##ORIGIN= UXNMR, Bruker Analytische Messtechnik GmbH
##OWNER= root
$$ XWIN-NMR		Version 3.5
$$ Tue Aug 25 14:27:06 2026 Russian Standard Time (UT+4h)  she@DPX200
##.OBSERVE FREQUENCY= 81.013821
##.OBSERVE NUCLEUS= ^31P
##.ACQUISITION MODE= SIMULTANEOUS
##.ACQUISITION SCHEME= undefined
##.AVERAGES= 64
##.DIGITISER RES= 17
##SPECTROMETER/DATA SYSTEM= spect
##.PULSE SEQUENCE= zgpg30
##.SOLVENT NAME= CDCl3
##.SHIFT REFERENCE= (INTERNAL, CDCl3, 0, 197.392)
##AUDIT TRAIL= $$ (NUMBER, WHEN, WHO, WHERE, WHAT)
$$ ##TITLE= Audit trail, XWIN-NMR		Version 3.5
$$ ##JCAMPDX= 5.01
$$ ##ORIGIN= Bruker BioSpin GmbH
$$ ##OWNER= she
$$ F:/spectra/data/she/nmr/P31/2/pdata/1/auditp.txt
$$ ##AUDIT TRAIL=  $$ (NUMBER, WHEN, WHO, WHERE, WHAT)
(   1,<2026-08-25 14:24:56.53 +0400>,<she>,<DPX200>,
      <created by zg, POWCHK disabled, PULCHK disabled
       configuration hash MD5:
       00 E9 B6 7A A2 85 ED C7 34 08 36 98 17 FE 4E 26
       data hash MD5: 32K
       38 05 EC E3 E1 82 4B E8 4D 21 A4 42 9F A1 67 EE>)
(   2,<2026-08-25 14:25:38.04 +0400>,<she>,<DPX200>,
      <Start of raw data processing
       efp BC_mod = 2 LB = 1.5 FT_mod = 6 PKNL = 1 PHC0 = 1992.45 PHC1 = 10.0983 SI = 64K 
       data hash MD5: 64K
       9E FD 6F 51 2B CD E6 82 A8 DE ED D1 1B 7E 33 F1>)
(   3,<2026-08-25 14:25:57.23 +0400>,<she>,<DPX200>,
      <pk PHC0 = 32.16109 PHC1 = -113 
       data hash MD5: 64K
       43 E3 6B 4A 3B 17 27 F8 B7 B1 4E C9 A1 BE 6E E1>)
(   4,<2026-08-25 14:26:30.14 +0400>,<she>,<DPX200>,
      <pk PHC0 = -78.65737 PHC1 = 260.5998 
       data hash MD5: 64K
       EE B8 D9 12 5D EA CC 0C AB D1 03 D8 09 8D 33 42>)
$$ ##END=
$$ 
$$ hash MD5
$$ B6 15 0B 31 AA 8E 02 ED 51 08 44 CB 98 61 03 30
##$RELAX= 
##$RELAX= 
##$RELAX= 
##$RELAX= 
##$RELAX= 
##$RELAX= 
##$RELAX= 
##$RELAX= 
$$ Bruker specific parameters
$$ --------------------------
##$DU= <F:/spectra>
##$EXPNO= 2
##$NAME= <P31>
##$PROCNO= 1
##$TYPE= <nmr>
##$USER= <she>
##$AMP= (0..31)
100 100 100 100 100 100 100 100 100 100 100 100 100 100 100 100 100 100 
100 100 100 100 100 100 100 100 100 100 100 100 100 100 
##$AQSEQ= 0
##$AQ_mod= 1
##$AUNM= <au_zg>
##$AUTOPOS= <>
##$BF1= 81.014009
##$BF2= 200.13
##$BF3= 200.13
##$BF4= 200.13
##$BF5= 200.13
##$BF6= 200.13
##$BF7= 200.13
##$BF8= 200.13
##$BYTORDA= 1
##$CFDGTYP= 0
##$CFRGTYP= 5
##$CHEMSTR= <none>
##$CNST= (0..31)
1 1 145 1 1 1 1 1 1 1 1 1 1 1 1 1 1 1 1 1 1 1 1 1 1 1 1 1 1 1 1 1 
##$CPDPRG= <waltz16>
##$CPDPRG1= <>
##$CPDPRG2= <waltz16>
##$CPDPRG3= <>
##$CPDPRG4= <mlev>
##$CPDPRG5= <mlev>
##$CPDPRG6= <mlev>
##$CPDPRG7= <mlev>
##$CPDPRG8= <mlev>
##$CPDPRGB= <>
##$CPDPRGT= <>
##$D= (0..31)
0 1 0 0 0 0 0 0 0 0.06 0 0.03 2e-05 3e-06 0 0 0.0002 0 0 0 0 0 0 0 0 0 
0 0 0 0 0 0 
##$DATE= 1787653495
##$DBL= (0..7)
120 120 120 11 120 120 24 19 
##$DBP= (0..7)
150 150 150 150 150 150 150 150 
##$DBP07= 0
##$DBPNAM0= <>
$$ [...]
##$SUBNAM3= <"">
##$SUBNAM4= <"">
##$SUBNAM5= <"">
##$SUBNAM6= <"">
##$SUBNAM7= <"">
##$SUBNAM8= <"">
##$SUBNAM9= <"">
##$SW= 400.765351723535
##$SWIBOX= (0..15)
0 1 3 0 0 0 0 0 0 0 0 0 0 0 0 0 
##$SW_h= 32467.5324675325
##$TD= 32768
##$TD0= 1
##$TE= 0
##$TE2= 300
##$TE3= 300
##$TEG= 300
##$TL= (0..7)
0 120 53 12 22 120 120 120 
##$TP= (0..7)
150 150 150 150 150 150 150 150 
##$TP07= 0
##$TPNAME0= <>
##$TPNAME1= <>
##$TPNAME2= <>
##$TPNAME3= <>
##$TPNAME4= <>
##$TPNAME5= <>
##$TPNAME6= <>
##$TPNAME7= <>
##$TPOAL= (0..7)
0.5 0.5 0.5 0.5 0.5 0.5 0.5 0.5 
##$TPOFFS= (0..7)
0 0 0 0 0 0 0 0 
##$TUNHIN= 0
##$TUNHOUT= 0
##$TUNXOUT= 0
##$USERA1= <user>
##$USERA2= <user>
##$USERA3= <user>
##$USERA4= <user>
##$USERA5= <user>
##$V9= 5
##$VALIST= <valist>
##$VCLIST= <CCCCCCCCCCCCCCC>
##$VD= 0
##$VDLIST= <DDDDDDDDDDDDDDD>
##$VPLIST= <PPPPPPPPPPPPPPP>
##$VTLIST= <TTTTTTTTTTTTTTT>
##$WBST= 1024
##$WBSW= 4
##$XGAIN= (0..3)
0 0 0 0 
##$XL= 0
##$YL= 0
##$YMAX_a= 45304
##$YMIN_a= -36553
##$ZGOPTNS= <>
##$ZL1= 120
##$ZL2= 120
##$ZL3= 120
##$ZL4= 120
##$ABSF1= 0
##$ABSF2= 0
##$ABSG= 0
##$ABSL= 0
##$ALPHA= 0
##$AQORDER= 0
##$ASSFAC= 0
##$ASSFACI= 0
##$ASSFACX= 0
##$ASSWID= 0
##$AUNMP= <proc_1d>
##$AZFE= 0.1
##$AZFW= 0.5
##$BCFW= 0
##$BC_mod= 2
##$BYTORDP= 0
##$COROFFS= 0
##$CY= -3
##$DATMOD= 1
##$DC= 0
##$DFILT= <>
##$DTYPP= 0
##$F1P= 0
##$F2P= 0
##$FCOR= 1
##$FTSIZE= 65536
##$FT_mod= 6
##$GAMMA= 0
##$GB= 0
##$INTBC= 1
##$INTSCL= 9.790993e-09
##$ISEN= 30
##$LB= 1.5
##$LEV0= 0
##$LPBIN= 0
##$MAXI= 10000
##$MC2= 0
##$MEAN= 0
##$ME_mod= 0
##$MI= 50
##$NCOEF= 0
##$NC_proc= -7
##$NLEV= 6
##$NOISF1= 182.463
##$NOISF2= 159.3651
##$NSP= 0
##$NTH_PI= 0
##$NZP= 0
##$OFFSET= 197.3918
##$PC= 4
##$PHC0= 1945.954
##$PHC1= 157.6981
##$PH_mod= 1
##$PKNL= yes
##$PPARMOD= 0
##$PSCAL= 0
##$PSIGN= 0
##$REVERSE= no
##$SF= 81.014063255964
##$SI= 65536
##$SIGF1= 159.3651
##$SIGF2= -187.1042
##$SINO= 113.3802
##$SIOLD= 16384
##$SREGLST= <1H.CDCl3>
##$SSB= 0
##$STSI= 65536
##$STSR= 0
##$SW_p= 32467.5324675325
##$SYMM= 0
##$S_DEV= 0
##$TDeff= 32768
##$TDoff= 0
##$TI= <>
##$TILT= no
##$TM1= 0
##$TM2= 0
##$TOPLEV= 0
##$USERP1= <user>
##$USERP2= <user>
##$USERP3= <user>
##$USERP4= <user>
##$USERP5= <user>
##$WDW= 1
##$XDIM= 65536
##$YMAX_p= 324511111
##$YMIN_p= -192702550
$$ End of Bruker specific parameters
$$ ---------------------------------
##NTUPLES= NMR SPECTRUM
##VAR_NAME=  FREQUENCY,     SPECTRUM/REAL,   SPECTRUM/IMAG
##SYMBOL=    X,             R,               I
##VAR_TYPE=  INDEPENDENT,   DEPENDENT,       DEPENDENT
##VAR_FORM=  AFFN,          ASDF,            ASDF
##VAR_DIM=   65536,         65536,           65536
##UNITS=     HZ,            ARBITRARY UNITS, ARBITRARY UNITS
##FACTOR=    0.49542278885378, 1,            1
##FIRST=     15991.5117654749, 0,            0
##LAST=      -16476.0207020576, 0,           0
##MIN=       -16476.0207020576, -192702550,  0
##MAX=       15991.5117654749, 324511111,    0
$$ Real data points
##PAGE= N=1
##DATA TABLE= (X++(R..R)), XYDATA
$$ [...]
47705a035829k272631o20557J279346J733831J019400M70479K06012n69865j418748
$$ -1035829 -3308460 -3929017 -2649671 -915840 103560 574039 780051 210186 -1208562
47696a208562r06580Q11824J676389O47496q13541j039983l51126P9174J49130
$$ -1208562 -2115142 -1303318 373071 1020567 207026 -832957 -1184083 -1104909 -955779
47687i55779M05181P46024P44500M96427J68098n46479j602732k025320j141141
$$ -955779 -550598 195426 939926 1436353 1604451 1057972 -544760 -2570080 -3711221
47678c711221K53362Q85285N92630J01877j48182j21909K43486P22245O42721
$$ -3711221 -3457859 -2572574 -1979944 -1878067 -2026249 -2148158 -1904672 -1182427 -539706
47669e39706j41615p60103n97532k71300l95596k86020P89809J841771J307872
$$ -539706 -681321 -1441424 -2038956 -2310256 -2705852 -2991872 -2202063 -360292 947580
47660I47580l72033j106578k02300O12081j99021j692752j736271J87260K407859
$$ 947580 575547 -531031 -733331 -121250 -320271 -2013023 -3749294 -3562034 -1154175
47651a154175L041772J852650J42501p59455o42712j51805K19523M43539M36784
$$ -1154175 1887597 3740247 3882748 3123293 2480581 2328776 2548299 2991838 3428622
47642C428622m2777p62704r90415m97586O5572K18158K90297M68588J56032q26257
$$ 3428622 3385845 2623141 1632726 1135140 1200712 1418870 1709167 2177755 2333787 1507530
47632A507530j353293n83452L39037k36052j736880j956579l61270J103225J017766
$$ 1507530 154237 -429215 -90178 -326230 -2063110 -4019689 -4380959 -3277734 -2259968
47623b259968M95994J131955K347425K238799L65885j653621k137520r54004P54690
$$ -2259968 -1763974 -632019 1715406 3954205 4320090 2666469 528949 -425055 329635
47614C29635J656315J046505o95957k258075k407384j088851N67307J293950O91359
$$ 329635 1985950 3032455 2336498 78423 -2328961 -3417812 -2850505 -1556555 -865196
47605h65196n70309j312994p86941O47669J766533J568690J77167j295917j705736
$$ -865196 -1435505 -2748499 -3535440 -2887771 -1121238 447452 624619 -671298 -2377034
47596b377034q27757M01468O88749k54819j256012j007063K61665J096180Q52036
$$ -2377034 -3204791 -2803323 -2114574 -2369393 -3625405 -4632468 -4370803 -3274623 -2422587
47587b422587N16566J039973J728412J249989k69847j336964j210092p62003r05772
$$ -2422587 -1906021 -866048 862364 2112353 1842506 505542 -704550 -1466553 -2372325
47578b372325j233944q97785j5078O70561R42271R48822L66154j064047k356419
$$ -2372325 -3606269 -4504054 -4519132 -3848571 -2906300 -1957478 -1591324 -2655371 -5011790
47569e011790k049404l59209Q23301N71351J13358N53891R20898o1957j451067
$$ -5011790 -7061194 -7420403 -6597102 -6025751 -5912393 -5358502 -4437604 -4499561 -5950628
47560e950628j249508N12028J832660J675558R27912M08709j03363n16391m6200
$$ -5950628 -7200136 -6688108 -4855448 -3179890 -2251978 -1843269 -1946632 -2463023 -2509223
47551b509223J163553J783815J357064R17989R06103L94814p29200r99342p5898
$$ -2509223 -1345670 438145 1795209 2713198 3619301 4014115 3284915 2285573 2209675
47542B209675N5368j614655k868991j680064K05815Q3758j018275r6949K361969
$$ 2209675 2265043 650388 -2218603 -3898667 -3692852 -3609094 -4627369 -4724318 -2362349
47533b362349K733814J08010k142231j527814K97344Q23345K18046j12269J8599
$$ -2362349 371465 479475 -1662756 -3190570 -2893226 -2069881 -1851835 -1964104 -1945505
47524a945505L06501J022715J760475J181155m46309o62541J441757L144226J901996
$$ -1945505 -1639004 -616289 1144186 2325341 1879032 1216491 2658248 5802474 7704470
47515G704470q39822k083924j586892r87376m37745O48355Q98236j242099l750835
$$ 7704470 6864648 4780724 3193832 2206456 1768711 2417066 3315302 2073203 -1677632
47506a677632k969126O72904K715522J108730j132311j000740K94767K59175o71905
$$ -1677632 -4646758 -3973854 -1258332 -149602 -1281913 -2282653 -1987886 -1728711 -2400616
47497b400616m67753R20662J886622J784325J036302k64952j831281k295013r20414
$$ -2400616 -2868369 -1947707 -61085 1723240 2759542 2494590 663309 -1631704 -2552118
47488b552118O74479N78855m18513j13604J458327K111873J060008j08125k13560
$$ -2552118 -1877639 -1298784 -1717297 -1830901 -372574 1739299 2799307 2691182 2477622
47479B477622J08930K86579P90794J435873R04028q47193j697439l84129J295710
$$ 2477622 2586552 2873131 3663925 5099798 6003826 5156633 3459194 3075065 4370775
47470D370775J040138o08770j405416q07254j25521O2194M53085J144039J254314
$$ 4370775 5410913 4802143 3396727 2589473 2463952 2526146 2979231 4123270 5377584
47461E377584O15531R6896l7357m74053j200871j133803J6099R76201P53241m1397
$$ 5377584 5993115 6090011 6052654 5578601 4377730 3243927 3260026 4236227 4989468 4948071
47451D948071m66478o19087q55480p86553q3418O14840N99759J56221j46545m50832
$$ 4948071 4481593 3862506 3007026 2220473 2137055 2751895 3351654 3507875 3361330 2910498
47441B910498j010605j364485j032999l53887J89065O68774R74871M42085p79310
$$ 2910498 1899893 535408 -497591 -851478 -662413 6361 981232 1423317 644007
47432F44007j185700o5413J035638O11224k61869K65189J502261J268233l13104
$$ 644007 -541693 -607106 428532 1039756 777887 1043076 2545337 3813570 3500466
47423C500466q84847K39945J061365L34707o13138m46880K00636M72217P59427
$$ 3500466 2615619 2855564 3916929 4251636 3638498 3191618 3392254 3864471 4623898
47414D623898J077434J49536k174667l544473k200668J25368O29656m43597m93681
$$ 4623898 5701332 5850868 3676201 131728 -2068940 -1943572 -1313916 -1757513 -2251194
47405b251194J295225K885490K428286M52154j235456j445614k49650J197040
$$ -2251194 -955969 1929521 4357807 4809961 3574505 2128891 1879241 3076281
47397C076281J460114K97205r26454j029769n61963n54592o05377K76483J536029
$$ 3076281 4536395 4833600 3907146 2877377 2315414 1760822 1155445 1431928 2967957
47388B967957J577014K23656j009888j174536q82462q75616j006989r40197o82202
$$ 2967957 4544971 4768627 3758739 2584203 1701741 826125 -180864 -1121061 -1803263
47379a803263k03909M22556N14137m02725j318900p02678J155412K240990J541835
$$ -1803263 -2007172 -1584616 -1070479 -1473204 -2792104 -3494782 -2339370 -98380 1443455
47370A443455J90572n23510p24949q56955n29194M97904J341772J155153M47596
$$ 1443455 1634027 1110517 385568 -471387 -1000581 -502677 839095 1994248 2441844
47361B441844K32631N21272O24146L87731J63270m6151m59516p61799l67535N31325
$$ 2441844 2674475 3195747 3819893 4207624 4370894 4324743 3865227 3103428 2735893 3267218
47351C267218Q90626M0874j375896j994714j235787j8439L03841l37377o57008
$$ 3267218 4157844 4198718 2822822 828108 -407679 -426118 -122277 -459654 -1116662
47342a116662O7024Q15825L72857o33348m97491R90569K123119J613580J46370
$$ -1116662 -1049638 -233813 139044 -494304 -991795 -1226 2121893 3735473 3881843
47333C881843q16183p84535l24746j51826n45630j126840j098294k79568K93728
$$ 3881843 3065660 2281125 1956379 1804553 1258923 132083 -966211 -1245779 -952051
47324i52051l29539j415156j476077o02707k96140r15695j079655m0468J159835
$$ -952051 -1281590 -2696746 -4172823 -4775530 -5071670 -5987365 -7067020 -7107488 -5947653
47315e947653J634412J948092K457940K140172M88364r52422o46337N08725N92440
$$ -5947653 -4313241 -2365149 92791 2232963 2721327 1768905 1122568 1631293 2223733
47306B223733l95205q57479l09600R8263l52584r62754q84038k38032K17315j54730
$$ 2223733 1828528 971049 661449 759712 407128 -555626 -1439664 -1677696 -1460381 -1615111
47296a615111j298666k111439j216507J170155K884869K321012N59343j83051
$$ -1615111 -2913777 -5025216 -6241723 -5071568 -2186699 134313 693656 510605
47288E10605M60479R71330M00136o49195j279219j183811l89957O87854J104931
$$ 510605 971084 1942414 2342550 1693355 414136 -769675 -1159632 -471778 633153
47279F33153M17450m33556m06674p3275o97202k050852k701612k155965j101782
$$ 633153 1050603 617047 210373 137098 -560104 -2610956 -5312568 -7468533 -8570315
47270h570315J59883J694924K585903J713389k9953m90310M60447O65888o87602
$$ -8570315 -8410432 -6715508 -4129605 -2416216 -2446169 -2936479 -2476032 -1810144 -2497746
47261b497746j594864m96278J207607J410275K14539r80982j618609j557518k04055
$$ -2497746 -4092610 -4588888 -3381281 -1971006 -1756467 -2737449 -4356058 -5913576 -6117631
47252f117631J995692K749335Q70365j258594p21714J446514J732848m37218k027469
$$ -6117631 -4121939 -1372604 -502239 -1760833 -2482547 -1036033 696815 259597 -1767872
47243a767872j373842m71165j093928j697983l18698J704453J570341o30674k015275
$$ -1767872 -3141714 -3612879 -4706807 -6404790 -6723488 -5019035 -3448694 -4079368 -6094643
47234f094643r54818J217036K547928K556161J691754M56911l75850j14385O46986
$$ -6094643 -7049461 -5832425 -3284497 -728336 963418 1420329 1044479 930094 1577080
47225A577080M41491q33099j456079n05200N15682m605j109219p50795Q46435
$$ 1577080 2018571 1185472 -270607 -775807 -260125 -264730 -1373949 -2124744 -1278309
47216a278309J446160K70548r35220p22356J38408L88875K27141L41050L76430
$$ -1278309 167851 438399 -496821 -1219177 -1080769 -691894 -464753 -123703 252727
47207B52727k26181q44729n57687K50384N08807J92644J49107N57322P96508O03107
$$ 252727 26546 -818183 -1375870 -1125486 -616679 -424035 -274928 282394 1078902 1682009
47197A682009K23642l35303j075172j282168k73840J236421J720567P79671n61650
$$ 1682009 1905651 1570348 495176 -786992 -1060832 175589 1896156 2675827 2114177
47188B114177j396541j617970j185011n4170J045732J061332R3761o74452o71822
$$ 2114177 717636 -900334 -2085345 -2139515 -1093783 -32451 61310 -613142 -1284964
47179a284964m26515l08740p8231J72505k0979l97386k34375J33751l13664j149163
$$ -1284964 -1711479 -2020219 -2098450 -1925945 -1946924 -2344310 -2578685 -2444934 -2758598 -3907761
47169c907761o66229J209615K231895J093204n98854r68296n88809p86670r41569
$$ -3907761 -4573990 -3364375 -1132480 -39276 -638130 -1606426 -2195235 -2981905 -3923474
47160c923474K49600J960958K120638N89804p33705p78885k91832j9823K25187
$$ -3923474 -3673874 -1712916 407722 997526 263821 -515064 -806896 -826719 -601532
47151f01532N31357N70749N56415J047639J601143J076687m34730j421012j081482
$$ -601532 -70175 500574 1056989 2104628 3705771 4782458 4347728 2926716 1845234
47142A845234k93673K8600J94029O50502Q54168J85068q33218j202395q56434
$$ 1845234 1551561 1580161 1774190 2424692 3278860 3463928 2630710 1428315 571881
47133E71881n66210p00303p94579l48152M27329Q25120M81864j66562m19105j94023
$$ 571881 5671 -694632 -1489211 -1837363 -1410034 -584914 -103050 -269612 -688717 -882740
47123h82740K8298J36380N42689J132674R53724l85089j822371k211245j784857
$$ -882740 -854442 -718062 -175373 957301 1911025 1525936 -296435 -2507680 -4292537
47114d292537j244281k94111J449588K822704K274808M32205m45304K90042Q81323
$$ -4292537 -5536818 -5830929 -4381341 -1558637 716171 1148376 703072 993114 1874437
47105A874437N4843j192380j519551j250107j269757j251541l64005J080583J961057
$$ 1874437 1929280 736900 -782651 -2032758 -3302515 -4554056 -4918061 -3837478 -1876421
47096a876421J873959J349718Q89986N65894L18575J02884o5739R180L84037N33571
$$ -1876421 -2462 1347256 2237242 2803136 3121711 3224595 3158856 3168036 3552073 4085644
47086D085644n5311q70117r53121n24430p08535j429913j227670K08731J105223
$$ 4085644 4030333 3160216 2207095 1682665 974130 -455783 -1683453 -1474722 -369499
47077c69499L25039o63943j04398J205727J286013J16173o84079o08827n21939
$$ -369499 -44460 -708403 -812801 392926 1678939 1795112 1111033 502206 -19733
47068a9733n34952J22866J093271R52155l08290q91488K4950R86081O75850n4615
$$ -19733 -554685 -431819 661452 1613607 1305317 413829 438779 1424860 2100710 2046095
47058B046095J65308Q99605P09618n61101j688558j747956p66869P94412K098374
$$ 2046095 2211403 3111008 3820626 3259525 1570967 -176989 -943858 -149446 1948928
47049A948928J959144J11611j786018j743725l0576J142820P05096J1274M06248
$$ 1948928 3908072 4019683 2233665 489940 459364 1602184 2307280 2318554 2724802
47040B724802R59731q931k031148k834297j469545M94205J271292R46166N28330
$$ 2724802 3684533 3675602 1644454 -1189843 -2659388 -2165183 -893891 52275 580605
47031E80605J76075m63693j010462q45622l91077m68539o24535L42296K115873
$$ 580605 756680 292987 -717475 -1563097 -1954174 -2422713 -3047248 -2704952 -589079
47022e89079K797783J604349N9793l05997J8513r7431l90885n4031L84106k17830
$$ -589079 2208704 3813053 3872846 3566849 3585362 3487931 3097046 3043015 3427121 3209291
47012C209291j513356j996832j275453m75245l68018n27281m92709m19811l02465
$$ 3209291 1695935 -300897 -1576350 -2051595 -2419613 -2946894 -3439603 -3859414 -4161879
47003d161879J96585P99586O80258j32929n67240j79640J23423l53116q86674
$$ -4161879 -3965294 -3165708 -2485450 -2618379 -3185619 -3365259 -3241836 -3594952 -4481626
46994d481626m78845O50765J525657J707595J389677P56551m5568p16848j120549
$$ -4481626 -4960471 -4309706 -2784049 -1076454 313223 1069774 1024206 307358 -813191
46985h13191j410827j537908j203051n72000k54235k36777K10399J100833J335630
$$ -813191 -2224018 -3761926 -4964977 -5536977 -5791212 -6027989 -5817590 -4716757 -3381127
46976c381127M75859k81286N0242N67812L4870q77387o45574M36960O00133n41393
$$ -3381127 -2905268 -3186554 -3136312 -2568500 -2533630 -3411017 -4056591 -3619631 -3019498 -3560891
46966c560891j390078q90364J07078N63505P68958J316622J838076J763937J447868
$$ -3560891 -4950969 -5841333 -5734255 -5170750 -4401792 -3085170 -1247094 516843 1964711
46957A964711J541024J808720J417727J17307j398310k097335j429780K7814P68109
$$ 1964711 3505735 5314455 6732182 6849489 5451179 3353844 1924064 1951878 2719987
46948B719987r2640j501292j688619o73575j82383q60650j308117o22832l6399
$$ 2719987 2627347 1126055 -562564 -1236139 -1418522 -2279172 -3587289 -4210121 -4246520
46939d246520o56703j280505l45683J270027J635041R87129J048309J661840R40283
$$ -4246520 -4903223 -6183728 -6529411 -5259384 -3624343 -2637214 -1588905 72935 1013218
46930A013218j134195k147634j048010J97556r030l57903P32325K093113J712195
$$ 1013218 -120977 -2268611 -3316621 -3119065 -3128095 -3485998 -2753673 -660560 1051635
46921A051635J31588n08285J59618P15272O68123P71599R30358K24022r15763
$$ 1051635 1183223 674938 834556 1549828 2217951 2989550 3919908 4143930 3228167
46912C228167r13134J88721M42670q62667j974868j563100p32688q14780j051156
$$ 3228167 2315033 2503754 2946424 2083757 108889 -1454211 -2186899 -3001679 -4052835
46903d052835k25095R25463R11031L1683k87713Q1213K41605L64302J289007K282819
$$ -4052835 -4277930 -3352467 -2441436 -2409753 -2697466 -2616253 -2374648 -2010346 -721339 1561480
46893A561480J590674m87156j419298j58302J128890L33966j466618j913179r56404
$$ 1561480 3152154 2664998 1245700 1087398 2216288 2550254 1083636 -829543 -1785947
46884a785947m09643p24162n49552N58814J220326N96861j96248m9919K91715
$$ -1785947 -2195590 -2919752 -3469304 -2910490 -1690164 -1093303 -1289551 -1339470 -1047755
46875a047755k99691j138146o57968R94745K006974J489187M41311j31722n09070
$$ -1047755 -1347446 -2485592 -3143560 -2148815 -141841 1347346 1788657 1656935 1147865
46866A147865j003534q91497K66346J333558J015294j53480o78493m27291m53272
$$ 1147865 144331 -747166 -480820 852738 1868032 1714552 1036059 608768 155496
46857A55496p88521l02829J017325J553168N28353o93166p71940k92875k37669
$$ 155496 -633025 -935854 81471 1634639 2162992 1469826 697886 405011 167342
46848A67342o0796R57426J611607K47449k159746k714558n84631J769829J965394
$$ 167342 106546 1063972 2675579 2923028 763282 -1951276 -2535907 -766078 1199316
46839A199316N47747m43127l09276J41297L22697M24571N64446M30459j60922
$$ 1199316 1747063 1303936 994660 1135957 1458654 1883225 2447671 2878130 2717208
46830B717208q68701j049291k94911R92294J598385O50504j108855j888778r61103
$$ 2717208 1848507 799216 504305 1496599 3094984 3745488 2636633 747855 -213248
46821b13248M82526R34987L24132l27911l54211M4183K83620q9802r65489j440677
$$ -213248 269278 1204265 1528397 1200486 846275 890458 1174078 1084276 118787 -1321890
46811a321890o47224Q42163J272680j2572j416476j102206N91797J851842J890872
$$ -1321890 -1969114 -1126951 145729 133157 -1283319 -2385525 -1793728 58114 1948986
46802A948986J416413R44146J78483p87820j095322m98160k2716n26263j394693
$$ 1948986 3365399 4309545 4488028 3700208 2604886 2106726 2084010 1557747 163054
46793A63054j444706n70716K87639N04598L50948K92573L33709K18068p7811k68644
$$ 163054 -1281652 -1852368 -1564729 -1060131 -709183 -416610 -82901 135167 57356 -211288
46783b11288q6681L91741P41176N70167l2310n15206m46305l9537O2905l79581
$$ -211288 -297969 93772 834948 1405115 1372805 857599 411294 371757 434662 55081
46773E5081p65750l52266O06585R14422j9126j159177j079637P2543Q27329N75029
$$ 55081 -710669 -1062935 -456350 458072 438946 -720231 -1799868 -1727325 -899996 -324967
46763c24967K63945N36238N57719l13528r33646l624J482579J301714o80804k186971
$$ -324967 -61022 475216 1032935 719407 -214239 -217863 1264716 2566430 1885626 -301345
46753c01345j830328q70755q55204j189106m10590J275426K303856K003617J119436
$$ -301345 -2131673 -3002428 -3857632 -5046738 -5457328 -4181902 -1878046 125571 1245007
46744A245007L60642k79687q19231j039460j016085r58653n46414N67152J617826
$$ 1245007 1605649 1325962 506731 -532729 -1548814 -2507467 -3053881 -2486729 -868903
46735h68903J342754k6357p07067J10573R73382L52061j022395j360907n55345
$$ -868903 473851 447494 -259573 -149000 824382 1176443 154048 -1206859 -1762204
46726a762204p5582m56942o48970o3978M14202J36129o5303O15699J332462P95846
$$ -1762204 -1837786 -2294728 -2943698 -3007676 -2593474 -2457345 -2522648 -1906949 -574487 221359
46716B21359n72608j071726l7849J465619K178643J803511O91418n66715j184786
$$ 221359 -351249 -1422975 -1460824 4795 2183438 3986949 4678367 4111652 2926866
46707B926866q32855l34989p11689j491506j211095K03808J027625L00479o93153
$$ 2926866 2094011 1759022 1047333 -444173 -1655268 -1451460 -423835 -123356 -816509
46698h16509n47154K9956m01341j405465j323099j04951M71358l69855j118545
$$ -816509 -1363663 -1333707 -1735048 -3140513 -4463612 -4568563 -4097205 -4467060 -5585605
46689e585605k56512J519383K377323J810454R17787O22306O74462N12034K83581
$$ -5585605 -5842117 -4322734 -1945411 -134957 782830 1405136 2079598 2591632 2875213
46680B875213N31704J186250J411592N81932q88481j943483j969474j234300m33087
$$ 2875213 3406917 4593167 6004759 6586691 5698210 3754727 1785253 550953 117866
46671A17866j82807p63855j753651k021561q86703O82987R95247m2110o96910
$$ 117866 -64941 -828796 -2582447 -4604008 -5490711 -4807724 -3812477 -3854587 -4551497
46662d551497j27Q06478L84410m70297k31366P10427O96623l81622r09767j97374
$$ -4551497 -4551624 -3745146 -3360736 -3831033 -4062399 -3351972 -2655349 -3036971 -3946738 -4144112
46652d144112O04724O06830M50170P81828R65950K80824o85300q02724J43521
$$ -4144112 -3539388 -2932558 -2482388 -1700560 -734610 -453786 -1139086 -1941810 -1798289
46643a798289J457079K317684K041963L88438j702924k403290q70611J543208
$$ -1798289 -341210 1976474 4018437 4406875 2703951 300661 -569950 973258
46635I73258K590828J393102r43367k596337k575600j345194k19747j5068l51420
$$ 973258 3564086 4957188 4013821 1417484 -1158116 -2503310 -2723057 -2738125 -3089545
46626c089545m95892m36817n00134m27677J67501Q38266R66052R94437J620658
$$ -3089545 -3585437 -4022254 -4522388 -4950065 -4782564 -3944298 -2978246 -1983809 -363151
46617c63151K157331J423893J1105l77494K02224K7114j133586j556126q13329
$$ -363151 1794180 3218073 3229178 2851684 3053908 3081022 1947436 391310 -422019
46608d22019o25357j457409j331162M19180J396036L20673k77073J486600K833091
$$ -422019 -1047376 -2504785 -3835947 -3416767 -2020731 -1700058 -1977131 -490531 2342560
46599B342560P10632k371569j751971J713733K756177M1035k099418j042166L54410
$$ 2342560 3053192 681623 -1070348 643385 3399562 3440597 1341179 299013 653423
46590F53423o96202k298076j726058j64087j92098j219823r09079O06642J183897
$$ 653423 -42779 -2340855 -4066913 -4231000 -4423098 -5642921 -6552000 -5945358 -4761461
46581d761461L01608n83282o42324k41205N59836J892116K841936K296138Q17034
$$ -4761461 -4459853 -5043135 -5685459 -5926664 -5366828 -3474712 -632776 1663362 2480396
46572B480396J1345K49251M89769J08368n11106r81175j235830j087408n79901
$$ 2480396 2491741 2740992 3230761 3339129 2828023 1846848 611018 -476390 -1056291
46563a056291m55680j217174k134830k171684j331112j29239J403306K950405
$$ -1056291 -1511971 -2729145 -4863975 -7035659 -8366771 -8496010 -7092704 -4142299
46555d142299L139110J245253j042118j438979k07179M34639k61279q29317l32628
$$ -4142299 -1003189 242064 -800054 -2239033 -2446212 -2011573 -2272852 -3102169 -3434797
46546c434797K76422O1358m59036n21626k84277k1831N77028J549257K136455
$$ -3434797 -3158375 -3097017 -3556053 -4077679 -4361956 -4383787 -3806759 -2257502 -121047
46537a21047J798801R04639j7314q12377j206594q58456k25460k01793n31882
$$ -121047 1677754 2582393 2565079 1752702 546108 -312348 -537808 -739601 -1271483
46528a271483N6177J580310K174248O98236j351755j808146o89629K61147J33814
$$ -1271483 -1215306 365004 2539252 3237488 1885733 77587 -612042 -350895 -217081
46519b17081m92807r87805j314528j332600p24620J88122N20365J2091n19826
$$ -217081 -709888 -1697693 -3012221 -4344821 -5069441 -4881319 -4360954 -4348863 -4868689
46510d868689k03554Q26522J594602J325532K92618l56476J39761J088666J092184
$$ -4868689 -5072243 -4245721 -2651119 -1325587 -1032969 -1389445 -1249684 -161018 931166
46501I31166j0700p75141j84772Q31904P56349l62755j171711r64593k41722L93387
$$ 931166 920466 145325 -39447 792457 1548806 1186051 14340 -950253 -1191975 -798588
46491g98588P20889M48240m75689j082163k70313J284747J542264j1568j310020
$$ -798588 -77699 370541 -105148 -1187311 -1457624 -172877 1369387 1357819 47799
46482D7799n54820J113659J237856m60032j890622j655261n83313N1586K69614
$$ 47799 -507021 606638 1844494 1384462 -506160 -2161421 -2744734 -2693148 -2423534
46473b423534N71806O38467j8713q35088q19743p3593M26921M41144P17736J461330
$$ -2423534 -1851728 -1213261 -1231974 -2067062 -2886805 -2960398 -2533477 -2092333 -1374597 86733
46463H6733J673252O17626q91527j471337r26963k04456Q4072J75953K74319J04501
$$ 86733 1759985 2377611 1486084 14747 -912216 -1116672 -1032600 -856647 -582328 -477827
46453d77827l75725o20921l47808j43254n91375j201198r79325N2004P25638L29376
$$ -477827 -853552 -1474473 -1822281 -1965535 -2556910 -3758108 -4737433 -4685429 -3959791 -3630415
46443c630415l57815j18724J054691J999822J913182J187539O06377K86806j93350
$$ -3630415 -3988230 -4106954 -3052263 -1052441 860741 2048280 2654657 2941463 2748113
46434B748113r61041j620695j793664j525745j112690p40685l53994K09915R05343
$$ 2748113 1787072 166377 -1627287 -3153032 -4265722 -5006407 -5360401 -5150486 -4245143
46425d245143J269081P85456l39858j088033p23367K30330O26871J94293k31657
$$ -4245143 -2976062 -2190606 -2530464 -3618497 -4341864 -4111534 -3484663 -3290370 -3522027
46416c522027j6250M29261M38649J71099L56042J160094J785795J338926O110
$$ -3522027 -3538277 -3109016 -2670367 -2499268 -2143226 -983132 802663 2141589 2147699
46407B147699q02420J41283K138732K794038P06990k440884l558833j865532K75661
$$ 2147699 1345279 1486562 3625294 6419332 7126322 4685438 1126605 -738927 -463266
46398d63266N32564o62160j261681l77437J122106K027990J776812N60586o26478
$$ -463266 69298 -592862 -1854543 -2231980 -1109874 918116 2694928 3255514 2629036
46389B629036n68810O47736J267545J2471j994495k623089j539096k63103K07414
$$ 2629036 2060226 2707962 3975507 3987978 1993483 -629606 -2168702 -2431805 -2224391
46380b224391K84962L52093M4237o48751q96512k05628Q74332J606743J750546
$$ -2224391 -1939429 -1587336 -1543099 -2191850 -3088362 -3293990 -2419658 -812915 937631
46371I37631J181011j13921j337880j286591N3174J244621J212652M13415k31393
$$ 937631 2118642 2004721 666841 -619750 -566576 678045 1890697 2304112 2072719
46362B072719n59527p42136n98115j01913J48424k84574r30153r99599l02343
$$ 2072719 1513192 771056 172941 71028 219452 -65122 -995275 -1994874 -2297217
46353b297217P23627J380735J028289k23060j148150p56097P2262k66062j264541
$$ -2297217 -1573590 -192855 835434 612374 -535776 -1291873 -1219611 -1485673 -2750214
46344b750214o33864J895171L357714J631753j232047j823711o8117J253274P39345
$$ -2750214 -3384078 -1488907 1868807 3500560 2268513 444802 376685 1629959 2369304
46335B369304l82706q82699r57701q63837k42402O92469R84916M56691j1773o5684
$$ 2369304 1986598 1103899 146198 -717639 -960041 -267572 717344 1174035 1162262 1096578
46325A096578l47792j059989j476711j298714j093020r40160j18162J240213J669360
$$ 1096578 748786 -311203 -1787914 -3086628 -4179648 -5119808 -5237970 -3997757 -2328397
46316b328397M87764q70348p45593M99021J251839R31540L50072K52906N22797
$$ -2328397 -1840633 -2710981 -3456574 -2957553 -1705714 -774174 -424102 -171196 351601
46307C51601O48754K61872o28035j438374j348896k69669Q61498J131174O26171
$$ 351601 1000355 1262227 634192 -804182 -2153078 -2422747 -1561249 -430075 196096
46298A96096O3797m9035M15067J239405J671381R11507o71739j551498r36170
$$ 196096 259893 210858 625925 1865330 3536711 4448218 3776479 2224981 1288811
46289A288811R4890K00714k32937O7056R20413P43070r14115k314009j743794
$$ 1288811 1383701 1584415 1351478 1418534 2338947 3082017 2167902 -146107 -1889901
46280a889901J89818J423104J061959R3752m23162p28602j350828j609561l57405
$$ -1889901 -1700083 -276979 784980 878732 455570 -273032 -1623860 -3233421 -3590826
46271c590826J881694K858580J357243r80073j633559l63661Q71100P72102k5369
$$ -3590826 -1709132 1149448 2506691 1526618 -106941 -470602 400498 1172600 1147231
46262A147231n51997p64402p19544k6J165568J477308L52897q74318p31876K80001
$$ 1147231 595234 -169168 -888712 -888738 276830 1754138 2107035 1232717 500841 780842
46252G80842O52730K10578j0100K48682K18563k73353n03281l06850l60960p05045
$$ 780842 1433572 1644150 1634050 1882732 2101295 1827942 1324661 1017811 656851 -48194
46242d8194m34316N80923J043181J21775j163472j446898r34166o63470o30202
$$ -48194 -482510 98413 1141594 1263369 99897 -1347001 -2281167 -2944637 -3574839
46233c574839l8167R54207J184984K75753p52679r74748o45318l21609J78425
$$ -3574839 -3613006 -2658799 -1473815 -1198062 -1950741 -2925489 -3570807 -3892416 -3713991
46224c713991J189260K167714K134206R96460k39656o21603j72085L73220M00043
$$ -3713991 -2524731 -357017 1777189 2773649 2533993 1912390 1740305 2113525 2513568
46215B513568p4057n01366m02460L6032J40157l12320o63575k44359O64039J246058
$$ 2513568 2439511 1938145 1535685 1571717 1711874 1399554 735979 491620 1155659 2401717
46205B401717J215041Q07906M1903j101616j926984j615362o54442m07977r59095
$$ 2401717 3616758 4424664 4466567 3364951 1437967 -177395 -831837 -1239814 -2198909
46196b198909q45162M07068J120776Q4179j182876n95409J168906J695970N56236
$$ -2198909 -3044071 -2637003 -1516227 -1432048 -2614924 -3210333 -2041427 -345457 210779
46187B10779m13373l99732n93390j399674j242677O33508K305940J764825j79345
$$ 210779 -202594 -602326 -1195716 -2595390 -3838067 -3204559 -898619 866206 686861
46178F86861j270148r17756k70697q7005k00606m88076q28438n71720N60220J523778
$$ 686861 -583287 -1501043 -1771740 -1858745 -2059351 -2547427 -3375865 -3947585 -3387365 -1863587
46168a863587J271785M90148N20701J049436O13379q20245j644720j111875k65429
$$ -1863587 -591802 -101654 419047 1468483 2081862 1261617 -383103 -1494978 -1760407
46159a760407J5771K53599R87951J563097J135693j03139j373289k123590j997818
$$ -1760407 -1744636 -1491037 -503086 1060011 2195704 2092565 719276 -1404314 -3402132
46150c402132r91578l9276k76104j200984q83536J235585L110312K771021J032014
$$ -3402132 -4393710 -4432986 -4709090 -5910074 -6793610 -5558025 -2447713 323308 1355322
46141A355322J03336M60709P88229M64564K36337M32320K67104n84402j112344
$$ 1355322 1458658 1919367 2707596 3172160 3408497 3840817 4107921 3523519 2411175
46132B411175m44762P43736J106975L59678n60036p86632m78786n24831j437469
$$ 2411175 1966413 2710149 3817124 4176802 3616766 2830134 2351348 1826517 389048
46123C89048k465214k078328J41330K392956K432653M94797q04415M0756J385341
$$ 389048 -2076166 -4154494 -4013164 -1620208 812445 1307242 502827 543583 1928924
46114A928924R44418q66420j793189j247895q34222j320376j299716K45428J930023
$$ 1928924 2873342 2006922 213733 -1034162 -1868384 -3188760 -4488476 -4243048 -2313025
46105b313025J991083R66215N86323Q87978M11742j070006k038557j630219p49762
$$ -2313025 -321942 644273 1230596 2118574 2530316 1460310 -578247 -2208466 -2958228
46096b958228k79775J93133J075101J613426J113447K43432L478J82004m6978
$$ -2958228 -3238003 -3044870 -1969769 -356343 757104 1000536 1004014 1186018 1139040
46087A139040n69363m97922L78614J231002J189960J63038j125688j564026o01681
$$ 1139040 569677 71755 450369 1681371 2871331 3034369 1908681 344655 -257026
46078b57026Q63007J200388O0401j169936j401872j212599j363447j220628j1135
$$ -257026 605981 1806369 1866770 696834 -705038 -1917637 -3281084 -4501712 -4512847
46069d512847J327160J191515l22470j599987j640765o60785Q91436K415116K801296
$$ -4512847 -3185687 -1994172 -2316642 -3916629 -5557394 -6218179 -5326743 -2911627 -110331
46060a10331J675064N08943O95150J076544l59304k702708k813573q5575K336375
$$ -110331 1564733 2073676 2768826 3845370 3486066 783358 -2030215 -2115790 220585
46051B20585K042139M03479k55212q6266m36686j130002j195331q93847r31810
$$ 220585 2262724 2666203 2410991 2324725 1888039 758037 -437294 -1331141 -2262951
46042b262951p60112L41884J429540J143200K6216m07863k64223p78479j653936
$$ -2262951 -3023063 -2681179 -1251639 -108439 -82223 -490086 -754309 -1532788 -3186724
46033c186724j212977O63555J908841J174776l65770q77071j55703P45121J128459
$$ -3186724 -4399701 -3736146 -1827305 -652529 -1018299 -1895370 -2051073 -1305952 -177493
46024a77493J020913N80406r3307p72810j115203q52113q0195N13660J73247q14512
$$ -177493 843420 1423826 1330519 557709 -557494 -1409607 -1489802 -976142 -802895 -1617407
46014a617407j160589l18391N86272M27334k08550k21205k3617o30022j325847
$$ -1617407 -2777996 -3096387 -2510115 -2082781 -2291331 -2512536 -2536153 -3166175 -4492022
46005d492022m28106J658422K434214Q97665r90078j362373r58210j206515j580665
$$ -4492022 -4920128 -3261706 -827492 70173 -919905 -2282278 -3240488 -4447003 -6027668
45996f027668p70138O77743R98869J9400o11181K8446J034373J408625J399001
$$ -6027668 -6797806 -6120063 -5121194 -5101794 -5712975 -5684529 -4650156 -3241531 -1842530
45987a842530J499419J280680J21662j507253k330253j681552j64100J009390
$$ -1842530 -343111 937569 1059231 -448022 -2778275 -4459827 -4623927 -3614537
45979c614537J071249K52024m96077m54265Q1214K20409k16318k87848P46722
$$ -3614537 -2543288 -2291264 -2787341 -3241606 -3160392 -2939983 -3156301 -3444149 -2697427
45970b697427K098546K208352Q05544o14530o82461K07822P13606L82242j33928
$$ -2697427 -598881 1609471 2415015 1800485 1118024 1325846 2039452 2421694 2287766
45961B287766l26297l57346m33131n03148n70593n07765K79485J927798K965080
$$ 2287766 1961469 1604123 1170992 667844 97251 -410514 -131029 1796769 4761849
45952D761849J606409j431312l094192j908909j50837o21784k561574k789725
$$ 4761849 6368258 4936946 1842754 -66155 -216992 -838776 -3400350 -6190075
45944f190075k93623K477634K982276J381878n06840j501213j508124q13768J33838
$$ -6190075 -6483698 -4006064 -1023788 358090 -148750 -1649963 -3158087 -3971855 -3838017
45935c838017P42750P29193L68426J04240J49601M15487M93501o9002j041960
$$ -3838017 -3095267 -2366074 -1997648 -1893408 -1743807 -1328320 -834819 -903821 -1945781
45926a945781j457594q74966j46164q2409k8337R85755K224287K014723L65333
$$ -1945781 -3403375 -4278341 -4424505 -4506914 -4535251 -3549496 -1325209 689514 1054847
45917A054847r06109p83923p7347M64866J215054K161342K130373O29451r47098
$$ 1054847 148738 -635185 -712532 -247666 967388 3128730 5259103 5888554 4941456
45908D941456j180416n92094n62539j238782j725193j593218j047093k16949O42808
$$ 4941456 3761040 3168946 2606407 1367625 -357568 -1950786 -2997879 -3214828 -2572020
45899b572020Q27917J02632n49694q6756J103073J779188J505784Q60700L75292
$$ -2572020 -1744103 -1641471 -2191165 -2277921 -1174848 604340 2110124 2970824 3346116
45890C346116J04609o0976l44377r45253j383470o45710J237041K493969J567536
$$ 3346116 3450725 3389749 3045372 2100119 716649 70939 1307980 3801949 5369485
45881E369485p33594k131317j605860j94213O92223P04568L45224J71474L07362
$$ 5369485 4635891 2504574 898714 704501 1396724 2101292 2446516 2617990 2925352
45872B925352L14459k66456r92456p85811M08573J145145M81177m95342l16779
$$ 2925352 3239811 2973355 1980899 1195088 1603661 2748806 3229983 2734641 2417862
45863B417862N24126L89486q59298j662037j099135K7662N55249J98066o57887
$$ 2417862 2941988 3331474 2472176 810139 -288996 -261334 293915 491981 -165906
45854a65906j357146j184357j35258O99772N10978J17596O89538J617998J328496
$$ -165906 -1523052 -2707409 -2842667 -2142895 -1631917 -1514321 -824783 793215 2121711
45845B121711n6518q03527l69113o5695n56395q05209k69062k5838n57398l97279
$$ 2121711 2065193 1261666 892553 826858 270463 -534746 -803808 -829646 -1387044 -1784323
45835a784323J381847K966775K072146o47560k429465k018471o23468L35405O25669
$$ -1784323 -402476 2564299 4636445 3988885 1559420 -459051 -1082519 -747114 -121445
45826a21445M35254j16139m73300j1801Q08590P94807k42589j183275j264122
$$ -121445 313809 197670 -275630 -287431 521159 1315966 1073377 -109898 -1374020
45817a374020r60863q63014p32783j93955N37750J121541J466463J216759r9567
$$ -1374020 -2334883 -3197897 -3930680 -4124635 -3586885 -2465344 -998881 217878 118311
45808A18311j739392j737943N54999K836578K377725k33527j729860o65302P23740
$$ 118311 -1621081 -3359024 -2804025 32553 2410278 2176751 446891 -218411 505329
45799E05329L6698j731891j852016L5856J579252J236671J14295j76233J96076
$$ 505329 542027 -1189864 -3041880 -3006024 -1426772 -190101 -75806 -252039 -55963
45790e5963Q6123o90556j315667j221349m89646N64520J496925J802046J458569
$$ -55963 30160 -660396 -1976063 -3197412 -3687058 -3122538 -1625613 176433 1635002
45781A635002J014749O91294k32j190400j914698j268825K00912J087160P48556
$$ 1635002 2649751 3341045 3340813 2150413 235715 -1033110 -832198 254962 1003518
45772A003518l00008j153328j048295K37164J779088K013337O91009m86489j77958
$$ 1003518 703510 -449818 -1498113 -1260949 518139 2531476 3222485 2735996 2558038
45763B558038O38813L62374n93854o85482j1887k9219q04478q63311J04796O48339
$$ 2558038 3196851 3559225 2965371 2279889 2268002 2238783 1434305 570994 675790 1324129
45753A324129Q9534m92139m39345n79738j274341j454111o79246k22725q37551
$$ 1324129 1413663 921524 482179 -97559 -1371900 -2826011 -3505257 -3727982 -4565533
45744d565533j269942m22722P44214J075166J270372K159683K476862P09858j863509
$$ -4565533 -5835475 -6258197 -5513983 -4438817 -3168445 -1008762 1468100 2177958 314449
45735C14449k489455q41550O96523N57505l07556m52175K00077R70673J445571
$$ 314449 -2175006 -3016556 -2320033 -1762528 -2070084 -2522259 -2322182 -1351509 94062
45726I4062J373025O15228m26053j102462j294920j220909p77886M8575N97249
$$ 94062 1467087 2082315 1656262 553800 -741120 -1962029 -2739915 -2691340 -2094091
45717b094091M62782M89618J473252K378679J571498m16274j291815l31269O61571
$$ -2094091 -1631309 -1141691 331561 2710240 4281738 3865464 2573649 2242380 2903951
45708B903951K92481l88752J79250J559884K039815J017022m74542j223920j040397
$$ 2903951 3196432 2807680 2986930 4546814 6586629 7603651 7129109 5905189 4864792
45699D864792o78628r23431j580940j525670k68619R15672M59617j161956j937716
$$ 4864792 4186164 3262733 1681793 156123 -112496 803176 1262793 100837 -1836879
45690a836879j156387j71087m2004j07797L98545Q94918O18555n6394n14169r21354
$$ -1836879 -2993266 -3164353 -3206357 -3314154 -2915609 -2020691 -1402136 -1458530 -1972699 -2894053
45680b894053j295748p83501Q41633K063798J517324J53941l5684J160956K170742
$$ -2894053 -4189801 -4973302 -4131669 -2067871 -550547 -396606 -432290 728666 2899408
45671B899408J934056O85824j070317k680320k815253q07329J478977J208201
$$ 2899408 4833464 5519288 4448971 1768651 -1046602 -1853931 -374954 833247
45663H33247j484856l121434j415394J627972K598043J217231P9698O44198J621940
$$ 833247 -651609 -3773043 -5188437 -3560465 -962422 254809 334507 978705 2600645
45654B600645J424875L31945n13337q93557j234853j368992p95509J01699K29257
$$ 2600645 4025520 4357465 3844128 2950571 1715718 346726 -448783 -347084 -117827
45645a17827o76538j564369j463390o62665l3344K20902M87525Q46844J027857
$$ -117827 -794365 -2358734 -3822124 -4484789 -4518133 -4297231 -3809706 -2962862 -1935005
45636a935005J067080J230737J321769Q43744n9900o01427m79801k75885m62627
$$ -1935005 -867925 362812 1684581 2528325 2468425 1866998 1387197 1111312 648685
45627F48685p89640r90863j252896j450265p93865R45493K576790K812820J916309
$$ 648685 -140955 -1131818 -2384714 -3834979 -4628844 -3683351 -1106561 1706259 3622568
45618C622568J025917L75326n43715j368387r86809N08692J451772Q13296l81905
$$ 3622568 4648485 5023811 4480096 3111709 2124900 2633592 4085364 4898660 4516755
45609D516755o28473N3947O31909P71984Q83134R08764L27041o71807j090089
$$ 4516755 3888282 3942229 4574138 5346122 6229256 7138020 7465061 6793254 5703165
45600E703165m59580N05689Q63904M28491m12227j193733j392795o40620N57588
$$ 5703165 5243585 5749274 6613178 7041669 6629442 5435709 4042914 3402294 3959882
45591C959882Q81098l14000j867721j949528k92279J384790J365802j63798j509059
$$ 3959882 4840980 4526980 2659259 709731 417452 1802242 3168044 3004246 1495187
45582A495187j436351l86106K64550p1942m61903L16909J959132K719814J649819
$$ 1495187 58836 -327270 -62720 -134662 -596565 -279656 1679476 4399290 6049109
45573F049109k1922n98914l89497j049277k570949k749449m48284K164564K152116
$$ 6049109 6027187 5428273 5038776 3989499 1418550 -1330899 -1779183 385381 2537497
45564B537497k84731k091229j262610J082505K628302K468861J347480L63252
$$ 2537497 2252766 161537 -1101073 -18568 2609734 5078595 6426075 6789327
45556F789327O1239K06927Q0911n79004r38731p9297J393814J765386M62761j140544
$$ 6789327 6850566 7057493 7138404 6559400 5620669 5541372 6935186 8700572 9163333 8022789
45546H022789j595404j071006o35133p76692j309117j894255j949815q74923Q34746
$$ 8022789 6427385 5356379 4721246 3944554 2635437 741182 -1208633 -2083556 -1248810
45537a248810J551469N54291p01836m91022P26924J109892J78727p74741q23691
$$ -1248810 302659 856950 155114 -335908 391016 1500908 1679635 904894 81203
45528H1203l75283R8859P62680J441390J347032M32863j45235L22662R95734Q66307
$$ 81203 -294080 -195221 567459 2008849 3355881 3788744 3643509 3966171 4961905 5828212
45518E828212L51540M77029J110616J145940J92146r06770j228308p24154p684
$$ 5828212 6179752 6656781 7767397 8913337 9105483 8198713 6970405 6246251 6238567
45509F238567K62484j55441p65343o31120M89005J525219J262531m1061r70208
$$ 6238567 6501051 6345610 5580267 4949147 5438152 6963371 8225902 8184841 7214633
45500G214633q28315l13224j93015k98013k83555m62228j075293j412407o70979
$$ 7214633 6386318 6073094 5880079 5582066 5298511 4836283 3760990 2348583 1677604
45491A677604O38172J172503N66450k25431m56541m11102m03792o8761O62238
$$ 1677604 2315776 3488279 4054729 3829298 3372757 2961655 2557863 2489102 3151340
45482C151340Q40578j73605j288644q69059Q31563J727673O57137j035133j263700
$$ 3151340 3991918 3818313 2529669 1660610 2492173 4219846 4876983 3841850 2578150
45473B578150K32734J825034K049801J014908j28026n54432m51723n15203r41422
$$ 2578150 2810884 4635918 6685719 7700627 7572601 7018169 6566446 6051243 5109821
45464E109821j177953q19545l23481k81883l52790J78423R42910P99915k06095
$$ 5109821 3931868 3112323 2788842 2506959 2154169 2332592 3275502 4075417 3869322
45455C869322n54662M55872J442412J006968q9158k53397K95378j5716j354965
$$ 3869322 3314660 3770532 5212944 6219912 6130754 5877357 6172735 6157019 4802054
45446D802054k037915j057773N38722J320561J188586P93904M09154J48566L51803
$$ 4802054 2764139 1706366 2245088 3565649 4754235 5548139 5957293 6105859 6457662
45437F457662R07676R38928m4618j307452j908956j881827j627578r14569M36646
$$ 6457662 7365338 8304266 8259648 6952196 5043240 3161413 1533835 619266 1055912
45428A055912J455077R53867n82822j318960m20149J012503J620177J324958P24752
$$ 1055912 2510989 3464856 2882034 1563074 1142925 2155428 3775605 5100563 5825315
45419E825315l0835r46795j445307q83701M08819J348370J292717N28785k67527
$$ 5825315 5794480 4847685 3402378 2518677 2927496 4275866 5568583 6097368 5829841
45410E829841n43122l8252R22727J408787Q26338j31896k24853N75976R38246
$$ 5829841 5286719 5248467 6171194 7579981 8406319 8274423 8049570 8625546 9563792
45401I563792P3244j164421j678604j682010j839166j625583k0394K347630L323684
$$ 9563792 9637036 8472615 6794011 5112001 3272835 1647252 1626858 3974488 7298172
45392G298172J940667k57269j321667j276360j386953j836636j510801l2673J243850
$$ 7298172 9238839 8981570 7659903 6383543 4996590 3159954 1649153 1616480 2860330
45383B860330Q88696n78535j126772K53621K070999K012267l7788j623004r03643
$$ 2860330 3749026 3170491 2043719 2297340 4368339 6380606 6342818 4719814 3816171
45374C816171P55252O74099j230061k291574j044013O98683O92482n67064j080567
$$ 3816171 4571423 5245522 4015461 1723887 679874 1378557 2071039 1503975 423408
45365D23408m20906L20031P87620J472778J949566J158230m30309r37595J58295
$$ 423408 2502 322533 1110153 2582931 4532497 5690727 5260418 4322823 4481118
45356D481118J178107Q47609N5353J7926K06212n14814j718925j926467q20081
$$ 4481118 5659225 6506834 6562187 6580113 6786325 6271511 4552586 2626119 1806038
45347A806038L81835O95122M88298O58797J328623J654656Q53319o00967j082068
$$ 1806038 2187873 2882995 3371293 4030090 5358713 7013369 7866688 7265721 6183653
45338F183653L33340K314583K562100P61284r55009r90727m02665r86802k373122
$$ 6183653 6516993 8831576 11393676 12154960 11199951 10209224 9806559 8819757 6446635
45329F446635k598893j084236N91482R72287M27880J41423L98913N27446J3770
$$ 6446635 3847742 2763506 3354988 4327275 4755155 4896578 5295491 5822937 5836707
45320E836707q55308j300624p85390M06174J292302J124916K17003l69563N5366
$$ 5836707 4981399 3680775 2895385 3301559 4593861 5718777 5935780 5566217 5621583
45311E621583J185066K122510K178831J329716J18772q44761j345313j501538
$$ 5621583 6806649 8929159 11107990 12437706 12556478 11711717 10366404 8864866
45303H864866j386848j003481n69958m02606m71148n14796n84925q57871q97407
$$ 8864866 7478018 6474537 5904579 5501973 5030825 4516029 3931104 3073233 2175826
45294B175826J0459J508922K134239J213087r7785m46813j39530l52358j150222
$$ 2175826 2186285 3695207 5829446 7042533 6944748 6497935 6358405 6006047 4855825
45285D855825j496929r28046m6732N69230R16665R81236N29298l36932j089332
$$ 4855825 3358896 2430850 2384118 2953348 3870013 4851249 5380547 5043615 3954283
45276C954283j342915j048513l09957M19080L32110p00203j429484n85875J262532
$$ 3954283 2611368 1562855 1252898 1671978 2004088 1303885 -125599 -711474 551058
45267E51058K314848J888920R50817L17603k34599p71586n96694M41757J255827
$$ 551058 2865906 4754826 5705643 6023246 5788647 5017061 4420367 4862124 6117951
45258F117951R84065J65919l75609q38514j634222k161168j606481m02977L20753
$$ 6117951 7102016 7267935 6892326 6053812 4419590 2258422 651941 248964 569717
45249E69717L72730M25916O09265M13267q0453j43533K51565K24633m74495q20089
$$ 569717 942447 1368363 1977628 2390895 2310442 2166909 2418474 2643107 2168612 1348523
45239A348523m8745J050653J213201M33582k84656n17339p44319j128792r52112
$$ 1348523 1299778 2350431 3563632 3997214 3712558 3195219 2450900 1322108 369996
45230C69996L19518J969958K550597J351900q40829k376809k129539m98548R51952
$$ 369996 689514 2659472 5210069 6561969 5721140 3344331 1214792 716244 1668196
45221A668196J100211M43876K76455Q16736R39556l818j012114p83008M70200
$$ 1668196 2768407 3212283 3488738 4305474 5245030 5241212 4229098 3446090 3916290
45212C916290J517917J943738K274563K463698J640371k75421j915645k104171
$$ 3916290 5434207 7377945 9652508 12116206 13756577 13481156 11565511 9461340
45204I461340j293091o69838n78095o24691p57737j278442k004442k244439j659327
$$ 9461340 8168249 7498411 6920316 6295625 5537888 4259446 2255004 10565 -1648762
45195a648762o76830j7969k3016l30649j66565P49679J637804J566536Q80169
$$ -1648762 -2325592 -2343561 -2366577 -2697226 -2863791 -2114112 -476308 1090228 1970397
45186A970397Q20635J582990J886459R69052j52617j90936O68416J376719J396088
$$ 1970397 2791032 4374022 6260481 7229533 7076916 6885980 7554396 8931115 10327203
45177A0327203O31991q52994k073350j445460P61324J763721r1155k397892j820910
$$ 10327203 10959194 10106200 8032850 6587390 7348714 9112435 9021280 6623388 4802478
45168D802478Q95011J959031J35568j859627j819346p44456j70241K65860J071340
$$ 4802478 5697489 7656520 7792088 5932461 4113115 3368659 3198418 3464278 4535618
45159D535618J200384O698j002959l35794R78212R11674n95275j897351k036171
$$ 4535618 5736002 5742700 4739741 4403947 5382159 6293833 5698558 3801207 1765036
45150A765036j367720m92020J64066L19649L58656J058703K038763J735755q6284
$$ 1765036 397316 -94704 69362 389011 747667 1806370 3845133 5580888 5494604
45141E494604j327865m65372J002807P76944q46427j764399j239293k39874N66034
$$ 5494604 4166739 3701367 4704174 5481118 4634691 2870292 1630999 1391125 1957159
45132A957159J090962P93563n13263j381618m02469J338079J703957R07167R17721
$$ 1957159 3048121 3841684 3328421 1946803 1544334 2882413 4586370 5493537 6411258
45123F411258J761610J344421o83336j846388o65730J000062Q48047p17471j849225
$$ 6411258 8172868 9517289 8833953 6987565 6321835 7321897 8169944 7452473 5603248
45114E603248j929120j369184j74806J565009K698218K127026M37742p32040n87576
$$ 5603248 3674128 2304944 2130138 3695147 6393365 8520391 8958133 8226093 7638517
45105G638517L14106R59867P18364j73941o48698m2879O58213j6686j565790j886544
$$ 7638517 7952623 8912490 9630854 9456913 8808215 8765336 9423549 9406863 7841073 5954529
45095E954529m90393O52713L55940J52888J488674K951684K400599L95859p84417
$$ 5954529 5464136 6116849 6472789 6625677 8114351 11066035 13466634 13862493 13078076
45086A3078076n42257o4168K37780R86842J889148J850731J022503O24133P38161
$$ 13078076 12535819 12471651 12709431 13696273 15585421 17436152 18458655 19082788 19820949
45077A9820949M35571J59071J530339M233069N548854M134409K153726K193981
$$ 19820949 20256520 20415591 21945930 26178999 31727853 35862262 38015988 40209969
45069D0209969L816255M873212M888928N217160O614254Q430892R928405J1071778
$$ 40209969 44026224 48899436 53788364 59005524 65619778 74050670 83979075 95050853
45061I5050853J2252699J4211485J7728943K2331641K5920065K6951815K6400768
$$ 95050853 107303552 121515037 139243980 161575621 187495686 214447501 240848269
45054B40848269K6010789K5038097K0635490J1649050L29416j0131014j8156045
$$ 240848269 266859058 291897155 312532645 324181695 324511111 314380097 296224052
45047B96224052k3377535k5529605k5036298k3468122k2029260k0348641j7850436
$$ 296224052 272846517 247316912 222280614 198812492 176783232 156434591 138584155
45040A38584155j5352687j3890213j2776159j0606645p778316o083268n789581
$$ 138584155 123231468 109341255 96565096 85958451 78180135 72096867 66307286
45033F6307286n140503l323451k043647k974065n030498n638131l948734j517577
$$ 66307286 61166783 57843332 55799685 52825620 47795122 42156991 38208257 36690680
45025C6690680k43457p05738k161434l206006k751164j230852m79115j541478
$$ 36690680 36447223 35741485 33580051 30374045 27622881 26392029 25912914 24371436
45017B4371436l093923l120524j707461p78439j207216j739606j089179K84224
$$ 24371436 21277513 18156989 16449528 15671089 14463873 12724267 11635088 11919312
45009A1919312J109289R56107K81699l60977n47883j18151L62705p0237j460309
$$ 11919312 13028601 13984708 14266407 13905430 13357547 13239396 13602101 13531864 12071555
45000A2071555k570768k378269j293266l39434K03015O21973Q39120N48909Q121
$$ 12071555 9500787 7122518 5829252 5489818 5692833 6314806 7153926 7702835 7710956
44991G710956j23039L31613R03397J130676R18428L48140m54095j277696j883334
$$ 7710956 7587917 7919530 8822927 9953603 10872031 11220171 10766076 9488380 7605046
44982G605046k039885j519816m06654N92416P27350K48264J76043P66251J041067
$$ 7605046 5565161 4045345 3638691 4231107 4958457 5206721 5382764 6149015 7190082
44973G190082L69600l64576m7864Q60324Q98712k66035j298716r00210O19018
$$ 7190082 7559682 7195106 7147242 8007566 8906278 8640243 7341527 6441317 7060335
44964G060335J669579J006377r70567k451557k030521l09142Q51259O70938R4513
$$ 7060335 8729914 9736291 8765724 6314167 4283646 3974504 4825763 5496701 5591214
44955E591214r2367m05731j169193j333369j56279J097877Q56477j89978j30676
$$ 5591214 5498847 5093116 3923923 2590554 2434275 3532152 4388629 4198651 4067975
44946D067975J069761J606954Q19904j5901r9272j67003n72424l81033O43348
$$ 4067975 5137736 6744690 7564594 7548693 7449421 7282418 6709994 6328961 6972309
44937F972309J029184j14774j356826r96660L53400Q47327J66206m53877l83516
$$ 6972309 8001493 7886719 6529893 5533233 5886633 6733960 6900166 6446289 6062773
44928F062773j55545r1284J17475L85789R7749p06556j036085l10160O67792O26313
$$ 6062773 5907228 5815944 5933419 6319208 6416957 5710401 4674316 4364156 5031948 5658261
44918E658261n52422j529069r49656Q72970K080383J460414J04599m3891R23895
$$ 5658261 5105839 3576770 2627114 3500084 5580467 7040881 7145480 7101589 8025484
44909H025484R04713r63755k739133k408390p21279K54728K97624Q32369K165330
$$ 8025484 8930197 7966442 5227309 2818919 2097640 2352368 2649992 3482361 5647691
44900E647691K950611K380745J099599k74429j867409l398485l853362k917424
$$ 5647691 8598302 10979047 12078646 11804217 9936808 6538323 2684961 -232463
44892b32463j483069k18974J094036K275834K261604Q30972m53990k45259N99690
$$ -232463 -1715532 -1934506 -840470 1435364 3696968 4527940 4073950 3828691 4428381
44883D428381L16846j118651j985200j187968N39014J806521K021054J520657
$$ 4428381 4745227 3626576 1641376 453408 992422 2798943 4819997 6340654
44875F340654R13242M93048O2801o36451j274257j140839k06000O44837Q11353
$$ 6340654 7253896 7746944 7809745 7173294 5899037 4758198 4552198 5197035 6008388
44866F008388P10279P46940L65169r27761k188049j909605j36400J385656J303039
$$ 6008388 6718667 7465607 7830776 6903015 4714966 2805361 2668961 4054617 5357656
44857E357656P6751q65643p41228M4047N36313K70495j88956O0288R16882J231995
$$ 5357656 5434407 4568764 3827536 3871583 4407896 4678391 4489435 4549723 5466605 6698600
44847F698600M88488k92544o9463O23448O50985Q4716k93212o23242j460367k088427
$$ 6698600 7187088 6894544 6825081 7448529 8099514 8184230 7891018 7267776 5807409 3718982
44837C718982j265548M54928J183597O43655N12313J367457J635391N33465k89844
$$ 3718982 2453434 2908362 4091959 4735614 5247927 6615384 8250775 8784240 8494396
44828H494396M30564J233916L72827j127619j104103L30996J354565J478326J649861
$$ 8494396 8924960 10158876 10531703 9404084 8299981 8630977 9985542 11463868 13113729
44819A3113729J966174J717290J370699K124976L565823M020664L245274K539310
$$ 13113729 15079903 16797193 18167892 20292868 23858691 27879355 31124629 33663939
44811C3663939K229715J489055P49491J497586L131061K990180O14367r71387
$$ 33663939 35893654 37382709 38132200 39629786 42760847 45751027 46365394 45394007
44803D5394007J42088J637645O41187j942673l387166l410047l507768l583376
$$ 45394007 45536095 47173740 47814927 45872254 42485088 39075041 35567273 31983897
44795C1983897k545834j361013k078756m044618m351994k332857n22676n45189
$$ 31983897 29438063 28077050 25998294 21953676 17601682 15268825 14746149 14200960
44787A4200960j035732p02111n39047j341639j571165P6956J889729J430949n87467
$$ 14200960 13165228 12463117 11924070 10582431 9011266 9088222 10977951 12408900 11821433
44778A1821433j276370J46402J475844R65869n07397j291841j237510j185786
$$ 11821433 10545063 10691465 12167309 13133178 12625781 11333940 10096430 8910644
44770H910644j337847j217415p28576l53262m14881p12863q92860q12843m80462
$$ 8910644 7572797 6355382 5626806 5273544 4858663 4145800 3252940 2440097 1959635
44761A959635R1559P52645J052208N79581l35687o17025L42806J606291J557897
$$ 1959635 2051194 2803839 3856047 4435628 4099941 3482916 3825722 5432013 6989910
44752F989910O865j336214r56518N38284J313701P02425k11784l25195J07547
$$ 6989910 6996775 5660561 4704043 5242327 6556028 7258453 7046669 6721474 6829021
44743F829021J57522m09552j023510j222434j058009o43640J06021J031802J483461
$$ 6829021 6986543 6576991 5553481 4331047 3273038 2629398 2735419 3767221 5250682
44734E250682J039528K84616K04230P20800O16283o16076j617734q35793J086318
$$ 5250682 6290210 6574826 6779056 7499856 8116139 7500063 5882329 5046536 6132854
44725F132854J889757P48435o35509n66450L03227K93887n80568p78693K07290
$$ 6132854 8022611 8771046 8135537 7569087 7872314 8166201 7585633 6806940 7014230
44716G014230J115170R96718N09317M07738J04913j034889j949244j099069Q91979
$$ 7014230 8129400 9126118 9635435 10043173 10148086 9113197 7163953 6064884 6956863
44707F956863J613354K03554j358642j140447N0871K33605o30895r74340n28826
$$ 6956863 8570217 8773771 7415129 6274682 6325553 6559158 5928263 4953923 4425097
44698D425097o85982j699800j722625K85962K432055K294445L74354o55258L34321
$$ 4425097 3739115 2039315 316690 602652 3034707 5329152 5703506 5048248 5382569
44689E382569J707668J609714K42754q40844o82921L74533J299723J291096M53581
$$ 5382569 7090237 8699951 8942705 8101861 7418940 7793473 9093196 10384292 10837873
44680A0837873k87786k18677L28751N28711K01202r8371J11013Q31800J680405
$$ 10837873 10550087 10331410 10660161 11188872 11390074 11291703 11402716 12234516 13914921
44671A3914921J911781Q93419p90143j401174j74263J306935J090132l91775j054430
$$ 13914921 15826702 16720121 15929978 14528804 14354541 15661476 16751608 16359833 15305403
44662A5305403k39915O61510N68725m9068m21486l35204M08757J740044K397917
$$ 15305403 15065488 15726998 16295723 16246655 15825169 15489965 15898722 17638766 20036683
44653B0036683J108405j108189j862258r73550p59169k077804k792656j527761
$$ 20036683 21145088 20036899 18174641 17201091 16441922 14364118 11571462 10043701
44645A0043701k53403j026431k448436j993893j71052N01010l93532r03887n4517
$$ 10043701 9790298 8763867 6315431 4321538 4150486 4651496 4257964 3354077 3299560
44636C299560J107797J626347J573958R87441j32240q64645k94301P48593O67306
$$ 3299560 4407357 6033704 7607662 8595103 8462863 7598218 7303917 8052510 8719816
44627H719816m23477j039502q11202n85383l23604Q16845K309342K495649J239069
$$ 8719816 8296339 7256837 6445635 5860252 5536648 6353493 8662835 11158484 12397553
44618A2397553J15294l08008j032737k072613j908859l63962M58299o39475k003513
$$ 12397553 12512847 12204839 11172102 9099489 7190630 6826668 7284967 6645492 4641979
44609D641979j789124n95801J17065M70030J252190J971573J598343K88103j066521
$$ 4641979 2852855 2257054 2374119 2844149 4096339 6067912 7666255 7954358 6887837
44600F887837k060865k379572j381725N74401J611838O56272q01024p92063L46514
$$ 6887837 4826972 2447400 1065675 1640076 3251914 3908186 3107162 2315099 2661613
44591B661613R42447P19854O64515R10776P53691L36962M22570P25519L12817
$$ 2661613 3604060 4323914 4988429 5899205 6652896 6989858 7412428 8137947 8450764
44582H450764m66696l13390O60643P33363q19405k499859k630163j389526j41948
$$ 8450764 7984068 7670678 8331321 9064684 8245279 5745420 3115257 1725731 1583783
44573A583783L05335J40993k1588L57182J248571J741888Q33137j160043k562773
$$ 1583783 1889118 2030111 2008523 2365705 3614276 5356164 6189301 5029258 2466485
44564B466485k115919l73677J000227J023272J82274l78007j29519M99627R35050
$$ 2466485 350566 -23111 977116 2000388 2182662 1804655 1675136 2174763 3109813
44555C109813J179966J393401J209763L08888n85866m58650K03087j99085j763183
$$ 3109813 4289779 5683180 6892943 7201831 6615965 6157315 6360402 6161317 4398134
44546D398134k468195j075301Q89322J376782P04916N77429J277569J667336J266335
$$ 4398134 1929939 854638 1743960 3120742 3825658 4403087 5680656 7347992 8614327
44537H614327N26361m19327j505536j743824l66202J409533J679322O11043j04438
$$ 8614327 9140688 8721361 7215825 5472001 5105799 6515332 8194654 8805697 8701259
44528H701259k20028r38711j959684j277634J322984L117089K072568l89544j658126
$$ 8701259 8481231 7542520 5582836 4305202 5628186 8745275 10817843 10428299 8770173
44519H770173j248002m17073N5763J77911n9624l99990j18833P74232J080207
$$ 8770173 7522171 7105098 7160861 7338772 7279148 6879158 6760325 7534557 8614764
44510H614764J91147p41988n50775J25063K5850o94984r85604o24452j07374M48026
$$ 8614764 8805911 8063923 7513148 7638211 7664061 6969077 5983473 5359021 5251647 5699673
44500E699673R82433Q06526m05300j544818j325515r3974P99803Q22894K89498
$$ 5699673 6682106 7488632 7083332 5538514 4212999 4119025 4918828 5741722 6031220
44491F031220o16974j510310j385324j10371N87627n03898j664621n66513J671689
$$ 6031220 5414246 3903936 2518612 2408241 2995868 2491970 827349 260836 1932525
44482A932525J712549p03859j929134J64979K952365L052482J098599Q5886O37703
$$ 1932525 3645074 2941215 1012081 1177060 4129425 7181907 8280506 8366392 9004095
44473I004095P16255n91160j671158j124390P0665N0626j295743k067594n66625
$$ 9004095 9720350 9129190 7458032 6333642 6404307 6454933 5159190 3091596 2524971
44464B524971K530961M411910K967008n85704k753796j791192M07467J167359
$$ 2524971 5055932 9467842 12434850 11849146 9095350 7304158 7711625 8878984
44456H878984N16800L58951J127910J341837L31842o65752o44427k83026m21476
$$ 8878984 9395784 9754735 10882645 12224482 12556324 11890572 11246145 10963119 10541643
44447A0541643n79968j14272L52570l9431p93061q40786k79255P0238K87715R28695
$$ 10541643 9961675 9847403 10199973 10160542 9367481 8526695 8247440 8317678 8605393 9534088
44437I534088J296552R4711j948609k151790M70114L360290L629918J722984J33930
$$ 9534088 10830640 10925351 8976742 6824952 7295066 10655356 14285274 16008258 16142188
44428A6142188m03902j150214k266739k181915n78785M52146m24677j464734n34343
$$ 16142188 15738286 14588072 12321333 10139418 9560633 10012779 9588102 8123368 7589025
44419G589025J349130J482902k72436j241618j0355J624048J554712K45589n19293
$$ 7589025 8938155 10421057 10148621 8907003 8896648 10520696 12075408 12320997 11801704
44410A1801704k69681K40333P03692J241441J328840L51784r75960j239262m18338
$$ 11801704 11532023 11772356 12476048 13717489 15046329 15398113 14422153 13182891 12764553
44401A2764553J1023o74082j405152j059706r2483L48713Q9447j54718L2905M74673
$$ 12764553 12775576 12101494 10696342 9636636 9544153 9892866 9982313 9827595 9860500 10335173
44391A0335173R06907J067159O03167m00796j071616o44604M30899R51065M50366
$$ 10335173 11242080 12309239 12912406 12511610 11439994 10795390 11226289 12177354 12627720
44382A2627720l60757n93262n9397P89174J276451R23223l7963o62700k91473
$$ 12627720 12266963 11673701 11614304 12403478 13679929 14603152 14565189 13902489 13611016
44373A3611016O38917J276218J459602J423702Q97416l58169j419255j045592
$$ 13611016 14249933 15526151 16985753 18409455 19306871 18948702 17529447 16483855
44365A6483855L35225J055045Q52985J290868K851886L586579K016650l13154
$$ 16483855 16819080 17874125 18727110 20017978 22869864 26456443 28473093 28159939
44357B8159939j059723n61351q48270j995642k054118n52435N10885j42519j107228
$$ 28159939 27100216 26538865 25690595 23694953 21640835 21088400 21599285 21456766 20349538
44348B0349538p15437L21775K57146q46806j334064n79874J62277k73202j270781
$$ 20349538 19634101 19955876 20213022 19366216 18032152 17452278 17614555 17341353 16070572
44339A6070572j309727m4808J196678J168083M28536N46821J619884J752009k50768
$$ 16070572 14760845 14716037 15912715 17080798 17509334 18056155 19676039 21428048 21177280
44330B1177280k716738k994129r04988J226903J690784Q56119l51580j484419
$$ 21177280 18460542 15466413 14561425 15788328 17479112 18335231 17983651 16499232
44322A6499232j774736l66006J824960K332387L59190j853536k099121j019286
$$ 16499232 14724496 14358490 16183450 18515837 18875027 17021491 14922370 13903084
44314A3903084l50681K341J070641K193094J744536M5602p89485m881Q31724M20103
$$ 13903084 13552403 13554744 14625385 16818479 18563015 18608617 17819132 17814251 18645975 19066078
44304A9066078m67540m55198N02234J433219J702309J387749Q69298M65986J56290
$$ 19066078 18598538 18143340 18645574 20078793 21781102 23168851 24038149 24504135 24660425
44295B4660425l99007j223185j680697j289591m70102J80157P89736J500976J561582
$$ 24660425 24261418 23038233 21357536 20067945 19597843 19778000 20567736 22068712 23630294
44286B3630294M38501p28351m27804P48694P70189o55458j535455p02305M50570
$$ 23630294 24068795 23340444 22912640 23661334 24431523 23776065 22240610 21538305 21988875
44277B1988875K85567o43631p15689L48493J428421J577883O63049q73133k031593
$$ 21988875 22274442 21630811 20915122 21263615 22692036 24269919 24932968 24059835 22028242
44268B2028242j770681l46067N69678n8219j181610j177274o3968Q59338J010684
$$ 22028242 20257561 19911494 20481172 20422953 19241343 18064069 18000101 18859439 19870123
44259A9870123R61154J148660J280832J045373O01304K82383K91678N64663N96103
$$ 19870123 20831277 21979937 23260769 24306142 24907446 25189829 25481507 26046170 26642273
44250B6642273j72688j359982j689315p32173J06204o06709k081805k189962l98454
$$ 26642273 26469585 25109603 23420288 22688115 22794319 22187610 20105805 17915843 17517389
44241A7517389J564374K124468J604649J119803R89804J037491J441814K204831
$$ 17517389 19081763 21206231 22810880 23930683 24920487 25957978 27399792 29604623
44233B9604623K411382J258405m00837p95216L08967J102286K87978r38848o16221
$$ 29604623 32016005 33274410 32873573 32078357 32387324 33489610 33777588 32838740 32222519
44224C2222519R33233J353022l51680k245952k089715l01405R51044Q49948N85019
$$ 32222519 33155752 34508774 34157094 31911142 29821427 29520022 30471066 31321014 31906033
44215C1906033J077243J554975Q68287p84448k071725j976829o62968P70941J253247
$$ 31906033 32983276 34538251 35406538 34622090 32550365 30573536 29910568 30681509 31934756
44206C1934756P54200K79675N58890J111552J164218R38580J083254J296642P66220
$$ 31934756 32688956 32968631 33527521 34639073 35803291 36741871 37825125 39121767 39887987
44197C9887987k79831q34527p81783p86688n90541P40560K588601K822641Q41808
$$ 39887987 39608156 38773629 37991846 37205158 36614617 37355177 39943778 42766419 43608227
44188D3608227j247371j481411l65777P15159J598297K417675K306278Q79059
$$ 43608227 42360856 40879445 40513668 41228827 42827124 45244799 47551077 48430136
44180D8430136l13280K24974J501934J517844K96294n41671m86272l16742o4520
$$ 48430136 48116856 48341830 49843764 51361608 51657902 51116231 50629959 50313217 50248697
44171E0248697J034285K667627L478822L031759K114633J186216J59405m43297
$$ 50248697 51282982 53950609 57429431 60461190 62575823 63762039 63921444 63478147
44163F3478147J00104J185526J491412J051544R59259J148022N31702n46641k58965
$$ 63478147 63578251 64763777 66255189 67306733 68265992 69414014 69945716 69399075 69140110
44154F9140110J757257L434071L059265J325924j13478n33071N9963J355282K279915
$$ 69140110 70897367 74331438 77390703 78716627 78603149 78070078 78130041 79485323 81765238
44145H1765238J688084J54995m87685J25660N06357J56247M85089J887685K373162
$$ 81765238 83453322 83608317 83120632 83246292 83752649 83908896 84393985 86281670 88654832
44136H8654832P68683q89051k37440J877074K944134K440714J652470J016938
$$ 88654832 89423515 88534464 88297024 90174098 93118232 95558946 97211416 98228354
44128I8228354Q1003o49956k33898O88806N67566n31451j024868l44778M47135
$$ 98228354 98309357 97659401 97425503 98114309 98681875 98150424 97125556 96780778 97227913
44119I7227913N42160J93278l11465q65449q37204J83576J046466K57996j461863
$$ 97227913 97770073 97963351 97651886 96786437 95949233 96132809 97179275 97437271 95975408
44110I5975408j812343l63274O71727k50069j860242k261845j557337r75337o76328
$$ 95975408 94163065 93799791 94471518 94221449 92361207 90099362 88542025 87566688 86890360
44101H6890360L4773J032808J335569N24232p93210j816393k127856j595467m09205
$$ 86890360 86925133 87957941 89293510 89817742 89024532 87208139 85080283 83484816 83075611
44092H3075611P28585R47481k4581j530315k498950k377138j597003r86496p22375
$$ 83075611 83804196 84751677 84727096 83196781 80697831 78320693 76723690 75737194 75014819
44083G5014819k78706M51292O61407k25031j533515k177074j999887j505507q26283
$$ 75014819 74736113 75187405 75848812 75623781 74090266 71913192 69913305 68407798 67581515
44074F7581515K4335L83238l30785j393693j563273r47280p85070j413173j805021
$$ 67581515 67605850 67989088 67658303 66264610 64701337 63754057 62968987 61555814 59750793
44065E9750793j238193j10476J019946J843178J635221k07273k566275l167814
$$ 59750793 58512600 58402124 59422070 61265248 62900469 62693196 60126921 56959107
44057E6959107j457057N44666J028093N77853O12139J113695J266608J226571
$$ 56959107 55502050 56046716 57074809 57652662 58264801 59378496 60645104 61871675
44049F1871675J723304K545252K790472K289164J730337J653263K046658K500782
$$ 61871675 63594979 66140231 68930703 71219867 72950204 74603467 76650125 79150907
44041G9150907K194146N06731j672715k279694p19387Q65000K83997j682523k575508
$$ 79150907 81345053 81851784 80179069 77899375 77179988 78044988 78328985 76646462 74070954
44032G4070954j818263j050765j218768j428192r91032o91033j210218j759091
$$ 74070954 72252691 71201926 69983158 68554966 67563934 66872901 65662683 63903592
44024F3903592j283796n3935Q98892J225289J270271J158102P54409L36080N11665
$$ 63903592 62619796 62565861 63464753 64690042 65960313 67118415 67872824 68208904 68720569
44015F8720569J338881J999387J665987N96628N0535Q51567K212485K579103J781901
$$ 68720569 70059450 72058837 73724824 74321452 74371987 75223554 77436039 80015142 81797043
44006H1797043J577790L454287O520721Q493590Q462820P700243P791758Q952254
$$ 81797043 83374833 86829120 93349841 101843431 110306251 118006494 125798252 134750506
43998A34750506J0405365J1617743J2737578J4232162J6303441J8348717J9016853
$$ 134750506 145155871 156773614 169511192 183743354 200046795 218395512 237412365
43991B37412365J7234808J3181331P908344K248043l366376q344733j2085498
$$ 237412365 254647173 267828504 275736848 277984891 274618515 266273782 254188284
43984B54188284j4589387j6102053j6298910j4891137j3018441j2645241j4030259
$$ 254188284 239598897 223496844 207197934 192306797 179288356 166643115 152612856
43977A52612856j4989799j3537293j0386097p888512p140468p170220o629800
$$ 152612856 137623057 124085764 113699667 105811155 98670687 91500467 84870667
43970H4870667n263181l729332k751755k543080k604003k164423j227137q77036
$$ 84870667 79607486 75878154 73126399 70583319 67979316 65814893 64587756 63710720
43962F3710720j911061l426454l692623k455417j349968j618488k390305k056589
$$ 63710720 61799659 58373205 54680582 52225165 50875197 49256709 46866404 44809815
43954D4809815o46144L40632K03690j77429o8702p2856q50725j734259j718359
$$ 44809815 44163671 44504303 44707993 44530564 44461862 44389006 43538281 41804022 40085663
43945D0085663j054312n87678j76972O48404R76945m36990k440321k280579J61197
$$ 40085663 39031351 38443673 38266701 38915105 39892050 39455060 37014739 34734160 34895357
43936C4895357J536642j09974k194289j597674M46366O67419o47396l58374J734845
$$ 34895357 36431999 36322025 34127736 32530062 32976428 33643847 32996451 32638077 34372922
43927C4372922K142241m64554k699228j643959Q00800J300204J20438k67964K89920
$$ 34372922 36515163 36050609 33351381 31707422 32508222 33808426 33928864 33660900 33950820
43918C3950820j08198j557627k005629p73925K83433l43676j798519k318687j311649
$$ 33950820 33842622 32284995 30279366 29505441 29788874 29445198 27646679 25327992 24016343
43909B4016343M04164J364618M90712j563125k434492p77005J496395J435755
$$ 24016343 24420507 25785125 26275837 24712712 22278220 21501215 22997610 24433365
43901B4433365p86399k065139q49989Q68072Q36935k98138m77379O49935J628581
$$ 24433365 23646966 21581827 20731838 21599910 22436845 22138707 21661328 22311263 23939844
43892B3939844J365335J13090j202879j730457j194502k57849J16171l5066J67224
$$ 23939844 25305179 25418269 24215390 22484933 21290431 21032582 21148753 21113687 21280911
43883B1280911P18295M10888j113922k320689j832458m14135L13292J85259J58758
$$ 21280911 21999206 22410094 21296172 18975483 17143025 16728890 17042182 17227441 17386199
43874A7386199M48523N07321L61402M58427M92036j41732r03666o68965K66820
$$ 17386199 17834722 18342043 18703445 19161872 19653908 19512176 18608510 17939545 18206365
43865A8206365L51460p20344j239382K0170J804505J954131K14048j606364j964621
$$ 18206365 18557825 17837481 16598099 16618269 18422774 20376905 20590953 18984589 17019968
43856A7019968j154829m95743n86145p46703j37606Q85205J024652j69983j386857
$$ 17019968 15865139 15369396 14783251 14036548 13898942 14784147 15808799 15638816 14251959
43847A4251959j081505M97954J703426J670692J059152O35821L16910q3173l17598
$$ 14251959 13170454 13668408 15371834 17042526 18101678 18737499 19054409 18971236 18653638
43838A8653638m83200j259276k593331l095913j765877L57729J376351R50769
$$ 18653638 18170438 16911162 14317831 11221918 9456041 9813770 11190121 12140890
43830A2140890M35422P84196J399364J178627j01930j621751k198585j187552
$$ 12140890 12576312 13360508 14759872 15938499 15836569 14214818 12016233 10828681
43822A0828681P30187J808498R86994p40248j483880q66512k97463p81810j567772
$$ 10828681 11558868 13367366 14354360 13614112 12130232 11263720 10966257 10184447 8616675
43813H616675j413776k80385Q47111J170965O06881l10233o38216J71349J275936
$$ 8616675 7202899 6922514 7769625 8940590 9547471 9237238 8599022 8770371 10046307
43804A0046307J101297m30953j349038k49653J485088J462119l33589j521772
$$ 10046307 11147604 10716651 9367613 9117960 10603048 12065167 11731578 10209806
43796A0209806n77812J407976K425652J705613j15424j789862k037309m55724
$$ 10209806 9631994 11039970 13465622 15171235 15055811 13265949 11228640 10772916
43788A0772916J670549K450367J613066N83214J27952n14161j581500j753149
$$ 10772916 12443465 14893832 16506898 17090112 17218064 16703903 15122403 13369254
43780A3369254m74432L96150q07576k582136k209207O3043J372775O19263k11612
$$ 13369254 12894822 13290972 12483396 9901260 7692053 7755096 9127871 9747134 9535522
43771I535522L85855J150384N69223n03167m81397K89370M48497J13903M30336
$$ 9535522 9921377 11071761 11640984 11137817 10656420 10945790 11394287 11508190 11938526
43762A1938526J223300J145112P4247n14676R6374P84036N00738p4685K48709
$$ 11938526 13161826 14306938 14381185 13866509 13962883 14746919 15247657 15172972 15421681
43753A5421681J236150J600307R03380J13516K67155J241115K013163J761993
$$ 15421681 16657831 18258138 19161518 19275034 19542189 20783304 22796467 24558460
43745B4558460N53739q26813j534003j215448j16876J155294J927710J757365
$$ 24558460 25112199 24285386 22751383 21535935 21419059 22574353 24502063 26259428
43737B6259428P48952m14379j000224q74361m92785k84055l12641n87946j252495
$$ 26259428 27008380 26594001 25593777 24719416 24226631 23942576 23629935 23041989 21789494
43728B1789494k079224k120771o00679J727180K864338J769749k35860j027131
$$ 21789494 19710270 17589499 16988820 18716000 21580338 23350087 23114227 22087096
43720B2087096k82335M62754K05527m24947p65059j295799k286621k607149j344135
$$ 22087096 21804761 22267515 22473042 22048095 21283036 19987237 17700616 15093467 13749332
43711A3749332L69843Q47854M65765Q20834J689463J165380r61768k352412j463926
$$ 13749332 14119175 14967029 15432794 16253628 17943091 19108471 18146703 15794291 14330365
43702A4330365L41972J152593J071240J077914J051293N66848K68830P28723J064731
$$ 14330365 14672337 15824930 16896170 17974084 19025377 19592225 19861055 20589778 21654509
43693B1654509L24890q39244j452103j914246k658098k512387o43386J149471
$$ 21654509 21979399 21140155 19688052 17773806 15115708 12603321 11959935 13109406
43685A3109406P51558o53523l35486J282836J190223r58441j933045j70867J644710
$$ 13109406 13860964 13207441 12871955 14154791 15345014 14386573 12453528 12282661 13927371
43676A3927371Q96387j146838j904586j335352q95544o95888j06896L63485R9516
$$ 13927371 14823758 13676920 11772334 10436982 9541438 8845550 8738654 9102139 9201655
43667I201655O257R68983J900945J477739O34369R99351J862823J281876m49973
$$ 9201655 9207912 10176895 12077840 13555579 14189948 15189299 17052122 18333998 17884025
43658A7884025j127223k23494M56165n2886m56060M06795J729997K132209J398539
$$ 17884025 16756802 16533308 16989473 16936587 16480527 16887322 18617319 20749528 22148067
43649B2148067J35190j116009j874767j850972j447218j274162j119629l89114
$$ 22148067 22283257 21167248 19292481 17441509 15994291 14720129 13600500 13211386
43641A3211386N48362O72773r2311q68940j303086j647179j505302k11911J414329
$$ 13211386 13759748 14432521 14340210 13471270 12168184 10521005 9015703 8803792 10218121
43632A0218121J535058k5626j276726q51544L19828Q28815O53636L19302k45333
$$ 10218121 11753179 11727553 10450827 9599283 9919111 10747926 11401562 11720864 11475531
43623A1475531q92629o70296O59212J593052P06543j266088k346346j728525l11620
$$ 11475531 10582902 9912606 10571818 12164870 12871413 11605325 9258979 7530454 7218834
43614G218834O47288N80995j86308o50540j00293P30380L72654j087540j673837
$$ 7218834 7866122 8447117 8260809 7610269 7509976 8240356 8613010 7525470 5851633
43605E851633k67367J577873J707109K02202j110886j136905k30004Q22199J275747
$$ 5851633 5584266 7162139 8869248 9071450 7960564 6823659 6593655 7415854 8691601
43596H691601N50028q92543j409855j53581J459122J543260L72933k40540L27356
$$ 8691601 9241629 8349086 6939231 6785650 8244772 9788032 10160965 9920425 10247781
43587A0247781R96272R13448L73930j03382k66542J93533J162430J473997J52267
$$ 10247781 11244053 12157501 12531431 12428049 12161507 12355040 13517470 14991467 15143734
43578A5143734j817857k378705j051896O58687J463743J433602R72437K72836
$$ 15143734 13325877 10947172 9895276 10553963 12017706 13451308 14423745 14696581
43570A4696581k0024P64818J880752J733678L16801n58198o491O88284L81720
$$ 14696581 14676557 15441375 17322127 19055805 19372606 18814408 18807917 19496201 19877921
43561A9877921j39834J50226O27230L16391j92693J55591P84848L37464q26672
$$ 19877921 19738087 19888313 20515543 20831934 20639241 20794832 21579680 21917144 21090472
43552B1090472q12291J046249L103100L491651K238131Q01082J95330Q4764m99085
$$ 21090472 20278181 21324430 24427530 27919181 30157312 30958394 31153724 31238488 30739403
43543C0739403j812172k876917k539758j019967J88125J90268k69572j51537K83969
$$ 30739403 28927231 26050314 23510556 22490589 22678714 22868982 22599410 22447873 22731842
43534B2731842Q7734p32130j232183r77930m73858j76373K3470K15824J76411
$$ 22731842 22819576 22087446 20855263 19877333 19403475 19227102 19250572 19466396 19642807
43525A9642807p6197n8940M71967R89287P39370k94959j187144r15784M78036
$$ 19642807 19566610 19507670 19979637 20968924 21708294 21413335 20226191 19310407 19788443
43516A9788443J654480J244980n60678k136850k296484j475127p36506l17713
$$ 19788443 21442923 22687903 22127225 19990375 17693891 16218764 15482258 15164545
43508A5164545J79006P40401R84950R37774Q94890P17978J35069m07294j66366
$$ 15164545 15343551 16083952 17068902 18006676 18901566 19619544 19754613 19347319 19180953
43499A9180953O09529Q36833K62599l9139O70881J517471J153872l57595j617216
$$ 19180953 19790482 20627315 20889914 20850775 21521656 23039127 24192999 23835404 22218188
43490B2218188j613591o72286K75849P30821P32781L99405k39599j029175j605349
$$ 22218188 20604597 19932311 20208160 20938981 21671762 22071167 21831568 20802393 19197044
43481A9197044j641630j095177j69269Q27916J497251J470923Q60105M46306R30026
$$ 19197044 17555414 16460237 16290968 17118884 18616135 20087058 20947163 21393469 22323495
43472B2323495J930051K251485J346361q067p74541q48491p52176o77965m70918
$$ 22323495 24253546 26505031 27851392 27843325 27068784 26220293 25468117 24790152 24319234
43463B4319234j85593L1722L65513R59756J346584R83172K04796j69898j44328
$$ 24319234 24133641 24165363 24530876 25490632 26837216 27820388 28025184 27855286 27710958
43454B7710958n71530j712804k610384k279675q98807N76685J451905J549392
$$ 27710958 27139428 25426624 22816240 20536565 19637758 20214443 21666348 23215740
43446B3215740R30490r2430r01673j009321n44224j02567j50029o21464r84484
$$ 23215740 24146230 24053800 23152127 22142806 21598582 21496015 21345986 20724522 19740038
43437A9740038o99113K11455J098388J406676J316079J333308J437767J179962
$$ 19740038 19040925 19252380 20350768 21757444 23073523 24406831 25844598 27024560
43429B7024560N70239K05286L52359N24371K70841j31925j97196n3822k58102
$$ 27024560 27594799 27800085 28152444 28676815 28947656 28815731 28618535 28564713 28306611
43420B8306611r11805j385692j019292P1625J030503J168898P41946N50046P82210
$$ 28306611 27394806 26009114 24989822 25061447 26091950 27260848 28002794 28552840 29335050
43411B9335050P57521M7079p39404p75318q4130Q14676J724420K436191K238727
$$ 29335050 30092571 30139650 29400246 28624928 28540798 29355474 31079894 33516085 35754812
43402C5754812R18133k54802O0537J154912J107776l75064j678184j882776j700825
$$ 35754812 36672945 36418143 36478680 37633592 38741368 38366304 36688120 34805344 33104519
43393C3104519j475899m81661R61945J025216n60434j242124N32839K309266J124885
$$ 33104519 31628620 31146959 32108904 33134120 32573686 31331562 31864401 34173667 35298552
43384C5298552j573907j823945P99166K598616J438049m90664p19534k20551j054334
$$ 35298552 33724645 31900700 32699866 35298482 36736531 36245867 35526333 35305782 34251448
43375C4251448k557710k371008j32948K111799K786302K258986J515861Q21010
$$ 34251448 31693738 29322730 29189782 31301581 34087883 36346869 37862730 38683740
43367C8683740j2351r15325j438714j014416N06257K276921K850980J659322k60240
$$ 38683740 38671389 37756064 36317350 35302934 35809191 38086112 40937092 42596414 42336174
43358D2336174j461679j591190j226970p88560l24977m552m0458k72522l88993
$$ 42336174 40874495 39283305 38056335 37267775 36942798 36938246 36897788 36625266 36236273
43349C6236273l88884l72229j88302J89386L09299j11920n45536l89387n4930
$$ 36236273 35847389 35475160 35286858 35476244 35785543 35673623 35128087 34738700 34683770
43340C4683770m32792j372527j639279n87017Q96408J472030Q49569j34629n59611
$$ 34683770 34250978 32878451 31239172 30652155 31548563 33020593 33870162 33735533 33175922
43331C3175922k25237L49589M94456N1578m74880n38677j89548J77152N19753
$$ 33175922 32950685 33300274 33794730 33846308 33371428 32832751 32643203 32820355 33340108
43322C3340108J079733J631962J482660N48923j30459L85148J443405J314487
$$ 33340108 34419841 36051803 37534463 38083386 37952927 38338075 39781480 41095967
43314D1095967n81460k619261k721511q20210J172712J768836J376662J102877
$$ 41095967 40514507 37895246 35173735 34353525 35526237 37295073 38671735 39774612
43306C9774612J067276P01645P187n55303j022047j641878j917360j224253k66513
$$ 39774612 40841888 41543533 41550720 40995417 39973370 38331492 36414132 35189879 34923366
43297C4923366l96330j333284j278861J59123J007553l9579j392493r75988N77189
$$ 34923366 34527036 33193752 31914891 32074014 33081567 33041988 31649495 30673507 31250696
43288C1250696J148575N23023K69107P37878N83824o22945j523093j217455n03196
$$ 31250696 32399271 32922294 33191401 33929279 34513103 33890158 32367065 31149610 30646414
43279C0646414k18175o0438J96796m1566p73635p40696O40035J915932J435393
$$ 30646414 30428239 30367801 30564597 30523031 29749396 29008700 29648735 31564667 33000060
43270C3000060l97924j876947k150639j495146k84484R94496J360685L81575p74420
$$ 33000060 32602136 30725189 28574550 27079404 26794920 27789416 29150101 29531676 28757256
43261B8757256o31343M92665R31050P9128r15760r59883l10349K68835O51882
$$ 28757256 28125913 28618578 29549628 29628756 28712996 27753113 27442764 27711599 28363481
43252B8363481J099712J489680J386442P02872m0760j98318K32789M85070N5084
$$ 28363481 29463193 30952873 32339315 33042187 33001427 32803109 33035898 33520968 33576052
43243C3576052k88937O06507K250970K614841R90969n22196K66161K407951L047141
$$ 33576052 33287115 33893622 36144592 38759433 39750402 39228206 39494367 41902318 44949459
43234D4949459J396219m45784o91081J5334K42559l7626J55687J238856K713678
$$ 44949459 46345678 45899894 45208813 45224147 45466706 45429080 45584767 46823623 49537301
43225D9537301L760517L725398K692920J831612K299311L545524L743644K278796
$$ 49537301 53297818 57023216 59716136 61547748 63847059 67392583 71136227 73415023
43217G3415023O28524K01745N48689N69681L09954L75096M82596n6378r60477
$$ 73415023 74043547 74245292 74793981 75363662 75673616 76048712 76531308 76474930 75514453
43208G5514453j340874j113656r59534j139801j346948j485712j661536j649888
$$ 75514453 74173579 73059923 72100389 70960588 69613640 68127928 66466392 64816504
43200F4816504j302062j184830j832373k645745k593258j760492j086916q13050
$$ 64816504 63514442 62329612 60497239 57851494 55258236 53497744 52410828 51597778
43192E1597778m85083l46430j186750k640384l215817k499869j833484k097120
$$ 51597778 51112695 50766265 49579515 46939131 43723314 41223445 39389961 37292841
43184C7292841k294487j346283K9676N25047K68474J81323J28022o26651j602053
$$ 37292841 34998354 33652071 33681747 34206794 34475268 34656591 34784613 34157962 32555909
43175C2555909j545501o23427l74567j141874j280676K75620K133135K290064
$$ 32555909 31010408 30386981 30012414 28870540 27589864 27865484 29998619 32288683
43167C2288683Q10458o83385j460802k109439k785606k624311j251422L31560
$$ 32288683 33099141 32415756 30954954 28845515 26059909 23435598 22184176 22515736
43159B2515736J010053Q93415P67577Q56076Q11066M81114m677o05417j164733
$$ 22515736 23525789 24419204 25186781 26042857 26853923 27335037 27330360 26724943 25560210
43150B5560210j126353k14388P67036O85492l15027q71130l68193O3658p76371
$$ 25560210 24433857 24219469 24986505 25671997 25356970 24485840 24117647 24181305 23404934
43141B3404934k156638k142273k50397J623415J422183m86132j686778o97991
$$ 23404934 21248296 19106023 18855626 20479041 21901224 21415092 19728314 19030323
43133A9030323J113907J177498j000272l096755k859006q62589N24408L88333
$$ 19030323 20144230 21321728 20321456 17224701 14365695 13503106 14027514 14415847
43125A4415847J25888R95830K243220K359592J144971m13154j551608k043652
$$ 14415847 14541735 15537565 17780785 20140377 21285348 20872194 19320586 17276934
43117A7276934j718309p59702q6843l38711p41221q4446J353494K040949J325717
$$ 17276934 15558625 14798923 14712080 14373369 13632148 13547702 14901196 16942145 18267862
43108A8267862J22897o49113j059240j267211r19480q3574K82515m10190j439711
$$ 18267862 18390759 17741646 16682406 15415195 14495715 14412141 14694656 14284466 12844755
43099A2844755j781183j315331m00738Q94080K294667K844167J943839L44041
$$ 12844755 11063572 9748241 9347503 10241583 12536250 15380417 17324256 17668297
43091A7668297q07807j358257j672491j469512m03560O79961N65471l88001o09306
$$ 17668297 16860490 15502233 13829742 12360230 11956670 12636631 13202102 12814101 12204795
43082A2204795K79720R34397N34379L6110L98626Q80200K59321j121144j776444
$$ 12204795 12484515 13418912 13953291 13989401 14388027 15268227 15527548 14406404 12629960
43073A2629960j109577N9625P66446P77614L28006j87983l11327j0370K4193o99741
$$ 12629960 11520383 11580008 12346454 13124068 13452074 13264091 12952764 12942394 12966587 12266846
43063A2266846j426538r83984L05583O91246n60262j831842j172202J015390K388524
$$ 12266846 10840308 9856324 10161907 10853153 10292891 8461049 7288847 8304237 10692761
43054A0692761J562951m09522j550107j088054J78954R55795N10239p79084j557941
$$ 10692761 12255712 11846190 10296083 9208029 9386983 10342778 10853017 10073933 8515992
43045H515992p02602J210258K218375J286130l35483q33493k71531j11342o86993
$$ 8515992 7813390 9023648 11242023 12528153 12192670 11359177 11087646 10976304 10289311
43036A0289311p62537J77853Q72798L55471l55037O1282R42857P34248k60237
$$ 10289311 9526774 9704627 10577425 10932896 10577859 10639141 11581998 12316246 12056009
43027A2056009j57965J435684K561169J764637J99587k53267K45162P5293j126172
$$ 12056009 11898044 13333728 15894897 17659534 17859121 17605854 17851016 17926309 16800137
43018A6800137j926539j306549p0462M53153K09530K00478R19079J707351J632545
$$ 16800137 14873598 13567049 13496587 13949740 14159270 14359748 15278827 16986178 18618723
43009A8618723N37208q80317j744913j644729q27624K3486L22640J22440P9057
$$ 18618723 19155931 18275614 16530701 14885972 14058348 14081834 14404474 14526914 14605971
43000A4605971O32220J283982J099012j8919j084172j319317j077827r64902o90780
$$ 14605971 15238191 16522173 17621185 17602266 16518094 15198777 14120950 13156048 12465268
42991A2465268K64831J265692J061851k43286j055273n08537L94987N23934L05484
$$ 12465268 12730099 13995791 15057642 14814356 13759083 13250546 13645533 14169467 14474951
42982A4474951O45880J151191P87374k91367j039621j324364j871131k438121
$$ 14474951 15120831 16272022 17059396 16768029 15728408 14404044 12532913 10094792
42974A0094792j750367K62121J739881J337477J39321l9995O98512Q11291j35761
$$ 10094792 8344425 8606546 10346427 11683904 11823225 11783230 12481742 13293033 13157272
42965A3157272r35552o94551P8112N79655O92533M36754m09509j476366j615088
$$ 13157272 12221720 11527169 11605281 12184936 12877469 13314223 12904714 11428348 9813260
42956I813260m91577M28679l35158k014385k467512j179115R1141l6053p17128
$$ 9813260 9321683 9750362 9415204 7400819 4933307 3754192 3845333 3809280 3092152
42947C092152n22684L07614N24408K1921j54478L09309N80455K78593J19368N15440
$$ 3092152 2569468 2877082 3401490 3423411 3268933 3578242 4158697 4437290 4556658 5072098
42937E072098P64402L38750o9955K73638P69376M00437n06446o42791L57503J450771
$$ 5072098 5836500 6175250 6105295 6378933 7148309 7548746 7042300 6399509 6757012 8207783
42927H207783J637627R37998j09622r68055j014791M3263J334882J350540j60198
$$ 8207783 9845410 10783408 10673786 9705731 8690940 8734203 10069085 11419625 11259427
42918A1259427j582401j346782J67278J314092J290491Q02660Q27560J370772
$$ 11259427 9677026 8330244 8497522 9811614 11102105 11904765 12732325 14103097
42910A4103097J528076N13562j322729k498318j850498r9506P13934k83718j634258
$$ 14103097 15631173 16144735 14822006 12323688 10473190 10373684 11087618 10803900 9169642
42901I169642j497777L756J338424J803575J911370J848781J081716k60004r66549
$$ 9169642 7671865 7675621 9014045 10817620 12728990 14577771 15659487 15399483 14432934
42892A4432934l27874Q78234J585592J698649J470072N77032j144240k658734
$$ 14432934 14105060 14983294 16568886 18267535 19737607 20314639 19170399 16511665
42884A6511665k589507r58451Q07309J536345J289049Q13798P28753J176201J695410
$$ 16511665 13922158 12963707 13771016 15307361 16596410 17410208 18138961 19315162 21010572
42875B1010572J540687O00190l36350p86741j421869k710796l398831j970775
$$ 21010572 22551259 23151449 22815099 22028358 20606489 17895693 14496862 12526087
42867A2526087N76470J399491l13548k086685j733175l03761O6768m06532o5114
$$ 12526087 13102557 14502048 14188500 12101815 10368640 10064879 10131647 9725115 9660001
42858I660001R24449Q34600l15458l89527J299677K409975Q81114j903509k938485
$$ 9660001 10584450 11419050 11103592 10714065 12013742 14423717 15304831 13401322 10462837
42849A0462837j534666K60104O88876J30418j44343K21944O06631M61002r1234
$$ 10462837 8928171 9188275 9877151 10007569 9863226 10085170 10691801 11152803 11061569
42840A1061569n34932n61891k88628R7710O06014J032425O70006q04216k340033
$$ 11061569 10526637 9964746 9676118 9773828 10379842 11412267 12082273 11278057 8938024
42831H938024k470507j353180o52376j050101j265022k75217R39721J092799P45237
$$ 8938024 6467517 5114337 4461961 3411860 2146838 1871621 2811342 3904141 4649378
42822D649378J139008J808349J269045l54074j310393p93156K03538P05378P94847
$$ 4649378 5788386 7596735 8865780 8511706 7201313 6408157 6611695 7317073 8111920
42813H111920O15078l5031p29646n79325J78956K60930n01273o82754L50778J232768
$$ 8111920 8726998 8691967 7962321 7382996 7561952 7822882 7321609 6638855 6989633 8222401
42803H222401P76268j39171j00457O77496J043907P17289Q9737q26521j909372
$$ 8222401 8998669 8859498 8759041 9436537 10480444 11197733 11287470 10460949 8551577
42794H551577k209970j103326M83570J209972J015047N78776K5925n30797k23637
$$ 8551577 6341607 5238281 5721851 6931823 7946870 8525646 8551571 8020774 7797137
42785G797137J127404J774681K18001k135384k664409j339694m38800p57081p91937
$$ 7797137 8924541 10699222 10917223 8781839 6117430 4777736 4338936 3581855 2789918
42776B789918R7951N19247j71192m95504M94527J448785J072040K77413L53452
$$ 2789918 2887869 3407116 3235924 2740420 3234947 4683732 5755772 6033185 6386637
42767F386637P11469K78052l01466K00847J310090J579257Q41492M9110m37877
$$ 6386637 7098106 7376158 7074692 7275539 8585629 10164886 11006378 11055488 10617611
42758A0617611q08353p50271o4770L26786l65631j174099p04741N22792R01689
$$ 10617611 9809258 9058987 8994217 9321003 8955372 7781273 7076532 7599324 8501013
42749H501013L17809j26727m53509j509100k548259j759205N10261J720074J040209
$$ 8501013 8818822 8692095 8238586 6729486 4181227 2422022 2932283 4652357 5692566
42740E692566O13300J736715K441350P75912j723800k272478r69845p5035j43198
$$ 5692566 6305866 8042581 10483931 11259843 9536043 7263565 6293720 6218685 6075487
42731F075487L25032J637415K020500N36669j216921j277959K16511J608494J762484
$$ 6075487 6400519 8037934 10058434 10595103 9378182 8100223 8316734 9925228 11687712
42722A1687712Q07476l91560q92835l68125M69621O16548R8396j07218M49963
$$ 11687712 12495188 12103628 11210793 10842668 11312289 11928837 12027233 11920015 12369978
42713A2369978J128735J297624J079112O95540N8645n55339m81513N5901k24279
$$ 12369978 13498713 14796337 15875449 16570989 16629634 16074295 15592782 15648683 15424404
42704A5424404j603335k257123o28923J896556K482862P32251q17482l35770J055544
$$ 15424404 13821069 11563946 10935023 12831579 15314441 16046692 15229210 14893440 15948984
42695A5948984J489956J086582J056136J308109P67120m43543r37997k28729O06108
$$ 15948984 17438940 18525522 19581658 20889767 21656887 21213344 20275347 20046618 20652726
42686B0652726P33501O38639Q46159Q86169L81971M6291M86838Q78597J23753
$$ 20652726 21386227 22024866 22871025 23757194 24139165 24185456 24672294 25550891 25674644
42677B5674644j217148j551217n68101M85108Q57161J159028J821607K103789
$$ 25674644 24457496 22906279 22338178 22823286 23680447 24839475 26661082 28764871
42669B8764871J410689M92818L86512R78317J570215K149473L020150L733654
$$ 28764871 30175560 30668378 31054890 32033207 33603422 35752895 38773045 42506699
42661D2506699L596717K938674K666988K715052K194712J127768O89240J402337
$$ 42506699 46103416 49042090 51709078 54424130 56618842 57746610 58435850 59838187
42653E9838187K379088K924242L649267N106345O397093O346208N337486M685074
$$ 59838187 62217275 65141517 68790784 73897129 80294222 86640430 91977916 96662990
42645I6662990M624332M289200L507759L195539L774730M488940M692587M657291
$$ 96662990 101287322 105576522 109084281 112279820 116054550 120543490 125236077 129893368
42637A29893368M555809L800305K223550R19630Q09439J085886L26148j290960
$$ 129893368 134449177 138249482 140473032 141392662 142202101 143287987 143614135 142323175
42629A42323175k223808j913348j547575k233277l565336m472141m519324l848323
$$ 142323175 140099367 138186019 136638444 134405167 130839831 126367690 121848366 118000043
42621A18000043k721032j803277k102780l747523n354783n485547m350873l249484
$$ 118000043 115279011 113475734 111372954 107625431 102270648 96785101 92434228 89184744
42613H9184744k713825k259195j778337j938806k902257l700923l479366k639446
$$ 89184744 86470919 84211724 82433387 80494581 77592324 73891401 70412035 67772589
42605F7772589k133765k161421k212591k013740j747221j557675j476417j676141
$$ 67772589 65638824 63477403 61264812 59251072 57503851 55946176 54469759 52793618
42597E2793618k138887k183782j158286K53704L20978j583778l822968m291176
$$ 52793618 50654731 48470949 47312663 47566367 47887345 46303567 42480599 38189423
42589C8189423k920317j422754p99503l91665L54917O07355l96609j630082j424804
$$ 38189423 35269106 33846352 33046849 32655184 33010101 33617456 33220847 31590765 30165961
42580C0165961P7328J027575M02512q62327j448525j113951k47256P51033J100341
$$ 30165961 30243289 31270864 31673376 30811049 29362524 28248573 28001317 28752350 29852691
42571B9852691k5192j951450k552645r87277P37205L62564j394638j960933o62073
$$ 29852691 29827499 27876049 25323404 24336127 25073332 25435896 24041258 22080325 21418252
42562B1418252O06155L65358p40212j555627j916388j841245q03734J165735K767906
$$ 21418252 22024407 22389765 21649553 20093926 18177538 16336293 15532559 16698294 19466200
42553A9466200K838926J714589M60076m56662j004589r63400l63267P7611j83788
$$ 19466200 22305126 24019715 24479791 24023129 23018540 22055140 21691873 21769484 21585696
42544B1585696o74246o27326r7506K47006j9035q84012j931535k154785o73402
$$ 21585696 20911450 20284124 20186618 20433624 20414589 19530577 17599042 15444257 14770855
42535A4770855J686844K571684Q89520j475915j985871p09732K07612k08847p94935
$$ 14770855 16457699 19029383 19918903 18442988 16457117 15747385 15954997 15746150 14951215
42526A4951215m68717K83770N76476M06184J15501l81649j080724j327666n96163
$$ 14951215 14482498 14766268 15342744 15748928 15864429 15482780 14402056 13074390 12478227
42517A2478227N20232P94588j48741j270703j272156j92585N53985N7615o33742
$$ 12478227 12998459 13793047 13644306 12373603 11101447 10908862 11462847 11520462 10886720
42508A0886720J43519K020743K686468J091038r34182j298908m95898k79818o77671
$$ 10886720 11030239 13050982 15737450 16828488 15894306 14595398 14099500 13819682 13142011
42499A3142011l59521O74679J041505M69406J26397K53995k89048j538896j708610
$$ 13142011 12782490 13457169 14498674 14968080 15094477 15348472 15059424 13520528 11811918
42490A1811918n3013J491796J010860n75339j069902k43809K89803j95381p34595
$$ 11811918 11758905 13250701 14261561 13686222 12616320 12372511 12662314 12466933 11732338
42481A1732338n08763J9521J21232q3974r625M25755O32121R9586q19539j121294
$$ 11732338 11223575 11243096 11364328 11280354 11270729 11696484 12328605 12428191 11608652 10487358
42471A0487358m01214M29730L05600m07390m63588K38850M59062l63699j268664
$$ 10487358 10086144 10515874 10821474 10414084 9950496 10189346 10648408 10284709 9016045
$$ [...]
##END NTUPLES=NMR SPECTRUM
##END=
