##TITLE=31Pdec_DE-176rm_1d
 , 24 sc
20.8.2026
##JCAMPDX= 6.0         $$ Bruker NMR JCAMP-DX V2.0
##DATA TYPE= NMR SPECTRUM
##DATA CLASS= NTUPLES
##ORIGIN= UXNMR, Bruker Analytische Messtechnik GmbH
##OWNER= root
$$ XWIN-NMR		Version 3.5
$$ Thu Aug 20 13:37:01 2026 Russian Standard Time (UT+4h)  she@DPX200
##.OBSERVE FREQUENCY= 81.013821
##.OBSERVE NUCLEUS= ^31P
##.ACQUISITION MODE= SIMULTANEOUS
##.ACQUISITION SCHEME= undefined
##.AVERAGES= 64
##.DIGITISER RES= 17
##SPECTROMETER/DATA SYSTEM= spect
##.PULSE SEQUENCE= zgpg30
##.SOLVENT NAME= DMSO
##.SHIFT REFERENCE= (INTERNAL, DMSO, 0, 197.392)
##AUDIT TRAIL= $$ (NUMBER, WHEN, WHO, WHERE, WHAT)
$$ ##TITLE= Audit trail, XWIN-NMR		Version 3.5
$$ ##JCAMPDX= 5.01
$$ ##ORIGIN= Bruker BioSpin GmbH
$$ ##OWNER= she
$$ F:/spectra/data/she/nmr/P31/2/pdata/1/auditp.txt
$$ ##AUDIT TRAIL=  $$ (NUMBER, WHEN, WHO, WHERE, WHAT)
(   1,<2026-08-20 13:35:20.62 +0400>,<she>,<DPX200>,
      <created by zg, POWCHK disabled, PULCHK disabled
       configuration hash MD5:
       00 E9 B6 7A A2 85 ED C7 34 08 36 98 17 FE 4E 26
       data hash MD5: 32K
       B9 5B 6E E1 E5 3E 82 D9 3A 47 28 30 F9 05 27 D6>)
(   2,<2026-08-20 13:35:23.78 +0400>,<she>,<DPX200>,
      <Start of raw data processing
       efp BC_mod = 2 LB = 1.5 FT_mod = 6 PKNL = 1 PHC0 = 1982.444 PHC1 = 47.69841 SI = 64K 
       data hash MD5: 64K
       94 38 AC 26 81 27 EC C2 77 0D F9 17 1E BE EC 07>)
(   3,<2026-08-20 13:35:58.92 +0400>,<she>,<DPX200>,
      <pk PHC0 = -23.45499 PHC1 = 39.2 
       data hash MD5: 64K
       DD 0B 66 CF 89 45 8B 85 9C A6 22 FA 13 3D B1 0E>)
(   4,<2026-08-20 13:36:03.62 +0400>,<she>,<DPX200>,
      <abs ABSG = 5 
       data hash MD5: 64K
       06 D3 46 F8 75 9B C9 4F ED 71 D8 50 41 BC D7 6D>)
$$ ##END=
$$ 
$$ hash MD5
$$ DA 68 C2 42 0F A1 83 7E 48 72 B2 3E 3C 56 CB 1F
##$RELAX= 
##$RELAX= 
##$RELAX= 
##$RELAX= 
##$RELAX= 
##$RELAX= 
##$RELAX= 
##$RELAX= 
$$ Bruker specific parameters
$$ --------------------------
##$DU= <F:/spectra>
##$EXPNO= 2
##$NAME= <P31>
##$PROCNO= 1
##$TYPE= <nmr>
##$USER= <she>
##$AMP= (0..31)
100 100 100 100 100 100 100 100 100 100 100 100 100 100 100 100 100 100 
100 100 100 100 100 100 100 100 100 100 100 100 100 100 
##$AQSEQ= 0
##$AQ_mod= 1
##$AUNM= <au_zg>
##$AUTOPOS= <>
##$BF1= 81.014009
##$BF2= 200.13
##$BF3= 200.13
##$BF4= 200.13
##$BF5= 200.13
##$BF6= 200.13
##$BF7= 200.13
##$BF8= 200.13
##$BYTORDA= 1
##$CFDGTYP= 0
##$CFRGTYP= 5
##$CHEMSTR= <none>
##$CNST= (0..31)
1 1 145 1 1 1 1 1 1 1 1 1 1 1 1 1 1 1 1 1 1 1 1 1 1 1 1 1 1 1 1 1 
##$CPDPRG= <waltz16>
##$CPDPRG1= <>
##$CPDPRG2= <waltz16>
##$CPDPRG3= <>
##$CPDPRG4= <mlev>
##$CPDPRG5= <mlev>
##$CPDPRG6= <mlev>
##$CPDPRG7= <mlev>
##$CPDPRG8= <mlev>
##$CPDPRGB= <>
##$CPDPRGT= <>
##$D= (0..31)
0 1 0 0 0 0 0 0 0 0.06 0 0.03 2e-05 3e-06 0 0 0.0002 0 0 0 0 0 0 0 0 0 
0 0 0 0 0 0 
##$DATE= 1787218520
##$DBL= (0..7)
120 120 120 11 120 120 24 19 
##$DBP= (0..7)
150 150 150 150 150 150 150 150 
##$DBP07= 0
##$DBPNAM0= <>
##$DBPNAM1= <>
##$DBPNAM2= <>
$$ [...]
##$SUBNAM3= <"">
##$SUBNAM4= <"">
##$SUBNAM5= <"">
##$SUBNAM6= <"">
##$SUBNAM7= <"">
##$SUBNAM8= <"">
##$SUBNAM9= <"">
##$SW= 400.765351723535
##$SWIBOX= (0..15)
0 1 3 0 0 0 0 0 0 0 0 0 0 0 0 0 
##$SW_h= 32467.5324675325
##$TD= 32768
##$TD0= 1
##$TE= 0
##$TE2= 300
##$TE3= 300
##$TEG= 300
##$TL= (0..7)
0 120 53 12 22 120 120 120 
##$TP= (0..7)
150 150 150 150 150 150 150 150 
##$TP07= 0
##$TPNAME0= <>
##$TPNAME1= <>
##$TPNAME2= <>
##$TPNAME3= <>
##$TPNAME4= <>
##$TPNAME5= <>
##$TPNAME6= <>
##$TPNAME7= <>
##$TPOAL= (0..7)
0.5 0.5 0.5 0.5 0.5 0.5 0.5 0.5 
##$TPOFFS= (0..7)
0 0 0 0 0 0 0 0 
##$TUNHIN= 0
##$TUNHOUT= 0
##$TUNXOUT= 0
##$USERA1= <user>
##$USERA2= <user>
##$USERA3= <user>
##$USERA4= <user>
##$USERA5= <user>
##$V9= 5
##$VALIST= <valist>
##$VCLIST= <CCCCCCCCCCCCCCC>
##$VD= 0
##$VDLIST= <DDDDDDDDDDDDDDD>
##$VPLIST= <PPPPPPPPPPPPPPP>
##$VTLIST= <TTTTTTTTTTTTTTT>
##$WBST= 1024
##$WBSW= 4
##$XGAIN= (0..3)
0 0 0 0 
##$XL= 0
##$YL= 0
##$YMAX_a= 148355
##$YMIN_a= -98044
##$ZGOPTNS= <>
##$ZL1= 120
##$ZL2= 120
##$ZL3= 120
##$ZL4= 120
##$ABSF1= 197.3918
##$ABSF2= -203.3724
##$ABSG= 5
##$ABSL= 3
##$ALPHA= 0
##$AQORDER= 0
##$ASSFAC= 0
##$ASSFACI= 0
##$ASSFACX= 0
##$ASSWID= 0
##$AUNMP= <proc_1d>
##$AZFE= 0.1
##$AZFW= 0.5
##$BCFW= 0
##$BC_mod= 2
##$BYTORDP= 0
##$COROFFS= 0
##$CY= -3
##$DATMOD= 1
##$DC= 0
##$DFILT= <>
##$DTYPP= 0
##$F1P= 0
##$F2P= 0
##$FCOR= 1
##$FTSIZE= 65536
##$FT_mod= 6
##$GAMMA= 0
##$GB= 0
##$INTBC= 1
##$INTSCL= 9.790993e-09
##$ISEN= 30
##$LB= 1.5
##$LEV0= 0
##$LPBIN= 0
##$MAXI= 10000
##$MC2= 0
##$MEAN= 0
##$ME_mod= 0
##$MI= 50
##$NCOEF= 0
##$NC_proc= -4
##$NLEV= 6
##$NOISF1= 182.463
##$NOISF2= 159.3651
##$NSP= 0
##$NTH_PI= 0
##$NZP= 0
##$OFFSET= 197.3918
##$PC= 4
##$PHC0= 1958.989
##$PHC1= 86.89841
##$PH_mod= 1
##$PKNL= yes
##$PPARMOD= 0
##$PSCAL= 0
##$PSIGN= 0
##$REVERSE= no
##$SF= 81.014063255964
##$SI= 65536
##$SIGF1= 159.3651
##$SIGF2= -187.1042
##$SINO= 113.3802
##$SIOLD= 16384
##$SREGLST= <1H.CDCl3>
##$SSB= 0
##$STSI= 65536
##$STSR= 0
##$SW_p= 32467.5324675325
##$SYMM= 0
##$S_DEV= 0
##$TDeff= 32768
##$TDoff= 0
##$TI= <>
##$TILT= no
##$TM1= 0
##$TM2= 0
##$TOPLEV= 0
##$USERP1= <user>
##$USERP2= <user>
##$USERP3= <user>
##$USERP4= <user>
##$USERP5= <user>
##$WDW= 1
##$XDIM= 65536
##$YMAX_p= 369200946
##$YMIN_p= -2717509
$$ End of Bruker specific parameters
$$ ---------------------------------
##NTUPLES= NMR SPECTRUM
##VAR_NAME=  FREQUENCY,     SPECTRUM/REAL,   SPECTRUM/IMAG
##SYMBOL=    X,             R,               I
##VAR_TYPE=  INDEPENDENT,   DEPENDENT,       DEPENDENT
##VAR_FORM=  AFFN,          ASDF,            ASDF
##VAR_DIM=   65536,         65536,           65536
##UNITS=     HZ,            ARBITRARY UNITS, ARBITRARY UNITS
##FACTOR=    0.49542278885378, 1,            1
##FIRST=     15991.5117654749, 0,            0
##LAST=      -16476.0207020576, 0,           0
##MIN=       -16476.0207020576, -2717509,    0
##MAX=       15991.5117654749, 369200946,    0
$$ Real data points
##PAGE= N=1
##DATA TABLE= (X++(R..R)), XYDATA
$$ [...]
36250a50018L1203Q9257L7836p0543j18993l3573R6907J20849M0307j1684j614
36239B9934k5451r1054p4226M6332J12523M4266j6225N4321J48935J16960J2353
36228C58668k1726L929j6563p6624r8771j08856j73371k17861j12056Q9555J91690
36217a81986J40216P2397P7710R6441Q1679P5598P7369J1596j08875j53779q2590
36206A05776k4556o7768j17592o4642M0540Q7282O1478J555q5349j61844j36674
36195c61794j3228O1724J4675k6758L8658Q4347k7876j69553j23863N5751J33506
36184c34411Q2695R8836K25901K70726J47821K4321J8326J5165q1488j60578j30125
36173A77189j05058j73817j88373k0068J59435J25830j3750J0404J74339K09016
$$ plain form
36250 -150018 -118815 -29558 8278 -62265 -181258 -214831 -117924 2925 43232 31548 29934
36239 29934 4483 -86571 -160797 -114465 -1942 42324 26099 80420 229355 346315 358668
36228 358668 336942 340871 324308 247684 148913 40057 -133314 -351175 -463231 -373676 -181986
36217 -181986 -41770 30627 108337 204778 286457 362055 439424 451020 342145 188366 105776
36206 105776 81220 13452 -104140 -168782 -128242 -40960 20518 22073 -63276 -225120 -361794
36195 -361794 -375022 -313298 -298623 -325381 -286723 -202376 -230252 -399805 -523668 -467917 -334411
36184 -334411 -251716 -152880 73021 343747 491568 515889 534215 549380 467892 307314 177189
36173 177189 72131 -101686 -290059 -310127 -150692 -24862 -38612 -28208 146131 355147
36163C55147P3330K4634J61794K31333K7143k84639m11724l02102r9485Q5687
36153a38882J86446J22998o8176j73433o1634J03428J01684n543o765Q2823N8193
36142B01139q6956j15403M6484J45630q425k27141k18087r925J28823J00258O3393
36131A9790J27405J85612J15724k4119r7643q2794o1590p8055r9535r7883r3990
36120a87078j11171j24647p6831N6999K14736K75197J76278J870j00375r6158
36110B8820q9722j40121j44714k168J73068J52449p9169k54487j64967N7419J36929
36099c26663M6564J4687J49706K69614J96172M3582M3657J82413K17182M2836
36089H79750j59553j98324j26122j07800j56987j51332m9104N4338P1792P232
$$ plain form
36163 355147 428477 453111 614905 846238 873381 588742 177018 -125084 -224569 -138882
36153 -138882 47564 170562 102386 -71047 -132681 -29253 72431 66888 60123 142946 201139
36142 201139 114183 -1220 45264 190894 182469 -44672 -262759 -272684 -143861 -43603 19790
36131 19790 147195 332807 448531 424412 326769 243975 182385 104330 4795 -93088 -187078
36120 -187078 -298249 -422896 -499727 -442728 -227992 47205 223483 225353 124978 28820
36110 28820 -60902 -201023 -345737 -347905 -174837 -22388 -101557 -356044 -521011 -463592 -326663
36099 -326663 -280099 -265412 -115706 153908 350080 393662 437319 619732 836914 879750
36089 879750 720197 521873 395751 287951 130964 -20368 -69472 -15134 56658 63890
36079F3890j00768k04179k12580o1413J55967K44059J45422J7443R284P6124R9970
36068B33219P7722O1671R392j39536k86799k57702o3917Q0273L6334j06194j91487
36057e47024j69592o1598R4434J91454J03799j03970j65671M6393K94947K65723
36047e1105r020k10867j68289k1190M4647K3024m731j9677m0243n9586p6102j02348
36035f95487j03676j7835J31029K30768K22765J51544N8875n2858j29941q2568
36025b87384O0618J55085J53895J62194K07555J45128q0144k62908k16892p4493
36015c7346q2123k08017k12189m9459P2878M6545N423N3449Q8221R846q5546o2434
36003d60752L7528P3696J4223m9175l4999O0731J73958J95928O3842j22341j68599
$$ plain form
36079 63890 -36878 -241057 -453637 -515050 -359083 -115024 30398 47841 57125 133249 233219
36068 233219 310941 372612 382004 242468 -44331 -302033 -365950 -285677 -249343 -355537 -547024
36057 -547024 -716616 -778214 -683780 -492326 -388527 -492497 -658168 -611775 -316828 -51105
36047 -51105 -60125 -270992 -439281 -460471 -415824 -392800 -397531 -417208 -457451 -517037 -593139 -695487
36035 -695487 -799163 -816998 -685969 -455201 -232436 -80892 -22017 -74875 -204816 -287384
36025 -287384 -226766 -71681 82214 244408 451963 597091 516947 254039 37147 -37346
36015 -37346 -119469 -327486 -539675 -589134 -516256 -469711 -464288 -410839 -322618 -312772 -398318 -460752
36003 -460752 -423224 -349528 -335305 -384480 -419479 -358748 -184790 11138 74980 -47361 -215960
35992b15960l2526J03988Q3175j8529l2099N1057R6979L7108o7403j34373j29778
35981b58361n6789M0563R7382J16435J74189K70432K69991J02244q4389j14966
35971E56731m4573m2510r5980n4538O1249N2963j13894k09174q1571J04329J09220
35960B42252o4221k32895k76804j89246j1942J40466J12415q4301k05814q0506
35950f50596J34314J83761Q9549N8834J04301M5524j20237j57707J6420J61801
35940a34036P7125r5309j09960J7944R5066O4113J7210j8263q6061j36334o9399
35929c77904N9939Q2367j8446o8297J8365J05938O9633r995j3191k618j04651
35918b58860k46326k08084N2301K94444K80421N3557j52578k07866j81324j72179
$$ plain form
35992 -215960 -248486 -144498 -61323 -79852 -111951 -60894 36085 73193 5790 -128583 -258361
35981 -258361 -315150 -274587 -177205 -60770 113419 383851 653842 756086 671697 556731
35971 556731 512158 469648 373668 319130 380379 433342 319448 110274 28703 133032 242252
35960 242252 178031 -54864 -331668 -520914 -532856 -392390 -279975 -364276 -570090 -650596
35950 -650596 -516282 -332521 -242972 -184138 -79837 -34313 -154550 -312257 -295837 -134036
35940 -134036 -56911 -152220 -262180 -244236 -149170 -85057 -67847 -86110 -172171 -308505 -377904
35929 -377904 -317965 -235598 -254044 -322341 -303976 -198038 -128405 -138400 -151591 -154209 -258860
35918 -258860 -505186 -713270 -660969 -366525 -86104 -32547 -185125 -392991 -574315 -746494
35908g46494j65427r6498K2353J12016J24018O2694n5089j78295j85725M647K65990
35897h35810L32625J16371j54711k16726r3535l637j9985q691J02278J85596J13010
35886d83215m5140j08112K194J93556K92631J84295o2825k12214j09041R1693
35876b56178R9895r2185j74672J5338K22285J44013j10787j87015q58J79152J48990
35865a2022J3121l7521J1059M1553j6724j27956j90258j19831K8426O2271j02218
35854d50100k53040j28905J78186L09203J49587j7727L7256J66090J35970k455
35844A24065p7254j19560k36143l02536j17565J92307K63277J8209k10446j69275
35834f34921j1782Q717p0799n0588P9343J49177R6559L4153M6038Q4640Q5272
$$ plain form
35908 -746494 -911921 -1008419 -986066 -874050 -750032 -687338 -742427 -920722 -1106447 -1101800 -835810
35897 -835810 -503185 -386814 -541525 -758251 -851786 -855423 -875408 -884099 -781821 -596225 -483215
35886 -483215 -528355 -636467 -634273 -440717 -148086 36209 -26616 -238830 -347871 -256178
35876 -256178 -156283 -248468 -423140 -407802 -185517 -41504 -152291 -339306 -340164 -161012 -12022
35865 -12022 1099 -36422 -25363 16190 -534 -128490 -318748 -438579 -410153 -347882 -450100
35854 -450100 -703140 -832045 -653859 -344656 -195069 -212796 -175540 -9450 126520 124065
35844 124065 46811 -72749 -308892 -611428 -728993 -536686 -273409 -255200 -465646 -634921
35834 -634921 -646703 -637986 -708785 -759373 -680030 -530853 -434294 -400141 -354103 -269463 -184191
35823a84191N6363L2188K9181O2911J27534J53450P0265p7556j64209j51553j33823
35812a79440j72617j80003n2812J31206J68424k791j85339j48655P1955K01607
35802c48465P2069j57185k09251n2209R0528Q1443M0300R6850J47844L6477j35950
35791c37549j11969J23594K81170J65125o7495j56101p4392K4463O5354Q3244
35781d556Q5485N1720J5814k521q3593k58061l41372j37597K15859L52698J60569
35770E4445q1524j21946m5623l3344m9174K2689J03872L5524j27043j75502o8977
35759d86603K1957j1505q9180j04400m8349N0803J62502K01455Q5986j12570k08075
35748e37979j27637J4863J03123J48406J90963K00127J43307N6135k1778j00393
$$ plain form
35823 -184191 -127828 -95640 -66459 -3548 123986 277436 347701 270145 105936 -45617 -179440
35812 -179440 -352057 -532060 -584872 -453666 -285242 -288033 -473372 -622027 -550072 -348465
35802 -348465 -276396 -433581 -642832 -695041 -604513 -523070 -482770 -385920 -238076 -201599 -337549
35791 -337549 -449518 -325924 -44754 120371 52876 -103225 -177617 -153154 -87800 -4556
35781 -4556 80929 132649 148463 145942 62349 -195712 -537084 -674681 -458822 -106124 54445
35770 54445 -27079 -149025 -194648 -227992 -277166 -254477 -150605 -115081 -242124 -417626 -486603
35759 -486603 -464646 -476151 -565331 -669731 -718080 -667277 -504775 -303320 -217334 -329904 -537979
35748 -537979 -665616 -650753 -547630 -399224 -208261 -8134 135173 191308 169530 69137
35738F9137j78386k08158j64488p3172N1257K00892K89652K02885j5400j52312
35728B1907q1973P5369J30472N8895k9971o2551m3098l221L925o8228j66021j61562
35716c26057m7396R738q6359j85866j09452N9971Q3397q7283k48203k20532l5689
35705a193731J61463K61413K30819J21025N0310Q5087J44643J15707L3186K6530
35695C6452J04760J34660M4618p9737j28932q5695J0947J03160J00298m3537k07743
35684a0749j98693j8735R4941j7882k15446k53035j07421L6708O8247O4199J16916
35673d40950J81352J60352O5589N294K7011N3322N607p1700q2091l6338l6437
35662a68989r7999j15313n1940k8992j19086j78133m3750J82518K46107J02420
$$ plain form
35738 69137 -109249 -317407 -481895 -555067 -503810 -302918 -13266 189619 174219 21907
35728 21907 -60066 15303 145775 204670 174699 112148 69050 65829 69754 1526 -164495 -326057
35716 -326057 -373453 -363715 -450074 -635940 -745392 -685421 -602024 -689307 -937510 -1158042 -1193731
35705 -1193731 -1032268 -770855 -540036 -419011 -368701 -283614 -138971 -23264 9922 36452
35695 36452 141212 275872 320490 240753 111821 26126 37073 140233 240531 196994 -10749
35684 -10749 -209442 -228177 -133236 -151118 -366564 -619599 -727020 -690312 -622065 -557866 -440950
35673 -440950 -259598 -99246 -33657 -28363 -1352 51970 57577 -14123 -96214 -132552 -168989
35662 -168989 -266988 -382301 -434241 -463233 -582319 -760452 -804202 -621684 -375577 -273157
35652b73157l0203N388J20113J68782J46381J06866L6797p4809j47486j06856
35642d8184n977M2150L277p3034j31106j32235n8112M7990R1059K6264q6774j55460
35630d80142j28869J104J85309K91986K10875K3167m9877P2349K16436J97561
35620E39899N9748k6119n852L1992N153r2265k14925k74458j82261L2722K11365
35609H4999K45821J96319J47563N6394j28931k88465k41634j2153J68902J32600
35599C61415o4712k47113k89383j81737j4142R3062R9295P6820R9743J46748J57708
35588B37704J15631J6430j46105k84720k28374M2898K80408K47536L4633q4600
35578B31441l9270K001o1917j44537j60715j24857l6342J32512K93936K83721
$$ plain form
35652 -273157 -303360 -297972 -177859 -9077 137304 244170 280967 206158 58672 -48184
35642 -48184 -54161 -12011 -8734 -81768 -212874 -345109 -403221 -355231 -264172 -237908 -324682 -480142
35630 -480142 -609011 -607907 -422598 -130612 80263 103430 53553 125902 342338 539899
35620 539899 599647 573528 567676 599668 604821 512556 297631 23173 -159088 -126366 84999
35609 84999 330820 527139 674702 731096 602165 313700 72066 59913 228815 361415
35599 361415 296703 49590 -239793 -421530 -435672 -342610 -243315 -166495 -66752 79996 237704
35588 237704 353335 369765 223660 -61060 -289434 -246536 33872 281408 316041 231441
35578 231441 192171 194172 132255 -12282 -172997 -297854 -334196 -201684 92252 375973
35568C75973R9870p2978j30524j59385k21673k26463j13135J5852O0646O6445
35558c05372Q7191O2202m1781j09753m5693O0058P6802M0212O5663J47931J93435
35547B30895J73831J13865Q918j11829j31588o422J03910K9401j53937k28703
35537B8341j39989k4498J5503q209p7744j75246k05000q9377P2286J16975P0507
35526d16451R6081K07201K49891J79013J16046R1332k1811k31244l29457k03248
35516b62647k2844K9454J6917O0664R0201J976q9847j2747J55103J86345N5233
35505B07808n4061n5625m0099n2374k6356L3268K2963o1510j00329p0495q5228
35494b82038j49811r9687J09319K58783J69410k6904r0163p830N8557M9428K7469
$$ plain form
35568 375973 475843 402865 272341 112956 -108717 -335180 -448315 -432463 -371817 -305372
35558 -305372 -218181 -155979 -197760 -307513 -353206 -293148 -216346 -176134 -110471 37460 230895
35547 230895 404726 518591 527509 415680 284092 277670 381580 410981 257044 28341
35537 28341 -111648 -136146 -120643 -128852 -206596 -381842 -586842 -676219 -603933 -486958 -416451
35526 -416451 -320370 -113169 136722 315735 431781 523113 501302 270058 -59399 -262647
35516 -262647 -285491 -256037 -239120 -178456 -88255 -86279 -176126 -188873 -33770 152575 207808
35505 207808 153747 98122 58023 5649 -20707 12561 35524 -25986 -126315 -196810 -282038
35494 -282038 -431849 -531536 -422217 -163434 5976 -20928 -111091 -118921 -60364 -10936 16533
35483A6533k307q4572j61505j27004k5222p625q0513q2937M1117J31648O1160
35472c21227n9115m8121O9721J01321l4932j89679j70679K0262J92297J96025
35462b44127R2335M0876N7982P318j37183j80356N018K10132J36641j44894k53919
35451d10177n1321J50779O5264j36963j03413J56887K94765J36559r7177j39590
35441a34387k4757L0578m5584j17891o7029M5685P2559j6115q8382l0706Q4468
35430b91561Q9524l8938j43191j12896k7159J664N178O4828J36949J17221K2821
35419a75560l5788l0837k4291k7507k136J7650l4652r7684l8956J03210J22572
35408b23979m1871j74483p6122J57195K82070K21503Q6932k8293j17239j58297
$$ plain form
35483 16533 14226 -70346 -231851 -358855 -384077 -391702 -472215 -555152 -514035 -382387 -321227
35472 -321227 -380342 -428463 -358742 -257421 -292353 -482032 -652711 -632449 -440152 -244127
35462 -244127 -151792 -110916 -52934 -45616 -182799 -363155 -358137 -148005 -11364 -156258 -410177
35451 -410177 -461498 -310719 -245455 -382418 -485831 -328944 -34179 102380 5203 -134387
35441 -134387 -159144 -128566 -174150 -292041 -359070 -313385 -240826 -256941 -345323 -376029 -291561
35430 -291561 -202037 -240975 -384166 -497062 -524221 -522557 -517379 -452551 -315602 -198381 -175560
35419 -175560 -211348 -242185 -266476 -293983 -296119 -278469 -313121 -410805 -449761 -346551 -223979
35408 -223979 -265850 -440333 -516455 -359260 -77190 144313 231245 202952 85713 -72584
35398g2584r8337M6256J71150J88035R2886n5831j68552j62487m6104M8825J73
35387e6570j38951j81824k9682K06843L23974K16908n2544l25666m53225l69502
35377h60239j17204J71899L32687K60690J3488j96857j94913m2402L8701k7881
35367f22031o3967Q0694K63128K31164N683j30365l6383J02547P8502m2714p6789
35356b10531l1636o1372j72715j90003k8730J77023K74479K65829K08735R3238
35346C24317o5064j35319l6305Q6362K8822j56328k06362k9239J55080J31502
35336I7466k3453r9132o0645l2707n1314k1328Q1489J33131L7703j33340k39371
35325c11501k27937j36488o154J28763K00636J45363j220j01031n7826N5482P6524
$$ plain form
35398 -72584 -170921 -124665 46485 234520 327406 271575 103023 -59464 -105568 -56743 -56570
35387 -56570 -195521 -377345 -407027 -200184 123790 340698 288154 -37512 -490737 -860239
35377 -860239 -977443 -805544 -472857 -212167 -198679 -395536 -590449 -632851 -594150 -622031
35367 -622031 -685998 -605304 -342176 -111012 -105329 -235694 -272077 -169530 -91028 -133742 -210531
35356 -210531 -242167 -303539 -476254 -666257 -694987 -517964 -243485 22344 231079 324317
35346 324317 259253 123934 87629 173991 202813 46485 -159877 -189116 -34036 97466
35336 97466 74013 -25119 -85764 -118471 -169785 -191113 -109624 23507 61210 -72130 -311501
35325 -311501 -539438 -675926 -682080 -553317 -352681 -207318 -208538 -309569 -367395 -311913 -235389
35314b35389k5625q8322J9751J85758J92060L4521o5421J2431J30477J37641Q5254
35303C83136P1082M2649n9614j08653K5672J93625J28039j43676l09802k09090
35293A3368q467R5949J13669J15726P9551o699o7164q0276j35132k38159k31911
35282c49545l8168J68859J80077K3962j14427j37632o7610N9392J88079K18786
35272A31773J18958o777n9735p6061j18736j48366j11938n1142o269P1137J86392
35261g0764K14830R5592k0506J0119Q3942K5979j13049j59463j17792j20414j48185
35250c19711p1506O4651P9150j4441L25J64968K34522N5060j82435k18066p6471
35239b83954K3257l900l6707L7264J60215J79523M5817r4596n5787J27809K08153
$$ plain form
35314 -235389 -261014 -349336 -329585 -143827 48233 82754 17333 29764 160241 297882 383136
35303 383136 454218 496867 437253 328600 354272 547897 675936 532260 222458 13368
35293 13368 4901 100850 214519 330245 409796 403097 335933 255657 120525 -117634 -349545
35282 -349545 -387713 -218854 -38777 -14815 -129242 -266874 -334484 -275092 -87013 131773
35272 131773 250731 243954 184219 108158 -10578 -158944 -270882 -322024 -328293 -257156 -70764
35261 -70764 144066 239658 219152 229271 313213 339192 226143 66680 -51112 -171526 -319711
35250 -319711 -391217 -326566 -247416 -261857 -261532 -96564 137958 193018 10583 -207483 -283954
35239 -283954 -260697 -264597 -301304 -264040 -103825 75698 121515 26919 -28868 98941 307094
35228C07094O4208j09748j06255l7021j19901k61600j87889N5971J21061p3845
35218c47925j79539K1162K53793J96179k6056r1556N084L5759k3738J231J10716
35207d4890J06479m9554j52974q7780J4615K7047J4866O3695J04290M9316k5267
35196A9843J2508J31879J69144N8895q0205j13783o2058m5024r9256j31190o9006
35185b08253J9755L4721J0268N8271J56256J42431k4698j46213m1022J74893K23744
35174D00153M5040j22543p1642R5211J14139p7405k51586j92394J3659R7745j5927
35163C4450j15582l9485O3778k4030k14587k21527q724J42269O3704o4918m0672
35152d25324M3465q36j13269p8688J23621K83131K41799M6611j59773k60379k02467
$$ plain form
35228 307094 371302 261554 155299 118278 -1623 -263223 -451112 -395141 -274080 -347925
35218 -347925 -527464 -506302 -252509 -56330 -82386 -173942 -168858 -133099 -156837 -155606 -44890
35207 -44890 61589 12035 -140939 -228719 -214104 -187057 -172191 -108496 -4206 45110 19843
35196 19843 32351 164230 333374 392269 312064 198281 136223 91199 -8057 -139247 -208253
35185 -208253 -188498 -153777 -143509 -85238 71018 213449 188751 42538 1516 176409 400153
35174 400153 445193 322650 251008 346219 460358 382953 131367 -61027 -47368 50377 34450
35163 34450 -81132 -120617 -56839 -80869 -295456 -516983 -525707 -383438 -319734 -384652 -425324
35152 -425324 -381859 -382695 -495964 -574652 -451031 -167900 73899 120510 -39263 -299642 -502109
35141e02109m6140M7463j0376j08582q8728L1564J13869J16050R9574O5982l3288
35130c14721j30057o5812J71398L80776L79969K02599K0902m7375k1297p818q4970
35119D83594j94614j88821m4113M9352o5606k49090k23130L3339K47835K33192
35109H1938J01992L6350L3765l12n7594p3930p7282j40821k34275k48761j53059
35098g31989k4042P3108J45990K04965K07993J16280k9334j29920j30421p6313
35088c73683m7176m7371q144R0299J56965R8079n0803j55771j26587J3238J65272
35077b85682K19566J23047n3104j50618r1178L1030Q1028M7648j194n3290j23844
35066b56591j49515n6034R3606J64353J50706J59958J94235J24943p4050k38593
$$ plain form
35141 -502109 -548249 -500786 -511162 -619744 -708472 -676908 -563039 -446989 -347415 -281433 -314721
35130 -314721 -444778 -510590 -339192 41584 421553 624152 645054 597679 576382 568564 483594
35119 483594 288980 100159 56046 105398 39792 -209298 -432428 -399089 -151254 81938
35109 81938 183930 220280 254045 253733 196139 122209 44927 -95894 -330169 -578930 -731989
35098 -731989 -756031 -682923 -536933 -331968 -123975 -7695 -37029 -166949 -297370 -373683
35088 -373683 -420859 -468230 -476374 -386075 -229110 -131031 -181834 -337605 -464192 -450954 -285682
35077 -285682 -66116 56931 3827 -146791 -237969 -206939 -125911 -78263 -79457 -132747 -256591
35066 -256591 -406106 -462140 -368534 -204181 -53475 106483 300718 425661 351611 113018
35056A13018k39839j54800j17397j24446j00269m9565j8184K5363J36867K64964
35046b64288K96897K21742J37113R2410L6045n3401r2712k6450M3683k1766j75018
35035A94255k13757p7089L8100k9255j27902j5459K17768K24180p0828l09707
35025a69694k08154M9794J30112K8022m0640l7217o7065p9798M3926J78992R8277
35014g3445r7764q2811J39388J95462m0925k13196n5059J87135J76178K078m6573
35003I0468K5917J6311o9189o4107K533n5250k26114k91817j67979P799J25999
34992f05429J94235J73126j6260k71360l31377j12799J59334K42359J44450J9034
34982d04687o1685j12059j12923j8354J39299K39109J89730L6048p3737m6755
$$ plain form
35056 113018 -126821 -281621 -399018 -523464 -623733 -673298 -691482 -666119 -529252 -264288
35046 -264288 32609 254351 391464 483874 519919 466518 373806 347356 391039 369273 194255
35035 194255 -19502 -96591 -58491 -87746 -215648 -231107 -13339 210841 140013 -169694
35025 -169694 -377848 -328054 -197942 -169920 -210560 -247777 -314842 -394640 -350714 -171722 -73445
35014 -73445 -171209 -254020 -114632 80830 39905 -173291 -228350 -41215 134963 137041 90468
35003 90468 116385 132696 63507 -600 1933 -53317 -279431 -571248 -739227 -731428 -605429
34992 -605429 -411194 -238068 -254328 -525688 -857065 -969864 -810530 -568171 -423721 -404687
34982 -404687 -466372 -578431 -691354 -709708 -570409 -331300 -141570 -105522 -179259 -226014
34972b26014M4455O1872k354k8016K5609N3590L803j6340N6747Q5445n8198k43815
34960b43216k39328l9170J56632K32529K28586J67512K8903j09333j16043k2759
34950D4313p846j22952k05397j18654O7009J93349J91511R1169m0003j24131j27663
34939a59295j05617j13808j00959M926J40527J76815J16483P0977O9964O1446
34929A61459O6813J34340J62520R433k14552k30325j6807J25497L4217p7468L060
34918A58187J48403J44487N0131L9541O2570m2668k05765j96266r336R8109j1585
34907B35808j68355j57771k789J05784N5882q4068j62776j09507j0427Q6p1657
34896c69790q3812J2661Q5462N6312P0956K55746M26661K91495r6622l52838k69231
$$ plain form
34972 -226014 -181559 -119687 -122041 -150057 -124448 -70858 -67055 -83395 -26648 58797 599 -243216
34960 -243216 -482544 -521714 -365082 -132553 96033 263545 292448 183115 67072 44313
34950 44313 36467 -86485 -291882 -410536 -343527 -150178 41333 132502 92499 -31632 -159295
34939 -159295 -264912 -378720 -479679 -474753 -334226 -157411 -40928 30049 100013 161459
34929 161459 228272 362612 525132 534565 320013 89688 72881 198378 232595 155127 158187
34918 158187 306590 451077 501208 540749 603319 560651 354886 158620 149284 247393 235808
34907 235808 67453 -90318 -93107 12677 68559 -15509 -178285 -287792 -298219 -298133 -369790
34896 -369790 -453602 -440941 -355479 -299167 -228211 27535 454196 745691 649069 296231 27000
34885B7000o8727n0145j86795k37591j16486L8167J05729J21306J57946J94740
34875a4856J57994L9497p5116r0842k424R2406Q3868l9161j70704j84743n8139
34864b62220R6996J37259M4929m0159Q789J28006J44732L5596k5978O2824J58384
34853D89158Q5028q4918j36073l3981M5385m530j01903j55936j72507j31629L6495
34842a65411K51818K59846k5679l10501k62918K7066J67259O022j93628j62888
34832d09014K2793J19653O5241j1843l0108l1198m8693m5663P40M9112N1842M128
34820b63010o9504j25403j07501o707R2745R5401K5334L981Q3916J71873J42870
34809D3995j8084k04015k72573j50611Q2966K23833J36465p0355j55219m3812
$$ plain form
34885 27000 -41727 -91872 -278667 -516258 -632744 -594577 -488848 -367542 -209596 -14856
34875 -14856 143138 182635 107519 16677 14253 106659 190527 151366 -19338 -204081 -262220
34864 -262220 -165224 -27965 16964 -23195 -14406 113600 258332 293928 267950 330774 489158
34853 489158 574186 489268 353195 319214 364599 360069 258166 102230 -70277 -201906 -165411
34842 -165411 86407 346253 320574 10073 -252845 -225779 -58520 -52498 -246126 -409014
34832 -409014 -386221 -266568 -201327 -213170 -243278 -274476 -323169 -368832 -368092 -318980 -267138 -263010
34820 -263010 -332514 -457917 -565418 -572125 -479380 -383979 -358645 -354664 -270748 -98875 43995
34809 43995 25911 -178104 -450677 -601288 -518322 -294489 -158024 -228379 -383598 -427410
34799d27410R6102J07500L4247p920p408M887O2789J65796J81135K0586j58376
34788G1928j21878J03855K58372K03204N8751l5217r6228j69648k00926j44593
34778g2380p3563p0589r9161p4761M602P5906J02642Q8915N0455J1193j6842o1661
34766a35244j39267j86223j35785m1407J066L5164J77147L59751L51429R7653
34756C84284j59229k02001r3023M481N9616Q2238J434j68443k17823k8709J74158
34745a63017J13313j14435j78122n333J58118J55541R2166P3822M8926j4560k9711
34734A36708L5897P7702L3166k3805m1011p2885j31192j20287j4768N3348j0998
34723g8125j17691j37117p4399p714L0317K3767n3706j47311j21854M8883K03555
$$ plain form
34799 -427410 -331308 -223808 -189561 -197481 -204889 -200002 -137213 28583 209718 230304 71928
34788 71928 -49950 53905 312277 515481 574232 539015 442787 273139 72213 -72380
34778 -72380 -145943 -216532 -315693 -390454 -385852 -309946 -207304 -118389 -67934 -56741 -73583 -135244
34766 -135244 -274511 -460734 -596519 -637926 -636860 -601696 -424549 -64798 286631 384284
34756 384284 225055 23054 -69969 -65488 -5872 76366 77800 -90643 -308466 -337175 -163017
34745 -163017 -49704 -164139 -342261 -347594 -189476 -33935 58231 132053 180979 166419 136708
34734 136708 172605 250307 283473 259668 218657 145772 14580 -105707 -120475 -67127 -78125
34723 -78125 -195816 -332933 -407332 -415046 -384729 -360962 -414668 -561979 -683833 -634950 -431395
34712d31395J97773Q0426j8673n5265l3782N6883J54847J13708p8611k05654j15292
34701c35035K2155m2427k32877k34704M3910L38811L86340K10958N175j02660
34691E9646q8723J4150J17600J26286M9718q632p748k6401j27612k52895k94640
34680d39251k05474j4303J88577K72135J71873J349m9459M2155J07545M8830j6091
34669A07886M1407J43194J27984M457p1169l1012L1483J6221p5828j95282k97132
34658a97791l20693k10827P58J92712K60674J94680N9890m7126l9599Q5472K11964
34647A90114K14491J07337J2651j3830k9583p0054q4026m7803l0857p5879j10855
34636F1706o6025J0742N3623J03232K01196K37750Q0443j68890k37240m1682J79361
$$ plain form
34712 -431395 -233622 -153196 -171869 -227134 -260916 -204033 -49186 64522 -14089 -219743 -335035
34701 -335035 -312880 -355307 -588184 -822888 -778978 -440167 -53827 157131 162306 59646
34691 59646 -29077 -14927 102673 228959 278677 270045 262297 235896 108284 -144611 -439251
34680 -439251 -644725 -659028 -470451 -198316 -26443 -25094 -74553 -32398 75147 123977 107886
34669 107886 149293 292487 420471 424928 353759 322747 354230 370451 294623 99341 -197791
34658 -197791 -518484 -729311 -728553 -535841 -275167 -80487 -20597 -67723 -107322 -21850 190114
34647 190114 404605 511942 524593 510763 481180 411126 327100 279297 248440 172561 61706
34636 61706 -4319 6423 60046 163278 364474 602224 682667 513777 276537 234855 414216
34625D14216J76610p743j58368j93055j96037j97254r4946J51754L70395L24746
34615E90318M859l12300l39436q7260J65086K03395Q9699k024m3160j11679j75377
34604a7879j14012L5857O5743r5983k42406j79573m095P1981M6713P5800J70870
34593a86984J79395O1042l2991r169K5868l5428j09833o0232O9839J02798j8920
34582a4615j50225j40465k7013L0419k4761o5127M3558K39659L20855J97558P602
34571D17445n0517O9645K45346L08009J57203j53950m04906l89370j69910k4246
34561D749o4781q2552R8179L04899K81994J11032O5546J39733P2215j67570k84183
34550D79261j33417M5070K6357o7721l8629M0210j0056j45635j89600j19401l6612
$$ plain form
34625 414216 590826 583083 424715 231660 35623 -161631 -256577 -104823 265572 590318
34615 590318 595177 282877 -56559 -143819 21267 224662 314361 312337 269177 157498 -17879
34604 -17879 -131891 -96034 -30291 -126274 -368680 -548253 -552348 -480367 -433654 -357854 -186984
34593 -186984 -7589 53453 20462 11293 37161 1733 -108100 -168332 -98493 4305 -14615
34582 -14615 -164840 -305305 -332318 -301899 -326660 -391787 -348229 -108570 212285 409843 417445
34571 417445 366928 436573 681919 989928 1147131 993181 588275 198905 28995 4749
34561 4749 -60032 -142584 -44405 260494 542488 653520 719066 858799 931014 763444 479261
34550 479261 345844 390914 417271 349550 310921 351131 341075 195440 5840 -113561 -150173
34539a50173M1282J38355J65283L3382j41060j60559l1145O7490N1569j0042n9001
34528e4619q3561m4627M6318M1004j43015l04626j97536O6526J52130K5732K575
34517d93699K03671L29472J46894j20408j43700J3792N0866q2081j63627r7227
34507c56047k5473m7152p7213l7835J7520M0363Q1855J71404K30382J91749J11169
34496C00722P9709R0531N9586n7571k07986k76213j81210J4009J17029J9860j23866
34485a65400o7012J78205L21893J94158j4271l8862Q4926J23792J5260r6918j47048
34474C88723k11108k69701j73206O6164J96776R4100j6784Q9081K57119J93833
34464F14997m9198j56440o1385k8035j76008k66767j05697J32725J87128R3228
$$ plain form
34539 -150173 -108891 29464 194747 228129 87069 -73490 -104635 -37145 14424 4382 -54619
34528 -54619 -138180 -182807 -136489 -95485 -238500 -543126 -740662 -674136 -522006 -496274 -493699
34517 -493699 -290028 39444 186338 65930 -77770 -63978 -13112 -95193 -258820 -356047
34507 -356047 -381520 -428672 -505885 -543720 -526200 -485837 -403982 -232578 -2196 189553 300722
34496 300722 380431 470962 530548 472977 264991 -11222 -192432 -178423 -61394 -41534 -165400
34485 -165400 -232412 -54207 267686 461844 447573 408711 493637 617429 632689 535771 388723
34474 388723 177615 -92086 -265292 -199128 -2352 91748 74964 164045 421164 614997
34464 614997 565799 409359 347974 319939 143931 -122836 -228533 -95808 91320 184548
34454A84548N2314Q5030P0800J8751L6065Q4604K4866j11591j36708j4916P0974
34443C64737J8826m1299J1295Q3111L6719p5196r9146j7651N0291M0315J163k3908
34431C49257n4924r4449q4301P112J10035J27218O3373J6580K5535n708j62266
34420B97462l42205l42502j34534P2139J03267L6454M1259J14518J29335P5653
34410E0846O6834J24795J41496P5334J6694J4620j406o2579p5761J4165J09487
34399D74525J09164N8611M1966L1882k7566p9712m3158K0755j6281j31665j59955
34388B78566k9001J39327J93202J13296j8987j21746j40788o1891M9513Q3343
34378D84834J7555l1365M9035K07705K78701J74708l1223k14907l20398l44827
$$ plain form
34454 184548 236862 321892 392692 411443 447508 532112 556978 445387 308679 293763 364737
34443 364737 383563 342264 353559 436670 473389 398193 299047 281396 331687 372002 373165 349257
34431 349257 294333 199884 115583 122695 232730 359948 423321 439901 465436 459728 297462
34420 297462 -44743 -387245 -521779 -449640 -346373 -309919 -268660 -154142 -24807 50846
34410 50846 117680 242475 383971 459305 475999 490619 489213 426634 350873 365038 474525
34399 474525 583689 642300 684266 716148 688582 608870 565712 586467 570186 438521 278566
34388 278566 249565 388892 582094 695390 676403 554657 413869 351978 401491 484834
34378 484834 502389 471024 520059 727764 1006465 1181173 1149950 935043 614645 269818
34368B69818k75469j14729N7069J22426M9886o6566j03136p712J84248L71287
34358D87122M20648K68871K4211j13042q0237j4287k5115k7973P5156J56555M660
34347A176569l23990n03752l38486M576K27512K25025R3676m5757j16853p4678
34337C23842M5065J11705M0511q5428j22856o1176j1995l0114n0042r936N2646
34326B02222O6082K6197j2346j4689P488L6610P1385R2263M6594p8429j83530
34315B59847j36559N0229J99323J78596O1814M001K6067K9921k1553o7716p5378
34304E08592p4669o7310j6141O1077R4136P0846M9737O0786Q9060J39147J99688
34293A114949J71586j8104k43878k93568j56922k4143J0465L6117R0027P1745
$$ plain form
34368 269818 -5651 -120380 -63311 59115 109001 42435 -60701 -68413 115835 487122
34358 487122 907770 1176641 1200852 1087810 1007573 993286 968171 940198 1015354 1171909 1176569
34347 1176569 852579 348827 10341 14917 242429 467454 561130 515373 398520 323842
34337 323842 368907 480612 521123 435695 312839 251663 239668 209554 159512 149576 202222
34326 202222 268304 294501 282155 267466 274954 311564 382949 475212 521806 443377 259847
34315 259847 123288 173517 372840 551436 613250 617251 643318 673239 651686 583970 508592
34304 508592 433923 366613 350472 411549 505685 576531 626268 687054 776114 915261 1114949
34293 1114949 1286535 1268431 1024553 730985 574063 549920 560385 596502 686529 758274
34283G58274l3139p8584j2623J9895n0135p3859L7104J26577O9700j81M5263P0984
34271H79276n4460j47698J5500K78558L06290J05843j0606O6889J29191M0152
34261A608935q6774j48956j95942k42906j99486n7858O3926J13792J38649J17399
34251A110779n193j14410k8805J62077J59062p9705k37852j18670P4332R2732
34241A014347N093K242O4615M5589o7728j67496j83272r6029P2446J84450P5012
34230I49269j77513k71321r6113R6174Q6229L931M7591J36998J11972O0728J40882
34219A088827K41518J56127k9564o6428K1138j8056k06125k81601j36662J5638
34209G84812m871j00778j13180n5752k0610k5670m4534m6678L2114K03577L02480
$$ plain form
34283 758274 725135 646551 633928 653823 603688 529829 566933 693510 763210 763029 808292 879276
34271 879276 824816 677118 692618 971176 1277466 1383309 1372703 1439592 1568783 1608935
34261 1608935 1522161 1373205 1177263 934357 734871 677013 740939 854731 993380 1110779
34251 1110779 1105586 991176 962371 1124448 1283510 1203805 965953 847283 921615 1014347
34241 1014347 1019440 1021682 1086297 1131886 1064158 896662 713390 617361 689807 874257 949269
34230 949269 771756 500435 404322 500496 586725 590656 638247 775245 887217 947945 1088827
34219 1088827 1330345 1486472 1456908 1390480 1411618 1393562 1187437 905836 769174 784812
34209 784812 779941 679163 565983 510231 489621 463951 419417 372739 404853 608430 910910
34198I10910J49029j41745k45075p7413Q1742J2719j48141j78508j04968p2420
34188A86130o0567M4517K08327K84968K30866J18556L548p8055n8993N7706J22414
34177A059417K5920j07591q7223N1291J15826P2152N9053R7593L9408j33695k03979
34166I88172m3934J51766J36861l2642j19623q1247q7945j92565k20122n0911
34156D47810J76351K53816J65375M3275l1890n9876k8611O2013J28117R7769N4368
34145A308517J32207K74304K66586N0245j72638k22018j66085j52447j61860q6268
34135A070543N4277J44044J53470J26564M6082j13709k41438j87687l417J02036
34125A150765M7830n0075r9651j18683p9350R4908L03807K89322J6353j93879
$$ plain form
34198 910910 1059939 918194 673119 595706 677448 690167 542026 363518 258550 186130
34188 186130 125563 170080 378407 663375 894241 1012797 1016345 938290 879297 937003 1059417
34177 1059417 1085337 977746 890523 941814 1057640 1129792 1188845 1286438 1325846 1192151 988172
34166 988172 944238 1096004 1232865 1200223 1080600 999353 911408 718843 498721 447810
34156 447810 624161 877977 1043352 1086627 1054737 994861 966250 1028263 1156380 1254149 1308517
34145 1308517 1440724 1715028 1981614 2031859 1859221 1637203 1471118 1318671 1156811 1070543
34135 1070543 1124820 1268864 1422334 1548898 1594980 1481271 1239833 1052146 1048729 1150765
34125 1150765 1198595 1148520 1048869 930186 850836 945744 1249551 1538873 1555226 1361347
34115A361347r4601J26980J52010J5773m898J13598R9219j51312l75768l16235
34105I26113n2973J61174K26550K17918K01892J69749R0094n8797k53811l79074
34095A248835l05843p7797Q8567O4533l5211m6944O871N444m3701l2077M4161
34084I16838P7631M3330L9046J07082J58597J22322M3768k0788q9086j54912j20788
34073A123040N5551K27740K12291M1707o8489j0017Q8737O6463m7284r5157j4387
34062A580195J00555J40755J02783M8052N761l9908r1614j11920o4381L4659J21298
34051A826235J47637J31982J25645J30867R3510O072l1754O7255K15714K16511
34041B929674K4235j62433j47504R953J00991N6887j3405m2872q2148j29747p6389
$$ plain form
34115 1361347 1266746 1393726 1545736 1561509 1556611 1670209 1769428 1618116 1242348 926113
34105 926113 873140 1034314 1260864 1478782 1680674 1850423 1940517 1881720 1627909 1248835
34095 1248835 942992 865195 953762 1018295 983084 936140 943011 948455 904754 872677 916838
34084 916838 994469 1037799 1076845 1183927 1342524 1464846 1508614 1487826 1398740 1243828 1123040
34073 1123040 1178591 1406331 1618622 1660329 1591840 1581823 1670560 1737023 1689739 1594582 1580195
34062 1580195 1680750 1821505 1924288 1972340 1978101 1938193 1846579 1734659 1670278 1704937 1826235
34051 1826235 1973872 2105854 2231499 2362366 2455876 2461948 2430194 2497449 2713163 2929674
34041 2929674 2953909 2791476 2643972 2653925 2754916 2811803 2798398 2755526 2673378 2543631 2467242
34030B467242Q8091J75848N0194j47731j84851o2305K3006j1440n6576l3540J487
34019B309425O267L2830J00852J38356J12909Q8181Q6484L4032p7056j12624O768
34008B726424J49088J37798n884j05108n1457J08827K51869K59494R9933r8126
33998C472858j40418j0465R6301O6712M2766J62297K94331K44871R7033Q7337
33988D413623K17143K64844J65559R8727J62605K24857J80920J37631K28112M10852
33978F504873N49122N58843M23558K05369P4622J61190L43417L73654K47679K25108
33968I667435M22858O40165O91123O51059O24642N28315L04831J24519J38682
33959A3793629K25426K18777J98620K80427K99487M1216l32106m50035k91266
$$ plain form
34030 2467242 2555333 2731181 2781375 2633644 2448793 2386488 2409494 2398054 2341478 2307938 2309425
34019 2309425 2315692 2348522 2449374 2587730 2700639 2788820 2875304 2909336 2832280 2719656 2726424
34008 2726424 2875512 3013310 3007426 2902318 2850861 2959688 3211557 3471051 3570984 3472858
33998 3472858 3332440 3321975 3418276 3484988 3527754 3690051 3984382 4229253 4326286 4413623
33988 4413623 4630766 4895610 5061169 5159896 5322501 5547358 5728278 5865909 6094021 6504873
33978 6504873 7053995 7612838 8036396 8241765 8316387 8477577 8820994 9194648 9442327 9667435
33968 9667435 10090293 10730458 11421581 12072640 12697282 13225597 13530428 13654947 13793629
33959 13793629 14019055 14237832 14436452 14716879 15016366 15057582 14725476 14275441 13984175
33950A3984175k19698m35900p12941p58350n69341l26347j57607j18009k17018
33941A0468964l61108m10917l70668l86118n02214n72062m68322k46295l9315
33932G111945P6152O6202o4736k08773k25702j37371j16773k32237l47776l37689
33922E583242k47748j65862q3530J5036O0798J0688n5743n5494k4614k4941k0796
33911D991036M5034J22672J05949k5869j82300k41200j29293J05072K77725K25129
33901E293955J2419j16261l4344J29917J92624J23282k55j08059j31617j5638
33891E346023J67405K37009J38815L7161O6789J25168N3797r1636j28298k9579
33881E922654N8971N5794K7791L4874L5685j3452o9643o7610j8134P274j7821
$$ plain form
33950 13984175 13764477 13328577 12615636 11857286 11287945 10961598 10803991 10685982 10468964
33941 10468964 10107856 9696939 9326271 8940153 8437939 7865877 7397555 7151260 7111945
33932 7111945 7188097 7254299 7189563 6980790 6755088 6617717 6500944 6268707 5920931 5583242
33922 5583242 5335494 5169632 5086102 5101138 5161936 5172624 5116881 5061387 5036773 5011832 4991036
33911 4991036 5036070 5158742 5264691 5238822 5056522 4815322 4686029 4791101 5068826 5293955
33901 5293955 5306374 5190113 5155769 5285686 5478310 5601592 5601337 5493278 5361661 5346023
33891 5346023 5513428 5750437 5889252 5926413 5993202 6118370 6172167 6080531 5952233 5922654
33881 5922654 5981625 6037419 6065210 6100084 6135769 6122317 6052674 5985064 5966930 5974204 5956383
33870E956383j7345R7019K70493L21427J85013M8111R9966K32926K07137O3642
33860G464772P8650K73127L08090J5270k91961k77494p4957j4589p9452l445K23610
33849G621621L45074K88492K44470K69792J82023m8618j39741Q7927L91480M22453
33839I664973J95112J7167M7172J35776R8717k5139n7027O3902K00875K11096
33829A0552624J45257J68488L03481L83636L03038J72486J37232J75645K03409
33820A2545296K43267L28516L60743K61707J64381K27770L44176K86583R7015
33811A4859454M6378K10294L71418L86660L72453M37682M88454M23773L17107
33802A7913673K77035K99614L61545M85678O14423N97906M21517K80112L16598
$$ plain form
33870 5956383 5939038 6036057 6306550 6627977 6812990 6861101 6961067 7193993 7401130 7464772
33860 7464772 7543422 7816549 8124639 8139909 7847948 7570454 7495497 7480908 7401456 7398011 7621621
33849 7621621 7966695 8255187 8499657 8769449 8951472 8902854 8763113 8851040 9242520 9664973
33839 9664973 9860085 9877252 9924424 10060200 10158917 10133778 10076751 10140653 10341528 10552624
33829 10552624 10697881 10866369 11169850 11553486 11856524 12029010 12166242 12341887 12545296
33820 12545296 12788563 13117079 13477822 13739529 13903910 14131680 14475856 14762439 14859454
33811 14859454 14905832 15116126 15487544 15874204 16246657 16684339 17172793 17596566 17913673
33802 17913673 18190708 18490322 18851867 19337545 19951968 20549874 20971391 21251503 21568101
33793B1568101M47341N46031O20422O90031O77172N67577N09931N98618P13044
33784B6938268P29895P35011Q45543R71320R57724Q51314Q22078R11981J044070
33775C4807204J186688J320909J339947J187359J023290J051243J242775J429966
33767D4589381J589880J799830J969519J902584J644945J506403J658025J927646
33759E8588213K092351K177405K329198K539734K665361K658726K641192K738432
33751G8430612K926390L077003L132815L184218L327338L482897L473187L298892
33743A04333352L189364L291030L452923L458544L335573L252636L218607L107427
33735A30639456K916576K764571K654668K466829K176311J857468J482318R69166
$$ plain form
33793 21568101 22015442 22561473 23181895 23871926 24549098 25116675 25626606 26225224 26938268
33784 26938268 27668163 28403174 29248717 30220037 31177761 32029075 32851153 33763134 34807204
33775 34807204 35993892 37314801 38654748 39842107 40865397 41916640 43159415 44589381
33767 44589381 46179261 47979091 49948610 51851194 53496139 55002542 56660567 58588213
33759 58588213 60680564 62857969 65187167 67726901 70392262 73050988 75692180 78430612
33751 78430612 81357002 84434005 87566820 90751038 94078376 97561273 101034460 104333352
33743 104333352 107522716 110813746 114266669 117725213 121060786 124313422 127532029 130639456
33735 130639456 133556032 136320603 138975271 141442100 143618411 145475879 146958197 147927363
33727A47927363M39483J31787m453l18658r33191j512497j759426j865025k185551
33718A39919832k682340l013529l063927l044731l102666l155328l155744l231678
33710A15469889l451415l662929l692802l560112l392568l259786l183397l185043
33702H8081837l212655l126424k880796k636509k565372k613615k597659k481672
33694F5967135k396268k392734k352193k184109j966373j811145j713371j624412
33686D9526530j565996j556550j521963j420688j371685j475218j563446j367073
33678C7683911r48475p13139q83001j188041j254654j104686j028438j098146
33670B9465331j106751r57193q12097p90734p70083o15625m22763l74078m77543
$$ plain form
33727 147927363 148366846 148498633 148494180 148175522 147242331 145729834 143970408 142105383 139919832
33718 139919832 137237492 134223963 131160036 128115305 125012639 121857311 118701567 115469889
33710 115469889 112018474 108355545 104662743 101102631 97710063 94450277 91266880 88081837
33702 88081837 84869182 81742758 78861962 76225453 73660081 71046466 68448807 65967135
33694 65967135 63570867 61178133 58825940 56641831 54675458 52864313 51150942 49526530
33686 49526530 47960534 46403984 44882021 43461333 42089648 40614430 39050984 37683911
33678 37683911 36735436 36022297 35139296 33951255 32696601 31591915 30563477 29465331
33670 29465331 28358580 27401387 26589290 25798556 25028473 24412848 23990085 23616007 23138464
33661B3138464n92950o38649o39887o23109n80354n15918m44766l70591l26455
33652A8405785l84024n40120o44514n49520l16427j67827k18934l45418l59976
33643A4879025k54877j97838k96979m41081m31192k51832j21137k20057m48024
33634A2216008n48887m33808k46393j22460m9897m246m8061j92609l01938k67657
33624A0000052j73745j51026j66170j15404m5720q9743k20221k71066k01549j40447
33614H424961j39937r1371M2396J07969l598j63716j97214j40912j44097k04743
33604G489738j96007j10905q2067j46334j72410q0722J8703M72q3687j06305q0196
33593F450280j29952k62639l04977j25148J65590L15573K14817L742j12296r7331
$$ plain form
33661 23138464 22545514 21906865 21266978 20643869 20063515 19547597 19102831 18732240 18405785
33652 18405785 18021761 17481641 16837127 16287607 15971180 15803353 15584419 15239001 14879025
33643 14879025 14624148 14426310 14129331 13688250 13257058 13005226 12884089 12664032 12216008
33634 12216008 11667121 11233313 10986920 10864460 10814563 10810317 10762256 10569647 10267709 10000052
33624 10000052 9826307 9675281 9509111 9393707 9347987 9258244 9038023 8766957 8565408 8424961
33614 8424961 8285024 8193653 8236049 8344018 8340420 8176704 7979490 7838578 7694481 7489738
33604 7489738 7293731 7182826 7100759 6954425 6782015 6701293 6719996 6720468 6636781 6530476 6450280
33593 6450280 6320328 6057689 5752712 5627564 5793154 6108727 6323544 6327286 6214990 6117659
33583F117659q3626j65847k74040k79715j69721n2744j5122l5914m9057l1174
33573D960699m621M252j7387o4738j09201j21313j08711r7128p1856J500P9332
33562D450828M6033j19604k55645j95783k409R2479j7366j84087k07879p6592
33552C529975N6679P5212R821k7498K8543J30513J62064O1439r6545j71266j07657
33541C651280K3076J26405J65267J35776M5105n4751q6664m6598j8914n3291r5743
33530C790948q6941n1481l4018l0386m8266j37815k66973k68662n0226K20108
33520C036288K95382J70220N0425L6611L5838p105r761M9748L9583j00734k10971
33509C385524j37644K0709O7898J1213J1714Q6254P5249p5485k01825j67729o3779
$$ plain form
33583 6117659 6034033 5868186 5594146 5314431 5144710 5091966 5076844 5040930 4991873 4960699
33573 4960699 4956078 4960330 4942943 4878205 4769004 4647691 4538980 4441852 4369996 4371496 4450828
33562 4450828 4496861 4377257 4121612 3925829 3923420 4015899 3998533 3814446 3606567 3529975
33552 3529975 3586654 3661866 3671687 3644189 3672732 3803245 3965309 4026748 3930203 3758937 3651280
33541 3651280 3674356 3800761 3966028 4101804 4146909 4092158 4005494 3958896 3939982 3886691 3790948
33530 3790948 3704007 3652526 3618508 3588122 3539856 3402041 3135068 2866406 2816180 3036288
33520 3036288 3331670 3501890 3552315 3588926 3624764 3617659 3607898 3657646 3697229 3596495 3385524
33509 3385524 3247880 3268589 3336487 3347700 3359414 3445668 3520917 3445432 3243607 3075878 3012099
33498C012099m4265q5441n3285N5261J03023L5665m4855o7638j00270j79576j75867
33487B454851J6348K41899K42845L4233r4387J911J20054L6470j60108k37946
33477B656170j70245r7567m6946O6759K02211K01979N6956n7679m7672k626N930
33466B767270K3826N1424o690j35296j54841J725J43998J01991k0622l9146J9409
33455B753048J4655l4979M44J07521J36211M6172l4725q329P9693J38337J36175
33444C334223J02060R6717J59692K23082J45713q3439k66617k36470q1124O929
33434C400766Q625L0705O3931J516j35871k02642j53825q2858l6342K6348Q8797
33423C009150P8705J9346j305o719p6492j26132J4027K76219L75007K13328O087
$$ plain form
33498 3012099 2967834 2882393 2829108 2884369 2987392 3023057 2978202 2910564 2810294 2630718 2454851
33487 2454851 2471199 2713098 2955943 2990176 2895789 2897700 3017754 3054224 2894116 2656170
33477 2656170 2485925 2388358 2341412 2408171 2610382 2812361 2869317 2811638 2763966 2761340 2767270
33466 2767270 2791096 2842520 2835830 2700534 2545693 2547418 2691416 2793407 2772785 2733639 2753048
33455 2753048 2767703 2732724 2733168 2840689 2976900 3023072 2988347 2980018 3059711 3198048 3334223
33444 3334223 3436283 3533000 3692692 3915774 4061487 3978048 3711431 3474961 3393837 3400766
33434 3400766 3409391 3440096 3504027 3505543 3369672 3167030 3013205 2930347 2894005 2920353 3009150
33423 3009150 3087855 3107201 3105896 3099177 3022685 2896553 2910580 3186799 3561806 3775134 3781221
33412C781221q4905j52292k50229k08789M1205K28501J09681j25843j25763J00569
33402C313356K52346K30932K12664K52601J67189j14428l72155l93457k40268
33393C308780r6896k0338L7710R5558J48758K15512K74297K38446Q5875n5755
33383D231947n0274O1582J07846J0609j02002m3286J84822L40609K04903j13961
33373D832795k56912n7225K25508K46596L4047r4906m385J24759J36121J10216
33363E296614J47483J71681R6815J4063M5984J41128J73875J49250J55980J99300
33353F592173K26792K44779K66658K25832R6332K0078J27954K92235K68944O8644
33343H430421l5664J03693L27160M39158M64353N28810O46486P48014Q02320P96158
$$ plain form
33412 3781221 3696316 3544024 3293795 3085006 3126211 3354712 3464393 3338550 3212787 3313356
33402 3313356 3565702 3796634 4009298 4261899 4429088 4314660 3942505 3549048 3308780
33393 3308780 3211884 3191546 3229256 3324814 3473572 3689084 3963381 4201827 4287702 4231947
33383 4231947 4181673 4243255 4351101 4361710 4259708 4216422 4401244 4741853 4946756 4832795
33373 4832795 4575883 4518658 4744166 4990762 5024809 4929903 4925518 5050277 5186398 5296614
33363 5296614 5444097 5615778 5712593 5726656 5772640 5913768 6087643 6236893 6392873 6592173
33353 6592173 6818965 7063744 7330402 7556234 7652566 7672644 7800598 8092833 8361777 8430421
33343 8430421 8394757 8498450 8825610 9264768 9729121 10257931 10904417 11652431 12454751 13250909
33333A3250909P02446N82856O10044Q47148J094639J114773R48343Q39934Q76728
33324B0867820Q79001O70162K98250o6711l30005m94125n79898o13187o39463
33315A9991844o82422p12808o92681o15366m81965k98016j26794p2240j43252
33306A6166300j95249r5824Q7440J68322J04850O5689J91006L86159M44266L22691
33296A7645650J89994J99177L16305M15622M61070N12308N93380O51754O52504
33287B1637764O33342O37933O55984O68784P06343Q07680R46909J045252J056610
33278B8796601J018175J013509J087508J196673J266950J318657J478035J795465
33270C8971573K112666K245184K272220K459770K858913L192864L257976L232808
$$ plain form
33333 13250909 13953355 14536211 15146255 15993403 17088042 18202815 19151158 19991092 20867820
33324 20867820 21746821 22416983 22715233 22648522 22318517 21824392 21244494 20631307 19991844
33315 19991844 19309422 18596614 17903933 17288567 16806602 16508586 16381792 16309552 16166300
33306 16166300 15971051 15875227 15962667 16130989 16235839 16301528 16492534 16878693 17322959 17645650
33296 17645650 17835644 18034821 18351126 18766748 19227818 19740126 20333506 20985260 21637764
33287 21637764 22271106 22909039 23565023 24233807 24940150 25747830 26694739 27739991 28796601
33278 28796601 29814776 30828285 31915793 33112466 34379416 35698073 37176108 38971573
33270 38971573 41084239 43329423 45601643 48061413 50920326 54113190 57371166 60603974
33262F0603974L403202L754994M086830M398228M861693N461300N982500O389734
33254I8942455O910124P662594Q486217R252235J0078456J1078372J2139421J3135537
33246A77685411J4145846J5256850J6334686J7207530J7894174J8410090J8508027
33239B95442614J7886226J6533558J4588941J1972390Q492011M285206j66649
33232C69034297m477708q520169j2129043j4975593j6866161j7937936j8439662
33225B75688025j8496909j8166861j7522565j6590394j5386124j4086899j2966622
33218A62471651j2075937j1197601j0216482r299003q568656p854765o983386
33211I6275821o122297n574242n341553n142658m791508m333553l850887l363254
$$ plain form
33262 60603974 64007176 67762170 71849000 76247228 81108921 86570221 92552721 98942455
33254 98942455 105852579 113515173 122001390 131253625 141332081 152410453 164549874 177685411
33246 177685411 191831257 207088107 223422793 240630323 258524497 276934587 295442614
33239 295442614 313328840 329862398 344451339 356423729 364915740 369200946 369034297
33232 369034297 364556589 356036420 343907377 328931784 312065623 294127687 275688025
33225 275688025 257191116 239024255 221501690 204911296 189525172 175438273 162471651
33218 162471651 150395714 139198113 128981631 119682628 111113972 103259207 96275821
33211 96275821 90153524 84579282 79237729 74095071 69303563 64970010 61119123 57755869
33203E7755869k933046k671310k581399k520463k364899k141938j978905j966861
33195C8597048k058850k072709j852481j469475j178014j112570j138643j089464
33187B6624842j013629j038355j101377j023231q03796o50629o99333q56190r40814
33178A8497488q68652o79849m88528m08009m39919m50709l41918k07684k18778
33169A4393442l85154n52094o06278n62111m63849l36562k35371k17909k54501
33160A0779613k70212k74474l35959m27821m22535k70658q7029k4296j22104k87650
33150H256875l75148l08273j73932j39528k23807k56878j59101j02533k17317
33141F300358k99948r8886K08944J88364k00915m99633m05660j72809j50060k45387
$$ plain form
33203 57755869 54822823 52151513 49570114 47049651 44684752 42542814 40563909 38597048
33195 38597048 36538198 34465489 32613008 31143533 29965519 28852949 27714306 26624842
33187 26624842 25611213 24572858 23471481 22448250 21644454 20993825 20294492 19438302 18497488
33178 18497488 17628836 16948987 16460459 16052450 15612531 15161822 14819904 14612220 14393442
33169 14393442 14008288 13456194 12849916 12287805 11823956 11487394 11252023 11034114 10779613
33160 10779613 10509401 10234927 9898968 9471147 9048612 8777954 8690925 8666629 8544525 8256875
33150 8256875 7881727 7573454 7399522 7259994 7036187 6779309 6620208 6517675 6300358
33141 6300358 6000410 5901524 6110468 6298832 6097917 5598284 5192624 5019815 4869755 4624368
33131D624368j56834Q3536J63581N296j21685l0385J22157J09205k7312o1422
33121D710505Q4364K27469J49990j36444l94210m22133k67570j37024j40451k12803
33111C461693k67038k94711k86393j88178j2099J20756J36138J10622J26848J22586
33101C030224P826j42469j61481l0566R2351R4276L8743L7031P8888O1761m7394
33090C059190j52783j57421j08053j41354k74331l40458k09179J0941J10275O3084
33080A859911J6157K1106k4101j40133j83987r0444q864p1057j74558j41749K1991
33069A084272J67041J96031R8568r8130k76495k40783N2630L61264M12165K17596
33059A974159j1569j67084k68327k73026j05650J33997K14824P4842q8520p8738
$$ plain form
33131 4624368 4467534 4551070 4714651 4719947 4598262 4567877 4690034 4799239 4771927 4710505
33121 4710505 4794869 5022338 5172328 5035884 4641674 4219541 3951971 3814947 3674496 3461693
33111 3461693 3194655 2899944 2613551 2425373 2413274 2534030 2670168 2780790 2907638 3030224
33101 3030224 3038050 2895581 2734100 2703534 2795885 2890161 2928904 2965935 3044823 3106584 3059190
33090 3059190 2906407 2748986 2640933 2499579 2225248 1884790 1675611 1686552 1796827 1859911
33080 1859911 1876068 1897174 1873073 1732940 1548953 1458509 1449645 1378588 1204030 1062281 1084272
33069 1084272 1251313 1447344 1545912 1447782 1171287 930504 983134 1344398 1756563 1974159
33059 1974159 1962590 1795506 1527179 1254153 1148503 1282500 1497324 1572166 1483646 1404908
33049A404908P7398K06334J82598K3690j26329j13066N0335J61775Q0396p5227
33039A872812j15813q2642j57767l20083l38343j36964O4597O3502o6677j34372
33029F48250r2133j9387M1129J03782J56598J50274N2031j10926k25917j47045
33019E56656J28534L67517L25361N9317j40454j39476r1517j39699j92405j08955
33009F24879N9655J59482J47815Q4423j017j01192j53376r4295K9843R3766K7223
32998H77206j15524j96348j06248J02660K16004Q4780j62783k63849j61135l7123
32988B37640q833L186N5567O1243q049j3191J14778K17118J50839K2088O94N3123
32976H86203M6714j6368o1450j07235j65692j03955J60540M26011M13706J46452
$$ plain form
33049 1404908 1482306 1688640 1871238 1894928 1768599 1655533 1705868 1867643 1948039 1872812
33039 1872812 1756999 1674357 1516590 1196507 858164 721200 785797 849299 782622 648250
33029 648250 556117 536730 577859 681641 838239 988513 1040544 929618 703701 556656
33019 556656 685190 1052707 1378068 1437385 1296931 1157455 1065938 926239 733834 624879
33009 624879 684534 844016 991831 1076254 1075237 974045 820669 726374 756217 849983 877206
32998 877206 761682 565334 459086 561746 777750 862530 699747 435898 274763 237640
32988 237640 228807 231993 287560 348803 340754 327563 442341 659459 810298 832386 833080 886203
32976 886203 932917 916549 855099 747864 582172 478217 638757 1064768 1478474 1624926
32966A624926j08005k05965k02283j25002M5024J91813J45394l5530j23613q5943
32956A120816j09472k25145k21751m3776L9829j40973l30906k06578J23960K68283
32946B74287J02109j10306j37443o0948n9131j10283o1488R6322J81921P3105
32936A88145j05066j23801N9551K56579K95281J97560O8146o0990j75661j90195
32926D09549o3140P9249R3263K3911k253j0201r7039j87023j18160N1752J00302
32915B80210J4388J5676J56410J97990Q830k10825k59581k14154j89400q9700
32905b90156J56674L45256K55829l869j74321k05760j88870j00224Q2091J65802
32895D2452l885j91023m5069L25890M51833J76542j54194k40258j76868j31897
$$ plain form
32966 1624926 1516921 1310956 1108673 983671 1028695 1220508 1365902 1330372 1206759 1120816
32956 1120816 1011344 786199 564448 520672 560501 419528 88622 -117956 6004 274287
32946 274287 376396 266090 128647 67699 8568 -101715 -163203 -66881 115040 188145
32936 188145 83079 -40722 18829 275408 570689 768249 836395 775405 599744 409549
32926 409549 346409 425658 518921 542832 540579 530378 433339 246316 128156 179908 280210
32915 280210 294598 310274 466684 664674 673504 462679 203098 -11056 -200456 -290156
32905 -290156 -133482 211774 467603 463734 289413 83653 -105217 -205441 -123350 42452
32895 42452 38567 -152456 -197525 128365 580198 756740 602546 362288 185420 53523
32885E3523m1175J64176L13352K22816k0900k07463k76266k74030j94594l5792
32875b96353J10289J76716K14332K44022J67796l1318j63427q4485O2649M9496
32865D49717j12142k36065k45181j87479o5858J25292K58508J94384J3209q1606
32855A12779o4129p7745j43429j11678O0034K00875J72072M1237o5315j22837
32845A864j33884m6320J34952K63581K07360L1618p7237m2769K9406O775j00620
32834B74726j54634p0457N2049M8024n9481n3922J46906K99280J43263j93581
32824D32173l36016j78156o546o2936k29475k56116r3532J37048L30510M03092
32814A40046K67063k4947k29674j82339j7901M4747K9735J05998K48413K55701
$$ plain form
32885 53523 12348 176524 489876 712692 691792 484329 208063 -65967 -260561 -296353
32875 -296353 -186064 -9348 204984 449006 616802 585484 422057 337572 400221 449717
32865 449717 337575 101510 -143671 -331150 -397008 -271716 -13208 181176 194385 112779
32855 112779 48650 -29095 -172524 -284202 -224168 -23293 148779 190016 124701 1864
32845 1864 -132020 -178340 -43388 220193 427553 459171 381934 339165 368571 375346 274726
32834 274726 120092 49635 101684 149708 90227 36305 183211 482491 625754 432173
32824 432173 96157 -81999 -88545 -151481 -380956 -637072 -730604 -593556 -263046 140046
32814 140046 407109 382162 152488 -29851 -47752 -3005 26730 132728 381141 636842
32804F36842R4055l7086l6846n9669k22977l59381k42327N6884K31938J30612
32794A92045p9344j51539m4759Q6593J06126K8480l5812j2534O7386J07348M5571
32783C09561p5372j44223r9624j769M3564K1691J1826L9620R206j46925l09782
32772c42227k73724L334L39318N17732M59826K26726l9316j76447j30365l8450
32762E46407o4857j46511p0608J64460K82837J29562q4466j11095m2158j16020
32752D87551k90739l02384r0009J24076J76380J22104L2325j04404k18591j57156
32742b20847M7299J32981k6922k11540j60154P2203K36240K29308J32408P414
32732B38390j49406k93243l29792k23584j7429K13455L51787K71602n82k30026
$$ plain form
32804 636842 730897 693811 656965 597296 374319 14938 -227389 -170505 61433 192045
32794 192045 112701 -38838 -83597 2996 109122 137602 101790 89256 156642 263990 309561
32783 309561 234189 89966 -9658 -11427 32137 53828 65654 105274 114480 -32445 -342227
32772 -342227 -615951 -612617 -273299 244433 704259 930985 891669 715222 584857 546407
32762 546407 481550 335039 264431 428891 711728 841290 756824 645729 603571 487551
32752 487551 196812 -105572 -195581 -71505 104875 226979 259304 154900 -63691 -220847
32742 -220847 -173548 -40567 -67489 -279029 -439183 -366980 -130740 98568 230976 238390
32732 238390 88984 -204259 -534051 -757635 -775064 -561609 -209822 61780 61198 -168828
32722a68828k08147P328J94487K37992J75499O1247n2134o1890O3952J50759Q993
32711D09258k44479k80837j6836K46050K34392M9286m4319l688J0362o5305j23958
32700A69926r2943l2308j2877l1281o9002j17699j19755k788J80215K57805J56185
32689B85478R033l5158j9509o9374j53071j22519K6274J21010Q1255L3726O7882
32678B25027O0359r2319k17795q3307K06420K97605Q6669j34719j17008J5127
32668B46059K2858o6893o4687L3894N5540m4439j14221n4780N2177R8352P3885
32657B37745M406q9001j27499k2349J56614K08153P4593n9087n0749l0953j70253
32646A31620l36344k37768J06788L13949J46176j54007k16628n1691M7047j35
$$ plain form
32722 -168828 -376975 -369647 -175160 62832 238331 299578 247444 185554 249506 400265 409258
32711 409258 164779 -116058 -132894 113156 347548 396834 352515 348827 359189 293884 169926
32700 169926 76983 44675 31798 517 -68485 -186184 -305939 -308727 -128512 129293 285478
32689 285478 294511 259353 239844 170470 17399 -105120 -78846 42164 123419 157145 225027
32678 225027 285386 193067 -24728 -108035 98385 395990 482659 347940 230932 246059
32668 246059 268917 202024 137337 171231 226771 182332 68111 13331 65508 163860 237745
32657 237745 242151 153150 25651 3302 159916 368069 442662 383575 332826 301873 131620
32646 131620 -204724 -442492 -335704 -21755 124421 -29586 -246214 -297905 -250858 -250993
32636b50993K0387J80111K35373M5817j29225j5057K16872K07425o462o2920J00814
32625E42142J28030j51479m05675l13429n4456J3532q9001p8238Q5725J70035
32615a52814Q1144k3493l0092K514K1902N2585P7866O3948Q7298K14841K89816
32604F85515J07207k01507k62786N640K51801J77917j00977l06538l43731k50779
32594b38238m8134J81425K63880J64595P4675J13715J38708J4597j35166j54156
32584C75901j27762j88926k27738p6687J47898J88711M6739n3908m0164l1848
32574A2216m2127M9452K01351J93166j3355j62191o8644J21820J69764N5534p9616
32563D37370j60472k03742k13778j73983q7182M0955J91870K76495J96734J2731
$$ plain form
32636 -250993 -230606 -50495 184878 230695 101470 86413 303285 510710 504248 441328 542142
32625 542142 670172 518693 113018 -200411 -254867 -241335 -330336 -408574 -322849 -152814
32615 -152814 -71670 -95163 -125255 -122741 -100839 -48254 29612 93560 180858 395699 685515
32604 685515 792722 591215 328429 334069 585870 763787 662810 356272 12541 -238238
32594 -238238 -286372 -104947 158933 323528 398203 511918 650626 665223 530057 375901
32584 375901 248139 59213 -168525 -245212 -97314 91397 138136 84228 44064 12216
32574 12216 -29911 19541 220892 414058 400703 238512 169868 291688 461452 516986 437370
32563 437370 276898 73156 -140622 -314605 -401787 -360832 -168962 107533 304267 316998
32553C16998p4988J6713J32686J05996j0496n8342k5510l4485j19225j63054p6924
32542I369P1126J51296J28174O4534N015o9319j52143j50146J114J81082J70668
32531D10770n7636k59139k22566m4613L8777l621j4127N2020P0266q11l9835Q404
32519f2111L8298K697J5447J11869J12365r7390l18263k85779n2973R9914O8183
32508c67743M898K7151P0108O3020N0816P4416Q4053M0755j8999p3864j48957
32497a94346k02172j16846J03623K56866J75968m3773j74532j46728q0225o9619
32487d91784q4012p8583o7194m8144K6964J52673K29493J92802J10058P3885N9351
32476G5509j9056j45645k06340j54483p6459o0519p5425k8370J01331K33123K70793
$$ plain form
32553 316998 242010 258723 391409 497405 486909 428567 403057 368572 249347 86293 9369
32542 9369 80495 231791 359965 424499 429514 360195 208052 57906 59020 240102 410770
32531 410770 353134 93995 -128571 -173184 -134407 -138028 -152155 -100135 -29869 -30680 -70515 -62111
32519 -62111 -23813 -21116 -5669 106200 218565 121175 -197088 -482867 -535840 -435926 -367743
32508 -367743 -362845 -335694 -265586 -202566 -151750 -77334 6719 47474 28475 -45389 -194346
32497 -194346 -396518 -513364 -409741 -152875 23093 -20680 -195212 -341940 -422165 -491784
32487 -491784 -575796 -654379 -721573 -769717 -742753 -590080 -360587 -167785 -57727 16158 75509
32476 75509 56453 -89192 -295532 -450015 -526474 -586993 -662418 -690788 -589457 -356334 -85541
32465h5541J93590Q0059M7838J37419K47448K24641L3650j95253k95827k09801
32455A78223r338J67524K04375R8487k2941m2289k390l1255j30242j74195j37050
32444I8909j40723k12319j88538L810J56484O5771j35422j67337k2661O8980L9445
32433d33601N4730J77690K39530J23473n6057j47067j36266n8165P1962J60710
32423c061Q5932o9526o3604J16324J67245o2391k80903j70399J22205K07198J5554
32412F4574j73673j82733r9285k1355O5246J34500J02819O406k0074K8244K6859
32401f8472l1671j6472Q4810J25120O7749N2290J12416Q5250p6501j59817l2411
32390A42291J08513M8480r0217p2023L9914Q764j35671j23974R1000K27867J06078
$$ plain form
32465 -85541 108049 188108 235946 373365 620813 845454 879104 683851 388024 178223
32455 178223 168885 336409 540784 639271 616330 574041 571651 540396 410154 235959 98909
32444 98909 -41814 -254133 -442671 -438861 -282377 -216606 -352028 -519365 -542026 -473046 -433601
32433 -433601 -378871 -201181 38349 161822 105765 -41302 -177568 -235733 -163771 -3061
32423 -3061 82871 13345 -50259 66065 233310 170919 -109984 -280383 -158178 49020 64574
32412 64574 -109099 -291832 -391117 -412472 -347226 -212726 -109907 -103501 -123575 -95331 -68472
32401 -68472 -100143 -116615 -31805 93315 161064 213354 325770 411020 334519 174702 142291
32390 142291 250804 299284 209067 137044 176958 185722 50051 -73923 17077 244944 351022
32379C51022j03814j80128j52207j42651j20800j9722N8725j0218j19506o3547
32369e02846J16186J65229J2058j09458j3251J73984K33482J71092J37780J45441
32359E29697O4350j31407k98772l20830k27392j02150K957L8734k2466r5348l8583
32348f01210J31888K11506Q1394r8461r5431P7224J93756J26804k6543j28013
32338a27086j57092j40147n0632J22587K78579K85476J47364O525l5495l0330
32328B99749p6999j57764j56566l4555R4705J03963P951p3030o0241L3253J55484
32317A35950K38456K01606L2444j44571j78677p6572J7632K4661K917J1884K9696
32306B95426L7904O1702Q0277K1419j02815j82001j81393j86375k12938j51726
$$ plain form
32379 351022 247208 67080 -85127 -227778 -348578 -368300 -309575 -319793 -439299 -502846
32369 -502846 -386660 -221431 -209373 -318831 -332082 -158098 75384 246476 384256 529697
32359 529697 594047 462640 163868 -156962 -384354 -486504 -483547 -444813 -467279 -562627 -601210
32348 -601210 -469322 -257816 -176422 -274883 -370314 -293090 -99334 27470 927 -127086
32338 -127086 -284178 -424325 -474957 -352370 -73791 211685 359049 365574 330079 299749
32328 299749 222750 64986 -91580 -126135 -31430 72533 80484 7454 -52787 -19534 135950
32317 135950 374406 576012 608456 463885 285208 208636 226268 250929 253846 265730 295426
32306 295426 333330 395032 475309 496728 393913 211912 30519 -155856 -368794 -520520
32296e20520l132K9262j49705k96425j39879J92931L19804J24858j08619r6487
32286f47912J25069L19661L28499J73694n168p9223n3972m5330q8928p2691N0008
32275C707J25382M1084m5263M8714J83098Q9855j62304k37576o0728P9447J6826
32264H2242n0181O2671K13895J89836K7970j03157j53793j51551q2585K7152O5334
32253A27833ko0837p2618j19991j82832r1339J39333K12277o23j90828p2723J49603
32241a62747J21051p6748r2469P6052R1709j13400j94588M0021L05886K63500
32231B58267j7640k12527j65342J8931J79011K38779K10698J57648J23132Q3762
32221H74719K3220J2737J06842K03526J62219L4313P16R1634J63020J57289J67367
$$ plain form
32296 -520520 -523652 -494390 -644095 -940520 -1080399 -887468 -567664 -442806 -551425 -647912
32286 -647912 -522843 -203182 125317 299011 293843 214620 160648 115318 26390 -46301 3707
32275 3707 129089 170173 124910 173624 356722 446577 284273 46697 -14031 65416 82242
32264 82242 32061 94732 308627 498463 526433 423276 269483 117932 35347 62499 127833
32253 127833 127831 66994 -5624 -125615 -308447 -399786 -260453 -48176 -48799 -239627 -312350 -162747
32241 -162747 -41696 -118444 -210913 -134861 -43152 -156552 -351140 -311119 -5233 258267
32231 258267 240627 28100 -137242 -118311 60700 299479 510177 667825 790957 874719
32221 874719 897939 910676 1017518 1221044 1383263 1417576 1418292 1509926 1672946 1830235 1997602
32210A997602J97736R5492j75744l96428l70526j94091r5820j23033j38392n8845
32200G37951M4066O3057j9760j26227j61818j14850p3369j01429j30631o3495
32190E3495M7194N5345m7783j13789p1612j9212k8073j7883Q6727K12860K52807
32179D10076K06657J17353k4031j98678k81872j72227M6572J70869Q6244j29987
32169B30976k76961j90480R2206L24819L05950J29141L9309N5903m0032k92745
32159C78086m11287j84702J63454K65118J00043n2463n4985l3093p9529r9448
32149h806j0420R7929R8888R007m6077J0660J23994J53264J2215k08548l05658
32138g3552j97169k4813M3734K5106L1841O8467O3213L7556P2129J28499P7291
$$ plain form
32210 1997602 2195338 2290830 2115086 1718658 1348132 1154041 1058221 935188 796796 737951
32200 737951 782017 845074 825314 699087 537269 422419 349050 247621 116990 53495
32190 53495 100689 156034 108251 -5538 -77150 -96362 -124435 -142318 -55591 157269 410076
32179 410076 616733 734086 710055 511377 229505 57278 103850 274719 360963 230976
32169 230976 -45985 -236465 -144259 180560 486510 615651 654960 710863 670831 378086
32159 378086 -33201 -217903 -54449 210669 310712 258249 203264 170171 90642 -8806
32149 -8806 -19226 78703 177591 186598 140521 151181 275175 428439 440654 232106 -73552
32138 -73552 -270721 -295534 -251800 -226694 -194853 -126386 -63173 -25617 46512 175011 252302
32127B52302q4965k01072j67018n2618K4075K9047j3220p2499j03602p0047k045
32116d61662M1614O6618J11835J45925J13357O7692J08401J76521R1607j51069
32106C10839l01020j83038M1985R7628l0929j12440j2490J51715K07252J32081
32096C01583J9507n8462q5753o5218j9779o173o6215j59022j83308q8574N5809
32085c55605J26190P2265m1949j17229j07553l0251O5208J14827O8718n4055j59180
32074d18614j63546p8306J6417N8426M4612J9523N0441J69366K98833K88427R3272
32063C78851j23414j50271K5018K06996K23178Q4337q3098j73861j50637l9779
32053A97320O9772Q0530o442p4256l0172O2551N3485q9715k04923j15847J31996
$$ plain form
32127 252302 167337 -33735 -200753 -253371 -229296 -200249 -213469 -285968 -389570 -459617 -461662
32116 -461662 -420048 -353430 -241595 -95670 17687 85379 193780 370301 461908 310839
32106 310839 9819 -173219 -131234 -33606 -64535 -176975 -189465 -37750 169502 301583
32096 301583 321090 262628 176875 111657 91878 85705 19490 -139532 -322840 -411414 -355605
32085 -355605 -229415 -157150 -199099 -316328 -423881 -454132 -388924 -274097 -205379 -259434 -418614
32074 -418614 -582160 -660466 -644049 -585623 -541011 -521488 -471047 -301681 -2848 285579 378851
32063 378851 255437 105166 130184 337180 560358 644695 561597 387736 237099 197320
32053 197320 267092 347622 341180 266924 236752 299303 352788 263073 58150 -57697 74299
32042G4299K89768J90886m8054j81237j35713n2636n1712r2491r2925m8691J9368
32031a29138J07369J51321M7375j55656k25845m1109K12853K85729J82112O7005
32021E02016j9446j23864j52421L5075L20320L95324J82407o0279j21812r3783
32011H63537j43183k45526k82392k38845j64939p0533K1303L6017k7863n4728
32001c07152M374L2979n0417j28219o5505N9733P7142n102k6347O5434J40318
31990b02762Q1197o5870j57748j04430N0767J68558J55734Q0901Q3626J60689
31980B50662J56642O346j50196j72731j05091n4805k6443k347n1801j92625k56444
31969e98833q6514K01431L47050K84271J65736R0774J3006q8230j45478j41024
$$ plain form
32042 74299 364067 554953 506899 325662 189949 137313 85601 -6890 -99815 -148506 -129138
32031 -129138 -21769 129552 176927 21271 -204574 -245683 -32830 252899 435011 502016
32021 502016 482570 358706 206285 241360 561680 957004 1139411 1079132 957320 863537
32011 863537 720354 474828 192436 -46409 -211348 -281881 -260578 -224561 -252424 -307152
32001 -307152 -302778 -269799 -320216 -448435 -513940 -454207 -377065 -382167 -408514 -343080 -202762
31990 -202762 -121565 -187435 -345183 -449613 -398846 -230288 -74554 6347 89973 250662
31980 250662 407304 413650 263454 90723 -14368 -69173 -95616 -97963 -149764 -342389 -598833
31969 -598833 -685347 -483916 -136866 147405 313141 403915 416921 328691 183213 42189
31959D2189j35340j25159l5393J07404J55158N5125n5303m6473L0363M8415j6007
31948B4979r3559j32973j22875o0594K9486Q5357P2079L1248K7731O9929J10451
31937D1259J09170P8383O8201R8251J05796R023j57618k42919j68345m4541j9209
31926a22549q0918j17285r9400p6223l7623N9881J51860J16417j9987q0999J9053
31915b87773J66293K17733J55700L1781j15359k27417k24922j09835J2263O4016
31905c17520P1841P3634M5848k4129p5398m4707N0919J35810J35768K0344j45825
31894g3415k10874r1106R5498J62749J05105P5278J24891J39170N3477m1435o0673
31883B78665k9812J8737Q5379R9001k6589j76603j15649J19254J79401p4550k94061
$$ plain form
31959 42189 -93151 -218310 -253703 -146299 8859 63984 8681 -37792 -7429 40986 24979
31948 24979 -68580 -201553 -324428 -385022 -355536 -270179 -198100 -166852 -139121 -69192 41259
31937 41259 150429 228812 297013 395264 501060 510083 352465 109546 -58799 -103340 -122549
31926 -122549 -203467 -320752 -420152 -496375 -533998 -474117 -322257 -205840 -225827 -306826 -287773
31915 -287773 -121480 96253 251953 283734 168375 -59042 -283964 -393799 -381536 -317520
31905 -317520 -245679 -172045 -126197 -150326 -225724 -270431 -219512 -83702 52066 72410 -73415
31894 -73415 -284289 -375395 -279897 -117148 -12043 63235 188126 327296 380773 339338 278665
31883 278665 248853 267590 352969 451970 425381 248778 133129 252383 431784 357234 63173
31872F3173j42756J73330K18685l656j01822N8921J88670R6486k3396K0365Q7475
31861F35475k204j13381k6848J35390M8000k83619m39410j40581L33065M71449
31851F17336J75991j45661j39307N5442O5037j64422l14348j75366P7125J85451
31841B37278J61432J54453J39593j2348k32083k81998j00433J04424J52951J00904
31831D24173Q3243J16306J41862J36777R2742l254r2210n8682R2287J83134R4456
31820A210834m3128j1588J95132L55666K86147K8321k14553k57736p1197J93720
31810A671618L29935K84937K13767K58536L34139K53898L9213o3047Q0537K92088
31800C695621L36827K49588K35541L14844K87361P5258j17835r7585M9800J30753
$$ plain form
31872 63173 -79583 93747 312432 308776 206954 265875 454545 551031 527635 548000 635475
31861 635475 633271 519890 493042 628432 676432 392813 -46597 -187178 145887 617336
31851 617336 793327 647666 508359 563801 628838 464416 150068 -25298 51827 237278
31841 237278 398710 553163 692756 680408 448325 166327 65894 170318 323269 424173
31831 424173 507416 623722 765584 902361 995103 991849 899639 840957 933244 1116378 1210834
31820 1210834 1167706 1156118 1351250 1706916 1993063 2021384 1806831 1549095 1477898 1671618
31810 1671618 2001553 2286490 2500257 2758793 3092932 3346830 3386043 3322996 3403533 3695621
31800 3695621 4032448 4282036 4517577 4832421 5119782 5195040 5077205 4979620 5029420 5160173
31790E160173J36522J56576J18699j11436m09186m69457k56874r3167j84898l34566
31780C712386k91001j35706q3354j01432j8731J18000J01572q3681k52976l32016
31770B633061l96748m16250k61470j5793K8145j99883l78508k18850J41332L40211
31760A255247K39714K722j66648j95785j21556l6261l5280j35312k58566l21643
31750B26632k92127j63511L1205J82952K02888J54027J45832J12178j01726m08001
31740I0349m83163k10563J16931J86768N4466l1689k084M7894Q7090J33844J21170
31729A11013m217j31129j29726o1368m9027m1735O5841J71624Q6345j33030k34087
31718c49496j36606L657Q8259J60476J81434K4683k20832k34933Q6487M02260
$$ plain form
31790 5160173 5296695 5453271 5571970 5460534 5051348 4581891 4325017 4231850 4046952 3712386
31780 3712386 3421385 3285679 3202325 3100893 3082162 3200162 3301734 3218053 2965077 2633061
31770 2633061 2236313 1820063 1558593 1542800 1570945 1371062 992554 773704 915036 1255247
31760 1255247 1494961 1497683 1331035 1135250 1013694 977433 942153 806841 548275 226632
31750 226632 -65495 -229006 -197801 -14849 188039 342066 487898 600076 498350 90349
31740 90349 -392814 -603377 -486446 -299678 -245212 -276901 -278985 -231091 -144001 -10157 111013
31729 111013 106796 -24333 -154059 -215427 -264454 -306189 -240348 -68724 17621 -115409 -349496
31718 -349496 -486102 -482445 -394186 -233710 -52276 -27593 -248425 -483358 -396871 5389
31708E389L43278n418k43937j70503M5361J50799Q6506l5119r5529o3613J5108
31697C2322P4372P1164n457j23857j85770q2097J52342L03814K14242N550o9955
31686C86670K5161Q4568k2748j85625k46930j97130j03583j163O2254J1671j24615
31675c11470j85041o8996J33652K74472K98609K07923J4733j81204k15878p5262
31665a08462M4078L897q4936p2130j5687m2377r5991m4682N5412M7492k4797L7020
31653c01163K29731K92404Q7446j70026j89089K8818K26096K11589L7742j05598
31643C47950r5494J8306Q2133K0847o5617l2962J04847J81649Q6764j10477k55799
31632B82147k64582j70114p0942l5301k5395N1019J74510J83481R742j48245o2457
$$ plain form
31708 5389 348667 343249 99312 -71191 -25830 124969 211475 176356 80827 17214 32322
31697 32322 106694 177858 172401 48544 -137226 -219323 -66981 236833 451075 456625 386670
31686 386670 411831 496399 473651 288026 41096 -156034 -259617 -260780 -198526 -186855 -311470
31675 -311470 -496511 -565507 -431855 -157383 141226 349149 363882 182678 -33200 -108462
31665 -108462 -64384 -60487 -145423 -217553 -233240 -275617 -371608 -416290 -360878 -313386 -338183 -301163
31653 -301163 -71432 220972 308418 138392 -50697 -21879 204217 415806 453548 347950
31643 347950 252456 270762 352895 373742 308125 275163 380010 561659 648423 537946 282147
31632 282147 17565 -152549 -223491 -258792 -284187 -233168 -58658 124823 134565 -13680 -76137
31621g6137J64279J98936m1725k50566j64229P9621J75373O4301q2041j66224
31611i8412k19109k09325m6273K01306L01928J58198m7374r6748l688O8287N1786
31600F0576L241n5090j61249k72689k45375k8106K16707K86420J84354Q6363P9964
31589A55116O3272n9349k03047k21174j20216l3034j2841J3006Q0973J19123Q1520
31578a36651L5176L8025K8845o1598j59299j24005M7469J97092J86865L2194j41703
31567e7590k11167j30435L3385J41532J19688M4843L3783O9457L6290p6540j33902
31556a30656o2822J5007m9394k08078k66361j26185J12564K84374L15297K46257
31546A30003J63147J17089P9211j9968j76599k70994j96099m080J46236J73523
$$ plain form
31621 -76137 88142 287078 245353 -5213 -169442 -89821 85552 149853 67812 -98412
31611 -98412 -317521 -526846 -573119 -371813 -69885 88313 40939 -55809 -59497 8790 60576
31600 60576 63817 8727 -152522 -425211 -670586 -698692 -481985 -195565 -11211 75152 155116
31589 155116 218388 159039 -44008 -265182 -385398 -418432 -431273 -418267 -337294 -218171 -136651
31578 -136651 -101475 -63450 -34605 -96203 -255502 -379507 -332038 -134946 51919 84113 -57590
31567 -57590 -268757 -399192 -365807 -224275 -104587 -59744 -25961 43496 79786 3246 -130656
31556 -130656 -193478 -178471 -227865 -435943 -702304 -828489 -715925 -431551 -116254 130003
31546 130003 293150 410239 489450 469482 292883 21889 -174210 -178290 -32054 141469
31536A41469J26403O1535k7459j34741j96633j78336j32306j10808q4070r303
31526e44249P6669J06291P7933L3870j4420o4292p0497o117N8719L8679k8003
31515c35417k9252M4037R0380P3955P6768J36011J60710Q7340P082L1194J06793
31504D49601Q9432l6063j27518q6217P981K499j32206k52940j94429L4074K27146
31493a8640J99498R082j10469m5339P5406R6420N3659O9985J29752J08481j4996
31482E52839j30538j74134j84188j66772o4147Q9323J37644L2143m2680Q2293
31472A31783K77581K61772M552k08254j59703J6005M6055j05365k27230j76261
31462a39065l8779L5929K2298j7116m1319k9588L8677J18593R7795m1352j37677
$$ plain form
31536 141469 267872 329407 301948 167207 -29426 -207762 -340068 -450876 -534946 -544249
31526 -544249 -467580 -361289 -283356 -249486 -263906 -328198 -398695 -404812 -346093 -307414 -335417
31515 -335417 -364669 -320632 -230252 -156297 -79529 56482 217192 304532 311614 342808 449601
31504 449601 539033 502970 375452 289235 297216 299715 167509 -85431 -279860 -245786 -18640
31493 -18640 180858 189940 79471 34132 109538 205958 259617 329602 459354 567835 552839
31482 552839 422301 248167 63979 -102793 -166940 -77617 60027 92170 49490 131783
31472 131783 409364 671136 675688 467434 307731 323736 369791 264426 37196 -139065
31462 -139065 -177844 -141915 -119617 -136733 -178052 -207640 -168963 -50370 47425 6073 -131604
31451a31604n1574J22303J90036J41149J10103J01616l963j58717j37811P9565
31441B61103J87643j2887k89970l16389j41180m8677q3826m1415J20424J85185
31431a79989M3870j15720q0513J25212L31023M08499L04459M7680k10886l06294
31421C67341k56872k16195k13479j25201O2552J80704J43305P4696O8426L2262
31411A17539r2114j64940q2519N186p9079k33225k17167r723J87889K49443K30230
31400h8480K03846J61666P6950m1374j46138j48510J620J75301J47759q0831k24793
31389C7016j17631K5392l8250j66453p5304J61352K17591M6031p4959j8333M1280
31378C7732L257J491Q5047Q0967p3014j67127p1015L1516l7810j47427r8064M5417
$$ plain form
31451 -131604 -183178 -60875 129161 270310 380413 482029 478066 319349 181538 261103
31441 261103 448746 435859 145889 -170500 -311680 -360357 -444183 -485598 -365174 -179989
31431 -179989 -136119 -251839 -332352 -207140 123883 532382 836841 884521 673635 367341
31421 367341 110469 -105726 -319205 -444406 -381854 -201150 -57845 16851 85277 117539
31411 117539 25425 -139515 -222034 -216848 -295927 -529152 -746319 -756042 -568153 -318710 -88480
31400 -88480 115366 277032 353982 312608 166470 17960 19580 194881 342640 261809 37016
31389 37016 -80615 -55223 -93473 -259926 -335230 -173878 43713 89744 14785 -3548 37732
31378 37732 40989 42480 127527 208494 135480 -31647 -102662 -71146 -108956 -256383 -354447 -309030
31366c09030J02409P5953O5275L9237n9039j21932m2114N3566r392j39010j16919
31355d60996L4871J10424P9876R0278J33426L4911j90141k79938j15106J02535
31345d59860J68590J28156Q5904M591j40372k09322r4295Q6732J71240J85446
31335g3190K12560J76458j1851k02951j72486J2318O2215r2592k03708j11491
31325d04718J3949k3884j25669p4579J15147K46623K47449K06623J48137O73j89470
31314A60281k41629j17428k0460r7066k00082j14690J01696K04925J26522L7565
31304a60366N2483P7294J1137q0920r7798o7367o4257p0045m2339l4760j00189
31293e77127j35774J943K37830L12255J21723j29184k04422j34809j06941j44243
$$ plain form
31366 -309030 -206621 -130668 -65393 -26156 -85195 -207127 -249241 -195675 -205067 -344077 -460996
31355 -460996 -426125 -315701 -235825 -145547 -12121 22790 -167351 -447289 -562395 -459860
31345 -459860 -291270 -163114 -77210 -72619 -212991 -422313 -516608 -429876 -258636 -73190
31335 -73190 139370 315828 303977 101026 -71460 -59142 3073 -89519 -293227 -404718
31325 -404718 -390769 -414653 -540322 -614901 -499754 -253131 -5682 200941 349078 349751 160281
31314 160281 -81348 -198776 -219236 -316302 -516384 -631074 -529378 -324453 -197931 -160366
31304 -160366 -107883 -30589 -19452 -100372 -198170 -265537 -329794 -399839 -442178 -476938 -577127
31293 -577127 -712901 -710958 -473128 -160873 -39150 -168334 -372756 -507565 -614506 -758749
31283g58749q3338J31311L11034K71869R5733P739N8268Q7512M796o5055J2118
31272G3238J57236J79251K5472j83543l18130l25155j94133K9467K11851K41048
31262a03398J72918J51528J91343J74646O6569l0318o8321j29758k44083k96746
31252a15620k14956r1083j2531P7996K17995K69652J04036j65445l10023k66211
31242e06190j30383L2663J91591K45565J35037M973M1148J76395J83195L9686
31232D13680m2256K8981R7203M8365j3136J7501O1753K0182n6646r1540j23530
31221C60557j95116k30174j56005l2124O1376J45809K35533K36151R4559o2132
31211D58434r4266o1223j01567j83468j57838j7562P6305K7038q2982j21699m2288
$$ plain form
31283 -758749 -842087 -710776 -399742 -127873 -32140 -24401 33867 121379 126175 61120 73238
31272 73238 230474 409725 435197 251654 -66476 -391631 -585764 -556297 -344446 -103398
31262 -103398 69520 221048 412391 587037 653606 623288 554967 425209 181126 -115620
31252 -115620 -330576 -421659 -434190 -356194 -138199 131453 235489 70044 -239979 -506190
31242 -506190 -636573 -603910 -412319 -166754 -31717 -26744 14404 190799 373994 413680
31232 413680 371424 400405 497608 545973 532837 550338 612091 632273 575627 484087 360557
31221 360557 165441 -64733 -220738 -252862 -191486 -45677 189856 426007 520566 458434
31211 458434 364168 302945 201378 17910 -139928 -157490 -81185 -54147 -137129 -258828 -301116
31200c01116J12395K46608K61143J48877K3864j4407k747k1603m4973M914J02030
31189E14985J40754Q9937J0862n2515r3571q3695m074Q9291J30728J30742J01075
31178I74519j7660k09079k64407l1124K82021L11573M9799j34238m3418P3989
31168I91975n3373k89759l16486j06803Q4270J12222P5085P7217Q1348K9925m7142
31157F38479r4684r3030k7835J02438K22328K16571P3030q1908j32168j01751
31147G21470r3505j38362j58732q0735N2876J13578M0063o8956o0818P7973J95309
31136F00161J58935P460j20957j54593j29134j04252j00858j01479o3726N0863
31126D2420K19563L45234L37875J98686L233j66722k45474j85426l873J83039
$$ plain form
31200 -301116 -188721 57887 319030 467907 491771 477364 474617 453014 408041 412955 514985
31189 514985 655739 745676 756538 704023 610452 526757 522683 611974 742702 873444 974519
31178 974519 956859 747780 483373 452249 734270 1045843 1095642 961404 917986 991975
31168 991975 938602 648843 332357 225554 309824 422046 497131 574348 655696 685621 638479
31157 638479 543795 450765 422930 525368 747696 964267 1037297 955389 823221 721470
31147 721470 627965 489603 330871 250136 303012 416590 456653 387697 326879 404852 600161
31136 600161 759096 766556 645599 491006 361872 257620 156762 55283 -8443 42420
31126 42420 261983 607217 945092 1143778 1147011 980289 734815 549389 545516 728555
31116G28555K34894J20197m3598r9455p607J06744Q6547o2567j62091r3061L3744
31105H42302M9520M212Q5757K66643K66136l6805l66007l92439j55789N0651Q2013
31094F96194O784j19694k77547l29670j36035J62835K51400Q5568l3438P3641
31084C80038J94663Q6580j34270j87580m4993R0598J09253N9450l5270j82589
31074C35880k74020j65593P8609K25597J83802Q7076L9327j9649j24379j63377
31064B03273p0886K6508K496n9335j0256J10573J46854Q2938M0365M4178r096
31053E07612j30790j80368r4098l528k0858n0595M3392J90695K05252O7961n7155
31042D77520p6440o1700o6735k3879R7561J77855J10706k2198o7896j8991J8437
$$ plain form
31116 728555 963449 1083646 1040048 940593 932986 1039730 1126277 1063710 901619 808558 842302
31105 842302 891822 896034 981791 1248434 1514570 1477765 1111758 719319 563530 614181 696194
31094 696194 702978 583284 305737 -23933 -159968 2867 254267 339835 306397 380038
31084 380038 574701 661281 527011 339431 294438 385036 494289 553739 518469 335880
31074 335880 61860 -103733 -25124 200473 384275 471351 510678 491029 366650 203273
31064 203273 132387 158895 161391 102056 91800 202373 349227 432165 472530 516708 507612
31053 507612 376822 196454 102356 98828 77970 27375 70767 261462 466714 534675 477520
31042 477520 401080 339380 272645 248766 346327 524182 634888 612690 544794 525803 544240
31031E44240J7564M2212Q8517O9380k7177j01521r9016q0453r3618r4660n3213
31020B12255j8463j1019L2722J18909J20261l1778j80764j30870O6008J82232
31010C59493J42284R4265J45600K15658K10536J76061J76897J55749L6827j19085
31000A594285j85734j40885n7393K2951R3732J04348O466j28577j63685q4740
30990A060768k4648o9913j52012j81466j84245k19723k41720j52434L6350J96693
30980F7650K35126J67086M4044r8563j97180j62628M929J65780J85573R6908L8224
30969E46949N4743N5956j9984j01514r7640m0267k9109p2053p1667K6031J45671
30958C97116J75551R7699j0950p8103r7810r9384q8400m1256M0621R4764N2218
$$ plain form
31031 544240 561804 604016 692533 761913 734736 633215 534199 453746 360128 265468 212255
31020 212255 193792 182773 215495 334404 454665 422887 242123 111253 177261 359493
31010 359493 501777 596042 741642 957300 1167836 1343897 1520794 1676543 1713370 1594285
31000 1594285 1408551 1267666 1210273 1233224 1326956 1431304 1437770 1309193 1145508 1060768
30990 1060768 1036120 966207 814195 632729 448484 228761 -12959 -165393 -129043 67650
30980 67650 302776 469862 513906 415343 218163 55535 60464 226244 411817 508725 546949
30969 546949 601692 657648 637664 536150 438510 398243 369134 297081 225414 251445 397116
30958 397116 572667 670366 659416 581313 483503 384119 295719 254463 295084 389848 442066
30947D42066o6485j53162j36154n9087M881O1713J39956J71265N6476j39071j95385
30936A27013j3809K25050K77970J32914k7779r4679j16603j39016j18426m2337
30926B10298n55m9066r1539j496J78495K60082J33975r9442k44734k14410r3833
30915a2225k4733n0908r0620n4926L8638J01652J01605R3810J19712J38366R6001
30904D56372J4756l6524k9156J1541N1130O1101J8906n4490q2627k0556O2944
30893D53397N8211l6103j10038r4206l4405J1050O3519J53041K18091J62827k204
30882H43180j49416j72561q8754M665L5995J2956J966N9950J61264J98122R4622
30871A001989q1016j76266j44307j03850j55794k10024j03846J28614K42774R1277
$$ plain form
30947 442066 375581 222419 86265 27178 32059 93772 233728 404993 461469 322398 127013
30936 127013 113204 338254 616224 749138 721359 626680 510077 371061 252635 210298
30926 210298 209743 160677 69138 67642 246137 506219 640194 540752 296018 81608 -12225
30915 -12225 -36958 -87866 -178486 -233412 -194774 -93122 8483 102293 222005 360371 456372
30904 456372 471128 434604 405448 416989 468119 529220 548126 493636 411009 390453 453397
30893 453397 511608 475505 365467 271261 236856 247906 311425 464466 682557 845384 843180
30882 843180 693764 521203 432449 437114 473109 486065 488031 547981 709245 907367 1001989
30871 1001989 920973 744707 600400 496550 340756 130732 26886 155500 398274 489551
30861D89551j67265k63555j42886K8807J33505K11440K88830K68935R2857j10116
30851H30103j62873p0729P566j7587q7460j18694r3470k8269M1672L9923q4541
30840B55641k49007k92100j62491L2015J71654K17033J52645j2810j47370o6699
30830a01489J93760L28858J30824k12000l50763k19355n2423j9894n8094o2888
30820d23464m1623k0534K7855R3843J05974O6341Q2469J88734K55715J66947j2575
30809D89682j33383j43953r4569l8371j0283l3773p4445n6724J2435K7714l9366
30798i5036o5923K1964R8339K9855q7448o5091P3008J24561K6569o0425q023J15915
30786A08265J84836J65658Q0968m7753j60231j74186r6007j7677K4122O8028Q6909
$$ plain form
30861 489551 322286 58731 -84155 -55348 78157 289597 578427 847362 940219 830103
30851 830103 667230 596501 604067 586480 499020 380326 286856 258587 300259 340182 255641
30840 255641 6634 -285466 -447957 -415942 -244288 -27255 125390 112580 -34790 -101489
30830 -101489 92271 421129 551953 339953 -10810 -230165 -282588 -302482 -360576 -423464
30820 -423464 -465087 -485621 -457766 -363923 -257949 -191608 -109139 79595 335310 502257 489682
30809 489682 356299 212346 117777 79406 69123 35350 -39095 -95819 -83384 -55670 -95036
30798 -95036 -160959 -138995 -40656 -10801 -98249 -163340 -90332 34229 60798 373 -7650 108265
30786 108265 293101 458759 539727 491974 331743 157557 61550 43873 67995 136023 222932
30775B22932j2613j87056k23786k9083J93272J98321K8909p1723l684J02018J08121
30764C25628K2219q4848j75503k22317j85240o3280P4980J39206Q3522n7292j77871
30753c20796j84668r2105J1108R9698K18793L23256K60173J5746j68528r6265
30743F6412Q3520R0911n2246p0059J01264J90791K0811k08448k23990o9056J1946
30732e8144n5222j26471r5302o043P1309J24518J49553J33926R9608P5619L3682
30721C47033o5105j72532j94077j25233n5910k8436K0770J44520K74736K76111
30711D21877R0828j87125l76586l63657k10263q4866o8000p4780m671J02522J39268
30700f15453J04189R1831J25238J17275K2810p2920p0782Q368O6813O3678M5957
$$ plain form
30775 222932 210319 23263 -200523 -229606 -36334 161987 190896 119173 115489 217507 325628
30764 325628 347847 262999 87496 -134821 -320061 -383341 -308361 -169155 -85633 -142925 -320796
30753 -320796 -505464 -597569 -586461 -486763 -267970 55286 315459 331205 162677 66412
30743 66412 149932 240843 188597 118538 219802 410593 431404 222956 -1034 -70090 -58144
30732 -58144 -113366 -239837 -335139 -341182 -269873 -145355 4198 138124 237732 313351 347033
30721 347033 281928 109396 -84681 -209914 -265824 -294260 -273490 -128970 145766 421877
30711 421877 512705 325580 -51006 -414663 -624926 -709792 -777792 -852572 -857243 -754721 -615453
30700 -615453 -511264 -419433 -294195 -176920 -154110 -227030 -297812 -289444 -222631 -158953 -112996
30689a12996O2967J00773J11149P8120L2940M966j5169m0111m1575K001K5289
30678B08354p0935k63318l90783l42777j78227m679J53242K80319K90240J61019
30668a57545M9078Q6974J43690O806k36066k61308J2426K77423K70747J09129
30658C01354L4548M6991Q468n4984j9339N7581q712k08246l14476k20601q5024
30647d62440o4820q6031N05J61136K20041J05414o5409j44526j14101o4506n9661
30636e74398o9039l5044L2457P2926P1221P1140Q4364O5205Q467j5815J7144K4366
30624b47006m1072p4138L2633J90030K06152M9238j21441j76290j38087q6985
30614d06966o6027q4542j05020l7592J35804K61006J83501k946n8003O0451J58164
$$ plain form
30689 -112996 -50029 50744 161893 240013 272953 277919 262750 222639 181064 183065 208354
30678 208354 137419 -125899 -516682 -859459 -1037686 -1042365 -889123 -608804 -318564 -157545
30668 -157545 -108467 -21493 122197 129003 -107063 -368371 -355945 -78522 192225 301354
30658 301354 335902 382893 391361 336377 317038 374619 365907 157661 -156815 -377416 -462440
30647 -462440 -527260 -613291 -612786 -451650 -231609 -126195 -191604 -336130 -450231 -514737 -574398
30636 -574398 -643437 -678481 -646024 -573098 -501877 -430737 -346373 -281168 -272701 -288516 -271372 -247006
30624 -247006 -288078 -362216 -329583 -139553 66599 115837 -5604 -181894 -319981 -406966
30614 -406966 -472993 -557535 -662555 -700147 -564343 -303337 -119836 -122782 -180785 -120334 37830
30603C7830J31119R6121J27603J09867k1455j18397p0867j6663j00126j95235
30593b0203j01563J18097K40637K21982J84459J44051J6484j43562j76934r5589
30583C87859p8054j73208k42481k18152j80587j47946m2014Q5797O4694p4281
30573f18373o9205J49190K88623J38531q5687r3129J7762m1383k41211k75869
30563h30751n2701J88776K59541K35211K34535K30127J61610M4358j04983k80721
30553H5002l75619k44835M5521K21830J54087K9302N5433J60127J44247K858r8491
30542A79462r7069r3925j51378j82300p6271J47019L33517L14980O7571k13899
30532B27707k69988o9394J30191R7845q6305j84868j45700j03957r2588J0838
$$ plain form
30603 37830 168949 265070 392673 502540 481085 362688 291821 275158 175032 -20203
30593 -20203 -121766 -3669 236968 458950 643409 787460 803944 660382 483448 387859
30583 387859 309805 136597 -105884 -324036 -504623 -652569 -694583 -608786 -544092 -618373
30573 -618373 -687578 -538388 -249765 -111234 -196921 -290050 -272288 -313671 -554882 -830751
30563 -830751 -883452 -694676 -435135 -199924 34611 264738 426348 470706 365723 85002
30553 85002 -290617 -535452 -489931 -268101 -114014 -84712 -29279 130848 275095 277953 179462
30542 179462 82393 -11532 -162910 -345210 -421481 -274462 59055 374035 441606 227707
30532 227707 -42281 -111675 18516 116361 30056 -154812 -300512 -404469 -497057 -486219
30522d86219K06308K72401P9897j61262j47729J12043L16308K62108N2781r9752
30512D06884j29625j12397j16834j52552k07338k48844k12171o2995J25709K23674
30502d86489J88076J10078R3794J34402J55050J24622P4697J4246r1316k27601
30492H9559k87900j90058q042Q5245J3562j17713j52263o0129M4103M1426n9218
30481f01428j30061o1462J11448K34011J97693N8162m2624m5358m982L3763J00158
30470a50680J98596K31891J13132q2926j78923j10814L72K2339j9918j4031N0275
30459E9313O0264l4742j05966J518K22468K90394O4019k43670k83295k252K78838
30448C06889K70976N7780q5038r1962j29039k48623k63658n3858J95122K19655
$$ plain form
30522 -486219 -279911 -7510 72387 -88875 -236604 -124561 191747 453855 506636 406884
30512 406884 277259 164862 48028 -104524 -311862 -560706 -772877 -835872 -710163 -486489
30502 -486489 -298413 -188335 -94541 39861 194911 319533 394230 408476 317160 89559
30492 89559 -198341 -388399 -396441 -311196 -297634 -415347 -567610 -627739 -583636 -542210 -601428
30481 -601428 -731489 -792951 -681503 -447492 -249799 -191637 -234261 -279619 -284601 -250838 -150680
30470 -150680 47916 279807 392939 310013 131090 20276 20648 42987 23069 9038 59313
30459 59313 119577 84835 -21131 -19613 202855 493249 557268 313598 30303 28051 306889
30448 306889 577865 635645 550607 458645 329606 80983 -182675 -236533 -41411 178244
30438A78244L4483j11385p9692K6519O5479K6672l2798q3052r3680j9607J12582
30427B3765J80995J03229n2454j42863r9112K8908J27372R6686n8643j93188j53954
30416a39259J5030R7097j4530j65418j55499l283J20189J35282R3024L2352m6454
30405c1469r3182m4381N2865Q7040M9165K2072J2149n3653j52849j56960l6700
30394c45903Q0372J10264J14473J38926J15711J2923p7020j02329j45333k30131
30384c28047k07328L701K11591J96569L8055k5109K9655K1154r6724j70929j30024
30373d57436q3418r6838r0751k6757Q564j4329Q385J13298J68896Q8018j4141
30362c96509J039R1148J33931J15471Q5086K2600j08558k43548k76241j90774
$$ plain form
30438 178244 212727 101342 21650 48169 113648 140320 107522 24470 -69210 -88817 23765
30427 23765 204760 307989 255535 112672 13560 42468 169840 266526 207883 14695 -139259
30416 -139259 -124229 -27132 -41662 -207080 -362579 -365862 -245673 -110391 -17367 14985 -31469
30405 -31469 -124651 -169032 -116167 -29127 20038 42110 54259 606 -152243 -309203 -345903
30394 -345903 -265531 -155267 -40794 98132 213843 226766 149746 47417 -97916 -328047
30384 -328047 -535375 -531674 -320083 -123514 -85459 -110568 -80913 -59759 -156483 -327412 -457436
30373 -457436 -540854 -637692 -728443 -755200 -746636 -760965 -752580 -639282 -470386 -382368 -396509
30362 -396509 -395470 -304322 -170391 -54920 30166 52766 -55792 -299340 -575581 -766355
30352g66355m5403J06934J99249J45920l0191j49419p9746P8552J38506Q9101
30342c12852O8514J24093J57486R8416q764j01648j62698j69866r1195M3083J42483
30331b12948J55052J10879O2051K5480j5828q0568j37366q8050J16618L32555
30321B67875L30482J10521n3748m78P2698o6068k83448k82964r2731j3945j07496
30310a19302r5687J43655L28006J93821r8841k14002j06577q63j5917m9123N50
30299c4280Q4468R7027j64j58727k75860k52002p1236J75630L58026L74455J91643
30288D88980r7416k81339k24145m6019L0197k748L4317J54755J43763o4159k14140
30277g7954j05796R2182J14976j277l2957O9158J73851K07589J65907L8k67005
$$ plain form
30352 -766355 -811758 -704824 -505575 -359655 -389846 -539265 -619011 -540459 -401953 -312852
30342 -312852 -244338 -120245 37241 135657 126893 25245 -137453 -307319 -398514 -355431 -212948
30331 -212948 -57896 52983 115034 140514 124686 44118 -93248 -181298 -64680 267875
30321 267875 598357 708878 655130 654652 727350 661282 377834 94870 2139 -11806 -119302
30310 -119302 -214989 -71334 256672 450493 351652 137650 31073 30210 14293 -34830 -34280
30299 -34280 50188 147215 147051 -11676 -287536 -539538 -610774 -435144 -77118 297337 488980
30288 488980 391564 110225 -113920 -159939 -129742 -132490 -98173 56582 200345 136186 -77954
30277 -77954 -183750 -91568 23408 22131 -10826 58332 232183 439772 605679 605717 338712
30266C38712m20074l03983r4890m9804r5324J2928K14076K15479J9181n1372Q5778
30255a29293J16549j01481k32000J0676L60372L67397M6984j89495j27732N1190
30245A73167J18695N8807l7475j17115j50096j08656q940R1757J37456Q4630o0918
30234A81312j78782j18558P9716J83167Q1605m5792j3469Q3947N9669l2132M215
30223B84898J57482K20230J19571p594p2535j31866j94703j58613p775J16357
30213C25452J22016Q0152N7120O96j12785j71065q7317M5370Q2413K7660p305
30202C62407J6946L4826m194o1100n2053N6200J81620J81499L2211q7936j3499
30191F46927J39961R7098j70021l63747k73906n9846K8608J9587Q9779K06351
$$ plain form
30266 338712 -81362 -385345 -480235 -530039 -625363 -612435 -398359 -182880 -163699 -215071 -129293
30255 -129293 -12744 -114225 -346225 -335549 24823 392220 439204 249709 121977 173167
30245 173167 291862 350669 313194 196079 45983 -62673 -71613 20144 157600 242230 181312
30234 181312 2530 -116028 -36312 146855 228460 182668 169199 253146 312815 280683 284898
30223 284898 442380 662610 782181 774587 702052 570186 375483 216870 209095 325452
30213 325452 447468 527620 584740 585436 472651 301586 214269 259639 342052 369712 362407
30202 362407 379353 414179 409985 348885 296832 353032 534652 716151 748362 660426 646927
30191 646927 786888 883986 713965 350218 76312 16466 45074 64661 154440 360791
30181C60791J72609j7827j48391j27104j11661k01873k38101o2312J89160K54683
$$ plain form
30181 360791 533400 515573 367182 240078 128417 -73456 -311557 -373869 -184709 69974
$$ [...]
##END NTUPLES=NMR SPECTRUM
##END=
