##TITLE=31Pdec_DE-178oil_TFAd6
 DMSO-d6+CCl4_, 24 sc
26.8.2026
##JCAMPDX= 6.0         $$ Bruker NMR JCAMP-DX V2.0
##DATA TYPE= NMR SPECTRUM
##DATA CLASS= NTUPLES
##ORIGIN= UXNMR, Bruker Analytische Messtechnik GmbH
##OWNER= root
$$ XWIN-NMR		Version 3.5
$$ Wed Aug 26 13:17:45 2026 Russian Standard Time (UT+4h)  she@DPX200
##.OBSERVE FREQUENCY= 81.013821
##.OBSERVE NUCLEUS= ^31P
##.ACQUISITION MODE= SIMULTANEOUS
##.ACQUISITION SCHEME= undefined
##.AVERAGES= 64
##.DIGITISER RES= 17
##SPECTROMETER/DATA SYSTEM= spect
##.PULSE SEQUENCE= zgpg30
##.SOLVENT NAME= DMSO
##.SHIFT REFERENCE= (INTERNAL, DMSO, 0, 197.392)
##AUDIT TRAIL= $$ (NUMBER, WHEN, WHO, WHERE, WHAT)
$$ ##TITLE= Audit trail, XWIN-NMR		Version 3.5
$$ ##JCAMPDX= 5.01
$$ ##ORIGIN= Bruker BioSpin GmbH
$$ ##OWNER= she
$$ F:/spectra/data/she/nmr/P31/2/pdata/1/auditp.txt
$$ ##AUDIT TRAIL=  $$ (NUMBER, WHEN, WHO, WHERE, WHAT)
(   1,<2026-08-26 13:16:24.28 +0400>,<she>,<DPX200>,
      <created by zg, POWCHK disabled, PULCHK disabled
       configuration hash MD5:
       00 E9 B6 7A A2 85 ED C7 34 08 36 98 17 FE 4E 26
       data hash MD5: 32K
       F0 B1 53 4D 27 B0 B1 2A 4E 55 74 AC 38 87 B3 71>)
(   2,<2026-08-26 13:16:26.89 +0400>,<she>,<DPX200>,
      <Start of raw data processing
       efp BC_mod = 2 LB = 1.5 FT_mod = 6 PKNL = 1 PHC0 = 1945.954 PHC1 = 157.6981 SI = 64K 
       data hash MD5: 64K
       ED D4 66 94 03 CD 52 26 0A 9A 28 94 6E 5C E3 EE>)
(   3,<2026-08-26 13:17:00.84 +0400>,<she>,<DPX200>,
      <pk PHC0 = -127.1191 PHC1 = 339.0002 
       data hash MD5: 64K
       21 6D 01 1E FA EE EC B0 50 BB 49 34 3D 01 54 0C>)
(   4,<2026-08-26 13:17:09.57 +0400>,<she>,<DPX200>,
      <abs ABSG = 5 
       data hash MD5: 64K
       FD 20 3D 6B 8E 02 E4 CB 6D 48 58 71 54 6A 6E 41>)
$$ ##END=
$$ 
$$ hash MD5
$$ 89 62 37 08 3D 45 A9 97 A6 8F 24 41 1A 59 E8 80
##$RELAX= 
##$RELAX= 
##$RELAX= 
##$RELAX= 
##$RELAX= 
##$RELAX= 
##$RELAX= 
##$RELAX= 
$$ Bruker specific parameters
$$ --------------------------
##$DU= <F:/spectra>
##$EXPNO= 2
##$NAME= <P31>
##$PROCNO= 1
##$TYPE= <nmr>
##$USER= <she>
##$AMP= (0..31)
100 100 100 100 100 100 100 100 100 100 100 100 100 100 100 100 100 100 
100 100 100 100 100 100 100 100 100 100 100 100 100 100 
##$AQSEQ= 0
##$AQ_mod= 1
##$AUNM= <au_zg>
##$AUTOPOS= <>
##$BF1= 81.014009
##$BF2= 200.13
##$BF3= 200.13
##$BF4= 200.13
##$BF5= 200.13
##$BF6= 200.13
##$BF7= 200.13
##$BF8= 200.13
##$BYTORDA= 1
##$CFDGTYP= 0
##$CFRGTYP= 5
##$CHEMSTR= <none>
##$CNST= (0..31)
1 1 145 1 1 1 1 1 1 1 1 1 1 1 1 1 1 1 1 1 1 1 1 1 1 1 1 1 1 1 1 1 
##$CPDPRG= <waltz16>
##$CPDPRG1= <>
##$CPDPRG2= <waltz16>
##$CPDPRG3= <>
##$CPDPRG4= <mlev>
##$CPDPRG5= <mlev>
##$CPDPRG6= <mlev>
##$CPDPRG7= <mlev>
##$CPDPRG8= <mlev>
##$CPDPRGB= <>
##$CPDPRGT= <>
##$D= (0..31)
0 1 0 0 0 0 0 0 0 0.06 0 0.03 2e-05 3e-06 0 0 0.0002 0 0 0 0 0 0 0 0 0 
0 0 0 0 0 0 
##$DATE= 1787735783
##$DBL= (0..7)
120 120 120 11 120 120 24 19 
##$DBP= (0..7)
150 150 150 150 150 150 150 150 
##$DBP07= 0
##$DBPNAM0= <>
$$ [...]
##$SUBNAM3= <"">
##$SUBNAM4= <"">
##$SUBNAM5= <"">
##$SUBNAM6= <"">
##$SUBNAM7= <"">
##$SUBNAM8= <"">
##$SUBNAM9= <"">
##$SW= 400.765351723535
##$SWIBOX= (0..15)
0 1 3 0 0 0 0 0 0 0 0 0 0 0 0 0 
##$SW_h= 32467.5324675325
##$TD= 32768
##$TD0= 1
##$TE= 0
##$TE2= 300
##$TE3= 300
##$TEG= 300
##$TL= (0..7)
0 120 53 12 22 120 120 120 
##$TP= (0..7)
150 150 150 150 150 150 150 150 
##$TP07= 0
##$TPNAME0= <>
##$TPNAME1= <>
##$TPNAME2= <>
##$TPNAME3= <>
##$TPNAME4= <>
##$TPNAME5= <>
##$TPNAME6= <>
##$TPNAME7= <>
##$TPOAL= (0..7)
0.5 0.5 0.5 0.5 0.5 0.5 0.5 0.5 
##$TPOFFS= (0..7)
0 0 0 0 0 0 0 0 
##$TUNHIN= 0
##$TUNHOUT= 0
##$TUNXOUT= 0
##$USERA1= <user>
##$USERA2= <user>
##$USERA3= <user>
##$USERA4= <user>
##$USERA5= <user>
##$V9= 5
##$VALIST= <valist>
##$VCLIST= <CCCCCCCCCCCCCCC>
##$VD= 0
##$VDLIST= <DDDDDDDDDDDDDDD>
##$VPLIST= <PPPPPPPPPPPPPPP>
##$VTLIST= <TTTTTTTTTTTTTTT>
##$WBST= 1024
##$WBSW= 4
##$XGAIN= (0..3)
0 0 0 0 
##$XL= 0
##$YL= 0
##$YMAX_a= 9742
##$YMIN_a= -12732
##$ZGOPTNS= <>
##$ZL1= 120
##$ZL2= 120
##$ZL3= 120
##$ZL4= 120
##$ABSF1= 197.3918
##$ABSF2= -203.3724
##$ABSG= 5
##$ABSL= 3
##$ALPHA= 0
##$AQORDER= 0
##$ASSFAC= 0
##$ASSFACI= 0
##$ASSFACX= 0
##$ASSWID= 0
##$AUNMP= <proc_1d>
##$AZFE= 0.1
##$AZFW= 0.5
##$BCFW= 0
##$BC_mod= 2
##$BYTORDP= 0
##$COROFFS= 0
##$CY= -3
##$DATMOD= 1
##$DC= 0
##$DFILT= <>
##$DTYPP= 0
##$F1P= 0
##$F2P= 0
##$FCOR= 1
##$FTSIZE= 65536
##$FT_mod= 6
##$GAMMA= 0
##$GB= 0
##$INTBC= 1
##$INTSCL= 9.790993e-09
##$ISEN= 30
##$LB= 1.5
##$LEV0= 0
##$LPBIN= 0
##$MAXI= 10000
##$MC2= 0
##$MEAN= 0
##$ME_mod= 0
##$MI= 50
##$NCOEF= 0
##$NC_proc= -8
##$NLEV= 6
##$NOISF1= 182.463
##$NOISF2= 159.3651
##$NSP= 0
##$NTH_PI= 0
##$NZP= 0
##$OFFSET= 197.3918
##$PC= 4
##$PHC0= 1818.835
##$PHC1= 496.6983
##$PH_mod= 1
##$PKNL= yes
##$PPARMOD= 0
##$PSCAL= 0
##$PSIGN= 0
##$REVERSE= no
##$SF= 81.014063255964
##$SI= 65536
##$SIGF1= 159.3651
##$SIGF2= -187.1042
##$SINO= 113.3802
##$SIOLD= 16384
##$SREGLST= <1H.CDCl3>
##$SSB= 0
##$STSI= 65536
##$STSR= 0
##$SW_p= 32467.5324675325
##$SYMM= 0
##$S_DEV= 0
##$TDeff= 32768
##$TDoff= 0
##$TI= <>
##$TILT= no
##$TM1= 0
##$TM2= 0
##$TOPLEV= 0
##$USERP1= <user>
##$USERP2= <user>
##$USERP3= <user>
##$USERP4= <user>
##$USERP5= <user>
##$WDW= 1
##$XDIM= 65536
##$YMAX_p= 260316831
##$YMIN_p= -223870069
$$ End of Bruker specific parameters
$$ ---------------------------------
##NTUPLES= NMR SPECTRUM
##VAR_NAME=  FREQUENCY,     SPECTRUM/REAL,   SPECTRUM/IMAG
##SYMBOL=    X,             R,               I
##VAR_TYPE=  INDEPENDENT,   DEPENDENT,       DEPENDENT
##VAR_FORM=  AFFN,          ASDF,            ASDF
##VAR_DIM=   65536,         65536,           65536
##UNITS=     HZ,            ARBITRARY UNITS, ARBITRARY UNITS
##FACTOR=    0.49542278885378, 1,            1
##FIRST=     15991.5117654749, 0,            0
##LAST=      -16476.0207020576, 0,           0
##MIN=       -16476.0207020576, -223870069,  0
##MAX=       15991.5117654749, 260316831,    0
$$ Real data points
##PAGE= N=1
##DATA TABLE= (X++(R..R)), XYDATA
$$ [...]
##PAGE= N=2
##DATA TABLE= (X++(I..I)), XYDATA
7477I96464N06750j556934k732492k206742j80993K048407K407208J23451k841570
$$ 996464 1503214 -53720 -2786212 -4992954 -5173947 -3125540 -718332 -594881 -3436451
7468c436451l754758k164455J24332J548913J839623J050127n96684j788446r65741
$$ -3436451 -7191209 -9355664 -9231332 -7682419 -5842796 -4792669 -5389353 -7177799 -8143540
7459h143540J250740K219086Q60845o58248k91800O79237J11807r34805L4672
$$ -8143540 -6892800 -4673714 -3812869 -4471117 -4762917 -4083680 -3971873 -4906678 -4872006
7450d872006J984372J459274j006185n93496L744540O175735K815191j153360
$$ -4872006 -2887634 -1428360 -2434545 -3028041 716499 6892234 9707425 8554065
7442H554065Q94809N812272M784032k708538p565414m850693n14468r22297l236143
$$ 8554065 9448874 15261146 20045178 17336640 9771226 4920533 4406065 3483768 247625
7433B47625j748405K070803K662465j95211j920640j063790l46508p85635o28729
$$ 247625 -1500780 570023 3232488 3037277 1116637 52847 -293661 -1079296 -1708025
7424a708025J78991j64782r75494L49969L095023L500477R81319p63424K5973
$$ -1708025 -1529034 -1693816 -2669310 -2319341 775682 4276159 5257478 4494054 4520027
7415D520027N61895j195920l039705k500068n13958J196486K910147M609570M171549
$$ 4520027 5081922 3886002 846297 -1653771 -2167729 -971243 1938904 6548474 10720023
7406A0720023O97267k988265l923244k873983k166826j985021j465373j267969
$$ 10720023 11417290 8429025 4505781 1631798 -535028 -2520049 -3985422 -5253391
7398e253391k104476k510407j071288N99306L7951k149443l397067l031800k024477
$$ -5253391 -7357867 -9868274 -10939562 -10340256 -10302305 -12451748 -15848815 -18880615 -20905092
7389b0905092K2631M100618Q260283Q419816L598594k182156m281844k099572
$$ -20905092 -20882461 -16781843 -8521560 -101744 3496850 1314694 -2967150 -5066722
7381e066722J213573K257116J87149k782331l483831j289440R18131M11563j596950
$$ -5066722 -3853149 -1596033 -1408884 -4191215 -7675046 -8964486 -8046355 -7634792 -9231742
7372i231742j692614Q37379L168108K996927J148623l23400o07708P877J080052
$$ -9231742 -10924356 -10086977 -6918869 -3921942 -2773319 -3096719 -3704427 -3696550 -2616498
7363b616498K011500K290626K155776J978721J134077r86904l095326l240775
$$ -2616498 -604998 1685628 3841404 5820125 6954202 5967298 2871972 -368803
7355c68803j940330j587822k396903j883434N97272K052927O05669j035341J54523
$$ -368803 -2309133 -3896955 -6293858 -8177292 -7580020 -5527093 -4921424 -5956765 -5802242
7346e802242K329279J768403o18220m67345K662228M025916J090943k269313j631220
$$ -5802242 -3472963 -1704560 -2322780 -2790125 -127897 3898019 4988962 2719649 1088429
7337A088429J403170K060756l83471k252008j468176K8814K44510M7833P55290
$$ 1088429 2491599 4552355 4168884 1916876 448700 477514 722024 769857 1525147
7328A525147J396653L54544j781969k907865k246892j012623n19027p16442n58454
$$ 1525147 2921800 3276344 1494375 -1413490 -3660382 -4673005 -5192032 -5908474 -6466928
7319f466928P35578K636426L405429J818411j175138l452461m344387m739708
$$ -6466928 -5731350 -3094924 310505 2128916 953778 -2498683 -6843070 -11582778
7311a1582778m401581j595592L279904O184620M195726J65796n71191K567738
$$ -11582778 -15984359 -17579951 -14300047 -8115427 -3919701 -3753905 -4325096 -1757358
7303a757358M864331L100491m69718j982959q83854O73693J134631M43603p75632
$$ -1757358 3106973 6207464 5737746 3754787 2870933 3544626 4679257 5122860 4347228
7294D347228j353317k28408J697106J835920n45297k691381k047059m5845O5555
$$ 4347228 2993911 2765503 4462609 6298529 5753232 3061851 1014792 968947 1034502
7285A034502j870188k778724q46529K176442L483427K292885J8806j377798r04033
$$ 1034502 -835686 -3614410 -4460939 -2284497 1198930 3491815 3510621 2132823 1228790
7276A228790O86500J548109P95655m87347r60453q87093j190722j614584j330042
$$ 1228790 1915290 3463399 4259054 3771707 2811254 1924161 733439 -881145 -2211187
7267b211187n77712n5632N22526J430798J449202k89437j839387q14788J192026
$$ -2211187 -2788899 -2844531 -2322005 -891207 557995 268558 -1570829 -2385617 -1193591
7258a193591J53327l963639o113016l086339J875564L703138J967945K4908j10422
$$ -1193591 -1040264 -5003903 -11116919 -14203258 -12327694 -8624556 -6656611 -6631703 -6742125
7249f742125R51404K206892K772814J337381j938198l924382k015883J630764
$$ -6742125 -5790721 -3583829 -811015 526366 -1411832 -5336214 -7352097 -5721333
7241e721333K721871J196134R81764L068390L352277o62018n019423m505640m5363
$$ -5721333 -2999462 -1803328 -821564 2246826 5599103 4937085 -82338 -4587978 -4633341
7232d633341K860103J679371r37131k047945j819867j400281o05506P23276J352625
$$ -4633341 -1773238 -93867 -1030998 -3078943 -4898810 -6299091 -6904597 -6181321 -4828696
7223d828696N01782m35651J93234J710391K214827J531647J085520J113911J83559
$$ -4828696 -4326914 -4762565 -4569331 -2858940 -644113 887534 1973054 3086965 3270524
7214C270524k004604l328665k069722L60094J241561L54189l9151J026939J617060
$$ 3270524 1265920 -2062745 -4132467 -3772373 -2530812 -2176623 -2215774 -1188835 428225
7205D28225L0824k204005k198831L37648K836047L172866J401433j648011n200533
$$ 428225 459049 -1744956 -3943787 -3606139 -770092 2402774 3804207 2156196 -3044337
7196c044337p383585n718486n05296M041171M228879J361603m44630Q2627P29457
$$ -3044337 -10427922 -16146408 -16651704 -12610533 -8381654 -7020051 -7464681 -7382054 -6652597
7187f652597L71439P04933K530494L530339J662552j645979l848970m745999n126966
$$ -6652597 -6281158 -5576225 -3045731 484608 2147160 501181 -3347789 -8093788 -13220754
7178a3220754l879275K09716M715055N297764J447574k556809l129202j122812
$$ -13220754 -17100029 -16890313 -12175258 -6877494 -5429920 -7986729 -11115931 -12238743
7170a2238743Q10588J919421K822313L375021K968730J728391M7342j888348l109523
$$ -12238743 -11428155 -9508734 -6686421 -3311400 -342670 1385721 1433063 -455285 -3564808
7161c564808k075807P51174K355567J079410n65744O14771L523070M187872J527270
$$ -3564808 -5640615 -4889441 -2533874 -1454464 -2020208 -1405437 2117633 6305505 7832775
7152G832775j431773k266036k063207k659772l571868l291418j861000m68590
$$ 7832775 6401002 4134966 2071759 -588013 -4159881 -7451299 -9312299 -9780889
7144i780889L82501Q39601P06416j76464j167163j559234j516706j292471k82064
$$ -9780889 -9398388 -8558787 -7852371 -8028835 -9195998 -10755232 -12271938 -13564409 -13846473
7135a3846473J799220L342615K168214j389882m174207l640810o54898J852399
$$ -13846473 -12047253 -8704638 -6536424 -7926306 -12100513 -15741323 -16396221 -14543822
7127a4543822K263193J381063O07302K57362L1824J68821J141513K474284K881798
$$ -14543822 -12280629 -10899566 -10292264 -10034902 -10003078 -9834257 -8692744 -6218460 -3336662
7118c336662J877938M95871p3408N9227L2422k61502j12886P49340J707934K110336
$$ -3336662 -1458724 -962853 -1036261 -977034 -944612 -1206114 -1319000 -569660 1138274 3248610
7108C248610J881156J276309P07459P41561J423070J605904M3270k586159l882015
$$ 3248610 5129766 6406075 7113534 7855095 9278165 10884069 10927339 8341180 4459165
7099D459165k538603M8650J688234J837225J154375k68010k556697m464250m070288
$$ 4459165 1920562 1969212 3657446 5494671 6649046 6381036 3824339 -639911 -4710199
7090d710199j398931J197301J855496J137532N01378K04378j19964P4138J496390
$$ -4710199 -6109130 -4911829 -3056333 -1918801 -1417423 -1213045 -1333009 -1258871 237519
7081B37519L147250K955523N58907j960659k647403j809160r48457p06347q43047
$$ 237519 3384769 6340292 6899199 4938540 2291137 481977 -466480 -1172827 -2015874
7072b015874j307810k013288k103994q81514P42754J159065M63862L92636J421029
$$ -2015874 -3323684 -5336972 -7440966 -8322480 -7579726 -6420661 -5956799 -5564163 -4143134
7063d143134J616989m30143k814607k270393J389113M527372L887734L61514k291320
$$ -4143134 -2526145 -2956288 -5770895 -8041288 -6652175 -2124803 1762931 2124445 -166875
7054a66875j821614M57696J903338J660614P83343j3122j165350k530119k487780
$$ -166875 -1988489 -1530793 372545 2033159 2816502 2803380 1638030 -892089 -3379869
7045c379869j87391K339321K299554P9046j149872q1176Q94539k98648j928294
$$ -3379869 -3567260 -1227939 1071615 1150661 789 -80387 814152 515504 -1412790
7036a412790j231437R00718R98588j564489l208939j129040K593043L555393O78703
$$ -1412790 -2644227 -1743509 -744921 -2309410 -5518349 -6647389 -4054346 -498953 179750
7027A79750k448903j954282J699686M259579K728478j035812k683688q84473J256974
$$ 179750 -2269153 -4223435 -2523749 1735830 4464308 3428496 744808 -139665 1117309
7018A117309P96866j077531j406753k01843r8478j721951k359426m3197L394206
$$ 1117309 1914175 836644 -570109 -771952 -870430 -2592381 -4951807 -4995004 -1600798
7009a600798M738077L274975P95132j141518k302325k648655j737250L03316K035905
$$ -1600798 3137279 6412254 7207386 6065868 3763543 1114888 -622362 -319046 1716859
7000A716859J801777k21766j590519k34198K403070K434406j264667m652289l417881
$$ 1716859 3518636 3296870 1706351 1472153 3875223 6309629 5044962 392673 -3025208
6991c025208J012755L331722J663752n68548n91249j41572j418756k676574j182084
$$ -3025208 -2012453 1319269 2983021 2414473 1823224 1681652 262896 -2413678 -3595762
6982c595762J616302J693943j522975m173187l198936J59617K643892K549120
$$ -3595762 -1979460 -285517 -1808492 -5981679 -9180615 -9020998 -6377106 -3827986
6974c827986L74185k196341l140495j477307J315662K467289J259970L3895R37564
$$ -3827986 -3453801 -5650142 -8790637 -10267944 -8952282 -6484993 -5225023 -5191128 -4253564
6965d253564K810291K708982k003k679533k774133q31365P90615J267418J774293
$$ -4253564 -1443273 1265709 1263706 -1415827 -4189960 -5021325 -4230710 -2963292 -1188999
6956a188999K759066K830036J414987N77603J979830L365993J194171l547628
$$ -1188999 1570067 4400103 5815090 6392693 8372523 11738516 12932687 9385059
6948I385059n750173l233351K13836O50594o56774n92660J53984j142614l751003
$$ 9385059 3634886 401535 615371 1265965 609191 16531 170515 -972099 -4723102
6939d723102m337383k618954j673377k447453k305650L4778K245383K654519K968081
$$ -4723102 -9060485 -11679439 -13352816 -15800269 -18105919 -18071141 -15825758 -13171239 -10203158
6930a0203158M483184M974333K315071j370821k449028r47905J76588k25173o17893
$$ -10203158 -5719974 -745641 1569430 198609 -2250419 -3198324 -3021736 -3246909 -3864802
6921c864802l8734O68823P78734M22116n18508k022968k598944p55091K082229
$$ -3864802 -3903536 -3234713 -2455979 -2033863 -2552371 -4575339 -7174283 -7929374 -5847145
6912e847145K657347M49513j287329o2511K451938K986672R13384j722039l162989
$$ -5847145 -3189798 -2740285 -4027614 -4090125 -1638187 1348485 2261869 539830 -2623159
6903b623159l235781k406116j113158J42413J033838J554958J506632N94820m39109
$$ -2623159 -5858940 -8265056 -9378214 -9235801 -8201963 -6647005 -5140373 -4545553 -4984662
6894d984662p908J963667L112049J550191j378501l058955l262658l461177l268104
$$ -4984662 -4992570 -3028903 83146 1633337 254836 -2804119 -6066777 -9527954 -12796058
6885a2796058q17981L027760M382116J787010j104611o61528J503788J566633
$$ -12796058 -13614039 -10586279 -6204163 -4417153 -5521764 -6183292 -4679504 -3112871
6877c112871k49040m40308J557532K348459M41701j007875O72849L113827K378434
$$ -3112871 -3361911 -3802219 -2244687 103772 545473 -462402 210447 3324274 5702708
6868E702708j122721l413321k651066r35823m53603n74195L00748J898337K477623
$$ 5702708 4579987 1166666 -1484400 -2420223 -2873826 -3448021 -3147273 -1248936 1228687
6859A228687J342465j45651j95911J105093J561885n06439l607991m250236j241724
$$ 1228687 2571152 2425501 2229590 3334683 4896568 4390129 782138 -3468098 -4709822
6850d709822K485092L341618J175125j421890k713252k882050k310222j027683
$$ -4709822 -2224730 1116888 2292013 870123 -1843129 -4725179 -7035401 -8063084
6842h063084K73674P34530R44509K142337L674974L405752J137796o12998k28525
$$ -8063084 -7789410 -7054880 -6110371 -3968034 -293060 3112692 4250488 3637490 3408965
6833C408965P20986J41632j514590k550591k789390k975094k604460p45433J525972
$$ 3408965 4129951 4271583 2756993 206402 -2582988 -5558082 -8162542 -8907975 -7382003
6824g382003J932016L43871q36076j46196J046156J040222M28522P46990J687482
$$ -7382003 -5449987 -5106116 -5942192 -6088388 -5042232 -4002010 -3573488 -2826498 -1139016
6815a139016J497210k38170j971680k515900k360783k036187p30958K047342M486149
$$ -1139016 358194 120024 -1851656 -4367556 -6728339 -8764526 -9495484 -7448142 -2961993
6806b961993M115316J253902j144921j402053q38953q34179m94341R65020J675729
$$ -2961993 1153323 2407225 1262304 -139749 -978702 -1812881 -2307222 -1342202 333527
6797C33527j37138k199687o67869L570630N029357J232021l484852m021990j211680
$$ 333527 196389 -2003298 -2671167 899463 5928820 7160841 3675989 -346001 -1557681
6788a557681P19760R04721J798420L441257K479287k197730o699089o949444l588497
$$ -1557681 -837921 66800 1865220 5306477 7785764 5588034 -1111055 -8060499 -11648996
6779a1648996o5310J885766K502402J623338q56281k947571k113543R09585K500469
$$ -11648996 -11714306 -9828540 -7326138 -5702800 -6559081 -9506652 -11620195 -10710610 -8210141
6770h210141J088681p01406o0063K027920K681796J386135K7440m29611p82765
$$ -8210141 -7121460 -7822866 -7882929 -5855009 -3173213 -1787078 -1759638 -2189249 -2972014
6761b972014j275865r23880L13943Q51224o7325j038138q04955k37634n11467
$$ -2972014 -4247879 -5171759 -4857816 -4006592 -4073917 -5112055 -5917010 -6154644 -6666111
6752f666111p70244M34908K299628K511368N47200j739512k882323l333626l870581
$$ -6666111 -7436355 -7001447 -4701819 -2190451 -1643251 -3382763 -6265086 -9598712 -13469293
6743a3469293m104981l308790j570591N67170K768935M620123N359790M444199
$$ -13469293 -17574274 -20883064 -22453655 -21886485 -19117550 -14497427 -9137637 -4693438
6735d693438K091313p51082k580312j948821J024877L893609L868191Q17583k606668
$$ -4693438 -2602125 -3353207 -5933519 -7882340 -6857463 -2963854 904337 1721920 -884748
6726h84748l861603k592513q2488J950187J988975k09927k732955l087320j105722
$$ -884748 -4746351 -7338864 -7421352 -5471165 -3482190 -3692117 -6425072 -9512392 -10618114
6717a0618114J056643K064526K737961L629816L375286R66416j874306k497181
$$ -10618114 -9561471 -7496945 -4758984 -1129168 2246118 3212534 1338228 -1158953
6709a158953p84974Q23205N16700r20599j387505k2453J677082J399584j009825
$$ -1158953 -1943927 -1120722 -604022 -1524621 -2912126 -2934579 -1257497 142087 -867738
6700h67738k791331j646887Q79463J485557J26375p9538J661811K117666m69026
$$ -867738 -3659069 -5305956 -4426493 -2940936 -2814561 -2894099 -1232288 885378 416352
6691D16352k798035j417842J744246K569493J282409J326294K898441K540929
$$ 416352 -2381683 -3799525 -2055279 514214 1796623 3122917 6021358 8562287
6683H562287o27997k962786j904068M15452J084460N16119K06158o84889l277795
$$ 8562287 7934290 4971504 3067436 3482888 4567348 5083467 5289625 4604736 1326941
6674A326941n328396l266305K370190O502815N219785j879m533080n515696l510507
$$ 1326941 -4001455 -7267760 -4897570 1605245 6825030 6823151 2290071 -3225625 -6736132
6665f736132m56488K224224L525447K636323L9325k004006j593730L39745J202110
$$ -6736132 -7192620 -4968396 -1442949 1193374 1232699 -771307 -2365037 -2025292 -823182
6656h23182L97628n0790R36524J562029K35574j448060j077233O46692R78717
$$ -823182 -425554 -476344 460180 2022209 2257783 809723 -267510 379182 1357899
6647A357899o43320k143343k310883k061860j944736r35069J430232L638728L908982
$$ 1357899 714579 -1428764 -3739647 -5801507 -7746243 -8681312 -7251080 -3612352 296630
6638B96630K142799k73600j631707r80870P46294J123254q07174k762563k356327
$$ 296630 2439429 2165829 534122 -446748 299546 1422800 615626 -2146937 -4503264
6629d503264q99389j218022k567896j546593J969627M108523L142886J943889
$$ -4503264 -5402653 -6620675 -9188571 -10735164 -8765537 -4657014 -1514128 429761
6621D29761K464758K166583j049534m141577l124502O39963K457726R44543j181874
$$ 429761 2894519 5061102 4011568 -130009 -3254511 -2614548 -156822 787721 -394153
6612c94153j783519j140812Q2308J287904R65259j470207l445705k199584N46309
$$ -394153 -2177672 -3318484 -3236176 -1948272 -983013 -2453220 -5898925 -8098509 -7552200
6603g552200O05339k128701l250007n97486K638434L051049J558421O83219N13077
$$ -7552200 -6946861 -9075562 -12325569 -12923055 -10284621 -7233572 -5675151 -4991932 -4478855
6594d478855J00277L64633K408565M485485L867699J122742l57350Q41899K271849
$$ -4478855 -4378578 -4013945 -1605380 2880105 6747804 7870546 7513196 8355095 10626944
6585A0626944J168948j921051m046882l374558r04302R79766J081729L52118K70867
$$ 10626944 11795892 9874841 5827959 2453401 1549099 2528865 3610594 3962712 4233579
6576D233579O37186j54418k415137l961258k711724L04784K054903J380796J39427
$$ 4233579 4870765 4716347 2301210 -1660048 -4371772 -4066988 -2012085 -631289 -491862
6567d91862J70157Q17927N31769l89384l49363P77446J301492L98011n46872r8564
$$ -491862 -321705 496222 1027991 638607 289244 1066690 2368182 2766193 2219321 2120757
6557B120757J074237J429094R12929N67904M08348n32575k144860k992300k442757
$$ 2120757 3194994 4624088 5537017 6104921 6513269 5980694 3835834 843534 -1599223
6548a599223j489214r59327m11511N10128J091841Q45110M96498O90129R01782
$$ -1599223 -3088437 -4047764 -4459275 -3949147 -2857306 -2012196 -1515698 -825569 76213
6539G6213O45708M67045N77473o1475j766777k664870j203043R89030J105552
$$ 76213 721921 1188966 1766439 1704964 -61813 -2726683 -3929726 -2940696 -1835144
6530a835144o87021j718130j179223j160152k778052l976141k581790L79219K096190
$$ -1835144 -2522165 -4240295 -5419518 -6579670 -9357722 -13333863 -15915653 -15536434 -13440244
6521a3440244J551796K06168k37487M59018J305246J241228K23559n27630K56007
$$ -13440244 -11888448 -11682280 -11919767 -11460749 -10155503 -8914275 -8690716 -9218346 -8962339
6512h962339K273777L804563L574878J837082l79800k135589k571221j210592
$$ -8962339 -6688562 -2883999 690879 2527961 2148161 12572 -2558649 -3769241
6504c769241J152006K697681K288931L92349j867264l692482m381645l256106
$$ -3769241 -2617235 80446 2369377 2761726 894462 -2798020 -7179665 -10435771
6496a0435771o38578J781014K382494J170132m86875j296108r61306j26157K91403
$$ -10435771 -11074349 -9293335 -6910841 -5740709 -6227584 -7523692 -8484998 -8611155 -8319752
6487h319752J0981k94913P2603Q13510J140832J053141J230331J809246K204967
$$ -8319752 -8308771 -8603684 -8531081 -7717571 -6576739 -5523598 -4293267 -2484021 -279054
6478b79054K050359J369985O7220j584493k229703p57876J691529K727004J860012
$$ -279054 1771305 3141290 3208510 1624017 -605686 -1363562 327967 3054971 4914983
6469D914983Q83967Q26803N84200o85106j870631j827624j250400j240959j414739
$$ 4914983 5798950 6625753 7209953 6524847 4654216 2826592 1576192 335233 -1079506
6460a079506q28306L38434J266805J689330J667750J259059J026982J439064J321968
$$ -1079506 -1907812 -1569378 -302573 1386757 3054507 4313566 5340548 6779612 8101580
6451H101580r14788l828524l678957j37776K123341K00967k084388L0521M325468
$$ 8101580 7186792 3358268 -320689 -458465 1664876 1865843 -218545 -188024 4137444
6442D137444M652224M07058k784503j735374O27591J221920R29618P49090r58291
$$ 4137444 8789668 9196726 6412223 4676849 5304440 6526360 7455978 8205068 7246777
6433G246777m224434m979419q89872L753040L548430q6975j399932Q17139K124897
$$ 7246777 3022343 -1957076 -2846948 906092 4454522 4367547 2967615 3784754 5909651
6424E909651J28362j908285p21180J778014J668474j145815l187064k502695r90998
$$ 5909651 6038013 4129728 3408548 5186562 6855036 5709221 2522157 19462 -971536
6415i71536j306930k966836k730935J033999N342583N437635Q39740l421495l007453
$$ -971536 -2278466 -5245302 -7976237 -6942238 -1599655 3837980 4677720 1256225 -1751228
6406a751228J80650J134525r54615k082294j0393K481549K331715P44649M94054
$$ -1751228 -1570578 -436053 -1390668 -3472962 -3483355 -1001806 1329909 2074558 2568612
6397B568612J214443N76290j244867j653543N9068J500302Q48031o41393q25951
$$ 2568612 3783055 4359345 3114478 1460935 1520003 3020305 3868336 3226943 2400992
6388B400992L41836J221740P76071o30094k058382k762302k491398j599196o45274
$$ 2400992 2742828 3964568 4740639 4110545 2052163 -710139 -3201537 -4800733 -5446007
6379e446007K20225J019828J212066J64026j421927j706911l7079J862389J934496
$$ -5446007 -5225782 -4205954 -2993888 -2829862 -4251789 -5958700 -5995779 -4133390 -2198894
6370b198894L70464q38325m56220R37069K196761K838117K910372K511127J750736
$$ -2198894 -1828430 -2666755 -3122975 -2185906 10855 2848972 5759344 8270471 10021207
6361A0021207P95910j32732o12458k83256K34606o34829l337510n521919m097182
$$ 10021207 10817117 10684385 10071927 9788671 10023277 9388448 6050938 529019 -3568163
6352c568163O80600M664228M222140J55852l626705m326802k079553J413471M404766
$$ -3568163 -2887563 1776665 5998805 6154657 2527952 -1798850 -3878403 -2464932 1939834
6343A939834N561383M550178K504066Q70811l44276k158727m402849n335081m015083
$$ 1939834 7501217 12051395 14555461 15426272 15081996 12923269 8520420 3185339 -829744
6334h29744j775153l76367L17404J602732L418638L900911J615332k500585n651649
$$ -829744 -2604897 -2981264 -2663860 -1061128 2357510 6258421 7873753 5373168 -278481
6325b78481n487207k205034J406290K581168J528451Q96120J850124K210360j06384
$$ -278481 -5765688 -7970722 -6564432 -3983264 -2454813 -1558693 291431 2501791 2395407
6316B395407l283455l733495j330168N23752K52098J66220J851070K801472L52728
$$ 2395407 -888048 -4621543 -5951711 -5427959 -5175861 -5009641 -3158571 -357099 -4371
6307d371l421222m171808j423578J197550J463155Q84739J290288K243622K760597
$$ -4371 -3425593 -7597401 -9020979 -7823429 -6360274 -5475535 -4185247 -1941625 818972
6298H18972K856769K288406K61293k366433l048290j213838L91319k58952j493800
$$ 818972 3675741 5964147 6225440 3859007 810717 -403121 -11802 -270754 -1764554
6289a764554j089505O1936J67918J77253J711544L015485J116626k659092l671593
$$ -1764554 -2854059 -2792123 -2624205 -2446952 -735408 2280077 3396703 737611 -2933982
6280b933982p60365K091472J887272M23136J89490J79839j435886l250174k547002
$$ -2933982 -3694347 -1602875 284397 707533 897023 1076862 -359024 -3609198 -6156200
6271f156200K59597K147589J682220K18545n76559k92606P37871J670531J211904
$$ -6156200 -5896603 -3749014 -2066794 -1848249 -2424808 -2717414 -1979543 -309012 902892
6262I02892r27619l024718l185897j571804N61342K888569N122153N307250J894711
$$ 902892 -24727 -3049445 -6235342 -7807146 -7245804 -4357235 764918 6072168 7966879
6253G966879k859109m610852k400898M19772J337171J648939K874916L259854
$$ 7966879 5107770 496918 -1903980 -1484208 -147037 1501902 4376818 7636672
6245G636672N45683l686137n490020l620215m71119J706326K879350L279726K062851
$$ 7636672 8182355 4496218 -993802 -4614017 -5085136 -3378810 -499460 2780266 4843117
6236D843117p70176k985001k423036J87771K206701K267964J084132m36470k095349
$$ 4843117 4072941 1087940 -1335096 -1147325 1059376 3327340 4411472 3975002 1879653
6227A879653l331160l061593j336127L35123J203666K272813L797606L671683
$$ 1879653 -1451507 -4513100 -5849227 -5514104 -4310438 -2037625 1759981 5431664
6219E431664O81110k136617r13082K702769K872317j754070n212139k798454J654313
$$ 5431664 6112774 3976157 3063075 5765844 8638161 6884091 1671952 -1126502 527811
6210E27811J523905k539000m081677j182457J152192k22675j779104j87031J548546
$$ 527811 2051716 -487284 -4568961 -5751418 -4599226 -4821901 -6601005 -6788036 -5239490
6201e239490n04038l652177k277103K881098N187824J771748k836169l956583
$$ -5239490 -5743528 -9395705 -11672808 -8791710 -3603886 -1832138 -4668307 -8624890
6193h624890k667607k001138j452843R60995L866274M053641J821527P91581K217936
$$ -8624890 -11292497 -13293635 -14746478 -13785483 -9919209 -5865568 -4044041 -3252460 -1034524
6184a034524L018527O32194l014984m285374k645121n49295L32953M97766O11250
$$ -1034524 1984003 2616197 -398787 -4684161 -7329282 -7878577 -7545624 -7047858 -6436608
6175f436608L68503k63642m52785N9408K76952l62793p54447K73445J978804K658924
$$ -6436608 -6068105 -6331747 -6784532 -6725124 -6448172 -6810965 -7565412 -7291967 -5313163 -2654239
6165b654239K045543J314631R56132K51197q60085j007218N18382J959277Q11734
$$ -2654239 -608696 705935 1662067 1913264 1053179 45961 564343 2523620 3335354
6156C335354k763237n432141m247488k84235K198694O63454k386741k260075J862231
$$ 3335354 572117 -4860024 -9107512 -9391747 -7193053 -6529599 -8916340 -11176415 -9314184
6147i314184N573818M884534J306889p25707m0679P42044L52411P60587K867902
$$ -9314184 -3740366 1144168 2451057 1725350 1684671 2426715 2779126 3539713 6407615
6138F407615L882660J503073j816460j987204O69578J803688q03660m404723n163955
$$ 6407615 10290275 11793348 9976888 7989684 8659262 10462950 9659290 5254567 90612
6129I0612k662557L32876J141476n15320k528200k395575R7764K404654K284624
$$ 90612 -2571945 -2239069 -1097593 -1612913 -4141113 -6536688 -6438924 -4034270 -1749646
6120a749646O93359J60673R53215R80354n72906j866619j263271M25624J420976
$$ -1749646 -1056287 -895614 57601 1037955 465049 -1401570 -2664841 -2239217 -818241
6111h18241J109401r4050j555587k369031j859002p10141k24574k19858M89859
$$ -818241 291160 197110 -1358477 -3727508 -5586510 -6296651 -6521225 -6741083 -6251224
6102f251224J311991J40421k788775m156758k170288Q84424K584372L833703N700710
$$ -6251224 -4939233 -4798812 -7587587 -11744345 -13914633 -13030209 -10445837 -6612134 -911424
6093i11424N870923K200677k399416l236255q08581K03926j579632k726918j297348
$$ -911424 4959499 7160176 4760760 1524505 715924 919850 -659782 -3386700 -4684048
6084d684048L64533M28825M02611J110152L37513k671904m360387k028918J394004
$$ -4684048 -4319515 -3890690 -3488079 -2377927 -2040414 -4712318 -9072705 -11101623 -9707619
6075i707619J689086j43579N290K560799M089773L044139J358052M06396p21355
$$ -9707619 -8018533 -8162112 -8156822 -5596023 -1506250 1537889 2895941 3302337 2580982
6066B580982k448126l526117l279250k309934o52495K009289M087799L227381
$$ 2580982 132856 -3393261 -6672511 -8982445 -9634940 -7625651 -3537852 -310471
6058c10471L53426o29183J621019L640572K120138j484533l292163j981154N12265
$$ -310471 42955 -586228 1034791 4675363 6795501 5310968 2018805 37651 549916
6049E49916J843736J197226m46088q54096J282130L935114L439701l68039l100864
$$ 549916 2393652 3590878 3144790 2290694 3572824 7507938 10947639 10579600 7478736
6040G478736j634848J373293J266143k095909m530404l391496m66614R44265j78026
$$ 7478736 5843888 7217181 8483324 6387415 1857011 -1534485 -2001099 -1056834 -1234860
6031a234860j906663j374612K282188O291945O555467K431622k228811l874574
$$ -1234860 -3141523 -4516135 -2233947 4057998 10613465 13045087 10816276 6941702
6023F941702l128177k349584j745645m69880M97903j33742r88176R829J725870
$$ 6941702 3813525 1463941 -281704 -751584 -253681 -387423 -1375599 -1365770 360100
6014C60100J457750k85351n03065J120454J752314K62792j412314k159580k882387
$$ 360100 1817850 1532499 1029434 2149888 3902202 4164994 2752680 593100 -2289287
6005b289287l157385j073034K338084K994063M1154k127017o64169J190615l19303
$$ -2289287 -5446672 -6519706 -4181622 -1187559 -1146405 -3273422 -3937591 -2746976 -3066279
5996c066279l275267l534542j188350Q71263K237200M033470M671344J845438
$$ -3066279 -6341546 -9876088 -11064438 -10193175 -7955975 -3922505 748839 2594277
5988B594277k160744k423192J286622L886873K357497o39391j627929q31425j85617
$$ 2594277 433533 -1989659 -703037 3183836 5541333 4901942 3274013 2442588 2256971
5979B256971j23469j58293j97148J44550J409267K651677K294263J120907J444414
$$ 2256971 2133502 1975209 1778061 1922611 3331878 5983555 8277818 9398725 10843139
5970A0843139K664283J367624k722104m929442k291681J609103J790292j255727
$$ 10843139 13507422 14875046 12152942 7223500 4931819 6540922 8331214 7075487
5962G075487l663938m469323n132154m663434o56489N082689P150191L824318
$$ 7075487 3411549 -1057774 -6189928 -10853362 -11509851 -6427162 723029 4547347
5954D547347o08296k204744j965658k118848j770995N73288L050750K722249K42159
$$ 4547347 3939051 1734307 -231351 -2350199 -4121194 -3547906 -497156 2225093 2467252
5945B467252j190569o48831j2158j50407J28490J055717R36683p93792k137743
$$ 2467252 1276683 627852 615694 465287 593777 1649494 2586177 1792385 -345358
5936c45358j562961l78354m37040j172797q71596L14431P90357L61510M70470
$$ -345358 -1908319 -2286673 -2723713 -3896510 -4768106 -4453675 -3663318 -3301808 -2831338
5927b831338J535324K015682P78711j088176j798729j272877r52708j580203k144027
$$ -2831338 -1296014 719668 1498379 410203 -1388526 -2661403 -3614111 -5194314 -7338341
5918g338341j320873N00479J257835l90972l093022m094592k608950p26765l02875
$$ -7338341 -8659214 -8158735 -6900900 -7291872 -10384894 -14479486 -17088436 -17815201 -18118076
5909a8118076k41532J640610M950047O940372O212194M132076K253291L75458
$$ -18118076 -18359608 -16718998 -11768951 -4828579 1383615 5515691 7768982 8144440
5901H144440j956250l801081l992465k799110j268097J31609J227101J528577
$$ 8144440 6188190 2387109 -1605356 -4404466 -5672563 -5540954 -4313853 -2785276
5893b785276R88994N03829O61262Q75018O28698M45268O18982L60489m83031m06715
$$ -2785276 -1796282 -1292453 -631191 243827 872525 1317793 1936775 2297264 1814233 1407518
5883A407518J234652K217483M30522k284456k303945K51161J537442p9607j572134
$$ 1407518 2642170 4859653 5290175 3005719 701774 952935 2490377 2410770 838636
5874H38636k14479J982949J339352j801298l372751j218677K057550K594366Q3844
$$ 838636 624157 2607106 3946458 2145160 -1227591 -2446268 -388718 2205648 2289492
5865B289492k198277j733807K66814R79771O1653j93420J199681K183006J104170
$$ 2289492 91215 -1642592 -1375778 -396007 -334354 -527774 671907 2854913 3959083
5856C959083m32562m89165n67257l041485o008431m992382p90L474675J955729
$$ 3959083 3526521 3037356 2470099 -571386 -6579817 -11572199 -11572989 -8098314 -6142585
5847f142585j375484j741749Q37839L051667L520596L220340K449856O88852j419690
$$ -6142585 -7518069 -9259818 -8421979 -5370312 -1849716 1370624 3820480 4509332 3089642
5838C089642k676501l196287l444556k569105k17189J266688l70589l087327k627692
$$ 3089642 413141 -2783146 -6227702 -8796807 -9013996 -7747308 -8117897 -11205224 -13832916
5829a3832916J300210M440945M092115K326375J867944J928723L46368k277092
$$ -13832916 -12532706 -8091761 -3999646 -1673271 194673 2123396 2469764 192672
5821A92672l109616r61308K220437L565438K060071o50783j833045m46487J632876
$$ 192672 -2916944 -3878252 -1657815 1907623 3967694 3316911 1483866 1037379 2670255
5812B670255J881771L10394q90943o31473m9130j71230m01884R904P78958J614754
$$ 2670255 4552026 4862420 3971477 3340004 3290874 3119644 2717760 2727664 3506622 5121376
5802E121376K653782L045013J172575k418348m403359k839539j43975L09016j018226
$$ 5121376 7775158 10820171 11992746 9574398 5171039 2331500 2187525 2496541 1478315
5793A478315j215027j1435p3386k193108l584021k145176L40423J106096M23848
$$ 1478315 263288 251853 178467 -2014641 -5598662 -7743838 -7403415 -6297319 -5873471
5784e873471M38032J332057J360000L67450N17449K654263M172798K307225j680026
$$ -5873471 -5435439 -4103382 -2743382 -2375932 -1858483 795780 4968578 7275803 5595777
5775E595777l745453k300639j50048n21239k784034l470355p57519L412952N489613
$$ 5595777 1850324 -450315 -600363 -1121602 -3905636 -7375991 -8133510 -4720558 769055
5766G69055L668234o68397m061415l843671p44054J704502J141632r23312j580118
$$ 769055 4437289 3768892 -292523 -4136194 -4880248 -3175746 -2034114 -2957426 -4537544
5757d537544p66858q80365k344157k285966J241242N825947P248826M303426m73887
$$ -4537544 -5304402 -6184767 -8528924 -10814890 -9573648 -3747701 3501125 7804551 7330664
5748G330664m024327n190381m459726k826326j059929O08666K081420K646658
$$ 7330664 3306337 -1884044 -6343770 -9170096 -10230025 -9621359 -7539939 -4893281
5740d893281J551318k96823n37453J669669L978556L526306N19900k202524k645055
$$ -4893281 -3341963 -3638786 -4176239 -2506570 1471986 4998292 5518192 3315668 670613
5731F70613j401302l67444q84394k753416m092546k776039R39169M014534M042637
$$ 670613 -730689 -1098133 -1982527 -4735943 -8828489 -11604528 -10665359 -6650825 -2608188
5722b608188K100090P79742N70442K00038m46584l10692M25798N46213K47659
$$ -2608188 -508098 271644 842086 1042124 595540 284848 710646 1256859 1504518
5713A504518O85291J116367l86693k885427k648361J310821M847739L914661k79611
$$ 1504518 2189809 3306176 2919483 34056 -2614305 -1303484 3544255 7458916 7179305
5704G179305l558521m057291k704659k96441K841813N149075M696597J806945
$$ 7179305 3620784 -436507 -3141166 -3437607 -595794 4553281 9249878 11056823
5696A1056823j145150k507963k523807k187854k330244l213615l710394j822548
$$ 11056823 9911673 7403710 4879903 2692049 361805 -2851810 -6562204 -8384752
5688h384752K406733N617538M760344J079195j621291j755581o96189K50966P72101
$$ -8384752 -5978019 -360481 4399863 5479058 3857767 2102186 1405997 1656963 2429064
5679B429064J70773j699026k453547K91732M241240M187986n65704m521028l553895
$$ 2429064 2599837 900811 -1552736 -1261004 2980236 7168222 6602518 2081490 -1472405
5670a472405m32439j7897k086630k513797L03051L800538N173430L984285J361339
$$ -1472405 -1904844 -1922741 -4009371 -6523168 -6220117 -2419579 2753851 6738136 8099475
5661H099475r49160j231843K81478P65634j706606m765863m403834n76271K629470
$$ 8099475 7150315 5918472 6199950 6965584 5258978 493115 -3910719 -4486990 -1857520
5652a857520K459429L85370r52783j097644j012333j003850p26647p1482P76432
$$ -1857520 601909 987279 34496 -1063148 -2075481 -3079331 -3805978 -3877460 -3101028
5643c101028J286370M67539j874390l782634k867776L03242K476789J952781N37270
$$ -3101028 -1814658 -1347119 -3221509 -7004143 -9871919 -9568677 -7091888 -5139107 -4601837
5634d601837L81779R95954Q66865K27988L02366R95906J251335R21293N35726
$$ -4601837 -4220058 -3224104 -2357239 -2129251 -1826885 -830979 420356 1341649 1877375
5625A877375j88019j784151l258757k710507l3638K437422K599692R64440k91256
$$ 1877375 1689356 -94795 -3353552 -6064059 -6097697 -3660275 -1060583 -96143 -387399
5616c87399p8590N91520L46678n39061o55270J82400L94079p48244j346863M39504
$$ -387399 -465989 125531 472209 -66852 -722122 -539722 -145643 -893887 -2240750 -1801246
5606a801246K856066K402497p84848k530691o20807J967647J850913K61040J76050
$$ -1801246 1054820 3457317 2672469 141778 -479029 1488618 3339531 3600571 3776621
5597C776621Q40152o46657l449989l494335k15920J774950m40620l445587k520406
$$ 3776621 4616773 3970116 520127 -2974208 -3190128 -1415178 -1855798 -5301385 -7821791
5588g821791J521532L934010K782257N32134m72570o92487j193463j719972k020418
$$ -7821791 -6300259 -2366249 416008 948142 475572 -216915 -1410378 -3130350 -5150768
5579e150768k755941l696619k952880K02699L223009L184282R66999J40011J826564
$$ -5150768 -7906709 -11603328 -14556208 -14353509 -11130500 -7946218 -6979219 -6839208 -5012644
5570e012644L212722J841501r63759k403191k050071j476799j386799j322728
$$ -5012644 -1799922 41579 -922180 -3325371 -5375442 -6852241 -8239040 -9561768
5562i561768j342264j603613q55624J961025M751557L999473R6821k203202q3294
$$ -9561768 -10904032 -12507645 -13363269 -11402244 -6650687 -2651214 -2554393 -4757595 -4840889
5553d840889L525248M466603K963124J919642J910654J379250M37264O00169J140086
$$ -4840889 -1315641 3150962 6114086 8033728 9944382 11323632 11760896 12361065 13501151
5544A3501151m74262l948238n349605k261077K668184M701969J966616l335557
$$ 13501151 13026889 9078651 3729046 1467969 4136153 8838122 10804738 7469181
5536G469181p105725o327796j655340K540454K442442p45143k595697j508163
$$ 7469181 363456 -5964340 -7619680 -5079226 -2636784 -3381927 -5977624 -7485787
5528g485787k6524Q2925K89179J479761J573347n03843j805591L10216L421115
$$ -7485787 -7512311 -7429386 -7140207 -5660446 -4087099 -4590942 -6396533 -6086317 -2665202
5519b665202L410111Q17667k04653J638341L329470K432385r5081k337442l634920
$$ -2665202 744909 1562576 1357923 2996264 6325734 8758119 8663038 6325596 2690676
5510B690676l810682k789371j561158j328580j411866j82277J887125K589539
$$ 2690676 -1120006 -3909377 -5470535 -6799115 -8210981 -8393258 -6506133 -3916594
5502c916594J548872P59738J222760J750924J568562J220825L34751k282952n309743
$$ -3916594 -2367722 -1607984 -385224 1365700 2934262 4155087 4489838 2206886 -3102857
5493c102857n139493j132357K658764L093562K028493K223221K463357L66840
$$ -3102857 -8242350 -9374707 -6715943 -3622381 -1593888 629333 3092690 3459530
5485C459530k510256k596994J14227K408546K807494K327834J067301j756474
$$ 3459530 949274 -1647720 -1533493 875053 3682547 6010381 7077682 5321208
5477E321208m472226l956610o56432J337232L35477o19801R28407K850759K109230
$$ 5321208 848982 -3107628 -3764060 -2426828 -2091351 -2711152 -1782745 1068014 3177244
5468C177244n40721k253166k217510j332158L39381K791959M081233K228802j395593
$$ 3177244 2636523 383357 -1834153 -3166311 -2826930 -34971 4046262 6275064 4879471
5459D879471l355688k679776j639739j911072k395496j529710L11661J866912
$$ 4879471 1523783 -1155993 -2795732 -4706804 -7102300 -8632010 -8320349 -6453437
5451f453437K995161M235990N042353L867586L30135l443306m481403k213072
$$ -6453437 -3458276 777714 5820067 9687653 10017788 6574482 2093079 -119993
5443a19993O15342J040646o07771j589044q59208k94703j238142j994106l84285
$$ -119993 495349 1535995 928224 -660820 -1520028 -1814731 -3052873 -5046979 -5431264
5434e431264K693888M179576K517752j143940m615089o009086m367523p23470
$$ -5431264 -2737376 1442200 3959952 2816012 -1799077 -7808163 -12175686 -12899156
5426a2899156K127749K525119J770439J530025R75388r80863k187480J92562M178160
$$ -12899156 -10771407 -8246288 -6475849 -4945824 -3970436 -4951299 -7138779 -6946217 -2768057
5417b768057M459978K11735k962040r46369K908849K928596o71420k663279m34870
$$ -2768057 1691921 1903656 -1058384 -2004753 904096 3832692 3161272 497993 63123
5408F3123L144354M189315J836629k412807o422382p715186m672469J044079M977923
$$ 63123 3207477 7396792 9233421 6820614 398232 -7316954 -11989423 -10945344 -5967421
5399e967421M386995J270860m29125K82826J056881K21049r67544q28756j40186
$$ -5967421 -1580426 -309566 -738691 -455865 601016 822065 -145479 -974235 -1114421
5390a114421o61969j739149q67176K107871L886196K161350r04964j707819j49476
$$ -1114421 -1776390 -3515539 -4382715 -2274844 1611352 3772702 2867738 1159919 1010443
5381A010443R72574N09885p5594k5699m56371j638184j850452o3220K301171L274250
$$ 1010443 1983017 2492902 2417308 2391609 1935238 297054 -1553398 -1616618 684553 3958803
5371C958803K331980J4800k471274l023241n60844K317541J581484k366413m330304
$$ 3958803 6290783 6305583 3834309 811068 250224 2567765 4149249 1782836 -2547468
5362b547468j366100L167054M734965L437923J831040J33481k554226m537717
$$ -2547468 -3913568 -746514 3988451 7426374 9257414 9390895 6836669 2298952
5354B298952l287080J49876K146340J297847p43391k369931l068156k325217l76238
$$ 2298952 -988128 -838252 1308088 2605935 1862544 -507387 -3575543 -5900760 -6276998
5345f276998R03852N21360L81595J965428L023714J281265p39248N67651L054699
$$ -6276998 -5373146 -4851786 -4470191 -2504763 518951 1800216 1060968 1628619 4683318
5336D683318J605875k863581l758610R35947N212390M174477P93589J00807J450834
$$ 4683318 6289193 3425612 -332998 602949 5815339 9989816 10783405 10884212 12335046
5327A2335046Q81254k053613m070965l080774j64115K195654J891853j246487
$$ 12335046 13216300 11162687 7091722 4010948 3846833 6042487 7934340 6687853
5319F687853m290036l708293k14002J625863p6538j846118p08924J068374K31715
$$ 6687853 2397817 -1310476 -1524478 101385 24847 -1821271 -2530195 -1461821 -1230106
5310a230106j835479j699449L43594J232135L17415l83265j52105j56738n93147
$$ -1230106 -3065585 -4765034 -4421440 -3189305 -2871890 -3255155 -3407260 -3563998 -4157145
5301d157145m34212K80126O32892R10704J978223L086879K816573J720911J508562
$$ -4157145 -4591357 -4311231 -3678339 -2767635 -789412 2297467 5114040 6834951 8343513
5292H343513J963193J268124o72513j771133j030673j73023j161588l387613m198574
$$ 8343513 10306706 11574830 10902317 9131184 8100511 7927488 6765900 3378287 -820287
5283h20287j967869J641131K972169O64608k140568j716253Q54041J269842j090456
$$ -820287 -2788156 -1147025 1825144 2489752 349184 -1367069 -513028 756814 -333642
5274c33642k039197M75758K882202J992662J27150N64933J716018L56436k326448
$$ -333642 -2372839 -1897081 985121 2977783 3104933 3669866 5385884 5742320 3415872
5265C415872k810414j108379K53601J124004K609326K938981l6964l521070k761709
$$ 3415872 605458 -502921 -249320 874684 3484010 6422991 6386027 2864957 103248
5256A03248J286501L183549J653486Q30419K395078K890485M53708j822601j633595
$$ 103248 1389749 4573298 6226784 7057203 9452281 12342766 12796474 10973873 9340278
5247I340278j132426k062640k239778k00615J122636q04275l336712k707054j9436
$$ 9340278 8207852 6145212 3905434 3704819 4827455 4023180 686468 -2020586 -2040022
5238b040022Q44291o90598j696827m86594J577815K402588J149391j372174k935051
$$ -2040022 -1195731 -1886329 -3583156 -4069750 -2491935 -89347 1060044 -312130 -3247181
5229c247181j797525N75881O48265k127497l851560j531778K659867M772385M363636
$$ -3247181 -5044706 -4468825 -3820560 -5948057 -9799617 -11331395 -8671528 -3899143 464493
5220D64493L671255L435073K623252J151562j2376q62156k087807l231826l117655
$$ 464493 4135748 7570821 10194073 11345635 11333259 10471103 8383296 5151470 2033815
5211B033815j805032n47121j62190n68342j255599j317952n8579J600683J718684
$$ 2033815 228783 -318338 -480528 -1048870 -2304469 -3622421 -3681000 -2080317 -361633
5202c61633K00481p79089k88524k23461j666957k251887J40457L178070L008936
$$ -361633 -161152 -940241 -1228765 -1452226 -3119183 -5371070 -5230613 -2052543 956393
5193I56393J54736j177039O44889K601476J773063p73376k034413r79984Q25689
$$ 956393 1111129 -65910 578979 3180455 4953518 4180142 2145729 1165745 1991434
5184A991434J284424l82903k948367l946771k069522J015239K326774J224029
$$ 1991434 3275858 2892955 -55412 -4002183 -6071705 -5056466 -2729692 -1505663
5176a505663J8486M57491J220087K44687j683883j822579K59696J737290Q39778
$$ -1505663 -1487177 -1029686 190401 435088 -1248795 -3071374 -2811678 -1074388 -234610
5167b34610j92040J291095L469529K237957k100866m336134j664592K325603L173466
$$ -234610 -426650 864445 4333974 6571931 4471065 134931 -1529661 795942 3969408
5158C969408J512514M38033J09337r49468j612969L6827K148852J223217j967403
$$ 3969408 5481922 5919955 6029292 5079824 3466855 3503682 5652534 6875751 4908348
5149D908348l335125j918560n42010k56891O92857K044554J081113j908054k938686
$$ 4908348 1573223 -345337 -887347 -1144238 -451381 1593173 2674286 766232 -2172454
5140b172454o67798J409087P31773j053126k162525l099896l321305p55354L253089
$$ -2172454 -2840252 -1431165 -699392 -1752518 -3915043 -7014939 -10336244 -11091598 -7838509
5131g838509L982175P72575j244343L78615J438822q06977k227656N07181L203477
$$ -7838509 -3856334 -3083759 -4328102 -3949487 -2510665 -3317642 -5545298 -5038117 -1834640
5122a834640J335885j637752l31793K844306J913623k139272l227450l77677J811684
$$ -1834640 -498755 -2136507 -2468300 376006 2289629 150357 -3077093 -3454770 -1643086
5113a643086J574220J219437P59798k156367n922485n767560j588304J503351
$$ -1643086 -68866 1150571 1910369 -245998 -6168483 -11936043 -13524347 -12020996
5105a2020996J294484Q86155J972403K007951j15053j350195J46166J830943J392904
$$ -12020996 -10726512 -9840357 -7867954 -5860003 -5975056 -7325251 -7179085 -5348142 -3955238
5096c955238L16071M16147N35835p97662k324074j932339L78045K804798L451537
$$ -3955238 -3639167 -3223020 -2687185 -3484847 -5808921 -7741260 -7363215 -4558417 -1106880
5087a106880J418756k016717l721307k341580n69990j109230k083649k66543K803582
$$ -1106880 311876 -1704841 -5426148 -7767728 -8337718 -9446948 -11530597 -11797140 -8993558
5078h993558K871464J96638p43960J274235K621252J384439J53077Q77943J866373
$$ -8993558 -6122094 -5925456 -6669416 -5395181 -2773929 -1389490 -1236413 -358470 1507903
5069A507903J612596J260658J508011R69763p60540j938268j771414j349653q53151
$$ 1507903 3120499 4381157 5889168 6858931 6098391 4160123 2388709 1039056 185905
5060A85905M89973J401902k01849k686868k286181K67533K05808l013439l882228
$$ 185905 675878 2077780 1875931 -810937 -3097118 -2829585 -2623777 -5637216 -9519444
5051i519444M16965N144729N132583J875992j66595k42287l80474r76780j027053
$$ -9519444 -9102479 -3957750 1174833 3050825 2884230 2641943 2261469 1284689 257636
5042B57636o47363n27031n27216n01927n87902Q6736K300535M036110K491319
$$ 257636 -389727 -916758 -1443974 -1945901 -2533803 -2447067 -146532 3889578 6380897
5033F380897q60542j652431K86396M41209k448775l756382p50163K655591K394496
$$ 6380897 5520355 3867924 4154320 4595529 2146754 -1609628 -2359791 295800 2690296
5024B690296M37747M87581J820793J677523K52740p53885j591341k835674l091734
$$ 2690296 3128043 3615624 5436417 7113940 7366680 6612795 5021454 2185780 -905954
5015i05954j570826k45551n38173p46191N25028J526614P32675k42195N8622P4843
$$ -905954 -2476780 -2722331 -3260504 -4006695 -3481667 -1955053 -1222378 -1464573 -1405951 -1331108
5005a331108j369605k195428p51461Q48448K62539j192867j201992j00694Q61817
$$ -1331108 -2700713 -4896141 -5647602 -4799154 -4536615 -5729482 -6931474 -7032168 -6170351
4996f170351J942982L121673L039768J880917J742433K224682M1396m673769o636986
$$ -6170351 -4227369 -1105696 1934072 3814989 5557422 7782104 7823500 3149731 -3487255
4987c487255l039033J948153L580072K564257J294532o10855k997313k747827
$$ -3487255 -6526288 -4578135 -998063 1566194 2860726 2249871 -747442 -3495269
4979c495269P46817K736931M23751k017393o78688J254615l32083k780041j727282
$$ -3495269 -2748452 -11521 412230 -1605163 -2283851 -1029236 -1361319 -4141360 -5868642
4970e868642P28175L0658k426357k104474L60614O25497j616550k590064n77861
$$ -5868642 -5140467 -5109809 -7536166 -9640640 -9280026 -8654529 -10271079 -12861143 -13439004
4961a3439004K916096O168805P302273M375522o83383k289882O17178J805025
$$ -13439004 -10522908 -4354103 2948170 7323692 6640309 4350427 4967605 6772630
4953F772630k169588n449933k598833J875091J483670j067990K11037L049517
$$ 6772630 4603042 -846891 -3445724 -1570633 -86963 -1154953 -943916 2105601
4945B105601J451160k573235k519098M90418j10364m038417m647690p51135J973728
$$ 2105601 3556761 983526 -1535572 -1045154 -1155518 -5193935 -9841625 -10592760 -8619032
4936h619032J143971K44498J113808J881687K030685K326853J000052l007828
$$ -8619032 -7475061 -7230563 -6116755 -4235068 -2204383 122470 1122522 -1885306
4928a885306n314748k062131K418381J982558q25465L62533M083568M251463J645144
$$ -1885306 -7200054 -9262185 -6843804 -4861246 -5686711 -5324178 -1240610 3010853 4655997
4919D655997J550701K922706R57442k250799j084179K057014L56290m541368n219683
$$ 4655997 6206698 9129404 10086846 7836047 6751868 8808882 9165172 4623804 -595879
4910e95879j849208p09861j739263l8224K838443K006983M73456L575683O185391
$$ -595879 -2445087 -3154948 -4894211 -4932435 -2093992 -87009 386447 3962130 10147521
4901A0147521O27431o926570m993727K440863K525635k888532j297132N687594
$$ 10147521 10774952 3848382 -1145345 1295518 3821153 932621 -364511 5323083
4893E323083M723239l349289m500703J431670M81571p385148p284976J077258
$$ 5323083 10046322 6697033 2196330 3628000 4109571 -3275577 -10560553 -9483295
4885i483295J924049n225411m009851M763717K384573q848793n666821Q928622
$$ -9483295 -7559246 -12784657 -16794508 -12030791 -9646218 -18495011 -24161832 -15233210
4877a5233210M680847j6675684j6920468K1285k8768435j15712693j60615193
$$ -15233210 -10552363 -27228047 -44148515 -44127230 -72895665 -188608358 -349223551
4870c49223551p3917759Q0102612J51644932R8386190K0626853M539278K3229288
$$ -349223551 -423141310 -343038698 -191393766 -93007576 -72380723 -67841445 -44612157
4863d4612157J8714927k030414k560406J1026493R757124k502265k595229O232464
$$ -44612157 -25897230 -27927644 -30488050 -19461557 -9704433 -12206698 -14801927 -8569463
4855h569463M444177n164784n589813J030200M89942m228334j64193Q467626P416222
$$ -8569463 -4125286 -9290070 -14879883 -13849683 -13359741 -17588075 -17752268 -9284642 -1868420
4846a868420r22212k791340J571389J110858l286532j497352M757465M534175
$$ -1868420 -2790632 -5581972 -4010583 -2899725 -6186257 -7683609 -2926144 1608031
4838A608031j661239l096037J564350L495478O39754q43870j43831j678086l502138
$$ 1608031 -53208 -3149245 -1584895 1910583 2550337 1706467 1562636 -115450 -3617588
4829c617588k52917M528598K919699k836856l792151J91637J752233K46429J066461
$$ -3617588 -3870505 658093 3577792 740936 -3051215 -2859578 -1107345 -860916 205545
4820B05545L084800N93878l955224k888671K238509K692054j761490k804487J021249
$$ 205545 3290345 3884223 -71001 -2959672 -721163 1970891 209401 -2595086 -1573837
4811a573837K430701m26956j180800J818226K409625j225406l073175o23570J130734
$$ -1573837 856864 429908 -750892 1067334 3476959 2251553 -821622 -1445192 -314458
4802c14458k97128j052545L43543K36228j692238p16623L552977N243556K276930
$$ -314458 -611586 -1664131 -1320588 -1084360 -2776598 -3493221 59756 5303312 7580242
4793G580242m87025o04413j629649m689052n356316k091035N39484J78735J66120
$$ 7580242 7093217 6488804 4859155 170103 -5186213 -7277248 -6737764 -6559029 -6392909
4784f392909J815462J515225j255490j463247K124409L437803n55102l986716
$$ -6392909 -4577447 -3062222 -4317712 -5780959 -3656550 -218747 -773849 -4760565
4776d760565j856516J572345J34421m445574o206929l768211l2434L027372M502263
$$ -4760565 -6617081 -5044736 -4910315 -9355889 -15562818 -19331029 -19363463 -16336091 -11833828
4767a1833828L000786p24034k720517r56276J680499K369541K512482L807006
$$ -11833828 -8833042 -9557076 -12277593 -13233869 -11553370 -9183829 -6671347 -2864341
4759b864341M278088J994759p65586r47364N04331P92633k67062j059763j235826
$$ -2864341 1413747 3408506 2642920 1695556 2199887 2992520 2725458 1665695 429869
4750D29869j225925o90384L34402P21851L27143N06448J311248Q91286j094234
$$ 429869 -796056 -1486440 -1152038 -430187 -103044 403404 1714652 2605938 1511704
4741A511704k497444k297671j899413j701679j97024K067956J888741j119499
$$ 1511704 -985740 -3283411 -5182824 -6884503 -7081527 -5013571 -3124830 -4244329
4733d244329k670553j81047K952478K704846M89790N9952J169668O00953k037979
$$ -4244329 -6914882 -7095929 -4143451 -1438605 -948815 -888863 280805 881758 -1156221
4724a156221l554489j967150Q48155J722489j13827k252266j724847J379805L493654
$$ -1156221 -4710710 -6677860 -5829705 -4107216 -4221043 -6473309 -8198156 -6818351 -3324697
4715c324697J834332j877077l824094l081251j573743j82237J674979L228234
$$ -3324697 -1490365 -3367442 -7191536 -10272787 -11846530 -12028767 -10353788 -7125554
4707g125554K914608J520359J043589Q08228j153166l278455j948105K087419
$$ -7125554 -4210946 -2690587 -1646998 -838770 -1991936 -5270391 -7218496 -5131077
4699e131077L989983K236919M06454N27614K95298j395747j889341j80325N79471
$$ -5131077 -1141094 1095825 1502279 2029893 2325191 929444 -959897 -1140222 -560751
4690e60751j101936j962550m9691J159430j316472m371434l570829Q8827K535088
$$ -560751 -1662687 -3625237 -3674928 -2515498 -3831970 -8203404 -11774233 -11685406 -9150318
4681i150318K793968K682152K765198K449687K167889K250937J430406r51031
$$ -9150318 -6356350 -3674198 -909000 1540687 3708576 5959513 7389919 6438888
4673F438888l250091m132123m376901m222824k097828J774709L946267K528499
$$ 6438888 3188797 -943326 -5320227 -9543051 -11640879 -9866170 -5919903 -3391404
4665c391404O8328r04803j506604k828137k687425L12951L162084K862856J234717
$$ -3391404 -3323076 -4227879 -5734483 -8562620 -11250045 -10937094 -7775010 -4912154 -3677437
4656c677437J339752K284271J735865O01875Q03164J085924m96081k362753k061090
$$ -3677437 -2337685 -53414 1682451 2284326 3087490 4173414 3677333 1314580 -746510
4647g46510p86976q58366j050124Q60988L064896K240440n23506j284200M50789
$$ -746510 -1533486 -2391852 -3441976 -2580988 483908 2724348 2200842 916642 1367431
4638A367431J638383R35807l66570j655452k972095k750033Q3676K776616J984599
$$ 1367431 3005814 3941621 3575051 1919599 -1052496 -3802529 -3718853 -942237 1042362
4629A042362n66449k61439L226809N663132M821645K573922L63771k569882n681284
$$ 1042362 475913 214474 3441283 9104415 13926060 16499982 16863753 14293871 8612587
4620H612587o294628l780359j106504p60373j750403j746740n6469K236706L396764
$$ 8612587 2317959 -1462400 -2568904 -3329277 -5079680 -6826420 -6882889 -4646183 -1249419
4611a249419K205037m50827j688686J5054K561976L077020J525904n29170k709270
$$ -1249419 955618 504791 -1183895 -1168841 1393135 4470155 5996059 5466889 2757619
4602B757619m625527m153106m33808L225159L209713P12145q31034j474200l345092
$$ 2757619 -1867908 -6021014 -6454822 -3229663 -19950 692195 -138839 -1613039 -4958131
4593d958131n145589l501915P39317K904371J432071l95263j28066R91303J505870
$$ -4958131 -10103720 -13605635 -12866318 -9961947 -8529876 -8925139 -9053205 -8061902 -6556032
4584f556032J761457J575842j29527k418939k665207o28440J046372R17086J65120
$$ -6556032 -4794575 -3218733 -3348260 -5767199 -8432406 -9060846 -8014474 -7097388 -6932268
4575f932268k06652k97181M35510K310174L201236J137671j368258j71032L559509
$$ -6932268 -7138920 -7436101 -7000591 -4690417 -1489181 -351510 -1719768 -1890800 1668709
4566A668709M366948Q37826k451400k273573o73044o4720K71182P08039o54378
$$ 1668709 6035657 6873483 4422083 2148510 1475466 1410746 1681928 2389967 1735589
4557A735589l774789n009076k543431M23390P13932k56251K73934J979056L076268
$$ 1735589 -2039200 -7048276 -9591707 -9168317 -8454385 -8710636 -8436702 -6457646 -3381378
4548c381378L354161K927638Q24143k621456m573677l281700n50553J158130J514433
$$ -3381378 -27217 2900421 3724564 1103108 -3470569 -6752269 -7302822 -6144692 -4630259
4539d630259P70519j375494l616968l104718K86983K992661K952443K253938K615416
$$ -4630259 -3859740 -5235234 -8852202 -11956920 -11669937 -8677276 -5724833 -3470895 -855479
4530h55479K295282J70491j204041R829J223216n7707j324129J011660N301921
$$ -855479 1439803 1610294 406253 416082 1639298 1581591 257462 1269122 6571043
4521F571043O600087L300420j747021n250539n560103k579370J322271K117223
$$ 6571043 13171130 16471550 14724529 9473990 3913887 1334517 2656788 4774011
4513D774011j223240m728961m699088k520190j318857p76898Q67870K335042J380568
$$ 4774011 3550771 -1178190 -5877278 -8397468 -9716325 -10493223 -9625353 -7290311 -5909743
4504e909743n47549l78059J201661R88906j063725j919117o77864N46555P70720
$$ -5909743 -6457292 -6835351 -5633690 -4644784 -5708509 -7627626 -8305490 -7758935 -6988215
4495f988215J175261K019052K176312J727496J617372J012135j465671m202022
$$ -6988215 -5812954 -3793902 -1617590 109906 1727278 2739413 1273742 -2928280
4487b928280m098615j491633L34671N07762J171066K401891J294451k476523m703311
$$ -2928280 -7026895 -8518528 -8183857 -7676095 -6505029 -4103138 -2808687 -5285210 -9988521
4478i988521k622159R10349K006076J356735J982764L724284L722400J396543
$$ -9988521 -12610680 -11700331 -9694255 -8337520 -6354756 -2630472 1091928 2488471
4470B488471n08875P802J693344K230243J036804r98176l100839m605152m227880
$$ 2488471 1979596 1987398 3680742 5910985 6947789 5949613 2848774 -1756378 -5984258
4461e984258j186499K710013L824145Q05895l175702l983057j522002Q18607J131216
$$ -5984258 -7170757 -4460744 -636599 169296 -3006406 -6989463 -8511465 -7692858 -6561642
4452f561642O68842N71653J71471n42289q8705J266992P72543j999188k921599
$$ -6561642 -5892800 -5321147 -5149676 -5691965 -5780670 -4513678 -3741135 -5740323 -8661922
4443h661922P75254N167977M431902p64594m137092k372469J432863L039538J907354
$$ -8661922 -7886668 -2718691 1713211 948617 -3188475 -5560944 -4128081 -1088543 818811
4434H18811j232j103612q31560L17077O68429p78582k244893j047995K322426
$$ 818811 817579 -286033 -1117593 -800516 -132087 -910669 -3155562 -4203557 -1881131
4425a881131M334285K954855j19017k163974k280469j084449M62463J277546Q08799
$$ -1881131 2453154 5408009 5288992 3125018 844549 -239900 222563 1500109 2308908
4416B308908m5832M3846Q15217P50424o72015k469305l640753l725760k367926
$$ 2308908 2263076 2306922 3122139 3872563 3200548 731243 -2909510 -6635270 -9003196
4407i003196K0934J688328J407967L59849L57407J031911R03949K98049N40354
$$ -9003196 -8982262 -7293934 -5885967 -5526118 -5168711 -4136800 -3232851 -2934802 -2394448
4398b394448R97278q889j623171j095099J671266L323384J656197j610539l550914
$$ -2394448 -1397170 -1406059 -3029230 -4124329 -2453063 870321 2526518 915979 -2634935
4389b634935l276713j660487J12638R28394M44209m8933R57680K807000L460501
$$ -2634935 -5911648 -7572135 -7459497 -6531103 -6086894 -6135827 -5178147 -2371147 1089354
4380A089354K509130J336777M94100o88920j924133j991563j157896j070003j966227
$$ 1089354 3598484 4935261 5429361 4740441 2816308 824745 -333151 -1403154 -3369381
4371c369381k397122j850360j147112k54352J452457K712668J394274j635246
$$ -3369381 -5766503 -7616863 -8763975 -9018327 -7565870 -4853202 -3458928 -5094174
4363e094174k996200j816219q17818j426565j417576R06639L469463L511263J450850
$$ -5094174 -8090374 -9906593 -10724411 -12150976 -13568552 -12661913 -9192450 -5681187 -4230337
4354d230337l26593o06817K28506J161545R64051n13999j176053P95189L303944
$$ -4230337 -4556930 -5163747 -4935241 -3773696 -2809645 -3323644 -4499697 -3704508 -400564
4345d00564K574663q48624k544081j332692r35511k809823k900586J143978M748836
$$ -400564 2174099 1325475 -1218606 -2551298 -3486809 -6296632 -9197218 -8053240 -3304404
4336c304404L187076n93682o16139K527032K936242j006640m375904l322494J50232
$$ -3304404 -117328 -711010 -1327149 1199883 4136125 3129485 -1246419 -4568913 -4418681
4327d418681K223730K099191J243054P16267Q21153J521585K130188J836906R05337
$$ -4418681 -2194951 -95760 1147294 1863561 2684714 4206299 6336487 8173393 9078730
4318I078730J31824p10674k320710l926306l687430j285701J318402K028546N54348
$$ 9078730 9210554 8499880 6179170 2252864 -1434566 -2720267 -1401865 626681 1181029
4309A181029j723597k901890j849203O02713K003314Q22989j556838k323740n56826
$$ 1181029 -542568 -3444458 -5293661 -4690948 -2687634 -1864645 -3421483 -5745223 -6302049
4300f302049J762789K071326M193k239349k205228J54196K485500K881476J797190
$$ -6302049 -4539260 -2467934 -2463741 -4703090 -6908318 -6754122 -4268622 -1387146 410044
4291D10044M94348r06566k287689k140217J35655J870991K91733k848055l417645
$$ 410044 904392 -2174 -2289863 -4430080 -4294425 -2423434 -2131701 -4979756 -8397401
4282h397401j070295Q40995J137071J825883L005604K050762j000137k573729
$$ -8397401 -9467696 -8626701 -7489630 -5663747 -2658143 -607381 -1607518 -4181247
4274d181247j693815j516618k735913j461454L302702O143361L302866j339659
$$ -4181247 -5875062 -7391680 -10127593 -11589047 -8286345 -2142984 1159882 -179777
4266a79777k942900k839504l680734k939970K076770P190474O633882K154334
$$ -179777 -3122677 -5962181 -9642915 -12582885 -10506115 -3315641 3318241 5472575
4258E472575l03836k61787j689343m462110m500803j456861Q40478J132533J481433
$$ 5472575 5168739 4906952 3217609 -1244501 -5745304 -7202165 -6361687 -5229154 -3747721
4249c747721J870520L79375j778823j563918J50664J93069n70061R56729L056350
$$ -3747721 -1877201 -1497826 -3276649 -4840567 -4689903 -4496834 -5066895 -4110166 -1053816
4240a053816J239914l279521m751430k342765o32547o50923J172884M478435M308279
$$ -1053816 186098 -3093423 -7844853 -10187618 -10820165 -11471088 -10298204 -5819769 -1511490
4231a511490O22100m24876K823604M337804J080444j818968n84693Q69072j058370
$$ -1511490 -889390 -1314266 1509338 5847142 6927586 5108618 4523925 5392997 4334627
4222D334627l094664j969534p94584k760863m703199k837554N52322J724392J664285
$$ 4334627 1239963 -729571 -1524155 -4285018 -8988217 -11825771 -11273449 -9549057 -7884772
4213g884772K402053K109072r42084m035818m232481k589326o90623J812227L332117
$$ -7884772 -5482719 -3373647 -4315731 -8351549 -12584030 -15173356 -15863979 -14051752 -10719635
4204a0719635O45474l974397l836552P68197J791122k250966l043077J214285
$$ -10719635 -10074161 -14048558 -17885110 -17116913 -15325791 -17576757 -20619834 -19405549
4196a9405549P67177o400286p698558j496768r682730m2090534o5051553l7771689
$$ -19405549 -18638372 -25038658 -32737216 -34233984 -43916714 -86007248 -151058801 -188830490
4188a88830490K5909279O6584305N3859604J9514262N840154J2222864J2851406
$$ -188830490 -162921211 -96336906 -42477302 -22963040 -17122886 -4900022 7951384
4181G951384K264287m135837j221149J039308j039929p55469K748748K240093
$$ 7951384 10215671 6079834 4858685 5897993 4858064 4102595 6851343 9091436
4173I091436k932494n010314j908569k2605j611272j553055J455547J985801j199250
$$ 9091436 6158942 1148628 -759941 -782546 -2393818 -3946873 -2491326 -505525 -1704775
4164a704775k046437J566668L545436P42257j017716K426038N259069R93945o222674
$$ -1704775 -3751212 -2184544 1360892 2103149 1085433 3511471 8770540 9764485 3541811
4155C541811p331317j612068L115108J896052k037308l302076q51257K580953
$$ 3541811 -3789506 -5401574 -2286466 -390414 -2427722 -5729798 -6581055 -4000102
4147d000102M342520L806654J947709k4512j738292l309595m246211l770528k211793
$$ -4000102 342418 4149072 6096781 6072269 4333977 1024382 -3221829 -6992357 -9204150
4138i204150p03046O09141K438480M222607M047100J450593j411156k420388j958500
$$ -9204150 -9907196 -9298055 -6859575 -2636968 1410132 2860725 1449569 -970819 -2929319
4129b929319j669166j855518j297860P58430L220509L858515J570434j891796
$$ -2929319 -4598485 -6454003 -7751863 -6993433 -3772924 85591 1656025 -235771
4121b35771l238671j409699R39265Q64278j055262k025916j144662O3772O27154
$$ -235771 -3474442 -4884141 -3944876 -3080598 -4135860 -6161776 -7306438 -7242666 -6615512
4112f615512J088202J519608J119994K55223O11314K511373L945498L133609O34437
$$ -6615512 -5527310 -4007702 -2887708 -2632485 -2021171 490202 4435700 7569309 8203746
4103H203746j678881k488965j635852j87688L8922j561673l116985k589334q30608
$$ 8203746 6524865 4035900 2400048 2212360 2251282 689609 -2427376 -5016710 -5847318
4094e847318j68596n41880L6338J362454R64922j226306j892792M55627K780387
$$ -5847318 -6015914 -6557794 -6521456 -5159002 -4194080 -5420386 -7313178 -6857551 -4077164
4085d077164K222127M10373M03451J942629K730846K327082J673670M87066j654351
$$ -4077164 -1855037 -1444664 -1041213 901416 3632262 5959344 7633014 8120080 6465729
4076F465729k977741j585527J043932J768969K42039j422323k518754l661933
$$ 6465729 3487988 1902461 2946393 4715362 4957401 3535078 1016324 -2645609
4068b645609l471801J93277N154103N647953J02132n621206n479962q51103K251556
$$ -2645609 -6117410 -5924133 -770030 4877923 4980055 -641151 -6121113 -6972216 -4720660
4059d720660J419266l29821j04615J082204P73535j101450k179144n89002K793183
$$ -4720660 -3301394 -3631215 -3735830 -2653626 -1880091 -2981541 -5160685 -5749687 -2956504
4050b956504M887861L336967r33580m578233n376248l916898j587168J253078
$$ -2956504 1931357 5268324 4334744 -243489 -5619737 -9536635 -11123803 -9870725
4042i870725L990165M702727K611742K11842L09357J775088J211370j522285k891606
$$ -9870725 -5880560 -1177833 1433909 1645751 1955108 3730196 4941566 3419281 527675
4033E27675j305547M25892j70248j278874j29537K204454K512893M90832j175908
$$ 527675 -777872 -351980 -522228 -1801102 -1930639 273815 2786708 3277540 2101632
4024B101632j134577p06859r36651j111209p01307l72707l76190j9364N16508
$$ 2101632 967055 260196 -676455 -1787664 -2488971 -2861678 -3237868 -3257232 -2740724
4015b740724j60270k209416l570284k535612J43453K640275L968274L598921J129738
$$ -2740724 -2900994 -5110410 -8680694 -11216306 -11072853 -8432578 -4464304 -865383 264355
4006B64355k108015k943303q9844L240947K907138o43376k988372j758252O49276
$$ 264355 -1843660 -4786963 -4876807 -1635860 1271278 627902 -2360470 -4118722 -3469446
3997c469446J111594O0133j827J331547J968554Q00117m89860P6736J729964J825899
$$ -3469446 -2357852 -2297719 -2299546 -967999 1000555 1800672 1310812 1387548 3117512 4943411
3987D943411n15919l109173l577172k312637j380001j291071o45538J067624K214957
$$ 4943411 4427492 1318319 -2258853 -4571490 -5951491 -7242562 -7888100 -6820476 -4605519
3978d605519J389287l26109o45267J010026K825801K638875L20029j746885r83428
$$ -4605519 -3216232 -3542341 -4187608 -3177582 -351781 2287094 2607123 860238 -123190
3969a23190J913755K815295p57748n340716n331463q82037K035650M91438j180601
$$ -123190 1790565 4605860 3848112 -1492604 -6824067 -7706104 -5670454 -5179016 -6359617
3960f359617J076750L825800J488904m109495n795800j673918K520428K315639
$$ -6359617 -5282867 -1457067 31837 -4077658 -9873458 -11547376 -9026948 -6711309
3952f711309K8333m17515Q17601J700098K219519K961399K805791J040126o30931
$$ -6711309 -6682976 -7100491 -6282890 -4582792 -2363273 598126 3403917 4444043 3813112
3943C813112q14766q39371j921581k459357j028107M35355j69276j049389L37300
$$ 3813112 2998346 2158975 237394 -2221963 -3250070 -2814715 -2983991 -4033380 -3696080
3934c696080K018913J92639l803026m485371n56449K900956K099611k33304J14332
$$ -3696080 -1677167 -1484528 -5287554 -9772925 -10329374 -7428418 -5328807 -5562111 -5447779
3925e447779K480238L391474K140059N03089j222226l833570n724867l958343
$$ -5447779 -2967541 423933 2563992 3067081 1844855 -1988715 -7713582 -11671925
3917a1671925P41494L743411K517993j97143r72843n41302j404917k858940k109984
$$ -11671925 -10930431 -7187020 -4669027 -4866170 -5839013 -6380315 -7785232 -10644172 -12754156
3908a2754156N19219J523478j27185j054609J090271L526612K445642j119329
$$ -12754156 -12234937 -10711459 -10838644 -11893253 -10802982 -7276370 -4830728 -5950057
3900e950057k866185j343197R50959J982376K194943K066612J164886L39586J466509
$$ -5950057 -8816242 -10159439 -9208480 -7226104 -5031161 -2964549 -1799663 -1460077 6432
3891F432L741320L513165k64023l429236k091154J688177K778538m8769l239376
$$ 6432 3747752 7260917 6996894 3567658 1476504 3164681 5943219 5894450 2655074
3882B655074l697584j867477K08694J257644R94737K2282l23953M21780P70036
$$ 2655074 -1042510 -2909987 -2701293 -1443649 -448912 -426630 -750583 -328803 441233
3873D41233m56454j469351L66595L942610M833017J120852l659221m775114j740847
$$ 441233 -15221 -1484572 -1117977 2824633 7657650 8778502 5119281 344167 -1396680
3864a396680J923576L063149J497435r49715k491108k455932j304621K5349R03504
$$ -1396680 526896 3590045 5087480 4137765 1646657 -809275 -2113896 -2088547 -1185043
3855a185043J235773J141262O87701j21247j236865k274972k451623j422048r6247
$$ -1185043 50730 1191992 1879693 1758446 521581 -1753391 -4205014 -5627062 -5723309
3846e723309L81103M21814J262618K332003J598589o70471j288705Q94931K305063
$$ -5723309 -5342206 -4920392 -3657774 -1325771 272818 -397653 -1686358 -791427 1513636
3837A513636j37500l638195l408307j51217J228468k55800l18028K953353N439175
$$ 1513636 1376136 -2262059 -5670366 -5821583 -4593115 -4848915 -5166943 -2213590 3225585
3828C225585L422777o85331k359928j459344j052203j932864k064099m87662J431440
$$ 3225585 6648362 5963031 3603103 2143759 1091556 -841308 -2905407 -3393069 -1961629
3819a961629K388659K340153J490667O3042j003474p30128N20145J437662J327879
$$ -1961629 427030 2767183 4257850 4320892 3317418 2587290 3107435 4545097 5872976
3810E872976M64287o09139j339138j319252q43667o20577n39929K00667J351080
$$ 5872976 6337263 5728124 4388986 3069734 2226067 1605490 1065561 1266228 2617308
3801B617308J450129M9585j455223j909611j586237o29678J439078L584847L198588
$$ 2617308 4067437 4117022 2661799 752188 -834049 -1463727 -24649 3560198 6758786
3792F758786o5420k820888k437742o36236j74464m66054L37088J176793m1497
$$ 6758786 6693366 3872478 1434736 798500 624036 157982 495070 1671863 1630366
3783A630366j955426j407006J198615K479324J678030J250973J698321N35940
$$ 1630366 -325060 -1732066 -533451 1945873 3623903 4874876 6573197 7109137
3775G109137k453765l530553o86961K814617L171898J120037m49639j085622j861809
$$ 7109137 4655372 1124819 437858 3252475 6424373 7544410 7094771 6009149 4147340
3766D147340k210722j173489k15759j208696k586278j245087J966803K521278
$$ 4147340 1936618 763129 547370 -661326 -3247604 -4492691 -2525888 -4610
3758d610j119904m522274k993989K048404M998825L224822l13399j619836m77552
$$ -4610 -1124514 -5646788 -8640777 -6592373 -1593548 1631274 1317875 -301961 -779513
3749g79513M55432j43537q49680p4555J646991K619857K133146P45030q28839
$$ -779513 -324081 -467618 -1317298 -1391853 255138 2874995 5008141 5753171 4924332
3740D924332k108697k613460k263205j771237j739612j641504o20989J019172
$$ 4924332 2815635 202175 -2061030 -3832267 -5571879 -7213383 -7834372 -6815200
3732f815200K160376K365854J873453N02458j845526l699480k925832L20129L123300
$$ -6815200 -4654824 -2288970 -415517 86941 -1758585 -5458065 -8383897 -8063768 -4940468
3723d940468L076623P91333j488946k415853j855099j14503J866957K608458J752476
$$ -4940468 -1863845 -1072512 -2561458 -4977311 -6832410 -6946913 -5079956 -2471498 -719022
3714g19022R36072J710089L200481L217603J269122r83380k066823j969652j045781
$$ -719022 217050 1927139 5127620 8345223 9614345 8630965 6564142 4594490 3548709
3705C548709O05078K018702J308917j824306m562543l792416j92432K379202J845012
$$ 3548709 4153787 6172489 7481406 5657100 1094557 -2697859 -2890291 -511089 1333923
3696A333923K32437N2988M69740p62599k980413l260182j098060O97124L82877
$$ 1333923 1566360 1619348 2089088 1326489 -1653924 -4914106 -6012166 -5315042 -4932165
3687d932165m92602m90888q38975k437434l036945m12399L520095M992848L526630
$$ -4932165 -5424767 -5915655 -6754630 -9192064 -12229009 -12641408 -9121313 -4128465 -601835
3678f01835J566368Q0732j796549l263976k077709J185288K809328J100575j209525
$$ -601835 964533 1045265 -751284 -4015260 -6092969 -4907681 -2098353 -997778 -2207303
3669b207303j068722J074061K898703L177639J750550j075489l663309l815032
$$ -2207303 -3276025 -2201964 696739 3874378 5624928 4549439 886130 -2928902
3661b928902j781523k93061l87646J03958K316968L650265J831814r91080j428635
$$ -2928902 -4710425 -5003486 -5391132 -5287174 -2970206 680059 2511873 1520793 92158
3652I2158j06425j59735j721678j770758O45875K555503J324227j751467l375014
$$ 92158 -14267 -174002 -1895680 -3666438 -3020563 -465060 859167 -892300 -4267314
3643d267314k224157J78474J773498K114840K135956K284946J817213N47698J41042
$$ -4267314 -6491471 -6312997 -4539499 -2424659 -288703 1996243 3813456 4361154 4502196
3634D502196J812256L519353K235299j110693k469412j122881j152005m547115
$$ 4502196 6314452 9833805 12069104 10958411 8488999 7366118 6214113 1666998
3626A666998p175600m984741m55923J523779J185036K031609L616273K206308
$$ 1666998 -5508602 -10493343 -10949266 -9425487 -8240451 -6208842 -2592569 -386261
3618c86261j955922m090955k293901m9611J06712K94238K301968L525238J306954
$$ -386261 -2342183 -6433138 -8727039 -8776650 -8669938 -8375700 -6073732 -2548494 -1241540
3609a241540k022179k258123N19031K443912J510233m04449j003356n62578q13712
$$ -1241540 -3263719 -5521842 -5002811 -2558899 -1048666 -1453115 -2456471 -3019049 -3832761
3600c832761k219263l269095k402927k34740Q93140o986j032169j46638J687397
$$ -3832761 -6052024 -9321119 -11724046 -11958786 -11065646 -11072632 -12104801 -12251439 -10564042
3591a0564042K132955J307386J294708K188930J747135n65768k258251j630739
$$ -10564042 -8431087 -7123701 -5828993 -3640063 -1892928 -2458696 -4716947 -6347686
3583f347686k18712l6674p66230j258963j711815k542440k770089j335955J080528
$$ -6347686 -6566398 -6603072 -7369302 -8628265 -10340080 -12882520 -15652609 -16988564 -15908036
3574a5908036K951770L646946L336777K270421R65955L9921o50789j492466j695952
$$ -15908036 -12956266 -9309320 -5972543 -3702122 -2736167 -2696246 -3347035 -4839501 -6535453
3565f535453j83269K075137K907991K312929K222906K517463P16416l147493n044748
$$ -6535453 -6718722 -4643585 -1735594 577335 2800241 5317704 6034120 2886627 -2158121
3556b158121k571365J151726J944778K32421p56609j50044M87221N55627O77419
$$ -2158121 -4729486 -3577760 -1632982 -1400561 -2157170 -2307214 -1819993 -1264366 -586947
3547e86947O38618j31830q99031p26310j93865o8822K21402Q15548J57034k111692
$$ -586947 51671 -80159 -979190 -1705500 -1899365 -1968187 -1746785 -931237 -774203 -2885895
3537b885895l318782j754298l5983q88179j998203L74825M542218N418534K460947
$$ -2885895 -6204677 -7958975 -7994958 -8883137 -10881340 -10506515 -5964297 -545763 1915184
3528A915184L5633k1793m58772k358676k606186K33184K502702R45217k267026
$$ 1915184 1950817 1929024 1470252 -888424 -3494610 -3261426 -758724 186493 -2080533
3519b080533l120459j297890Q67060K302094L007094K177732l04332k051407q12896
$$ -2080533 -5200992 -6498882 -5631822 -3329728 -322634 1855098 1550766 -500641 -1313537
3510a313537K040349L178187J647819o55976k059318k415972j841166l32889J256793
$$ -1313537 726812 3904999 5552818 4896842 2837524 421552 -1419614 -1752503 -495710
3501d95710J554894L72394r08351r77577j44657L0253j215465k234681m27473
$$ -495710 1059184 1431578 523227 -454350 -599007 -568754 -1784219 -4018900 -4446373
3492d446373L829157O150036L244053j913670l164810O39790M108916K831153
$$ -4446373 -617216 5532820 8776873 6863203 3698393 4338183 8447099 11278252
3484A1278252j267222l882353m135155l640148k606656l16666K180049L067489
$$ 11278252 10011030 6128677 1993522 -1646626 -4253282 -4569948 -2389899 677590
3476F77590K501713J791131R05410p82245k441724k954652k933678l072482j995445
$$ 677590 3179303 4970434 5875844 5093599 2651875 -302777 -3236455 -6308937 -8304382
3467h304382J169036L537213J691347k582759m019364j388277J037673L38763
$$ -8304382 -7135346 -3598133 -1906786 -4489545 -8508909 -9897186 -8859513 -8520750
3459h520750j081631j85210J980564K919032K870026L187068K946661P59184j560305
$$ -8520750 -9602381 -9787591 -7807027 -4887995 -2017969 1169099 4115760 4874944 3314639
3450C314639r64455J616469J746638k129648n882533m872446J83416M436641M756213
$$ 3314639 2350184 3966653 5713291 3583643 -2298890 -7171336 -6987920 -2551279 2204934
3441B204934K377384K31576l59788M1535M27107P1362j242197k650580k474491
$$ 2204934 4582318 4813894 4454106 4495641 4922748 4994110 3751913 1101333 -1373158
3432a373158k48522J908622J431597j188966k708607j402280P25379J040985r7339
$$ -1373158 -1621680 286942 1718539 529573 -2179034 -3581314 -2855935 -1814950 -1912289
3423a912289n24433J98375O27667K16017p6841n418o85996k396913l499636k492380
$$ -1912289 -2436722 -2238347 -1610680 -1394663 -1471504 -1476922 -2162918 -4559831 -8059467 -10551847
3413a0551847M0949K268677K937942J928888J40948o69318P87629L435296M448384
$$ -10551847 -10510898 -8242221 -5304279 -3375391 -3234443 -3903761 -3116132 319164 4767548
3404D767548K625099j5973j022908p16107j183567k914246m151918l427454j275184
$$ 4767548 7392647 7376674 6353766 5637659 4454092 1539846 -2612072 -6039526 -7314710
3395g314710P19717J466485Q08215n55507j326756p00275M80049N10539q06864
$$ -7314710 -6594993 -5128508 -4320293 -4875800 -6202556 -6902831 -6422782 -5912243 -6719107
3386f719107j481245K02988L152181M433725K679412l95832k065972j421653K26849
$$ -6719107 -8200352 -7997364 -4845183 -411458 2267954 1872122 -193850 -1615503 -1388654
3377a388654J076070L72621j221182k042270o12348K631202M983486L988346M31377
$$ -1388654 -312584 60037 -1161145 -3203415 -3815763 -1184561 3798925 7787271 8218648
3368H218648k330770k356752j178263j214568k444985k895386j558402O22556
$$ 8218648 5887878 3531126 2352863 1138295 -1306690 -4202076 -5760478 -5137922
3360e137922K290451K876645K401902J222403L7996o41837j000717j380362j676059
$$ -5137922 -2847471 29174 2431076 3653479 3691475 3049638 2048921 668559 -1007500
3351a007500j786056j838009j287433Q38883L514934L303461j163519n635913
$$ -1007500 -2793556 -4631565 -5918998 -5080115 -1565181 1738280 574761 -5061152
3343e061152m621180J023605M693340K886252n27842p34611J070839M22303l180543
$$ -5061152 -9682332 -8658727 -3965387 -1079135 -1606977 -2341588 -1270749 -848446 -4028989
3334d028989n598610l776134R82283N222945O409428M041778k8175k481730j666199
$$ -4028989 -9627599 -13403733 -12421450 -7198505 -789077 3252701 3224526 742796 -923403
3325i23403L42776N49863p42413q43269P03438J388212j6354j460175j054725
$$ -923403 -580627 -30764 -773177 -1616446 -913008 475204 458850 -1001325 -2056050
3316b056050M745l61182j886599k769556k353457j207450M28187K406867L516937
$$ -2056050 -2051305 -2412487 -4299086 -7068642 -9422099 -10629549 -10201362 -7794495 -4277558
3307d277558K461373l3028j634306j219688r3106L7292o63370o63627N72170J615648
$$ -4277558 -1816185 -1849213 -3483519 -4703207 -4796313 -4759021 -5422391 -6086018 -5513848 -3898200
3297c898200Q34180j298364k433518j153617J163147J996572P26052r27749j223066
$$ -3898200 -3064020 -4362384 -6795902 -7949519 -6786372 -4789800 -4063748 -4991497 -6214563
3288f214563l8640J725387L100299L172832J563669o65177j678323j040704k24973
$$ -6214563 -6253203 -4527816 -1427517 1745315 3308984 2643807 965484 -75220 -300193
3279c00193m43454j187277j599862j854987k032761j090321J285727K882753J277909
$$ -300193 -743647 -1930924 -3530786 -5385773 -7418534 -8508855 -7223128 -4340375 -3062466
3270c062466k372008m125414k174692J025861K258867J337396K03949k54579p12971
$$ -3062466 -5434474 -9559888 -11734580 -10708719 -8449852 -7112456 -6908507 -7163086 -7876057
3261g876057j402048j427393k78095J274033K215784K312363J640480K7710k203791
$$ -7876057 -9278105 -10705498 -10983593 -9709560 -7493776 -5181413 -3540933 -3513223 -5717014
3252e717014l574467k742616m40728J045862P49462L11969J571953L708876M097217
$$ -5717014 -9291481 -12034097 -12474825 -11428963 -10679501 -10367532 -8795579 -5086703 -989486
3243i89486J727341j565874l425667l297322k060318n52050P65813J559131J973790
$$ -989486 737855 -828019 -4253686 -7551008 -9611326 -10163376 -9397563 -7838432 -5864642
3234e864642K709190L921550M468490L087052J56941k386609k901721j478739
$$ -5864642 -3155452 766098 5234588 8321640 8478581 6091972 3190251 1711512
3226A711512K95929P91732j85419j274375j281611p72263j016336j586669o97841
$$ 1711512 2007441 2799173 2613754 1339379 57768 -714495 -1730831 -3317500 -4015341
3217d015341J657783K962378J804646K97876Q76108K322084J703701p40099j877385
$$ -4015341 -2357558 604820 2409466 2707342 3583450 5905534 7609235 6869136 4991751
3208D991751p17890K30313n27866q93611R73454K858751J385354k654650m823469
$$ 4991751 4273861 4504174 3976308 3082697 4056151 6914902 8300256 5645606 822137
3199H22137k774854R55150K518752J326457j31953p0383N33535m2276j295565
$$ 822137 -1952717 -997567 1521185 2847642 2715689 2645306 3178841 3136565 1841000
3190A841000r35713J574562L453239J941379j668226l291751j237764J918342
$$ 1841000 905287 2479849 5933088 7874467 6206241 2914490 1676726 3595068
3182C595068L093810K236955J048773J38233p97261j355444j043650p07147j335738
$$ 3595068 6688878 8925833 9974606 10112839 9315578 7960134 6916484 6209337 4873599
3173D873599j949988q39903J154060R68721k267420n184594m146237n2191K809625
$$ 4873599 2923611 2083708 3237768 4206489 1939069 -3245525 -7391762 -7443953 -4634328
3164d634328K361788J004341J498815K586547R85919k968349m751177j828590
$$ -4634328 -2272540 -1268199 230616 2817163 3803082 834733 -3916444 -5745034
3156e745034K240168K340284j296217l910676l066456r17071N23371K219593M675017
$$ -5745034 -3504866 -1164582 -2460799 -6371475 -9437931 -10355002 -9831631 -7612038 -2937021
3147b937021N494092L123536R0453o56036k72764j410870l087550k292008M85241
$$ -2937021 2557071 5680607 5771060 5115024 4842260 3431390 343840 -1948168 -1462927
3138a462927J783383R33990Q19183K385639K860268Q53992q90201j15259J098442
$$ -1462927 320456 1254446 2073629 4459268 7319536 8173528 7283327 7168068 8266510
3129H266510k3544k211413k327922l87240R80538R91839J315925K482821K683080
$$ 8266510 8242966 6031553 3703631 3316391 4296929 5288768 6604693 9087514 11770594
3120A1770594O94362k164870l715538l087272q18963J811142L124335K044778
$$ 11770594 12464956 10300086 6584548 3497276 2678313 4489455 7613790 9658568
3112I658568n10370k145623j582352j20140J15225j101577j923853r91179N94711
$$ 9658568 9148198 7002575 5420223 5300083 5415308 4313731 2389878 1398699 1993410
3103A993410N49875j463923k995298j833317Q24989J617867n89040l066483k647263
$$ 1993410 2543285 1079362 -1915936 -3749253 -2924264 -1306397 -1895437 -4961920 -7609183
3094g609183M15442L069893L171791J346136n69835j709632k390771k824042k418559
$$ -7609183 -7193741 -4123848 -952057 394079 -175756 -1885388 -4276159 -7100201 -9518760
3085i518760p05008J380978J987420N24048j397377j930652j158109k69034N56891
$$ -9518760 -10223768 -8842790 -6855370 -6331322 -7728699 -9659351 -10817460 -11086494 -10529603
3076a0529603J827869K914232K636403J542211J327821J800250R83970j052239
$$ -10529603 -8701734 -5787502 -3151099 -1608888 -281067 1519183 2503153 1450914
3068A450914j319086J547892M384894L425271o84763m178204n029848m014841
$$ 1450914 131828 1679720 6064614 9489885 8805122 4626918 -402930 -4417771
3060d417771k106675K38812J646819O50752j598221j866848J023932M376859M937868
$$ -4417771 -6524446 -6285634 -4638815 -3988063 -5586284 -7453132 -6429200 -2052341 2885527
3051B885527K751123N95415K94417P37188k48356k630240l657497j247014K746615
$$ 2885527 5636650 6232065 6526482 7263670 7015314 4385074 727577 -519437 2227178
3042B227178M197610J800966j269448j561303N38759K121732J608286l08246k309722
$$ 2227178 6424788 8225754 6956306 5395003 5933762 8055494 9663780 9355534 7045812
3033G045812l352625k865007j515863q51952j023212l39598J578515K246150k1312
$$ 7045812 3693187 828180 -687683 -1539635 -2562847 -2902445 -1323930 922220 900908
3024I00908k926894l356885j870409q76791j03960K182745M696395M482616K429876
$$ 900908 -2025986 -5382871 -7253280 -8130071 -8234031 -6051286 -1354891 3127725 5557601
3015E557601K545645N058001N115862K13967n355249o193445k759121K63064K97202
$$ 5557601 8103246 13161247 18277109 18491076 13135827 6942382 4183261 4446325 4743527
3006D743527j204410j771261n46763J347426J776933k09329k629154k543539j22649
$$ 4743527 3539117 1767856 1221093 2568519 4345452 4136123 1506969 -1036570 -1159219
2997a159219J426085N21879q23787o55354J34570J06944l02563l43090m55319
$$ -1159219 266866 788745 -35042 -690396 -555826 -448882 -751445 -1094535 -1549854
2988a549854o21005J93620J382489N39245k131609k736673L10553K893714J453345
$$ -1549854 -2170859 -1977239 -594750 -55505 -2187114 -4923787 -4613234 -1719520 -266175
2979b66175q73765P37388M354034L828939j317118m814970l098808j38816p18379
$$ -266175 -1139940 -402552 3951482 7780421 6463303 1648333 -1450475 -1589291 -2307670
2970b307670l445129l622840k57230L059463L097952L81163k188416k647852j573761
$$ -2307670 -5752799 -9375639 -9632869 -6573406 -3475454 -3094291 -5282707 -7930559 -9504320
2961i504320o91745l72347N26250K190751L045609K535450K648386M590338N871105
$$ -9504320 -10196065 -10568412 -10042162 -7851411 -4805802 -2270352 378034 4968372 10839477
2952A0839477L611865o70386k932895k317633j408655j412499j112859o42139
$$ 10839477 14451342 13780956 10848061 8530428 7121773 5709274 4596415 3954276
2944C954276j961305m590621m893640j353359K763190L880503K414176Q57185
$$ 3954276 1992971 -2597650 -7491290 -8844649 -6081459 -2200956 213220 1070405
2936A070405L17353P85508K199185L269810J774931j919663m125142k832718q82724
$$ 1070405 1387758 2173266 4372451 7642261 9417192 7497529 3372387 539669 -343055
2927c43055j492125l145524k351310M32350J612167L48660l42384J377244L432192
$$ -343055 -1835180 -4980704 -7332014 -6899664 -5287497 -4938837 -5281221 -3903977 -471785
2918d71785L131267P00233j692200k700287k425179j420438j83129P63878R18649
$$ -471785 2659482 3359715 1667515 -1032772 -3457951 -4878389 -5061518 -4297640 -3378991
2909c378991O0639j340471k029320j062419P21636J366861M22418m06315K5296
$$ -3378991 -3318352 -4658823 -6688143 -7750562 -7028926 -5662065 -5239647 -5645962 -5620666
2900e620666N71013N0112n28788O0748O39895m57661j950142j144335J497250
$$ -5620666 -5049653 -4999541 -5528329 -5467581 -4827686 -5285347 -7235489 -8379824 -6882574
2891f882574K590895R95715m90923K75080J524877Q56727p08953o29492P58226
$$ -6882574 -4291679 -3295964 -3786887 -3511807 -1986930 -1130203 -1839156 -2468648 -1710422
2882a710422P60660j173054k323268o64317K216240L284305J724314p51471k270984
$$ -1710422 -949762 -2122816 -4446084 -5110401 -2894161 390144 2114458 1362987 -907997
2873i07997k198676p76569J198151K373982J780312J29712p12724L5443J147651
$$ -907997 -3106673 -3883242 -2685091 -311109 1469203 1598915 886191 921634 2069285
2864B069285J114248k5029j140774j479967r30949L41148J529100J223355q89072
$$ 2069285 3183533 3158504 2017730 537763 -393186 -52038 1477062 2700417 1811345
2855A811345k892067k619766m11682J594932K559751L435996M394632L998348
$$ 1811345 -1080722 -3700488 -4112170 -2517238 42513 3478509 7873141 11871489
2847A1871489J717160o71914j405757j009226j057656j919048k923130l577437
$$ 11871489 13588649 12916735 11510978 10501752 9444096 7525048 4601918 1024481
2839A024481l290055j068889K763379N322738L651031j463664n699232n711054
$$ 1024481 -2265574 -3334463 -571084 4751654 8402685 6939021 1239789 -4471265
2831d471265k488236K41594K89457r54364o85574J674621L710486L025517J19512
$$ -4471265 -6959501 -6717907 -6428450 -7382814 -8068388 -6393767 -2683281 342236 461748
2822D61748k503648l225773k125946J29000K342200K504174j9575k324219j008048
$$ 461748 -2041900 -5267673 -7393619 -7264619 -4922419 -2418245 -2437820 -4762039 -5770087
2813e770087K415337K723694j320985m413675k190218K324467L230845Q201k846125
$$ -5770087 -3354750 -631056 -1952041 -6365716 -8555934 -6231467 -3000622 -2992421 -5838546
2804e838546k746336j296847l10189L80715R28852P24465K29575Q40188K428537
$$ -5838546 -8584882 -9881729 -10191918 -9811203 -8882351 -8157886 -7928311 -7088123 -4659586
2795d659586L313041K850987J865058O59332r09863j610632N3996K816630L634586
$$ -4659586 -1346545 1504442 3369500 4028832 3118969 1508337 1562333 4378963 8013549
2786H013549J994364K90743m31422j808537m366202n755851m345327j724330Q5687
$$ 8013549 10007913 10298656 9867234 8058697 3692495 -2063356 -6408683 -8133013 -8047326
2777h047326J352697K742726L136615J526189p56651j811338j748963j713638
$$ -8047326 -6694629 -3951903 -815288 710901 -45750 -1857088 -3606051 -5319689
2769e319689j677110r36107L04488J322735J871688J733113N31566j063224j429792
$$ -5319689 -6996799 -7932906 -7628418 -6305683 -4433995 -2700882 -2169316 -3232540 -4662332
2760d662332k63486Q27759Q68202P68496J071893O69172r03823k126558j968413
$$ -4662332 -4925818 -4098059 -3229857 -2461361 -1389468 -720296 -1624119 -3750677 -5719090
2751e719090j434280j114827J22075K056365J803146j609251m252575k467569
$$ -5719090 -7153370 -8268197 -8146122 -6089757 -4286611 -5895862 -10148437 -12616006
2743a2616006J443928K810682J799398K169973M096917L773716L83614j938695
$$ -12616006 -11172078 -8361396 -6561998 -4392025 -295108 3478608 3862222 1923527
2735A923527p17526Q65177q57972m258307m836113j515209K164934K452968o34191
$$ 1923527 1206001 2071178 1213206 -3045101 -7881214 -9396423 -7231489 -4778521 -5412712
2726e412712l459401k409793K076177N484321M409725R18423l97024J148906K093993
$$ -5412712 -8872113 -11281906 -9205729 -3721408 688317 1606740 1209716 2358622 4452615
2717D452615Q81468J05561J454117K333163J08708l252454l923205j701327L27934
$$ 4452615 5334083 5439644 6893761 9226924 9335632 6083178 2159973 458646 786580
2708G86580M68854j08649o173P97436J811689K468667J801995m90480k706521
$$ 786580 1255434 1146785 1140612 1938048 3749737 6218404 8020399 7529919 4823398
2699D823398k611268m76458Q70469m69078l054148l804165j456070K243789M514720
$$ 4823398 2212130 1735672 2606141 2137063 -917085 -4721250 -6177320 -3933531 581189
2690E81189M159298K006920p71396l674063n775226n141741j146620L400591M748675
$$ 581189 4740487 6747407 5976011 2301948 -3473278 -8615019 -9761639 -6361048 -1612373
2681a612373K773614P17901K56756k71755j884349k473740l70666K316651K667174
$$ -1612373 1161241 1879142 2135898 1864143 -20206 -2493946 -2864612 -547961 2119213
2672B119213J312573Q96576J548134J003526j410246l781665m425916l352749
$$ 2119213 3431786 4328362 5876496 6880022 5469776 1688111 -2737805 -6090554
2664f090554j211465J018928J709099L08194r73434L03265K904698L303789Q54182
$$ -6090554 -7302019 -6283091 -4573992 -4265798 -5239232 -4935967 -2031269 1272520 2126702
2655B126702j473463j857384j826592k655332k794131q32990J520552J783626
$$ 2126702 653239 -1204145 -3030737 -5686069 -8480200 -9313190 -7792638 -6009012
2647f009012L23255o04707k82332R2756k38889p16454p19668m15316l57922q09907
$$ -6009012 -5685757 -6290464 -6572796 -6480040 -6718929 -7435383 -8155051 -8570367 -8928289 -9738196
2637i738196j141395R3746L364619O336518N642479J252172k785584l188167j237969
$$ -9738196 -10879591 -10785845 -7421226 -1084708 4557771 5809943 3024359 -163808 -1401777
2628a401777j50057l99907M5831J887709L323903K582751o7879k741676l268906
$$ -1401777 -1551834 -1951741 -1905910 -18201 3305702 5888453 5820574 3078898 -190008
2619a90008p46885L063036M757678K989734O8736j430864j953316k854892l071490
$$ -190008 -936893 2126143 6883821 9873555 9942291 8511427 6558111 3703219 631729
2610F31729j160524P96472m78573l631459l696068L96699L828267L018419M66744
$$ 631729 -528795 267677 -210896 -3842355 -7538423 -7141724 -3313457 -295038 171706
2601A71706K629J122728J414207J319511K372790L049591Q46408k874977m452639
$$ 171706 174335 1297063 2711270 4030781 6403571 9453162 10299570 7424593 2971954
2592B971954l465625k422347j586770J024668M368532M401211P64201j634185
$$ 2971954 -493671 -2916018 -4502788 -3478120 890412 5291623 6055824 4421639
2584D421639j03177J539038m61001l299060k313316J182347K273695N84961M3135
$$ 4421639 4318462 5857500 5396499 2097439 -215877 966470 3240165 3825126 3868261
2575C868261J226778K40115l808801o085538l248026J387196L032919J896935
$$ 3868261 5095039 5335154 1526353 -4559185 -7807211 -6420015 -3387096 -1490161
2567a490161R48746N31591o75643j705722p31729R29848M55341j676841k583006
$$ -1490161 -541415 -9824 -685467 -2391189 -3122918 -2193070 -1737729 -3414570 -5997576
2558e997576k094748k618020l908016k715660J349909M174922L242320J251698
$$ -5997576 -8092324 -10710344 -14618360 -17334020 -15984111 -11809189 -8566869 -7315171
2550g315171J206757J804552R24777J25015J439273K436832m76539n260941o078383
$$ -7315171 -6108414 -4303862 -3379085 -3254070 -1814797 622035 145496 -5115445 -11193828
2541a1193828j870133J995420J719261N388Q17240L223342L742714K098936R14684
$$ -11193828 -13063961 -11068541 -9349280 -9343892 -8526652 -5303310 -1560596 538340 1453024
2532A453024J015159O14426r97511k031947j190070J83254J50723r93806j306929
$$ 1453024 2468183 3082609 2085098 53151 -1136919 -953665 -802942 -1796748 -3103677
2523c103677k9939J389734J271021j29908j085228p74297k75357p81809j712257
$$ -3103677 -3133616 -1743882 -472861 -602769 -1687997 -2462294 -2737651 -3519460 -5231717
2514e231717j640632o22547j87434r48170j619363q91369R23258K731413M004603
$$ -5231717 -6872349 -7494896 -7682330 -8630500 -10249863 -11141232 -10217974 -7486561 -3481958
2505c481958M514800L865950K356569J345796J458450J176772j192979m489430
$$ -3481958 1032842 4898792 7255361 8601157 10059607 11236379 10043400 5553970
2497E553970n426153k754969P66975J488191r35938l496843l579846j630491Q0085
$$ 5553970 127817 -2627152 -1860177 -371986 -1307924 -4804767 -8384613 -10015104 -9935019
2488i935019L18086l01713q30894j104916j154764o07955O36026J904887K661595
$$ -9935019 -9616933 -9918646 -10749540 -11854456 -13009220 -13617175 -12981149 -11076262 -8414667
2479h414667L148070L310013K124047o28046k857555k355363Q1071J847440K413464
$$ -8414667 -5266597 -1956584 167463 -460583 -3318138 -5673501 -5592430 -3744990 -1331526
2470a331526L297427M195210K586315j649618m663497l917151k066896k564547
$$ -1331526 1965901 6161111 8747426 7097808 2434311 -1482840 -3549736 -6114283
2462f114283l851176j885779K892842N548306L700209N92466l2445J197097J422157
$$ -6114283 -9965459 -11851238 -8958396 -3410090 290119 882585 850140 2047237 3469394
2453C469394J36030p19435m7068J075842J106016k26026j944010k920518k780775
$$ 3469394 3605424 2885989 2838921 3914763 5020779 4794753 2850743 -69775 -2850550
2444b850550j837585l44547J533886K795011J883273j004703l071349k102703
$$ -2850550 -4688135 -5032682 -3498796 -703785 1179488 174785 -2896564 -4999267
2436d999267L79124J254285L78421K99866J580440J648848p70911l130051k694612
$$ -4999267 -4620143 -3365858 -2987437 -2687571 -1107131 541717 -229194 -3359245 -6053857
2427f053857k95002J594453K463712L064955K774065N80583k037283k172088L91122
$$ -6053857 -6348859 -4754406 -2290694 774261 3548326 4128909 2091626 -80462 310660
2418C10660K536785J954799l0614p08738M69403J812238J864232O27153j240382
$$ 310660 2847445 4802244 4771630 4062892 4532295 6344533 8208765 8835918 7595536
2409G595536l116285m200775l750709k150149j015537j347949j921560n38834
$$ 7595536 4479251 278476 -3472233 -5622382 -6637919 -7985868 -9907428 -10446262
2401a0446262L045532O415139P016358M628237J130266j256972j348269R2224
$$ -10446262 -7400730 -985591 6030767 10659004 11789270 10532298 9184029 9276253
2393I276253M81609j923003m987113m509027j80340K923165R73548l081510l787582
$$ 9276253 9757862 7834859 2847746 -1661281 -1841621 1081544 2055092 -1026418 -4814000
2384d814000p76953J956300K776619L482050M188173K511182j332613l663175
$$ -4814000 -5590953 -3634653 -858034 2624016 6812189 9323371 7990758 4327583
2376D327583l128792k621166l438096k453129J899083N386986L756127p98030
$$ 4327583 1198791 -1422375 -4860471 -7313600 -5414517 -27531 3728596 2930566
2368B930566l161036k445482j330933p52562J52757O20119n84832j787760n97322
$$ 2930566 -230470 -2675952 -4006885 -4759447 -4606690 -3986571 -4571403 -6359163 -6956485
2359f956485J457200Q55045j993023l157572j277056J075578K136833K760088
$$ -6956485 -5499285 -4644240 -6637263 -9794835 -11071891 -9996313 -7859480 -5099392
2351e099392L109786J867811l34676p16258J117643K039762K35245k152111k728987
$$ -5099392 -1989606 -121795 -456471 -1172729 -55086 1984676 2219921 67810 -2661177
2342b661177k061212j483112o53479P15746J185187k69424k302578l070271k406629
$$ -2661177 -4722389 -6205501 -6858980 -6143234 -4958047 -5227471 -7530049 -10600320 -13006949
2333a3006949q95830J320774L483408L849959J904930n17669j473491r13369K60775
$$ -13006949 -13902779 -12582005 -9098597 -5248638 -3343708 -3861377 -5334868 -6248237 -5987462
2324e987462J455223J991600J262512m968l87289l9973k50117n48150R55012L776908
$$ -5987462 -4532239 -2540639 -1278127 -1283095 -1670384 -1710357 -1960474 -2508624 -1553612 2223296
2314B223296M723247K447007o65291k412831l420709m372963m021635k021472
$$ 2223296 6946543 9393550 8728259 6315428 2894719 -1478244 -5499879 -7521351
2306g521351n11770n55790k00338J448424J760981o42200k257754K4330L145228
$$ -7521351 -8033121 -8588911 -8789249 -7340825 -5579844 -6222044 -8479798 -8455468 -5310240
2297e310240K336663j003453j504952J381870K744725M39643j788309q17177J192776
$$ -5310240 -2973577 -3977030 -5481982 -4100112 -1355387 -915744 -2704053 -3521230 -2328454
2288b328454J007332o78259j237464l89548L05564M56067Q15046J287159J123610
$$ -2328454 -1321122 -1999381 -3236845 -3626393 -3320829 -2864762 -2049716 -762557 361053
2279C61053O35051R19199J852251J751812l52706k868410l130875r31871O52639
$$ 361053 996104 1915303 3767554 5519366 5166660 2298250 -832625 -1764496 -1111857
2270a111857q10089l337009k968979L36958K403346J147796m32698L99606J462769
$$ -1111857 -1921946 -5258955 -8227934 -7890976 -5487630 -4339834 -4772532 -4372926 -2910157
$$ [...]
##END NTUPLES=NMR SPECTRUM
##END=
