##TITLE=31Pdec_DE-177_TFAd6
 CCl4_DMSO-d6, 24 sc
24.8.2026
##JCAMPDX= 6.0         $$ Bruker NMR JCAMP-DX V2.0
##DATA TYPE= NMR SPECTRUM
##DATA CLASS= NTUPLES
##ORIGIN= UXNMR, Bruker Analytische Messtechnik GmbH
##OWNER= root
$$ XWIN-NMR		Version 3.5
$$ Mon Aug 24 14:08:36 2026 Russian Standard Time (UT+4h)  she@DPX200
##.OBSERVE FREQUENCY= 81.013821
##.OBSERVE NUCLEUS= ^31P
##.ACQUISITION MODE= SIMULTANEOUS
##.ACQUISITION SCHEME= undefined
##.AVERAGES= 64
##.DIGITISER RES= 17
##SPECTROMETER/DATA SYSTEM= spect
##.PULSE SEQUENCE= zgpg30
##.SOLVENT NAME= CDCl3
##.SHIFT REFERENCE= (INTERNAL, CDCl3, 0, 197.392)
##AUDIT TRAIL= $$ (NUMBER, WHEN, WHO, WHERE, WHAT)
$$ ##TITLE= Audit trail, XWIN-NMR		Version 3.5
$$ ##JCAMPDX= 5.01
$$ ##ORIGIN= Bruker BioSpin GmbH
$$ ##OWNER= she
$$ F:/spectra/data/she/nmr/P31/2/pdata/1/auditp.txt
$$ ##AUDIT TRAIL=  $$ (NUMBER, WHEN, WHO, WHERE, WHAT)
(   1,<2026-08-24 14:07:29.59 +0400>,<she>,<DPX200>,
      <created by zg, POWCHK disabled, PULCHK disabled
       configuration hash MD5:
       00 E9 B6 7A A2 85 ED C7 34 08 36 98 17 FE 4E 26
       data hash MD5: 32K
       8C DD 8D E8 35 29 F1 25 AF 95 6A FF 8D F8 6F C1>)
(   2,<2026-08-24 14:07:32.12 +0400>,<she>,<DPX200>,
      <Start of raw data processing
       efp BC_mod = 2 LB = 1.5 FT_mod = 6 PKNL = 1 PHC0 = 1925.762 PHC1 = 179.8983 SI = 64K 
       data hash MD5: 64K
       4A EF 44 B4 76 6A 35 F0 DE 03 59 9D 3A 98 33 40>)
(   3,<2026-08-24 14:07:50.81 +0400>,<she>,<DPX200>,
      <pk PHC0 = 66.68854 PHC1 = -169.8 
       data hash MD5: 64K
       AE D4 02 03 CB 86 87 B7 CF 12 37 A3 C9 23 06 D5>)
$$ ##END=
$$ 
$$ hash MD5
$$ D0 D1 0A CC 28 50 C2 12 EE FF 60 A9 F4 89 C7 7B
##$RELAX= 
##$RELAX= 
##$RELAX= 
##$RELAX= 
##$RELAX= 
##$RELAX= 
##$RELAX= 
##$RELAX= 
$$ Bruker specific parameters
$$ --------------------------
##$DU= <F:/spectra>
##$EXPNO= 2
##$NAME= <P31>
##$PROCNO= 1
##$TYPE= <nmr>
##$USER= <she>
##$AMP= (0..31)
100 100 100 100 100 100 100 100 100 100 100 100 100 100 100 100 100 100 
100 100 100 100 100 100 100 100 100 100 100 100 100 100 
##$AQSEQ= 0
##$AQ_mod= 1
##$AUNM= <au_zg>
##$AUTOPOS= <>
##$BF1= 81.014009
##$BF2= 200.13
##$BF3= 200.13
##$BF4= 200.13
##$BF5= 200.13
##$BF6= 200.13
##$BF7= 200.13
##$BF8= 200.13
##$BYTORDA= 1
##$CFDGTYP= 0
##$CFRGTYP= 5
##$CHEMSTR= <none>
##$CNST= (0..31)
1 1 145 1 1 1 1 1 1 1 1 1 1 1 1 1 1 1 1 1 1 1 1 1 1 1 1 1 1 1 1 1 
##$CPDPRG= <waltz16>
##$CPDPRG1= <>
##$CPDPRG2= <waltz16>
##$CPDPRG3= <>
##$CPDPRG4= <mlev>
##$CPDPRG5= <mlev>
##$CPDPRG6= <mlev>
##$CPDPRG7= <mlev>
##$CPDPRG8= <mlev>
##$CPDPRGB= <>
##$CPDPRGT= <>
##$D= (0..31)
0 1 0 0 0 0 0 0 0 0.06 0 0.03 2e-05 3e-06 0 0 0.0002 0 0 0 0 0 0 0 0 0 
0 0 0 0 0 0 
##$DATE= 1787566048
##$DBL= (0..7)
120 120 120 11 120 120 24 19 
##$DBP= (0..7)
150 150 150 150 150 150 150 150 
##$DBP07= 0
##$DBPNAM0= <>
##$DBPNAM1= <>
##$DBPNAM2= <>
##$DBPNAM3= <>
##$DBPNAM4= <>
##$DBPNAM5= <>
##$DBPNAM6= <>
##$DBPNAM7= <>
##$DBPOAL= (0..7)
0.5 0.5 0.5 0.5 0.5 0.5 0.5 0.5 
$$ [...]
##$SUBNAM2= <"">
##$SUBNAM3= <"">
##$SUBNAM4= <"">
##$SUBNAM5= <"">
##$SUBNAM6= <"">
##$SUBNAM7= <"">
##$SUBNAM8= <"">
##$SUBNAM9= <"">
##$SW= 400.765351723535
##$SWIBOX= (0..15)
0 1 3 0 0 0 0 0 0 0 0 0 0 0 0 0 
##$SW_h= 32467.5324675325
##$TD= 32768
##$TD0= 1
##$TE= 0
##$TE2= 300
##$TE3= 300
##$TEG= 300
##$TL= (0..7)
0 120 53 12 22 120 120 120 
##$TP= (0..7)
150 150 150 150 150 150 150 150 
##$TP07= 0
##$TPNAME0= <>
##$TPNAME1= <>
##$TPNAME2= <>
##$TPNAME3= <>
##$TPNAME4= <>
##$TPNAME5= <>
##$TPNAME6= <>
##$TPNAME7= <>
##$TPOAL= (0..7)
0.5 0.5 0.5 0.5 0.5 0.5 0.5 0.5 
##$TPOFFS= (0..7)
0 0 0 0 0 0 0 0 
##$TUNHIN= 0
##$TUNHOUT= 0
##$TUNXOUT= 0
##$USERA1= <user>
##$USERA2= <user>
##$USERA3= <user>
##$USERA4= <user>
##$USERA5= <user>
##$V9= 5
##$VALIST= <valist>
##$VCLIST= <CCCCCCCCCCCCCCC>
##$VD= 0
##$VDLIST= <DDDDDDDDDDDDDDD>
##$VPLIST= <PPPPPPPPPPPPPPP>
##$VTLIST= <TTTTTTTTTTTTTTT>
##$WBST= 1024
##$WBSW= 4
##$XGAIN= (0..3)
0 0 0 0 
##$XL= 0
##$YL= 0
##$YMAX_a= 6615
##$YMIN_a= -9434
##$ZGOPTNS= <>
##$ZL1= 120
##$ZL2= 120
##$ZL3= 120
##$ZL4= 120
##$ABSF1= 0
##$ABSF2= 0
##$ABSG= 0
##$ABSL= 0
##$ALPHA= 0
##$AQORDER= 0
##$ASSFAC= 0
##$ASSFACI= 0
##$ASSFACX= 0
##$ASSWID= 0
##$AUNMP= <proc_1d>
##$AZFE= 0.1
##$AZFW= 0.5
##$BCFW= 0
##$BC_mod= 2
##$BYTORDP= 0
##$COROFFS= 0
##$CY= -3
##$DATMOD= 1
##$DC= 0
##$DFILT= <>
##$DTYPP= 0
##$F1P= 0
##$F2P= 0
##$FCOR= 1
##$FTSIZE= 65536
##$FT_mod= 6
##$GAMMA= 0
##$GB= 0
##$INTBC= 1
##$INTSCL= 9.790993e-09
##$ISEN= 30
##$LB= 1.5
##$LEV0= 0
##$LPBIN= 0
##$MAXI= 10000
##$MC2= 0
##$MEAN= 0
##$ME_mod= 0
##$MI= 50
##$NCOEF= 0
##$NC_proc= -8
##$NLEV= 6
##$NOISF1= 182.463
##$NOISF2= 159.3651
##$NSP= 0
##$NTH_PI= 0
##$NZP= 0
##$OFFSET= 197.3918
##$PC= 4
##$PHC0= 1992.45
##$PHC1= 10.0983
##$PH_mod= 1
##$PKNL= yes
##$PPARMOD= 0
##$PSCAL= 0
##$PSIGN= 0
##$REVERSE= no
##$SF= 81.014063255964
##$SI= 65536
##$SIGF1= 159.3651
##$SIGF2= -187.1042
##$SINO= 113.3802
##$SIOLD= 16384
##$SREGLST= <1H.CDCl3>
##$SSB= 0
##$STSI= 65536
##$STSR= 0
##$SW_p= 32467.5324675325
##$SYMM= 0
##$S_DEV= 0
##$TDeff= 32768
##$TDoff= 0
##$TI= <>
##$TILT= no
##$TM1= 0
##$TM2= 0
##$TOPLEV= 0
##$USERP1= <user>
##$USERP2= <user>
##$USERP3= <user>
##$USERP4= <user>
##$USERP5= <user>
##$WDW= 1
##$XDIM= 65536
##$YMAX_p= 385401294
##$YMIN_p= -103968255
$$ End of Bruker specific parameters
$$ ---------------------------------
##NTUPLES= NMR SPECTRUM
##VAR_NAME=  FREQUENCY,     SPECTRUM/REAL,   SPECTRUM/IMAG
##SYMBOL=    X,             R,               I
##VAR_TYPE=  INDEPENDENT,   DEPENDENT,       DEPENDENT
##VAR_FORM=  AFFN,          ASDF,            ASDF
##VAR_DIM=   65536,         65536,           65536
##UNITS=     HZ,            ARBITRARY UNITS, ARBITRARY UNITS
##FACTOR=    0.49542278885378, 1,            1
##FIRST=     15991.5117654749, 0,            0
##LAST=      -16476.0207020576, 0,           0
##MIN=       -16476.0207020576, -103968255,  0
##MAX=       15991.5117654749, 385401294,    0
$$ Real data points
##PAGE= N=1
##DATA TABLE= (X++(R..R)), XYDATA
$$ [...]
7508d085265r13840J313994L296804K883321L48571j286617o2608J795716O91571
7499C981647k888195m543910k180435Q61373O86568j520671j547772J435081L764397
7490a951917K677921j26082j507718j229003j304727k178139j866748Q38050M020434
7481b627929M571743J871263j457529k515288j150932L89729M43322k20028J51439
7472e44210J569370K037853K84366k201593k918397j692930p52246j249596j547348
7463g014731j22058J516208R69589r67373j138488J081593K595888J173184j320809
7454c226997j739834L61478L153554N068201N186105K903923p48973k941413k170448
7445E845596k02580P84086J053896J316485M29898j931581k889246n74621J583434
$$ y = [-4085265, -4999105, -3685111, -388307, 2495014, 2843585, 1556968, 1494360, 3290076, 3981647, 1093452, -3450458, -5630893, -4769520, -4082952, -5603623, -7151395, -5716314, -1951917, 726004, 599922, -907796, -2136799, -3441526, -5619665, -7486413, -6648363, -2627929, 1943814, 3815077, 2357548, -157740, -1308672, -918943, -475621, -695649, -544210, 1025160, 3063013, 3347379, 1145786, -1772611, -3465541, -4217787, -5467383, -7014731, -7136789, -5620581, -4650992, -5618365, -6756853, -5675260, -3079372, -1906188, -3226997, -4966831, -4605353, -1451799, 3616402, 8802507, 11706430, 10957457, 8016044, 5845596, 5643016, 6427102, 7480998, 8797483, 9227381, 7295800, 4406554, 3831933, 5415367]
7436E415367k97860l249144j074125N335355Q118737L898273j619549k871253
7428A3655801j871803k705711m212047l134542m93010M00274l98531m52823M52086
7419A239694Q42431R17493J641880K184263J610490J148715J519468N04342l089120
7410H519656n700473l672149P00590K496317J361970K78365p05796l485014o044263
7401f250797m190996J085757M306136L819896L185778L688570K257034j512891
7393F388487l025999k79834K230922Q11237j523199n97976J934951J804136r92199
7384F750526k995044k666261j109667O50663J784386R06118j770334l354782k067166
7375c871561n1554K68441K31730K102784M400921L867615P39052j592827j449701
$$ y = [5415367, 5117507, 1868363, 794238, 6129593, 14248330, 18146603, 16527054, 13655801, 11783998, 9078287, 4866240, 1731698, 1238688, 1638962, 1240431, 787608, 1239694, 2082125, 2999618, 4641498, 6825761, 8436251, 9584966, 11104434, 11608776, 8519656, 2819183, -852966, -152376, 2343941, 3705911, 3984276, 3278480, -206534, -6250797, -10441793, -9356036, -5049900, -1230004, 1955774, 5644344, 7901378, 6388487, 3362488, 3082654, 5313576, 6124813, 4601614, 4003638, 5938589, 7742725, 6750526, 3755482, 1089221, -20446, 630217, 2414603, 3320721, 1550387, -1804395, -3871561, -3923115, -3654674, -3422944, -1320160, 3080761, 6948376, 7687428, 6094601, 4644900]
7366D644900k40548M98727O31458L25026k47235m68421l06893r25323k576387
7357A335304l234040j376516J245504J918554P58943k13412n23369j058618j407550
7348b555200k58382J916126L083845K442599J004476k49234r15596l53907J674633
7339E789360L702648L577244Q96764k481698m135827k960412k51621J046779k93914
7330D889323j499953N38521L712502K972489j373508l133678m3967K136075o18749
7321G579055l051389P67032O450791N217782k252133o791501m509699q26894l26579
7312B256465j011214n42347n62328j880270j842215L29998J290281k73237p78191
7303c013058J635557L112242O67144k295085j638596O84535M89488j471682j426154
$$ y = [4644900, 4404352, 4903079, 5534537, 5859563, 5612328, 5143907, 4837014, 3911691, 1335304, -1898736, -3275252, -2029748, -111194, 647749, 434337, -89032, -1147650, -2555200, -2813582, -897456, 2186389, 4628988, 5633464, 5384230, 4468634, 4114727, 5789360, 9492008, 13069252, 13966016, 11484318, 7348491, 4388079, 4136458, 5183237, 4889323, 3389370, 3927891, 7640393, 10612882, 9239374, 6105696, 6061729, 8197804, 7579055, 4527666, 5294698, 11745489, 16963271, 14711138, 7919637, 3409938, 2583044, 2256465, 1245251, 702904, 140576, -1739694, -3581909, -3251911, -1961630, -2234867, -3013058, -1377501, 1734741, 2401885, 106800, -1531796, -847261, -357773, -1829455, -3255609]
7294c255609Q08516K095615J238926l05719j612874k433184j575379J299424L624427
7285a15857K976630P16999n26635j083231k406774l111254j167093J483087J252168
7276a981960r74200r09568K051292L639238J327236k211115l543170k643947j115439
7267f361633M89886J818143J847500O42809O285J045072K757565L784846L674838
7258I705311J993843j351054m269339l853645p86870N49484j906380m656855l754239
7249h329744m50108J379448J338019K160427M218746M469119J351253k635328
7241C501832m442868m025147l029673k022456o39064R12621K029118K508455K183116
7232c024066Q65694m18794L35964L192452M999801K986079j445183m582496n048828
$$ y = [-3255609, -2447093, -351478, 887448, 581729, -1031145, -3464329, -5039708, -3740284, -115857, 2860773, 3577772, 3051137, 1967906, -438868, -3550122, -4717215, -3234128, -1981960, -2956160, -3865728, -1814436, 1824802, 3152038, 940923, -2602247, -5246194, -6361633, -5871747, -4053604, -2206104, -1563295, -1557010, -511938, 2245627, 6030473, 9705311, 11699154, 10348100, 6078761, 2225116, 1438246, 1987730, 81350, -4575505, -8329744, -8779852, -7400404, -6062385, -3901958, 316788, 4785907, 6137160, 3501832, -941036, -4966183, -7995856, -10018312, -10657376, -9744755, -7715637, -5207182, -3024066, -2158372, -2577166, -2241202, 951250, 5951051, 8937130, 7491947, 2909451, -2139377]
7223b139377m105471k298444P97390L582689L044514n03639k791745j490050M95956
7214e408177k9455j393228p8927L390527N265242L934010J102981j414882k913419
7205B454672k664914p47066O90070n6950j384198j050562k23255j036987j737365
7196e756555O98144M096175L327325q37747j823464K163240M483609L39007n516083
7187A173651o070530k062490P97596Q20501O59194J142567P06758j80294O90445
7178b322602K900456L698445K430359Q78787l83987k200089l724695k957092m57145
7169b137563R51729L86131l99432o09966j355435k542197k057846Q90212M083183
7160b791184M958627L274750O82321q83389m57953Q63434O43341j626902l222847
$$ y = [-2139377, -6244848, -8543292, -7745902, -4163213, -1118699, -1622338, -4414083, -5904133, -5408177, -5437632, -6830860, -6909787, -3519260, 1745982, 5679992, 6782973, 5368091, 2454672, -210242, -957308, -267238, -324188, -1708386, -2758948, -2982203, -4019190, -5756555, -5058411, -962236, 2365089, 1527342, -296122, 1867118, 6350727, 6689734, 1173651, -4896879, -6959369, -6161773, -5341272, -4682078, -3539511, -2832753, -3013047, -2322602, 577854, 4276299, 6706658, 7585445, 7201458, 5001369, 1276674, -1680418, -2137563, -1185834, -799703, -1199135, -1809101, -3164536, -5706733, -7764579, -6874367, -2791184, 2167443, 5442193, 6124514, 5241125, 4783172, 5646606, 6289947, 4663045, 1440198]
7151A440198k125830m97054j287422l082360k212745J068592K927768K138677
7143a630176J359018J888264J788833L06199l01068R02339J386266m53403k264760
7134B981512j562546L60291Q44052k54330j403522j939468j648005M6346K381923
7125a93747K864920P13869j381900j172104l40756j433131l245695k517456R00203
7116e805797L757379L894278K268296O02695n01144r03271n68417l49674j347669
7107A046676k928870k930900n93188J988211K352590Q00142k14914M01566R02238
7098H23551n07668k523189k202633N55117K319758R83781r88186l88379J496549
7089d31299P86378k615362m375621k078144J304188J910936J50397q66616p1561
$$ y = [1440198, -685632, -1182686, -2470108, -5552468, -7765213, -6696621, -3768853, -1630176, -271158, 1617106, 3405939, 3712138, 3411070, 4313409, 5699675, 5246272, 2981512, 1418966, 1779257, 2623309, 2368979, 965457, -974011, -2622016, -2575670, -193747, 2671173, 3385042, 2003142, 831038, 490282, -942849, -4188544, -6706000, -5805797, -2048418, 1845860, 4114156, 4716851, 4215707, 3312436, 2744019, 2394345, 1046676, -1882194, -4813094, -5406282, -3418071, -1065481, -265339, -480253, -78687, 823551, 315883, -2207306, -4409939, -3854822, -1535064, -551283, -1539469, -1927848, -431299, 355079, -2260283, -6635904, -8714048, -7409860, -5498924, -5348527, -6215143, -6286704]
7080f286704Q82993P11252j8171l74371m04550n66801o31137K61991K321713M192347
7070H8562M165531K529431J429403J691087J556140j0275r50522M20387J683906
7061A2603650k55251l469145l296867J46548J775384n20647k761849j381461J743814
7052D584176L117066K489894J278180l89144k319878l040402k409378k376464
7044I34050k963143j306766K557097L433689j299183n727119k753343N180010
7036a944708Q733595L952908l683617p379270o099184k836911j56203J075058
7028h338332J376554K150804L697136L979640J500875j496160j606549O58995
7020A922963J653309P3335j792527k289860k330503k576964j992773j63527J649025
$$ y = [-6286704, -5403711, -4692459, -4710630, -5085001, -5489551, -6056352, -6687489, -6425498, -4103785, 88562, 4254093, 6783524, 8212927, 9904014, 11460154, 11449879, 10499357, 10919744, 12603650, 12348399, 8879254, 5582387, 5728935, 7504319, 6983672, 4221823, 2840362, 4584176, 7701242, 10191136, 11469316, 11080172, 8760294, 5719892, 3310514, 934050, -2029093, -3335859, -778762, 2654927, 1355744, -4371375, -7124718, -1944708, 6788887, 10741795, 7058178, -321092, -6420276, -9257187, -9413390, -8338332, -6961778, -4810974, -1113838, 2865802, 4366677, 2870517, 1263968, 1922963, 3576272, 3649607, 1857080, -432780, -2763283, -5340247, -7333020, -7496547, -5847522]
7011e847522K642934L265343L252366J429818j647480l202140j549910J738654
7003H2063L760224L037509K19113k419302k314357O87992L165747J708226k532588
6994E394627n118270l958291j197479M51505N46302j86203j126092j381856m36321
6985g012078N08616R1683m23985J208003L806696L548925j01317k936487j984718
6976c294662M72437R09843m73085j334406j240641j261643j231313k18175J272272
6967f399373J913354J652968J279858O95001m90169j320300m47048J543221K484503
6958I12015J360726o31495j775148j435460Q8395K123790L571207L231115J150987
6949H596132o28072J44811K855605L842457O84825m058756n576033l144844q92791
$$ y = [-5847522, -3204588, 60755, 3313121, 4742939, 3095459, -106681, -1656591, 82063, 3842287, 6879796, 7098909, 4679607, 2365250, 3053242, 6218989, 7927215, 5394627, 276357, -3681934, -4879413, -4427908, -3881606, -4067809, -5193901, -6575757, -7012078, -6503462, -6411779, -6835764, -5627761, -1821065, 1727860, 1626543, -1309944, -3294662, -2822225, -1912382, -2385467, -3719873, -4960514, -6222157, -7453470, -7671645, -6399373, -4486019, -2833051, -1553193, -858192, -1348361, -2668661, -3115709, -1572488, 912015, 2272741, 1641246, -133902, -1569362, -1480967, 642823, 4214030, 7445145, 8596132, 7968060, 8112871, 10968476, 14810933, 15495758, 11437002, 5860969, 2716125, 1823334]
6940A823334j445301k240963l87251K054251J245705k138831l908798k472137
6932g469991J7531J892302L381050M161647L412276K213166K228594K326659M23229
6923A2586463j903691j342529R63052O79834j951067j875749J834576L451481
6915A2442370j57075m083659l234549N8454J158133Q12092J986333L097658Q20861
6906A2900618l032372l736670j121183R37189J191617J528000J698313n92831
6898I772681m336355n442862l025359o68861n77072r29270j63126L35384o57257
6889e692097j963181k356791k131742j247750J019890L627601M176373K798330
6881a769367K262278L067508K266770r64663k602815L10299M326127M090965M5310
$$ y = [1823334, 378033, -1862930, -2250181, -195930, 1049775, -1089056, -4997854, -7469991, -7452460, -5560158, -2179108, 1982539, 5394815, 7607981, 9836575, 12163234, 12586463, 10682772, 9340243, 10303295, 10983129, 9032062, 7156313, 8990889, 12442370, 12285295, 8201636, 4967087, 5025541, 6183674, 6995766, 8982099, 12079757, 12900618, 9868246, 6131576, 5010393, 5947582, 7139199, 8667199, 10365512, 9772681, 5436326, -6536, -3031895, -3700756, -4277828, -5207098, -5370224, -5034840, -5692097, -7655278, -10012069, -12143811, -13391561, -12371671, -8744070, -4567697, -1769367, 492911, 3560419, 5827189, 4862526, 2259711, 2570010, 6896137, 10987102, 11032412]
6872A1032412k587622j476555M16062K71265p40992n37264M7535j047509l289593
6863B087739m065032k523937n86814J26874K91201R50517J484760J025408M50702
6854g58582R29369J453597K61346j769102j940514p1605R83571p1625q96751N01273
6844a379023K515104K698402J407326M51992J99662L33293J460424L383238L656097
6835A4726515P53398k895523l963917k825010j996593j516751M15045L120583
6827E817747L747013J779247l17338j116255j589902k192023j832435m11401M17403
6818D302056k80966j707869k973953l588316k626963O8337K357106K268673J288047
6809h93848J944040L108701J862232p00774o93054J465704J037964k684358m203763
$$ y = [11032412, 8444790, 6968235, 7384297, 7655562, 6914570, 6377306, 6424841, 5377332, 2087739, -1977293, -4501230, -5088044, -4961170, -4669969, -3719452, -2234692, -1209284, -758582, 170787, 1624384, 1885730, 116628, -1823886, -1895491, -911920, -983545, -1880296, -1379023, 1136081, 3834483, 5241809, 5693801, 5893463, 6226756, 7687180, 11070418, 14726515, 15479913, 12584390, 8620473, 5795463, 3798870, 2282119, 2697164, 5817747, 9564760, 11344007, 11026669, 9910414, 8320512, 6128489, 4296054, 3884653, 4302056, 4021090, 2313221, -660732, -4249048, -6876011, -6807674, -4450568, -2181895, -893848, 1050192, 4158893, 6021125, 5320351, 4627297, 6093001, 7130965, 4446607, 242844]
6800B42844p06482K764926J151513k651089k882138j70429K65937k452427l686308
6791h123653o39074L995535O215510M909146J464203j845633k779835r64842R93547
6782C224904L13520k238987l448919j969550O83280K863004L976326L335395O63373
6773G402346k078455k028864P81221L115888K589196J25285k074350k985600k465814
6764B380853m76496K154330L492615K271808o72205l361885m472838l826937j912654
6755d423409M49651K314856K946132K128216N03160m03118N66402K380846K387533
6746H850269k55451k857480k492650r8429P96020r86040k925687k612135o06608
6737c188191J265410K415208K982247K481978P31408q01018m11741J291756J859268
$$ y = [242844, -463638, 2301288, 3452801, 801712, -2080426, -2250855, -1984918, -4437345, -8123653, -8762727, -4767192, 1448318, 6357464, 7821667, 5976034, 3196199, 2231357, 3224904, 3538424, 1299437, -2149482, -4119032, -3435752, -572748, 3403578, 6738973, 7402346, 5323891, 3295027, 4076248, 7192136, 9781332, 9906617, 7832267, 4846667, 2380853, 1904357, 4058687, 7551302, 9823110, 9150905, 5789020, 1316182, -2510755, -4423409, -3973758, -1658902, 1287230, 3415446, 3918606, 3515488, 4081890, 6462736, 8850269, 8594818, 5737338, 3244688, 3146259, 3942279, 2956239, 30552, -2581583, -3188191, -1922781, 492427, 3474674, 5956652, 6688060, 5887042, 5475301, 6767057, 8626325]
6728H626325K74416j570169j411258K86949R59665m97315k065084j225086J537144
6719D915587L128937J771499p62466j551169k09945J062835P77440j5769K59950
6710I376899J066067N11907j503914k535065p87675K099437K972959J304174m61638
6701A2043151p14265o18754j417674k057823j229966O4090J91000l14976j13713
6692E831070N8636j169887k457254j364233J058584J223817j096987j963445M68414
6683E88715K993562K697707J363433J681512K448815J164309j089774j307444
6675A0540835M31238J341929M13989q80117j705271k460067k634068j194857Q99293
6666D752904J378991n372j285574j389389r97302l69959R58549K046448Q92358
$$ y = [8626325, 8900741, 7330572, 5919314, 6206263, 7165928, 6668613, 4603529, 3378443, 4915587, 8044524, 9816023, 9053557, 7502388, 7292443, 8355278, 9132718, 9116949, 9376899, 10442966, 10954873, 9450959, 6915894, 6128219, 8227656, 11200615, 12504789, 12043151, 11328886, 10710132, 9292458, 7234635, 6004669, 6068759, 6259759, 5944783, 5831070, 5889706, 4719819, 2262565, 898332, 1956916, 3180733, 2083746, 120301, 588715, 3582277, 6279984, 7643417, 9324929, 11773744, 12938053, 11848279, 10540835, 10972073, 12314002, 12727991, 11847874, 10142603, 7682536, 5048468, 3853611, 4752904, 6131895, 6126523, 4840949, 3451560, 2454258, 2084299, 3042848, 5089296, 5981654]
6657E981654k220350m092257k513609R21931L001350K597653J254625R52481J986186
6648G869664K727293J544886p95678j620439j8649J492371N82400j251517j130818
6639I399513M86923P58260o33347j216421m19056o13736k504404l170791o04517
6630A482424K777996L458510J470399n55547j340224j660573k147320k450500
6622A035165k202928j440328l59816O03305J054106J390256K240951K810876J340507
6613F472094j985348m231447l145287j76787J379113M30273j110810j104778M76767
6604b996210J989871K157696J392016R87666J069653K82722j719148k772576j016429
6595f24739J767567K171888Q4321j393606j011988q66766j924785j811067Q16388
$$ y = [5981654, 3761304, -330953, -2844562, -1922631, 1078719, 3676372, 4930997, 5883478, 7869664, 10596957, 12141843, 11346165, 9725726, 9707077, 11199448, 11781848, 10530331, 9399513, 9886436, 10644696, 10011349, 8794928, 8375872, 7762136, 5257732, 2086941, 1482424, 4260420, 7718930, 9189329, 8633782, 7293558, 5632985, 3485665, 1035165, -1167763, -2608091, -2967907, -2364602, -1310496, 79760, 2320711, 5131587, 6472094, 4486746, 255299, -2889988, -3066775, -1687662, -1257389, -2368199, -3472977, -2996210, -1006339, 1151357, 2543373, 3531039, 4600692, 4883414, 3164266, 391690, -624739, 1142828, 3314716, 3399037, 2005431, 993443, 126677, -1798108, -3609175, -2792787]
6586b792787L000413J704511j063010r13636K417070M772645L481054M20645j267927
6577I758978j026828m36976n55484r19287p08428j56279m95566k299908m256716
6568a096494m479534k849430p98371J020897K968960M281135L234323K62750j692426
6559H51810j246497l83975o40785m47543J346221K300989J51260k628387k037292
6550b734199J241391L021644J965821L86767p26636k709257m924441m322592o93384
6541i494886J962317J293640k9729P98906K088815J038126j202632j587544l33625
6532e466612j32827j237987j164903Q08377K339680J883289R06315J055246J500597
6523D91175P50570o27286j058915p51467j334555k877489l284070j417548P22155
$$ y = [-2792787, 207626, 1912137, 849127, -64509, 2352561, 7125206, 10606260, 11026905, 9758978, 8732150, 8295174, 7739690, 6820403, 6111975, 5955696, 5460130, 3160222, -1096494, -5576028, -8425458, -9223829, -8202932, -5233972, -952837, 2281486, 2544236, 851810, -394687, -778662, -1419447, -1866990, -520769, 1780220, 1931480, -696907, -2734199, -1492808, 1528836, 3494657, 3881424, 3154788, 445531, -4478910, -8801502, -9494886, -7532569, -6238929, -6268658, -5469752, -3380937, -2342811, -3545443, -5132987, -5466612, -5599439, -6837426, -8002329, -7193952, -4854272, -2970983, -2064668, -1009422, 491175, 1241745, 614459, -444456, -1195923, -2530478, -5407967, -8692037, -10109585, -9387430]
6514i387430M62382j599334j985954J007916M730646N365734K600107m10343j189638
6505d05914l43934K61449P1217j72057Q6872O90745J186384J034021k09132k220381
6495b0730l625502l071553p62439J445497J802013N01048n03373L07580K287354
6486a640105L487687K925019J219067p59840k574883l391792k136612O12197K375925
6477A16663J719854J84462j46193L83587L37390J18354J017698K274944K062336
6468H069095R61374J182165K283573J352679j743672l198615j182530Q13137n89119
6459G948087l054142k161206J562445L539659K048316o8262n30308l82883q57527
6450H044179j117247n38823k07553n21815k6112J587095J997171J6183j776819
$$ y = [-9387430, -8925048, -10524382, -12510336, -11502420, -6771774, -1406040, 1194067, 783724, -405914, -749848, -488399, -417182, -589239, -502367, 188378, 1374762, 2408783, 2199651, -20730, -3646232, -6717785, -7480224, -6034727, -4232714, -3731666, -4235039, -3927459, -1640105, 1847582, 4772601, 5991668, 5231828, 2656945, -734847, -2871459, -2259262, 116663, 1836517, 2020979, 1874786, 2258373, 2595763, 2714117, 3731815, 6006759, 8069095, 9030469, 10212634, 12496207, 13848886, 12105214, 8906599, 7724069, 8537206, 7948087, 4893945, 2732739, 4295184, 7834843, 9883159, 9814897, 9284589, 8901706, 8044179, 6926932, 6388109, 6180556, 5658741, 5632629, 7219724, 9216895, 9233078, 7456259]
6441G456259j144769o23167l757208q180476p434882l16682O344096O460048K341776
6432A144995K90007J581211K340683R27172K91862K300856M200616K943191j58792
6423A5861801j816474j587943j366862j490907n59657J313529K070413Q81397
6415A3305297p13333j498790k245334l642632m409591k964461N4439K307980K365889
6406B559464R12248l49978l95480L31802N57054k55248j227276j433977j298072
6397e99463j513132j270071N47042K630719K157998j001662l444060k771570o29206
6388e893405M38190P83586J860948K627896J043409j811981k590995o40156J097892
6379c084616P08608j72168L36695J151945J91744k153835l412707k032730J265375
$$ y = [7456259, 6311490, 5688323, 1931115, -6249361, -13684243, -14000925, -7656829, -1196781, 1144995, 1435002, 3016213, 5356896, 6284068, 6575930, 8876786, 13077402, 16020593, 15861801, 14045327, 12457384, 11090522, 9599615, 9039958, 10353487, 12423900, 13305297, 12591964, 11093174, 8847840, 5205208, 795617, -2168844, -2114405, 193575, 2559464, 3471712, 3121734, 2726254, 3058056, 3615110, 3359862, 2132586, 698609, -599463, -2112595, -3382666, -2835624, -204905, 1953093, 951431, -2492629, -5264199, -5893405, -5455215, -4671629, -2810681, -182785, 860624, -951357, -3542352, -4182508, -3084616, -2376008, -2548176, -2211481, -1059536, -867792, -3021627, -6434334, -8467064, -7201689]
6370g201689M348385N038756K726017m54553j258987P75109K336711N27502l224392
6361C612859n045861l345959J53404L223456M852530M634225K658680J58624j449360
6352I452598k212036k860795k900805j595623m20678j638207m153409m065460
6344a0394415n15069K335657J273120j079783m35255K477289L287984P84725j775374
6335d041121j967339r06644m6696J121616K813307L436045K164872P18652P31733
6326D024425J231119N08480j110870k121840k097223j481157m18972O69895O65715
6317a30428n32489j179566j78027J013231P20429k09953j02663N75322L67123
6308C42979l07174j32561K98596l62400j060725L54669K977850L483086J141143
$$ y = [-7201689, -2853304, 2185452, 4911469, 4456916, 3197929, 3973038, 6309749, 6837251, 3612859, -1433002, -4778961, -4625557, -1402101, 3450429, 8084654, 10743334, 10901958, 9452598, 7240562, 4379767, 1478962, -116661, -537339, -2175546, -6328955, -10394415, -10909484, -8573827, -7300707, -8380490, -8815745, -6338456, -3050472, -2265747, -4041121, -6008460, -6915104, -6961800, -5840184, -3026877, 409168, 2574040, 3292692, 4024425, 5255544, 5764024, 4653154, 2531314, 434091, -1047066, -1466038, -796143, -130428, -662917, -1842483, -2020510, -1007279, -286850, -496803, -599466, -24144, 342979, 35805, -96756, 201840, -160560, -1221285, -866616, 2111234, 5594320, 6735463]
6299F735463j234508j939586k439428l636362l635529j273251J064178P00844
6291e658179j297722j831439q7102K042831K832276K141414P39217l33931m13015
6282a865650j45544p88564j985439j866195j21791J102129N55898j44562N11154
6273d748564J362361J048446O75402J389015J472440q81117l556175k936654N51450
6264e623396K911337K220073L99174n63143p67991m65153P81955K202525J924832
6255C020213o7300j486883j056432K3387O07388J176095J958044J849392M09531
6246F433435j049057j453926j255820r13608j25357N75689k76572k406967l259320
6237c731503j562628O75252J323949J171734J881371K829984K331648O46469n80625
$$ y = [6735463, 5500955, 3561369, 1121941, -2514421, -6149950, -7423201, -6359023, -5658179, -6955901, -8787340, -8874442, -6831611, -3999335, -1857921, -1118704, -1452635, -1865650, -2011194, -2799758, -4785197, -6651392, -6773183, -5671054, -5115156, -5259718, -4748564, -3386203, -2337757, -1662355, -273340, 1199100, 317983, -3238192, -6174846, -5623396, -2712059, -491986, -92812, -655955, -1423946, -1889099, -1107144, 1095381, 3020213, 2952913, 1466030, 409598, 432985, 1040373, 2216468, 4174512, 6023904, 6433435, 5384378, 3930452, 2674632, 1761024, 1635667, 2211356, 1934784, -472183, -3731503, -5294131, -4618879, -3294930, -2123196, -241825, 2588159, 4919807, 5566276, 4985651]
6228D985651r50059j185178j100479J14733J884047K467056J244305o62205k021820
6219D776051k521991k217269j069802P58615K674110L693612K787175j0131k750961
6210F119409l118588j194646P19526J371764J701723K094611J079826j657607
6202G116018l484174k365161j03124O04819L37563R86911J470994m55376l099235
6193A009235k331825J463007K759345j047071n176524l997798J111332M087287
6185b123012K567785N9669N9381J607054J813578K34522j267026j730212j912533
6176f90794k001923p35198K073936L844290K211498j084303j947686L38347K080232
6167D088399Q64286q89214k28498J371149O87335j621485k048496N0763J831435
$$ y = [4985651, 4035592, 2850414, 1749935, 1864668, 3748715, 6215771, 7460076, 6797871, 4776051, 2254060, 36791, -1033011, -274396, 2399714, 6093326, 8880501, 8870370, 6119409, 3000821, 1806175, 2525701, 3897465, 5599188, 7693799, 8773625, 7116018, 3631844, 1266683, 1163559, 1768378, 2105941, 3092852, 4563846, 4108470, 1009235, -1322590, 140417, 2899762, 1852691, -3323833, -7321631, -6210299, -2123012, 444773, 504442, 563823, 2170877, 3984455, 4218977, 2951951, 1221739, -690794, -2692717, -3427915, -1353979, 2490311, 4701809, 3617506, 1669820, 2008167, 4088399, 4952685, 4063471, 3834973, 5206122, 5893457, 4271972, 2223476, 2274239, 4105674]
6158D105674J866090J684403J958367J077111j304284k837169k193656j111179
6150C245357j056108q81765K16391M36842j351370k724277j265645R45832k8021
6141b462764l821929n733223k951309J992201M685101L724840J228784k40418
6133c578717j37176M24516P05109J226116K304164K730217J305410r48873k015637
6124B015129j905520k093934k203043l72429K674533L543044J405955k74151Q64193
6115C653777K546107K116214P08340J10587r47052l512059m715922k030743J454345
6106f16406J187466j484654j673434Q62146J939997O11726J75534J333044Q25986
6097C161405j930972l125139j305514J82169j51104R24142M302052M917566p7589
$$ y = [4105674, 5971764, 7656167, 9614534, 10691645, 9387361, 6550192, 4356536, 3245357, 2189249, 1307484, 1523875, 1960717, 609347, -2114930, -3380575, -2434743, -2462764, -6284693, -12017916, -14969225, -12977024, -8291923, -4567083, -3338299, -3578717, -3715893, -3291377, -2586268, -1360152, 944012, 3674229, 4979639, 4030766, 2015129, 109609, -1984325, -4187368, -4559797, -1885264, 1657780, 3063735, 2789584, 3653777, 6199884, 8316098, 9024438, 9135025, 8187973, 4675914, -40008, -2070751, -616406, 571060, -913594, -2587028, -1724882, 215115, 826841, 1002375, 2335419, 3161405, 1230433, -1894706, -3200220, -3018051, -3169155, -2245013, 2057039, 6974605, 6897016]
6088F897016n049970l762222P95644J195817k761465m455208j257681K265962
6080f132107K372509Q24258r6848j561186m347172n412184j920977L826730O724964
6071e722013M851057P92929k056709k495960j277550L59400J591978K188385K177706
6062D09223J589171P49794L34008M34415J25491j098351k070487j446611P0160
6053i03187O12178m5923l88015J57840M35168j02140j94973J157183K927120L385422
6043G040673K136748N2593j791871k431270j409889L27746J066264O59849R24713
6034F575556K558546L178193M19504l946195n527070k965289M02148J295203N14143
6025B504739N72054J325167O36891j531085k769985k186207j730322k437144k159518
$$ y = [6897016, 1847046, -1915176, -1119532, 76285, -2685180, -7140388, -8398069, -6132107, -3759598, -2935340, -3032188, -4593374, -8940546, -14352730, -16273707, -12446977, -5722013, -870956, -78027, -2134736, -4630696, -5908246, -5548846, -3956868, -1768483, 409223, 1998394, 2748188, 3082196, 3516611, 3642102, 2543751, 473264, -973347, -903187, -291009, -336932, -724947, -567107, -131939, -234079, -429052, 728131, 3655251, 7040673, 9177421, 9230014, 7438143, 5006873, 3596984, 3924730, 4990994, 5650843, 6575556, 9134102, 12312295, 12731799, 8785604, 3258534, 293245, 695393, 1990596, 2504739, 3076793, 4401960, 5038851, 3507766, 737781, -1448426, -3178748, -5615892, -7775410]
6016g775410P84056L931698L635940M48376j686294j146080j91224n59824r26546
6007c485308O5220J266947J351157J230322K027651K617066J555047m4914j07086
5998F476102R23770P92956p73839j531300l08703R28089m10561m057231o894673
5989d855390o257526k756629M83076J379588Q91362P82713O44019q62740k592529
5980a3144056j793071J359586L386460K685294J687111K167389K040730m26983
5972b037540k559706j165659K017824K919002J420931P96807K033340L043817
5964F468816K921858K698401K038631n55083l915462m666137k299199j29080k61975
5955B300770j099623r24527n59263j001476j412864j061707p55106r20980n36310
$$ y = [-7775410, -6991354, -3059656, 576284, 1024660, -661634, -1807714, -1998938, -2558762, -3485308, -3420088, -2153141, -801984, 428338, 2455989, 5073055, 6628102, 6583188, 6476102, 7399872, 8192828, 7418989, 5887689, 5578986, 6507075, 6096514, 2039283, -4855390, -11112916, -13869545, -13386469, -12006881, -11115519, -10332806, -9688787, -10551527, -13144056, -14937127, -13577541, -10191081, -7505787, -5818676, -3651287, -1610557, -2037540, -4597246, -5762905, -3745081, -826079, 594852, 1391659, 3424999, 6468816, 9390674, 12089075, 14127706, 13572623, 9657161, 4991024, 2691825, 2562745, 2300770, 1201147, 276620, -282643, -1284119, -2696983, -3758690, -4513796, -5434776, -5971086]
5946e971086Q07562J902549J986826J707901J263409j29539k107799k809009j492800
5937d841986N43053K097508K892258K241383k87032k766114k642294p70739k47958
5928c781921j121831m87292J717495K037252r5920o95518J772269L196897R12378
5919C453809j340365J21336K280295N48235l307202m241498k162801j006617j365177
5910g019985j76288K830976M088527K057022m80692p87424P18838K209779K398190
5901E838943P67353j584114k018694R9963J387786p39594l029104o15551M960936
5892E067924P171632L751742p00161k040046j464142j632598k440927k719607
5884D993817k502954j622571P77031L532096L407291k30180l460497k689645P53155
$$ y = [-5971086, -5163524, -3260975, -1274149, 433752, 1697161, 1567622, -540177, -3349186, -4841986, -4298933, -2201425, 690833, 2932216, 2645184, -120930, -2763224, -3533963, -3781921, -4903752, -5391044, -3673549, -1636297, -1732217, -2427735, -655466, 2541431, 3453809, 2113444, 2234780, 4515075, 5063310, 1756108, -2485390, -4648191, -5654808, -7019985, -7196273, -4365297, -276770, 1780252, 1299560, 512136, 1230974, 3440753, 5838943, 6606296, 5022182, 3003488, 3103451, 4491237, 3751643, 722539, 106988, 5067924, 12239556, 15991298, 15291137, 13251091, 11786949, 10154351, 7713424, 4993817, 2490863, 868292, 1645323, 5177419, 8584710, 8354530, 4894033, 2204388, 2957543]
5875B957543K834629J735109j098471l077867k294673J070475M056978L447513
5867I631236j25442k652843k126397q70451j269542k055726j030509R12463J298813
5858A711602J43888l55085L87167N01398j062299k437539j151123K291575M434109
5849D463693K925582l26259j458430J34458J136001m41455k250894j938789j428893
5840H15014l189927m681641j681037L930534N569484J594509k303446j982929
5832a929439l13015q27285j452333Q43994L445243J843690k467978l728542o67729
5823e253394J983350J175433l08672P81456K699457J716723j650807k964769j75188
5814a996411L320915L196931o8195k171732j086516N86755J64616j039679m41300
$$ y = [2957543, 5792172, 7527281, 6428810, 3350943, 1056270, 2126745, 6183723, 9631236, 9505794, 6852951, 4726554, 3856103, 2586561, 530835, -499674, 412789, 1711602, 1855490, 1500405, 1887572, 2388970, 1326671, -1110868, -2261991, 29584, 4463693, 7389275, 7063016, 5604586, 5739044, 6875045, 6433590, 4182696, 2243907, 815014, -2374913, -7056554, -8737591, -4807057, 762427, 2356936, 53490, -1929439, -2242454, -3069739, -4522072, -3678078, -232835, 1610855, -857123, -4585665, -5253394, -3270044, -2094611, -2403283, -1621827, 1077630, 2794353, 1143546, -1821223, -1996411, 1324504, 4521435, 4453240, 2281508, 1194992, 1781747, 1946363, 906684, 465384]
5805D65384J191955J111565o19681j373729o01246m11291j234170q18135J416354
5796h72994K731467J408962n26765p93044j63223l46676j159123j702206j947316
5787c370918j499527N82732L118619K982680q6212k067317m29545K001782J847957
5778C080251M78249Q26537J901940R07230j274236j354779P89480K150108J509920
5769I014700M34895j47637p21983r62173j69751N31558k54704j165045j47185
5760F412675J294352J14270k525390k344104Q91381K393207k0974k242690l97379
5751C575348L142792L739323J358592m70314o08246j093664k596730k918394p84279
5742C344428J671093J694574m31279k070228j734661l37439Q70728J915321K919440
$$ y = [465384, 1657339, 2768904, 2149223, 775494, 174248, -237043, -1471213, -2289348, -872994, 1858473, 3267435, 2740670, 1947626, 1784403, 1437727, 278604, -1423602, -3370918, -4870445, -4287713, -1169094, 1813586, 1727374, -339943, -769488, 1232294, 3080251, 3558500, 4385037, 6286977, 7194207, 5919971, 4565192, 5354672, 7504780, 9014700, 9449595, 9301958, 8579975, 7617802, 7448051, 7979609, 7724905, 6559860, 6412675, 7707027, 7821297, 5295907, 2951803, 3843184, 6236391, 6215417, 3972727, 3575348, 6718140, 10457463, 11816055, 11345741, 10737495, 9643831, 7047101, 4128707, 3344428, 5015521, 6710095, 6278816, 4208588, 2473927, 2136488, 3007216, 4922537, 7841977]
5733G841977K797680P94069j464576j614462j86069j90603k466135l981172k262053
5724g31344P36596J374994o12290k225867j571593R1218M83006j054099k974654
5715f484033k887676j43218K687537K488759Q4210n11150J742675K913546M48552
5706C39202k116479m60090L484132M409500J551449j304642k477947l593865m414630
5697d583370k216114K541028N103892L089434O883k48363J304283J675685R47245
5688G620603J056073J719650J048723p11736j104253P51202K415630R77695l204078
5679A0569509o372017n273769j004757J987444J139094j402681k286332j503590
5671d147099j243246j678465j007581Q20908J631661N37203q20722r96168k93327
$$ y = [7841977, 10639657, 11433726, 9969150, 8354688, 8168619, 7978016, 5511881, 1530709, -731344, 5252, 1380246, 767956, -1457911, -3029504, -2938286, -2455280, -3509379, -6484033, -9371709, -9514927, -6827390, -4338631, -4254421, -4765571, -3022896, -109350, 339202, -1777277, -2237367, 1246765, 5656265, 7207714, 5903072, 3425125, -168740, -4583370, -6799484, -4258456, 845436, 3934870, 3941753, 3693390, 4997673, 6673358, 7620603, 8676676, 10396326, 11445049, 10733313, 9629060, 10380262, 12795892, 13773587, 10569509, 4197492, -1076277, -2081034, -93590, 1045504, -357177, -2643509, -4147099, -5390345, -7068810, -8076391, -7255483, -5623822, -5086619, -5907341, -6903509, -7196836]
5662g196836P47772K031753K713103J697823k05412q62037P6042P83821K32002
5653A8031o58310j011595r29590l30654R26527J833501J379745N00895M71994
5644B200544K95666j212885j975361M87695L594767K358635k347715l933974J74377
5635c58251M649566M422727J340265m68109r21590j762044k134089p40132P14720
5626D743063L27097l98695M69662J335169J8562j764611j045065J239262J892739
5617F817183P04386n8400j13788r88286k239902j924964m52678j67015j155866
5608D20670j116469K68437K90142k371269m869375l431165J871519O693011O581984
5599D337485J597590l321317l518238M386K234588J156365k0860J325936K977509
$$ y = [-7196836, -6449064, -4417311, -1704208, -6385, -211797, -1073834, -997792, -213971, 18031, -640279, -1651874, -2581464, -2912118, -1985591, -152090, 1227655, 1728550, 2200544, 2496210, 1283325, -692036, -204341, 3390426, 5749061, 3401346, -532628, -358251, 4291315, 8714042, 10054307, 9586198, 8664608, 6902564, 4768475, 4028343, 4743063, 5070160, 4671465, 5141127, 6476296, 6494858, 4730247, 3685182, 4924444, 6817183, 7521569, 7463169, 7349381, 6361095, 4121193, 2196229, 1743551, 1576536, 420670, -695799, -427362, -137220, -2508489, -7377864, -10809029, -8937510, -2244499, 4337485, 5935075, 2613758, -904480, -900094, 1334494, 2490859, 2469999, 3795935, 6773444]
5590F773444K007667j73304m99561N12450J70205j442819j894918p58433J42011
5581D836742J65576K42913M25789M3235m07864l06421p41906k390855l084361
5572a217152j029174J122167k26218l187270k572894J695466L833202R49293k610304
5563c242884j976990J440998K953230J396027l24305J02211J907335K863292J744098
5554F863012n49710j751531p37531Q27319O32087p92817p59397J296406K609771
5545G637609J009737k036584l576635k858477j525103j066978j301109j129679
5537d847219j34625Q28112Q97890Q57790K241578M383802M268329P08133l193610
5528F010180l823035j665323K81280J055820J606181J437732p68455l540657l459323
$$ y = [6773444, 8781111, 8607807, 8108246, 8620696, 8790901, 7348082, 5453164, 4694731, 4836742, 5002318, 5245231, 5671020, 5714255, 5306391, 4999970, 4258064, 1867209, -1217152, -2246326, -1124159, -1350377, -4537647, -7110541, -5415075, -1581873, -632580, -3242884, -5219874, -3778876, -825646, 570381, 246076, 348287, 2255622, 5118914, 6863012, 6313302, 4561771, 3824240, 4651559, 5283646, 4490829, 3731432, 5027838, 7637609, 8647346, 6610762, 3034127, 175650, -1349453, -2416431, -3717540, -4847219, -4981844, -4153732, -3255842, -2398052, -156474, 4227328, 8495657, 9203790, 6010180, 2187145, 521822, 803102, 1858922, 3465103, 4902835, 4134380, 593723, -2865600]
5519b865600o7805L374391M589751M498146M047424K289105r09888l202727k762643
5510H990154q58192K67921L85110O28132J290771J663774J123111m72262k548374
5501A0470145l595114k386397K33414J997881J824876N28767r20860k201115k742416
5492C209181j896791k62952P54617Q37225P39636O46141K70855J78355R13295
5483E389562J198349n74991l247181l918197k141343l76948R210L53035J655147
5474a653357K701523K287144J045530M0173n58537o98120k52632o8647j158500
5465A684577k491635j860775N79931K016450Q81643j194314k043381j411687o9314
5456c908505J424527K322579J911519P15381r4844n34330j330745k040733j782855
$$ y = [-2865600, -2933405, 440986, 5030737, 9528883, 13576307, 15865412, 14955524, 11752797, 8990154, 8131962, 8399883, 8784993, 9413125, 10703896, 12367670, 13490781, 13018519, 10470145, 6875031, 4488634, 4722048, 6719929, 8544805, 9073572, 8152712, 5951597, 3209181, 1312390, 1049438, 1804055, 2641280, 3380916, 4027057, 4297912, 4476267, 5389562, 6587911, 6012920, 2765739, -1152458, -3293801, -3670749, -3661539, -3308504, -1653357, 1048166, 3335310, 4380840, 4421013, 3862476, 3164356, 2911724, 2843077, 1684577, -807058, -2667833, -2087902, -71452, 810191, -384123, -2427504, -3839191, -3908505, -2483978, -161399, 1750120, 2465501, 2370657, 1836327, 505582, -1535151, -3318006]
5447c318006j269123j636178j999623r95522K31192j2271j14625K516716O077871
5438e19569O191051K834792K09727l96490j799189m302189m266233j008763J186424
5429a870439L85896N7531J803632J569732k728202n988701l611516Q93372J763477
5420g725218r1068j69748J466246J687911J034999K282373M156704K871525j080535
5411D433189l391195k561164j015544k68739K98987N05903l44380r80202p8266
5402c401411N26930j212146l025467j600616J214066J057908j249560q50677K642446
5393e898527M248385J954514k98223L55422J395541Q1158j918673j925799m94758
5384b500960N01146J062368J934813K585694K127686M47632k389933n695732o946227
$$ y = [-3318006, -4587129, -6223307, -8222930, -9218452, -8987260, -8999531, -9114156, -6597440, -519569, 5671482, 8506274, 8716001, 8319511, 6520322, 2218133, -2048100, -3056863, -1870439, -1484543, -1427012, 376620, 1946352, -781850, -6770551, -10382067, -9488695, -7725218, -7816286, -7986034, -6519788, -4831877, -3796878, -1514505, 2642199, 5513724, 4433189, 1041994, -1519170, -2534714, -2803453, -2504466, -1998563, -2342943, -3323145, -3401411, -2874481, -4086627, -7112094, -8712710, -7498644, -6440736, -7690296, -8540973, -5898527, -1650142, 304372, 6149, 361571, 1757112, 1838270, -80403, -2006202, -2500960, -1999814, -937446, 997367, 3583061, 5710747, 6158379, 3768446, -1927286, -8873513]
5375h873513m023686R37248L227130J647968m77727q07357m40939n3337J774409
5366g089804M486188M396625M57379k816623j600961J469472J648315o40767j346445
5357a036621J77981N19039j667941l230873j381207K091307L263548J129301j471056
5348a606522j512044P94231K581064J874806k36452j320365o30219N93929J207368
5339A745796J091189L43019p60259j018506O48839L116237L799933K042205N1247
5330A1059700k79055J47775n85516k428571l515969k736615j072069l46812j091035
5321h48167j934720j444049k88666l57534j484188j057394J808066L865982J922608
5312A81938k205884l993008k479551q44097j036970j453590m63691J048913J737509
$$ y = [-8873513, -12897199, -11959951, -8732821, -7084853, -7562580, -8369937, -8810876, -8864213, -7089804, -2603616, 1793009, 2250388, -566235, -2167196, -697724, 950591, 309824, -1036621, -858640, -339601, -2007542, -5238415, -6619622, -4528315, -1264767, -135466, -1606522, -3118566, -2324335, 256729, 2131535, 1895083, 574718, -55501, 538428, 1745796, 2836985, 3180004, 2419745, 1401239, 2050078, 5166315, 8966248, 11008453, 11059700, 10780645, 10928420, 10342904, 7914333, 4398364, 1661749, 589680, 242868, -848167, -2782887, -4226936, -4515602, -4873136, -6357324, -7414718, -5606652, -1740670, 181938, -2023946, -6016954, -8496505, -9340602, -10377572, -11831162, -12294853, -11245940, -9508431]
5303i508431J659463J017798m85892j937592j235744J791010M227644L403737
5295a068007l775l041253l326902n10974L390068M864925K108338k305258l988329
5286c881167k145102n906K81147J13553J007364K005370K124807K438044L553685
5277E491795L475598N36174l202128m042415j372429J663072J869678p82607l331950
5268C04788k815393K65321J822574r18673n001306n000771p10896K180816M19339
5259i454201j791747R01952O691670Q781885M699199o72868j839833O69274J980672
5250I966003n10514m178867m826718j894198J248874J897890J008844P16646Q73023
5241D300983J55358q94317p88680k04192j030511k636574k358282J50853K251881
$$ y = [-9508431, -7848968, -6831170, -7317062, -9254654, -10490398, -8699388, -4471744, -1068007, -1071782, -4113035, -7439937, -7950911, -4560843, 304082, 2412420, 107162, -3881167, -6026269, -6032175, -5751028, -5637475, -4630111, -2624741, -499934, 1938110, 5491795, 8967393, 9503567, 6301439, 2259024, 886595, 2549667, 4419345, 3636738, 304788, -2510605, -2245284, -422710, -1341383, -6342689, -11343460, -12054356, -9873540, -9454201, -11245948, -10343996, -3652326, 5129559, 9828758, 9155890, 7316057, 7985331, 9966003, 9455489, 5276622, 449904, -1444294, -195420, 1702470, 2711314, 3427960, 4300983, 4456341, 3562024, 2773344, 2569152, 1538641, -1097933, -3456215, -3305362, -1053481]
5232a053481K343108J446143N04801n83273r67560M54292J969540P75832j743114
5223C146288j285198J848543K169323j916559m503957j344390L136049L034883
5215D284982K39917K75828K627961K280299j136750k856044j175060L18050o72182
5206D187001j955871j481461l74748J84523J055029K389472K242043j93767k578476
5197C473745k354537J78953K749010L401864J483270j784590l486096j833149
5189A828470J107488J771279J21736m87185J244428K540887J179604r38905r38689
5180G429113N86655P75339j103220k808504k355433l39730J098780O21313j171825
5171B732488k469644k105734p91993j74146o33615p65868N12908K065837J763588
$$ y = [-1053481, 1289627, 2735770, 3240571, 2657298, 1689738, 2144030, 4113570, 4889402, 3146288, 1861090, 3709633, 5878956, 3962397, -541560, -1885950, 1250099, 4284982, 4524899, 4800727, 7428688, 9708987, 8572237, 5716193, 4541133, 4859183, 4187001, 2231130, 749669, 374921, 559444, 1614473, 4003945, 6245988, 6052221, 3473745, 1119208, 1298161, 4047171, 7449035, 8932305, 7147715, 3661619, 1828470, 2935958, 4707237, 4828973, 4341788, 5586216, 8127103, 9306707, 8367802, 7429113, 8015768, 8791107, 7687887, 4879383, 2523950, 2184220, 3283000, 3904313, 2732488, 262844, -1842890, -2634883, -2809029, -3442644, -4208512, -3695604, -1629767, 133821]
5162A33821m77221k097460j127030R21127J020408p91081j177148J328245L623055
5153A356716K678923M19281N45715K295302J821916r60472k006214k3344J493027
5144G620850M69943p42913o96986j720461m301256m072465J048982N597002M055391
5135G258087m08329j092553J607530K003171n33697j073109J340287J738046j727003
5126I112430m160550k170483N91004j45297k457696k158498L70048J754572J368565
5117B104095J174114J462660O99111j068120j896734r95586K76690N28343k17172
5108B067401j136205j401811n43013R63403J707024Q30710p35700j293237m80628
5099b2056K80814m44280k209477k916213j240430J464927K603573J658285O43184
$$ y = [133821, -343400, -2440860, -3567890, -2646763, -1626355, -2417436, -3594584, -2266339, 1356716, 4035639, 4454920, 5000635, 7295937, 9117853, 8157381, 6151167, 6127823, 7620850, 8090793, 7347880, 6650894, 4930433, 629177, -3443288, -2394306, 3202696, 7258087, 6849758, 5757205, 7364735, 9367906, 8834209, 7761100, 9101387, 10839433, 9112430, 4951880, 2781397, 3372401, 3227104, 769408, -1389090, -1019042, 735530, 2104095, 3278209, 4740869, 5439980, 4371860, 2475126, 1479540, 1756230, 2284573, 2067401, 931196, -470615, -1013628, -50225, 1656799, 2487509, 1751809, 458572, -22056, 258758, -185522, -2394999, -5311212, -6551642, -5086715, -2483142, -824857, -181673]
5090a81673Q41800J080496M11553K51213J662458K499505L36411k976510l136429
5081G88824N75911M335339M973534L147260R68936o31350j489646j658884j972621
5072I037303l069255l698029k389442o57078j319424l351529k296536K832340
5064d911650O910457N410799N96686k067691j299395k25213o40878r17006K63210
5055C119319J317036J98047k413479l778168k288969R35351L463769L935331K837773
5046G326010J296451k04245j614138k558650k625999k081725j427623m66749J227014
5037a129654K956526L056667P80611k500672m268003k975552M60411L080534K431811
5028A892679p96045l291096k767878l26121J397379J399711O72378K88939L84566
$$ y = [-181673, 660127, 1740623, 2152176, 2403389, 4065847, 6565352, 6901763, 3925253, 788824, 1364735, 5700074, 10673608, 13820868, 14789804, 14158454, 12668808, 11009924, 9037303, 5968048, 2270019, -119423, -776501, -2095925, -5447454, -7743990, -4911650, 1998807, 7409606, 8006292, 5938601, 4639206, 4413993, 3773115, 2856109, 3119319, 4436355, 4634402, 2220923, -1557245, -3846214, -2910863, 552906, 4488237, 7326010, 8622461, 8418216, 6804078, 4245428, 1619429, -462296, -1889919, -2356668, -1129654, 1826872, 4883539, 5664150, 3163478, -1104525, -4080077, -3619666, -539132, 1892679, 1096634, -2194462, -4962340, -5288461, -3891082, -2491371, -1818993, -1530054, -1145488]
5019a145488O58159R28413J285969J976024K713181K316572J50347k251274k660231
5010C971672j266571l07014m93423l25181O59458R29590J30807J9028R30731O41758
5000D890855j566338l106843k364353j278627j365766q53836J449978L158041
4992a036889K339052R08785O56664j84776k587189l150859L98158M018514K987827
4983D349287o49075j769298j17598J182264J908406L299412L245206l68555l974779
4974G105270k906910N04177N19046k370495k925675n79814N68688K4834J050789
4965I89910L167137K529586m46035j566045n54113n32099p43070J689865L778824
4956H313960J48487n939670n702049M98223K964306j146505l383774R05370M954236
$$ y = [-1145488, -487329, 441084, 1727053, 3703077, 6416258, 8732830, 8883177, 6631903, 3971672, 2705101, 2398087, 1904664, 1579483, 2238941, 3168531, 3299338, 3318366, 4249097, 4890855, 3324517, 217674, -2146679, -3425306, -4791072, -5644908, -4194930, -1036889, 1302163, 2210948, 2867612, 2682836, 95647, -3055212, -2657054, 1361460, 4349287, 3700212, 1930914, 1813316, 2995580, 4903986, 8203398, 11448604, 11080049, 7105270, 4198360, 4702537, 5221583, 2851088, -74587, -654401, -85713, -60879, 989910, 4157047, 6686633, 6240598, 4674553, 4120440, 3588341, 2845271, 4535136, 8313960, 8462447, 2522777, -3179272, -2681049, 283257, -863248, -4247022, -3341652, 1612584]
4947A612584L172052L20852J685015L830588K262846j24830N70716J764455J23309
4938A5217587j782262r56109J12620j055600j735053l362M26167k737740m780051
4929B706197j649244K635887K486116o13066j874003q32521J47234N31734L41814
4920C880148j258960k794586j153255K179906K111589q48507m56659L944387N474446
4911A1078509K038294N3130K101617K276244j516164k764145O38175J449680k511581
4902A2843759k762986L539846O249913K14905m313731K45142N390637K951584
4894B4359069l46738K308975L912559j309675m590357N99699M728034R11566m65194
4885C0107938O882962R373600p48899o380151L978069J1664161K678413j001978
$$ y = [1612584, 4784636, 5105488, 6790503, 10621091, 12883937, 12759107, 13329823, 15094278, 15217587, 13435325, 12479216, 12591836, 11536236, 9801183, 9797821, 10223988, 7486248, 2706197, 1056953, 3692840, 6178956, 5565890, 3691887, 2859366, 3006600, 3538334, 3880148, 2621188, -173398, -1326653, 853253, 2964842, 2116335, 1659676, 5604063, 11078509, 13116803, 13169933, 15271550, 17547794, 16031630, 13267485, 13905660, 15355340, 12843759, 10080773, 13620619, 19870532, 20085437, 15771706, 16016848, 21407485, 24359069, 24012331, 26321306, 30233865, 28924190, 24333833, 24933532, 29661566, 30573132, 30107938, 36990900, 46364500, 45615601, 39235450, 43213519, 54877680, 57556093, 56554115]
4877E6554115J8107982L2086355J7091740J3167492O4375263J17001655O7016692
4870C85401294p9296827j82146416j44555993l5064583K0312712K754982j4499676
4863d7094507J893139J4963509K519761p985566K156100J1857546M205806n391949
4855b2876161k364979K895213L33415j195368M327037O130257j663704p267482
4847b1681772k678077K534636K47203k313670J487858N251386L396731J512316
4839a2243389L265088K170545m330191p243491j756468L363003J394085q12660
4831a6193478L282367P295840L838896k143764k742613k29452m81292j644270
4823i017766O35867L755626L176005Q70708O99129J085652m54521j259449J105748
$$ y = [56554115, 74662097, 106748452, 123840192, 137007684, 201382947, 318384602, 385401294, 306104467, 123958051, -20597942, -55662525, -35349813, -32594831, -47094507, -45201368, -30237859, -27718098, -35703664, -33547564, -21690018, -17484212, -22876161, -25241140, -22345927, -22012512, -23207880, -18880843, -12750586, -14414290, -21681772, -24359849, -21825213, -21578010, -23891680, -22403822, -17152436, -13755705, -12243389, -8978301, -6807756, -11137947, -18381438, -20137906, -16774903, -15380818, -16193478, -12911111, -5615271, -1776375, -3920139, -6662752, -6892204, -7373496, -9017766, -8381899, -4626273, -1450268, -579560, 119569, 1205221, 750700, -508749, 596999]
4814E96999K975093O34611l005476l771257k931706k918754j964056J188251K774556
4805f421739K79065j947787N76540M810023N193784K026099q00994k341626l409604
4796b036239k731875L25055K576521J454860n98049m37301O87879N36237M82566
4787B59654K196846L391137J573998j163929j589743n95867q34180j917772j994789
4778f74645j499981j657439j693099p17467J26564O424j0662J50479j219500l330680
4768a0520006k302840K359712N499261L879561J127689J200595J960777Q0860
4760C285609k346869j797509j03428j159919l603961k901950Q98830L158094J657608
4751b913495j099672k279713j592828k7073J299096J316834J01043r54026j269961
$$ y = [596999, 3572092, 4206703, 1201227, -2570030, -5501736, -8420490, -10384546, -9196295, -6421739, -6142674, -8090461, -7513921, -2703898, 2489886, 4515985, 3714991, 1373365, -2036239, -4768114, -4443059, -1866538, -411678, -1009727, -1447028, -759149, -222912, 259654, 2456500, 5847637, 7421635, 6257706, 4667963, 4072096, 3237916, 1320144, -674645, -2174626, -3832065, -5525164, -6242631, -6116067, -6109643, -6120305, -5969826, -7189326, -10520006, -12822846, -10463134, -4963873, -1084312, 43377, 1243972, 3204749, 3285609, 938740, -858769, -962197, -2122116, -5726077, -8628027, -7729197, -4571103, -2913495, -4013167, -6292880, -7885708, -7912781, -6613685, -5296851, -5195808, -6149834, -7419795]
4742g419795j719171k198537j208290J002178K066438J537934J533514K032925
4734d372804K51377l335590l819943K04493L175303J158334j630639j09487K994791
4725e484165K123186j484943k121733R92178L347966K689351R47886l06258j086442
4716c82974o86919J106748J795084l41319k278347n89710K221116J215154k752468
4707f93635m262799j890593N70888J229942K278736M328735M410545J431163j178554
4698F224428n53088J480335J585802l48403j620309m05018K101629K638409p26679
4689A0377106n507663o615960k555132K356967L823664K829396K298528J694398
4681H701304q54365l575760l218842p20883K14972p55340p11421J028353K298531
$$ y = [-7419795, -9138966, -11337503, -12545793, -11543615, -9477177, -7939243, -6405729, -4372804, -4121427, -7457017, -11276960, -11072467, -7897164, -6738830, -8369469, -8478956, -5484165, -3360979, -4845922, -6967655, -5975477, -2627511, 61840, 1009726, 703468, -382974, -1069893, 36855, 1831939, 1490620, -787727, -1377437, 843679, 2058833, -693635, -4956434, -6847027, -6276139, -5046197, -2767461, 1561274, 5971819, 7402982, 6224428, 5671340, 7151675, 8737477, 8389074, 6768765, 6363747, 8465376, 11103785, 10377106, 4869443, -1746517, -4301649, -1944682, 1878982, 4708378, 7006906, 8701304, 7846939, 4271179, 1052337, 331454, 546426, -208914, -920335, 108018, 2406549]
4672B406549K493824K758377K132302j348476n577247n721120j519736J780397
4664b595130J112477o01908j80827Q39398l24666k794584l649875k240888l48143
4655a0784146N65204M39289r1496l83725l80478o88449j350126j288035k15733
4646a4177695K50743o65817p72576J651469L995864K673495q75764j937062K36654
4637i620689J691361N75801k16515J451105L252968K384797j60044j577193r73256
4628c191665P71557K660050L485350K065129r31799k963418k525379p59584M09148
4619i80611L14422n47559j191113p06531N02745O66338n77524o85026K076796
4610a128063M930209L992224K61488j763497q41605m4821j086528k068804j555339
$$ y = [2406549, 4900373, 7658750, 9791052, 8442576, 2865329, -2855791, -4375527, -2595130, -1482653, -2084561, -2265388, -1425990, -1750656, -4545240, -8195115, -10436003, -10784146, -10218942, -9779653, -9871149, -10254874, -10635352, -11323801, -12673927, -13961962, -14177695, -13926952, -14592769, -15365345, -13713876, -9718012, -7044517, -7920281, -9857343, -9620689, -7929328, -7353527, -7570042, -6118937, -2865969, -481172, -641216, -2218409, -3191665, -2420108, 239942, 3725292, 5790421, 4858622, 1895204, -630175, -1389759, -980611, -666189, -1213748, -2404861, -3111392, -2608647, -1942309, -2519833, -3204859, -1128063, 3802146, 7794370, 8055858, 6292361, 5450756, 5405935, 4319407, 2250603, 695264]
4601F95264o99449k88601N23616J526351J134237l43329p53427j37168p85302
4592H72192k529401k385028l7900R98564n98659j551152J24643J516675J20190
4583c469876j582268m86753J784091J823195n4140j074452o63306l13170l96380
4574d433059j87219J67220J28917R291l2261o10610j325903n57349J463692J985692
4564c391589r8732k181991j972141o89192j08752M92544J915354K569684J246742
4555b218073l16596k89292N18669J092285K089190K769726J14480n537607q226287
4546a0003505m274254J438538K383635J4344L02193L511980M565125K149553J89352
4537B76961L82859J45239j348877j575593m31928j389598m767809n544875q52918
$$ y = [695264, -4185, -292786, 230830, 1757181, 2891418, 2548089, 1794662, 1657494, 872192, -1657209, -4042237, -4080137, -3081573, -3680232, -5231384, -5106741, -3590066, -3469876, -5052144, -5538897, -3754806, -1931611, -1985751, -3060203, -3723509, -4036679, -4433059, -4620278, -4453058, -4324141, -4314850, -4347111, -4957721, -6283624, -6840973, -5377281, -3391589, -3490321, -5672312, -7644453, -8333645, -8442397, -7949853, -6034499, -3464815, -2218073, -2534669, -2823961, -2305292, -1213007, 876183, 3645909, 3760389, -1777218, -10003505, -14277759, -12839221, -10455586, -10441242, -10139049, -6627069, -2061944, 87609, 276961, 659820, 805059, -543818, -2119411, -2551339, -3940937, -8708746, -14253621, -15106539]
4528a5106539M998314O257445K924962p75142k147927j430396K28716J692464
4520c358103K294305K765112L980766M399178J644918k763220m033490q92015
4512D037451K119312J251146j352669j946870j004474j180167k285904k237910
4504b600085j101328m59777j74467P62768J399614K78890j335639j120457L32012
4495d018469P34164M68101J699363L415790J895999k910258n725944k790483K857580
4486d374157N423645L327093l87034k773610l327167k533628q12566R59090J738505
4477b759829J569821J441061J659842J278666n02155k882346l863057k264058
4469f322055O50463K083972Q83369p60907r0199K087766K080983j406588m955687
$$ y = [-15106539, -10108225, -3850780, -925818, -1700960, -3848887, -5279283, -5050567, -3358103, -1063798, 1701314, 5682080, 10081258, 11726176, 8962956, 4929466, 4037451, 6156763, 7407909, 6055240, 4108370, 3103896, 1923729, -362175, -2600085, -3701413, -4161190, -4335657, -3572889, -2173275, -1894385, -3230024, -4350481, -4018469, -3284305, -2816204, -1116841, 2298949, 4194948, 1284690, -4441254, -7231737, -4374157, 1049488, 4376581, 3989547, 1215937, -2111230, -4644858, -5457424, -4498334, -2759829, -1190008, 251053, 1910895, 3189561, 2687406, -194940, -4057997, -6322055, -5671592, -3587620, -2704251, -3465158, -3555357, -1467591, 613392, -793196, -5748883]
4460e748883m789335j498063J527614K710877K813545K084323O0474k018600j794977
4451f653025N65394K046135J058290m54675l67874O70964J263506J824162K898230
4442B851107K996419R25133j191951m52391J968701J953105j338357l755506j966696
4433A989564J791635K886814M46561k099031j941100Q739J288982J250453R74824
4424F597441Q19147j52785k039915l060809j903451k9024K18127p78972n65034
4415h95275J102426J534588l66036j987263j401343q16733k523146m048067j699026
4406a1099875K679581L637894N80491j087417J531325M345194K916838p87284
4398B716747j963951j34236J347844R33849m4305q25006j864236k444783j244525
$$ y = [-5748883, -10538218, -12036281, -10508667, -7797790, -4984245, -2899922, -2839448, -4858048, -6653025, -6087631, -4041496, -2983206, -3437881, -3805755, -3134791, -1871285, -47123, 2851107, 5847526, 6772659, 5580708, 5128317, 7097018, 9050123, 7711766, 3956260, 1989564, 3781199, 6668013, 7114574, 5015543, 3074443, 3083182, 4372164, 5622617, 6597441, 7416588, 7263803, 5223888, 2163079, 259628, 230604, 448731, -330241, -895275, 207151, 1741739, 1375703, -611560, -2012903, -2829636, -5352782, -9400849, -11099875, -8420294, -4782400, -4201909, -5289326, -3758001, 587193, 3504031, 2716747, 752796, 618560, 1966404, 2900253, 2855948, 2030942, 166706, -2278077, -3522602]
4389c522602N90250L21067j810294k065079J437338N497931N789435K174263j804825
4380F607484l450836l010158j999659j369028j329587j572216j323034r0650J386615
4371f151069J679515M25522j092462j459429o47159M11167J177416J659847J524528
4362b472124J71127j929395k873034j219473J989610L982959L255467J221537
4354B126674M34495J488057K378124J151009j420449k570921q56173K169767L894807
4345H795390L323446J202331j412628l482089l781591k107039k59917q3150r10534
4336A284219r83511q69953k518076m787334l659397J547424N678258M169007o42949
4327g82312k796496m87511K667987L003497L55961l083302m758241l097838P61502
$$ y = [-3522602, -2932352, -2611285, -4421579, -6486658, -5049320, 448611, 6238046, 8412309, 6607484, 3156648, 146490, -1853169, -3222197, -4551784, -6124000, -7447034, -7537684, -6151069, -4471554, -4046032, -5138494, -6597923, -7245082, -6833915, -5656499, -3996652, -2472124, -2300997, -4230392, -7103426, -8322899, -6333289, -2350330, 905137, 2126674, 2561169, 4049226, 6427350, 7578359, 6157910, 3586989, 2730816, 4900583, 8795390, 12118836, 13321167, 11908539, 8426450, 4644859, 2537820, 2277903, 2194753, 1284219, 300708, -569245, -3087321, -7874655, -11534052, -9986628, -4308370, -139363, -782312, -3578808, -4066319, -1398332, 1605165, 1961126, -1122176, -5880417, -8978255, -8216753]
4318h216753L210140K205057L3062j56390R98533Q05276o58400j126607n25031
4309c431113p59297j623914j054251O12430Q55649k31174K96419K849634M025833
4300A540216K110506k53457p02404n39806j247597j289445P59341K886617K493917
4291E757888K86968j501105k706443m141686m695177k808019Q0938P51685j154508
4282a0129459k337349l07436L265642M766567L106940N90216n40253q08192j651978
4273d045302k255745p77643J656323J669908p90713j500354J381043L780987K136585
4264A255089o49427j96367J925380J306797j494590k441854j351651j271387j947846
4255d865856o44752J517764J037108q52631J05190K783683J939762k013503l042197
$$ y = [-8216753, -5006613, -2801556, -2768494, -2924884, -1926351, -1121075, -1779475, -2906082, -3431113, -4190410, -5814324, -6868575, -6256145, -5400496, -5631670, -5335251, -2485617, 1540216, 3650722, 3397265, 2694861, 2155055, 907458, -381987, 377354, 3263971, 5757888, 6044856, 4543751, 1837308, -2304378, -6999555, -9807574, -9726636, -8974951, -10129459, -12466808, -12774244, -9508602, -4742035, -1635095, -1044879, -1585132, -2393324, -4045302, -6301047, -7078690, -5422367, -3752459, -4543172, -6043526, -4662483, -881496, 1255089, 605662, 409295, 2334675, 3641472, 2146882, -294972, -1646623, -2918010, -4865856, -5510608, -3992844, -2955736, -3808367, -3703177, -919494, 1020268, -993235, -4035432]
4246d035432j56543R09211j609088k371151P64808K472589l01214l028322k217791
4237i572933r85391j596834p87339K656806L907115Q50410j320810M24119J325345
4228e099512j609956l199429J98610L229400J073614j900513o70720J397279K9715
4219f551512j392842J043393L846437L271091K337982L052904Q57433n079172
4211A385714o617217q29979K347212k831032o311114l35812M940115n62460p417726
4202a6232299l478141L776277K255065j394737L112444N887191m242957j2294186
4194b2611343k617836L199985k1337277m6454247j4147537O5310912J05112106
4187F6454763N6421408k1640519m5133374j4493901Q213479j513935j2499243
$$ y = [-4035432, -4191975, -3282764, -4891852, -7263003, -6498195, -4025606, -4326820, -7355142, -9572933, -10558324, -12155158, -12942497, -10285691, -6378576, -5528166, -6848976, -6424857, -5099512, -6709468, -9908897, -9710287, -6480887, -5407273, -7307786, -7978506, -6581227, -6551512, -7944354, -6900961, -3054524, 216567, 2554549, 5607453, 6464886, 1385714, -5231503, -6061482, -3714270, -6545302, -12856416, -13192228, -8252113, -8814573, -16232299, -19710440, -15934163, -13679098, -15073835, -11961391, -6074200, -10317157, -22611343, -25229179, -22029194, -43366471, -89820718, -103968255, -38657343, 66454763, 122876171, 101235652, 56102278, 41608377, 49821856, 48307921, 35808678]
4180C5808678m871161K623667l798757r233588k548328L251929k380310q469115
4172A0383015m237377K611729K593124N74010K789502L893634j004992m922560
4164A2680085r96608N135918N064535M37125k629185l664625m610392l862073
4156G554780n01599J872298J174349O75665K382336K915576P4935k790358k736655
4147A0621327j521739q56391M62777K079818J247275j234886j149764J033835
4139A0682252r7496m684618n614812k14585M581525L240607k49748n65863J27061
4130G204323k213452n246640m277749k06757K382752J863067j58466k054073k184942
4121d891937Q56022N055528N756446K142917j166491j197638m96487j555182k646583
$$ y = [35808678, 30937517, 33561184, 29762427, 20528839, 17980511, 21232440, 18852130, 10383015, 6145638, 8757367, 11350491, 11924501, 14714003, 18607637, 17602645, 12680085, 11683477, 16819395, 21883930, 22321055, 19691870, 16027245, 11416853, 7554780, 7053181, 8925479, 10099828, 10775493, 13157829, 16073405, 16148340, 13357982, 10621327, 9099588, 8243197, 8705974, 10785792, 12033067, 10798181, 9648417, 10682252, 10584756, 5900138, 285326, 70741, 4652266, 7892873, 7643125, 7077262, 7204323, 4990871, -255769, -4533518, -4740275, -2357523, -494456, -652922, -2706995, -4891937, -4035915, 1019613, 6776059, 8918976, 7752485, 6554847, 6058360, 4503178, 1856595]
4112A856595k140469j769254k452010j964338J44248O56099j065295o64448L583091
4103c815781O600146M489917J039014R98042K078021l07274m544951n482317k658287
4094a603470P4876J053998J601189J950896J160511l3445j17420N71169J028602
4085E686906J626401K375413J578533r91196k262388k45730K460240K641977J178261
4076A4048417N37557L67066q79047k350566k351786j425450q33492r8068J179536
4067H194167J464045o469j200745o18032J54310k20997j87864J110090J133654
4058I822159j689475m314016l621691j462424j173856k100055j784449p60050
4050g083857o88687k95469K187505M675733L976986J121807m83999o02666j420637
$$ y = [1856595, -283874, -2053128, -4505138, -6469476, -6325228, -5669129, -6734424, -7398872, -3815781, 2784365, 7274282, 8313296, 9311338, 11389359, 11082085, 6537134, 1054817, -1603470, -1528594, -474596, 1126593, 3077489, 4238000, 4204555, 4087135, 4658304, 5686906, 7313307, 9688720, 11267253, 10276057, 8013669, 7767939, 10228179, 12870156, 14048417, 14585974, 14953040, 14073993, 11723427, 9371641, 7946191, 7112699, 7014631, 8194167, 9658212, 9651743, 8450998, 7832966, 7987276, 7766279, 7578415, 8688505, 9822159, 8132684, 3818668, 196977, -1265447, -2439303, -4539358, -6323807, -7083857, -7772544, -8068013, -5880508, -1204775, 2772211, 3894018, 3410019, 2807353, 1386716]
4041A386716k645208j873002Q18674K593948J862588l85944k475502k836796l94567
4032c949093L341403M420355J247433k817152m034573k837623j354931K09629
4024e774552J609914P29547k402069l495681l06397K699374R64835k618220k549354
4015a1142603L61101J429003N65302J191462K784002J945114l02114K77445L157141
4006B65853L580402J056009R3352J882159K320461m38691l106333l447220l134418
3997i28426k859415p61065K436303K827636R4723r97594J651841L977957K817164
3988H259124Q44634J044751J478886m59415l022616l443457k568787k304543j841383
3979b012806k17780N43319j206201k987331j714669J322075K736342K247543J850647
$$ y = [1386716, -1258492, -3131494, -2312820, 281128, 2143716, 1757772, -717730, -3554526, -3949093, -607690, 3812665, 5060098, 2242946, -1791627, -4629250, -5984181, -5774552, -4164638, -3435091, -5837160, -9332841, -9639238, -6939864, -5975029, -8593249, -11142603, -10781502, -9352499, -8787197, -7595735, -4811733, -2866619, -3168733, -2891288, 265853, 3846255, 4902264, 4995616, 6877775, 9198236, 8759545, 5653212, 2205992, -928426, -3787841, -4548906, -2112603, 715033, 809756, -187838, 1464003, 5441960, 8259124, 9103758, 10148509, 11627395, 11167980, 8145364, 4701907, 2133120, -171423, -2012806, -2230586, -1687267, -2893468, -5880799, -7595468, -6273393, -3537051, -1289508, 561139]
3970E61139J528825k48613k692775l064570p97463J564412J748472J51462j201453
3961b450564q24883R31235K128718J424421Q3668L22182J667879J448949o24137
3952D107468j524547J15310J450950R2600j830454j330919L86224L06966q54141
3943I19457J74800L223669M225792J389006j916622k052421j13000K20510j759471
3934D311720k900060p36783L064484M753328K970456j26920j963476k262383k166456
3925D943910k149170k063343k168621k496910j966214R2189K119956K046088M29736
3916a212379l12063L51207N81886k94957m61236J172143K751539K082134j52278
3907D505996j433020p75866L57465K12041j123452j906866r63728N75187O38641
$$ y = [561139, 2089964, 1841351, -851424, -3915994, -4713457, -3149045, -1400573, -1249111, -2450564, -3275447, -2344212, -215494, 1208927, 1292595, 1614777, 3282656, 4731605, 4107468, 2582921, 2698231, 4149181, 4241781, 2411327, 1080408, 1466632, 1773598, 919457, 1094257, 4317926, 8543718, 9932724, 8016102, 5963681, 5850681, 6071191, 4311720, 1411660, 674877, 3739361, 8492689, 11463145, 11336225, 9372749, 7110366, 4943910, 2794740, 731397, -1437224, -3934134, -5900348, -5808159, -3688203, -1642115, -1212379, -1524442, -1173235, -591349, -886306, -1347542, -175399, 2576140, 4658274, 4505996, 3072976, 2297110, 2654575, 2866616, 1743164, -163702, -1127430, -552243, 86398]
3898H6398o10388p49422Q62338J425763q06781k855179j238518K033858K117949
3889B66018r86102k420089k67190J816408J012503n63652l50880N04008K93181
3880f95795K24055J515668K222644M53652j794847j569963K80327P74864l36560
3871A074045q16800L9199Q89372J156494J371226J179973j72646j608099j142412
3862A970352Q56385J754739L77595j428874j569527l47800M96577K53817j91621
3853B171643J60076J067140J356001M40197r16103j644840j571795r28419M19656
3844E53556J999747J996655n02394l249776l333249j494364r64144k094191j786110
3835h874270J032144L272908K652291J083202Q54323R17166j20153m86930J621517
$$ y = [86398, -523990, -1273412, -411074, 1014689, 207908, -2647271, -3885789, -1851931, 266018, -720084, -3140173, -3407363, -1590955, -578452, -1142104, -1492984, -988976, -695795, -471740, 1043928, 3266572, 3720224, 1925377, 355414, 635741, 1410605, 1074045, 257245, 296444, 1185816, 2342310, 3713536, 4893509, 4720863, 3112764, 1970352, 2826737, 4581476, 4959071, 3530197, 1960670, 1612870, 2109447, 2363264, 2171643, 2331719, 3398859, 4754860, 5195057, 4278954, 2634114, 1062319, 133900, 553556, 2553303, 4549958, 4047564, 797788, -2535461, -4029825, -4993969, -7088160, -8874270, -7842126, -4569218, -1916927, -833725, 20598, 937764, 817611, 330681, 1952198]
3826A952198L852454K675187r39088k724632j188262J125421J980669J642964
3818H376911P80703o16376j789788j395863J88689Q80701j69958j385672j021486
3809C847861P53502K375829K461632Q68160r87553j323682l17939k30823k057612
3800E389375l510882k256166K12454O12712r77914j140246J534217M101913L385724
3791G351187J54713k354547k609202j783232j220559n13916J363307L718490M103667
3782H209908J342460k161385k784798l64648J520212O11486j081022j007061l29816
3773C955336j603182l820898l479956l27756J676070J76582j956557q94176K424004
3764c850533L577992R61884j943533j327659J903523L604490K062328j23832k96407
$$ y = [1952198, 5804652, 8479839, 7540751, 4816119, 3627857, 4753278, 6733947, 8376911, 9157614, 8541238, 6751450, 5355587, 5544276, 6424977, 6255019, 4869347, 3847861, 4601363, 6977192, 9438824, 10306984, 9319431, 7995749, 7677810, 7446987, 5389375, 1878493, -377673, -165219, 447493, -530421, -1670667, -136450, 3965463, 7351187, 7505900, 5151353, 2542151, 758919, -461640, -975556, 387751, 4106241, 8209908, 9552368, 7390983, 4606185, 4241537, 5761749, 6373235, 5292213, 4285152, 3955336, 2352154, -1468744, -4948700, -5276456, -3600386, -3423804, -5380361, -6274537, -3850533, -272541, 689343, -1254190, -2581849, -678326, 2926164, 4988492, 4864660, 4568253]
3755D568253N08795p1327j420711j027265Q09125R23844j469309l011919j356372
3746a546886J041071Q23348j080634j402361k9293J28263j662849k451906j22955
3737f304202L246101M012702J426251j951508l508553k988265j681746k40242
3729g989462J828736M501450O135321N032176J700260j499946k761546j975225
3721D971764o4935J454962R01947j747011l862529l003677l30269J067102O41344
3712B8698L16823M23803o55436k594854k795702p45223J111852J757199K760131
3703c92709M009806K996828L9685q84352J001164R69986l189251o276677l509086
3694e234606J564841K563823k35046j878173j003958J04604J222120L576849N346886
$$ y = [4568253, 5077048, 5005721, 3585010, 2557745, 3366870, 4290714, 2821405, -190514, -1546886, -505815, 317533, -763101, -2165462, -2194755, -2066492, -3729341, -6181247, -6304202, -3058101, 954601, 2380852, 429344, -3079209, -6067474, -7749220, -7989462, -6160726, -1659276, 4476045, 9508221, 11208481, 9708535, 6946989, 4971764, 4906829, 6361791, 7263738, 5516727, 1654198, -1349479, -1679748, -612646, 28698, 345521, 769324, 113888, -2480966, -5276668, -6021891, -4910039, -3152840, -392709, 3617097, 6613925, 6653610, 5769258, 6770422, 7740408, 4551157, -1725520, -5234606, -3669765, -1105942, -1340988, -3219161, -4223119, -4118515, -2896395, 680454, 6027340]
3685F027340L912226J180127P81489J525271j66355k905546k395604J85314n23287
3676G620975m359883n043410m91020L743057L443593J189807J68425q33309k810153
3667B628082k955174J08476K500134Q98362j869904j439685J189585J763121n26381
3658B296616k514435j983742L8957J261892M85900j390742k004480l11527J481027
3649b640534Q61638q25714m11603J581227J746775r8901o94796M18554J40202
3640G6848j630159r79998K351030K896075j542098n158369k951845J426321J972421
3631c539774m89545j402520o02400q39524j263764Q88235L988918L823046P19929
3622A282601r65412n1357J91122j951700m096555l696285p63460L370920O693381
$$ y = [6027340, 9939566, 11119693, 11901182, 13426453, 13260098, 10354552, 7958948, 8144262, 7620975, 3261092, -1782318, -2273338, 1469719, 4913312, 6103119, 6271544, 5438235, 2628082, -327092, -218616, 2281518, 3179880, 1309976, -129709, 1059876, 2822997, 2296616, -217819, -2201561, -2162604, -900712, -414812, -1805554, -3810034, -4121561, -2640534, -1778896, -2604610, -3016213, -1434986, 311789, 212888, -481908, -63354, 76848, -1553311, -2533309, -182279, 2713796, 1171698, -3986671, -6938516, -5512195, -3539774, -4029319, -5431839, -6034239, -6873763, -8137527, -7249292, -3260374, 562672, 1282601, 317189, 265832, 456954, -1494746, -5591301, -9287586, -10051046, -6680126, 13255]
3613A3255O453096K023930k758678l652829j634160p93294j697667j346826P71457
3604b621716J575522q9883j448335o08183N52161p7508j677686k501956k337705
3595i235289j525798P7033J831303K163203R14529m8811L66877Q90438J45951
3586d420564j141808j346740j12282J647712K995734L461275K914695J488334
3578E486356n06593k422800l036564j502103R79426J891371P28471q8067J059926
3569B589423K299307J275160j027285k006942j470977j127119j266579r38185
3561a673197n37525j160871j959080j132989Q14572J699020J193908R20530J312478
3552e23154J237721M90176j47008r57241k471573l090069q92816K407534K989760
$$ y = [13255, 6466351, 8490281, 5731603, 2078774, 444614, -348680, -2046347, -3393173, -2621716, -1046194, -1136077, -2584412, -3192595, -2640434, -2717942, -4395628, -6897584, -9235289, -10761087, -10684054, -8852751, -6689548, -5775019, -5823830, -5456953, -4566515, -4420564, -5562372, -6909112, -7021394, -5373682, -2377948, 1083327, 3998022, 5486356, 4979763, 2556963, -479601, -1981704, -1002278, 889093, 1617564, 1529497, 2589423, 4888730, 6163890, 5136605, 3129663, 1658686, 531567, -735012, -1673197, -2210722, -3371593, -5330673, -6463662, -5649090, -3950070, -2756162, -1835632, -523154, 714567, 1204743, 1057735, 100494, -2371079, -5461148, -6353964, -3946430, -956670]
3543i56670O10112r45290L04509J938893J455074k28487j031702o04347M19974
3534I62066J582819J965307P89753o65925l74348Q24867J03189k345169k988787
3525a46228p69801R16899k7716q02552J375216M438357M956498L396529K185973
3516A5523175J069748j492934m085258l786194j078457N80623j20511j085465
3508E524727p57601j74245n24981j259517j417167r48390j68044N85787N67555
3499A428124n88952j696594j224453L48203J088850N55968L24716J231889J938714
3490C406465J026068r06336k166305k057137j286842r42930j563319k708106l196513
3481a0394955k265452n17465Q41269J467887J766921J693939R66172L04497Q47768
$$ y = [-956670, -346558, -1291848, -987339, 951554, 2406628, 2178141, 1146439, 542092, 962066, 2544885, 4510192, 5299945, 4634020, 4259672, 5084539, 5187728, 2842559, -146228, -916029, 870, -26846, -829398, 545818, 4984175, 9940673, 13337202, 15523175, 16592923, 15099989, 11014731, 7228537, 6150080, 6730703, 6610192, 5524727, 4767126, 4592881, 4067900, 2808383, 1391216, 442826, 274782, 860569, 1428124, 839172, -857422, -2081875, -1733672, -644822, -88854, 235862, 1467751, 3406465, 4432533, 3526197, 1359892, -697245, -1984087, -2927017, -4490336, -7198442, -10394955, -12660407, -13177872, -12336603, -10868716, -9101795, -7407856, -6441684, -6137187, -5289419]
3472e289419K100877K219170R38414L18583J413669K138705M35800j949478j598024
3463G28297J287835K790442R29486j543611j470160K7782m83255l471035n671971
3454f876190m329201k44956L504287M504775K626249j18640j307905n09500M17125
3445b333956R2261m44308Q7065N18716q88011k810777k142962J155467L514166
3436c252339K624456J08861j452173j515941o74383N97716J159476k33241k343729
3427d981297k103598P71583K678777J370588o65079k89654J657431K448706J644578
3418B532035L73879j182309k641946k099737Q25567K852854J429381r03382l82665
3409H03677J838724J949937K41469L96621K602000K717477r65592m779309m932794
$$ y = [-5289419, -3188542, -969372, -30958, 287625, 1701294, 3839999, 4275799, 2326321, 728297, 2016132, 4806574, 5736060, 4192449, 2722289, 2750071, 2266816, -1204219, -6876190, -11205391, -11450347, -7946060, -3441285, -815036, -933676, -2241581, -2751081, -2333956, -2241695, -2686003, -2598938, -2080222, -2968233, -5779010, -7921972, -6766505, -3252339, -627883, -519022, -1971195, -3487136, -4161519, -3563803, -2404327, -2637568, -4981297, -7084895, -6313312, -3634535, -2263947, -2929026, -3218680, -1561249, 887457, 2532035, 2905914, 1723605, -918341, -3018078, -2192511, 660343, 2089724, 1186342, 803677, 2642401, 4592338, 4833807, 5230428, 7832428, 10549905, 9584313, 4805004, -127790]
3400a27790k133427M54631J019464k84038k152557k704497j134491R17135J335850
3391d809720L78651l96200r09501j695561j620145L38738K335757K252256J628575
3382b497150K899878M219906K050816k151315l495805j455505j18918o73990j87020
3373a409103J443893M32607l177093l908802O8462L096037J111896j863430j030162
3364e235695J344555R94522n37054M89539K528012J575363j165693j049953J997204
3355I40800L268837O59311k792675l739542j896079J201444L395457K467652j276965
3346B228240l817419j959897J931664K937520J92224k886356l917803l439983
3338h731810k085137M02757L160266M221093L009891Q89174o46284q46319L53338
$$ y = [-127790, -2261217, -1806586, -787122, -1071160, -3223717, -5928214, -7062705, -6145570, -4809720, -4431069, -4827269, -5736770, -7432331, -9052476, -8713738, -6377981, -4125725, -2497150, 402728, 4622634, 6673450, 4522135, 1026330, -429175, -548093, -1222083, -1409103, 34790, 467397, -2709696, -6618498, -6550036, -3453999, -2342103, -4205533, -5235695, -3891140, -2896618, -3433672, -2944133, -416121, 1159242, -6451, -1056404, 940800, 4209637, 4868948, 2076273, -1663269, -3559348, -2357904, 1037553, 3505205, 2228240, -1589179, -3549076, -1617412, 1320108, 1512332, -1374024, -5291827, -8731810, -10816947, -10414190, -7253924, -3032831, -22940, 866234, 219950, -626369, -273031]
3329b73031J747341J502475j23134n12603J215622K256927M63205k007270k173884
3320B095648q08978l59588p28504n67710m70379j247220j276349O29040K009367
3311g24673N01076j526681n67556J980811K257867M52047l71368k31253j362371
3302D07899k689589j162777K082167K889104J069447K08557O65800p95164l981352
3293a305908m614185j971357n38314j951078j726784K932022P797339P773343
3285F395078L790062r472j991874k609518j925245q69632j726474m298987m717028
3276g963090j071158K849821K678738l92361j904812l39904K169616L628294L770422
3267C425566L007945J956340J056332m59891l566568o666934o392811k366629
$$ y = [-273031, 1474310, 2976785, 2853651, 2341048, 3556670, 5813597, 6276802, 4269532, 2095648, 1286670, 927082, 198578, -369132, -839511, -2086731, -3363080, -2734040, -724673, -223597, -1750278, -2317834, -337023, 1920844, 2372891, 2001523, 1770270, 407899, -2281690, -3444467, -1362300, 1526804, 2596251, 2804808, 3470608, 2675444, -1305908, -5920093, -7891450, -8429764, -10380842, -12107626, -9175604, -1378265, 6395078, 10185140, 10175668, 8183794, 5574276, 3649031, 2779399, 1052925, -3246062, -7963090, -9034248, -6184427, -3505689, -3898050, -5802862, -6142766, -3973150, -344856, 3425566, 6433511, 8389851, 9446183, 8986292, 5419724, -1247210, -7640021, -10006650]
3259a0006650J631665K703421K124826K004031J843829O25441n87834n81893j13073
3250c56237K7796O13131J667804J290425r99907k444543r93937J407167J855374
3241B067073M70839q11193j019359J88645K852056M814393K822839k229517m801464
3232D354312k147795J595139J946049M75172N13392O58318j954095n068693m148280
3223c776481L1815K478360J561312K7164o94446j667625k313092n97109K356068
3214b594034K924100Q66707j63618J286460K433692J285106o37764j756340k479660
3205A164649k526370l32671L186099M146197J059523k571029l089544j256934
3197b20080k1892l84035j487647k524431k640193r66782J595037K527475J030423
$$ y = [-10006650, -8374985, -5671564, -3546738, -1542707, 301122, 926563, 338729, -243164, -356237, -328441, 284690, 1952494, 3242919, 2243012, -201531, -1195468, 211699, 2067073, 2537912, 1726719, 707360, 896005, 3748061, 8562454, 11385293, 9155776, 4354312, 2206517, 3801656, 5747705, 6222877, 6736269, 7394587, 5440492, 371799, -3776481, -3744666, -1266306, 295006, 322170, -372276, -2039901, -4352993, -4950102, -2594034, 330066, 1196773, 1033155, 2319615, 4753307, 6038413, 5400649, 3644309, 1164649, -1361721, -1694392, 1491707, 5637904, 6697427, 4126398, 1036854, -220080, -241972, -626007, -2113654, -4638085, -7278278, -8245060, -6650023, -4122548, -3092125]
3188c092125p40776r56156m00143j99261K47027J344212J683087M34886o17507
3179b296756L80236K417239L278164K623899J414171j78706k032811k657343j062451
3170A885642Q84502N47685j547303k363214p48979J262237J797279J445560J405537
3161D568946J280842P7110j756215k676867k025598o31714M21203Q33794Q15329
3152I06830M52990j84054n70891O6523J813536L563576L798530K001467p34064
3143A1114443k585349k682545j974136k042399k860485k557264l09793J479936
3135b417592j06105l801095m782805r85701L720514M533001J754565p32029j320996
3126d138243j639732k346240j693124J025084L642316M110748L152556K531391
$$ y = [-3092125, -3832901, -4789057, -5189200, -5388461, -5141434, -3797222, -2114135, -1679249, -2296756, -1916520, 500719, 3778883, 6402782, 7816953, 7638247, 5605436, 2948093, 1885642, 2770144, 3317829, 1770526, -592688, -1341667, -79430, 1717849, 3163409, 4568946, 5849788, 5926898, 4170683, 1493816, -531782, -1163496, -742293, 91501, 906830, 1359820, 1175766, 604875, 671398, 2484934, 6048510, 9847040, 11848507, 11114443, 8529094, 5846549, 3872413, 1830014, -1030471, -3587735, -3897528, -2417592, -2523697, -6324792, -11107597, -12093298, -8372784, -3839783, -2085218, -2817247, -4138243, -5777975, -8124215, -9817339, -8792255, -5149939, -1039191, 2113365, 4644756]
3118D644756K331431J362963p88977l176673m244955k816977O23024L504461L496364
3109D935417J461702L62831J040441J420869N50195M40333K089018K537783r32217
3100A3906372n479587n483528l55584M156486L395494o23691k864606k056324
3092D595032j143193k112420l358684k631080l64513J236355J249126P51157R31844
3083h46376J722403K304905K047932Q31868p68412j555203q08184N78718J002285
3074D509936L24758m2371M79452P18086R651l28074P17540J580597K95111j976020
3064F288666k166887J10896J878636J258818J09593Q22540K490682K278758m21278
3055A2650424l196635l726259k118123o0499J066060Q80035j70741j060374q85084
$$ y = [4644756, 6976187, 8339150, 7550173, 4373500, 128545, -2688432, -2065408, 1439053, 4935417, 6397119, 6759950, 7800391, 9221260, 9771455, 10211788, 12300806, 14838589, 13906372, 8426785, 2943257, 2587673, 6744159, 10139653, 9515962, 6651356, 4595032, 3451839, 1339419, -2019265, -4650345, -5014858, -3778503, -2529377, -1778220, -846376, 876027, 3180932, 5228864, 6060732, 5292320, 3737117, 2928933, 3507651, 4509936, 4834694, 4792323, 5271775, 5989861, 5999512, 5671438, 6388978, 7969575, 8264686, 6288666, 4121779, 4232675, 6111311, 7370129, 7479722, 8302262, 10792944, 13071702, 12650424, 9453789, 5727530, 3609407, 3548908, 4614968, 5495003, 5324262, 4263888, 3378804]
3046C378804P1980L72200q31072k335172k025220M43385K978048L464071J993507
3037G510531N2556j514036k538693k392919o38434J416746J777183O34750K61227
3028D568911J475693K224367O91885k047476l848740m309657m172880l377330
3020h795227j586748L57930J349125J663212K120156K363551J597841L37262k49199
3011h42097j99574l78984o90201k09830J109886K125169J784386O8686j871960
3002H95481k263716n17107J352507R49004o56832j01627K519780K845301q70774
2993D152017m181586l044980j06291L7389j570520q79062J530494J719720j45306
2984b488125j83191J734967J438173k054612m601079l589038r63205J371933L535549
$$ y = [3378804, 3450784, 3822984, 2991912, 656740, -1368480, -925095, 2052953, 5517024, 7510531, 7563087, 6049051, 3510358, 1117439, 479005, 1895751, 3672934, 4307684, 4568911, 6044604, 8268971, 8960856, 6913380, 3064640, -1245017, -5417897, -8795227, -10381975, -10024045, -8674920, -7011708, -4891552, -2528001, -930160, -592898, -842097, -1041671, -1420655, -2110856, -2320686, -1210800, 914369, 2698755, 2767441, 895481, -1368235, -1885342, -532835, 416169, -240663, -342290, 2177490, 5022791, 4152017, -29569, -3074549, -3180840, -3143451, -4713971, -5593033, -4062539, -2342819, -2488125, -2671316, -936349, 501824, -1552788, -6153867, -9742905, -10706110, -9334177, -5798628]
2975e798628M152978J066047l076536k604447J823709K836143j782064m546350
2967g929148j14331N852490N897714K266295J617224L435800K260059j866813
2959A1419290l812480k550962j881215k594753j456495J768411L161517J421194
2951E474507k15899J81802Q98264R05595J232767J164598j494974n231749n408966
2942b494055j626529J008880K1499o75761J841321L833992R81351m082685n386024
2933f578011k158625J097853J580646P21234L02705J26205N5809J210493L846522
2924B04831N874760M773193M37466m350643o142591l708330Q84303M093103L883129
2915E949221R29397k501696m217020l356458j154566j5175p33044j312892J43534
$$ y = [-5798628, -1645650, -579603, -3656139, -6260586, -4436877, -1600734, -3382798, -7929148, -8043479, -2190989, 3706725, 5973020, 7590244, 11026044, 13286103, 11419290, 7606810, 5055848, 3174633, 579880, -876615, 891796, 4053313, 5474507, 5258608, 5440410, 6338674, 7244269, 8477036, 9641634, 8146660, 2914911, -2494055, -4120584, -3111704, -3090205, -3765966, -1924645, 1909347, 2890698, -1191987, -6578011, -8736636, -7638783, -6058137, -5336903, -5034198, -4907993, -4852184, -3641691, 204831, 6079591, 10852784, 11290250, 6939607, 797016, -2911314, -2027011, 2066092, 5949221, 6878618, 4376922, 159902, -3196556, -4351122, -4366297, -5099341, -6412233, -6268699]
2906f268699K418408L019611K059679J623094J809030O35076j860426k771564
2898F64209p19445J797351K051767P39773J87670P49227Q91859k48234j921020
2889D193157k753332j950776k18803M70819p15594j598833M30556M047475M951764
2880F856433J799023j709163j919754K71719J696201J276539Q2392j044320j804215
2871E504855j802490j382628j797156l080626l280327j305545J125149K022661
2863c996107J878471K039584K093523J074616k06896m06241m5295l44172p04402
2854A383081J75379J482084J234593k71877n79731J073848K260403O26518k735513
2845D648785m274751k075453J609012K565799j18810k068687J096744P027582
$$ y = [-6268699, -3850291, -830680, 1228999, 2852093, 4661123, 5296199, 3435773, 664209, -55236, 1742115, 3793882, 4533655, 4721325, 5470552, 6362411, 6114177, 4193157, 1439825, -510951, -729754, -258935, -974529, -2573362, -2142806, 1904669, 6856433, 8655456, 6946293, 5026539, 5298258, 6994459, 8270998, 8353390, 7309070, 5504855, 3702365, 2319737, 522581, -2558045, -5838372, -7143917, -6018768, -3996107, -2117636, -78052, 2015471, 3090087, 2883191, 2476950, 2431655, 2087483, 1383081, 1558460, 3040544, 4275137, 4003260, 3423529, 4497377, 6757780, 7384298, 4648785, 374034, -1701419, -92407, 2473392, 2354582, 285895, 1382639, 8410221]
2837H410221Q488578K767137m364669o175543l058924l0206P42516O63873J30746
2828G573729j727423l376424j803644K366549M753976L099978k15435k329435
2820H341871l088855l053089j840815r3765O6310j504149j827231P18060L240999
2811I59336K172758j617254m126037l396944j032212O46317Q45194J64764j39388
2802e523466Q92386K605732L062427J651766K58762O02059J682827J510787K19268
2793F962548n05583k83035k10227o19952p63884o20654j027720j859960j903660
2784h32127q74238O7796J74019n1126j96011n04469o48485K96951J901847K187690
2774A521847N11462j015969m74461R41192P42449j203182k803180k727146j286362
$$ y = [8410221, 16898799, 19665936, 15301267, 9125724, 6066800, 6036594, 6779110, 7442983, 7573729, 5846306, 2469882, 666238, 3032787, 7786763, 10886741, 10671306, 8341871, 5253016, 2199927, 359112, 265347, 331657, -1172492, -2999723, -2281663, 959336, 3132094, 1514840, -2611197, -6008141, -7040353, -6394036, -5548842, -5384078, -5523466, -4631080, -2025348, 1037079, 2688845, 2947607, 3549666, 5232493, 6743280, 6962548, 6456965, 6173930, 5963703, 5343751, 4579867, 3959213, 2931493, 1071533, -832127, -1706365, -1638569, -1464550, -1515676, -1711687, -2216156, -2864641, -2567690, -665843, 1521847, 2033309, 1017340, 542879, 1484071, 2226520, 1023338, -1779842, -4506988, -5793350]
2765e793350Q88098K753278K178279j664957n437817m673860k35264K185197M23885
2756i376511p95717K169175N211886L021755j241066j49038N295190N594377k692009
2747G038042j0300434p888294R14009N489306L036102q8530J95424Q99772o76987
2738a381590j894844N3351L030359L590121K269236J704253J867005P65325j395365
2729H607851k139686o95876N90553m73836k782900l093519p5852L509276L533965
2720F979976l26396l480480j909741K411719L992043J096763k524832l337748
2712B901304j991034n38157P88228J977134J521467r34450k619181j261857J209062
2703A052516J550733J1181r56472j116416j831183k225405k37613K850112L277156
$$ y = [-5793350, -4905252, -2151974, 26305, -1638652, -7076469, -11750329, -11985593, -9800396, -9376511, -10172228, -8003053, -2791167, 230588, -1010478, -1159516, 4135674, 9730051, 7038042, -3262392, -11150686, -10236677, -4747371, -1711269, -1799799, -1604375, -704603, -1381590, -3276434, -3223083, -192724, 3397397, 5666633, 7370886, 9237891, 10003216, 8607851, 6468165, 5772289, 6362842, 5889006, 3106106, 12587, -63265, 3446011, 6979976, 6653580, 3173100, 1263359, 3675078, 7667121, 8763884, 6239052, 2901304, 910270, 372113, 1160341, 3137475, 4658942, 3724492, 1105311, -156546, 1052516, 2603249, 2614430, 1657958, 541542, -1289641, -3515046, -3752659, -902547, 2374609]
2694B374609N93271j604799j585890j810286l652928m077650n30314M159975N333547
2685h00465K804268J65244o80290q19440j036448o83191J67903L55597j94202
2676g21024k53650L94477N73055K6239j6849P70478R07120m18340j709420j262941
2666a710855L85650J394478J044553M8367q07799j129689n53021Q63422K046628
2657A581734J729115m9881j913939k613832j956352l61572J716095L575282M039993
2648E746643K235352j157271l852646l827839j398190J053912J673928Q76867
2640A350756R2720l32689q95738j253194m50052J152303J871514J109218J70076
2631B814914k3465k82028j017229o17242J932317M129600K502360k186283n142816
$$ y = [2374609, 2967880, 1363081, -222809, -2033095, -5686023, -9763673, -10293987, -6134012, -800465, 2003803, 2169047, 1488757, 669317, -367131, -1050322, -882419, -526822, -721024, -974674, -580197, -7142, 19097, 2248, 772726, 1679846, 1261506, -447914, -1710855, -1325205, 69273, 1113826, 1162193, 354394, -775295, -1328316, -464894, 1581734, 3310849, 3260968, 1347029, -1266803, -3223155, -3584727, -1868632, 1706650, 5746643, 7981995, 6824724, 2972078, -855761, -2253951, -1200039, 473889, 1350756, 1443476, 1110787, 215049, -1038145, -1488197, -335894, 1535620, 2644838, 2814914, 2791449, 2509421, 1492192, 874950, 2807267, 6936867, 9439227, 7252944, 2110128]
2622B110128l571495N3228J870417J371871M34983k84909j308548j878492o67378
2613a870195J171990P16252k131425l465981m74698M335256O139513L681862j40415
2604G962159k693789l957813m506725l789756j397688J700147M137303N139780
2596B593618M147058J188815j735024j774693J011086L038434J928403k92438
2588A0105259q63966q17657k495823m316777k489331K345163M802903K120844
2580H390615k241268m028435l469884k865253k354513j148244k85010p93767j063086
2571i858845O67400K801531K659294Q45240m5137J99897R248j09320J460736L168472
2561A798516J678937k118696l256360j23508K789017J712447r51532r31606J537205
$$ y = [2110128, -1461367, -1408139, 462278, 1834149, 2269132, 1984223, 675675, -1202817, -1870195, -698205, 18047, -2113378, -5579359, -6054057, -1718801, 4420712, 8102574, 7962159, 5268370, 1310557, -3196168, -6985924, -8383612, -6683465, -2546162, 2593618, 6740676, 7929491, 6194467, 4419774, 5430860, 8469294, 10397697, 10105259, 9241293, 8423636, 5927813, 1611036, -878295, 1466868, 6269771, 8390615, 6149347, 2120912, -1348972, -4214225, -6568738, -7716982, -8001992, -8795759, -9858845, -9191445, -6389914, -3730620, -2885380, -2930517, -2730620, -2721372, -2830692, -1369956, 1798516, 3477453, 1358757, -1897603, -2021111, 767906, 2480353, 1528821, 597215, 2134420]
2552B134420L080444K490880J155749j58114j555974k095082p97517Q93931M84862
2543E633599j822604l107952j620547J148191K475569J192534j463032k808557
2535c72799j040792K466894M068841K106322r39130j882892r42353m96860j114801
2526A852430j279214k85826J019217J925883K091849P35041j977389l383157j088918
2517c90084K877584L772371M25523l108542l026766j76844K180031K517410J445855
2508F516538j4041r68405r50885r03784k390825m873908n572040l202636O1435
2499a2298551J817787K566122L611295L762912J003232l471234n856992m498798
2491a3364227j665271j47998j41636k76122J4575M42789J140115K560452M333500
$$ y = [2134420, 5214864, 7705744, 8861493, 8703379, 7147405, 5052323, 4254806, 5148737, 5633599, 3810995, 703043, -917504, 230687, 2706256, 3898790, 2435758, -372799, -1413591, 1053303, 5122144, 7228466, 6289336, 4406444, 3464091, 2967231, 1852430, 573216, 287390, 1306607, 3232490, 5324339, 6059380, 4081991, 698834, -390084, 2487500, 6259871, 6685394, 3576852, 550086, 373242, 2553273, 5070683, 6516538, 6502497, 5534092, 4583207, 3679423, 1288598, -3585310, -9157350, -12359986, -12298551, -10480764, -7914642, -4303347, -540435, 462797, -3008437, -8865429, -13364227, -15029498, -15177496, -15319132, -15595254, -15580679, -15137890, -13997775, -11437323, -7103823]
2482g103823N265684M693029L204080J727228M72600n86553o55889J104909L420264
2473A1541529L126100j000637n706602o566883l394803j19421P27065P14913J839865
2464A161126K910936J710358j126367k965090k988348k711361l005532k866297
2456i880575j381314Q75997K847337M006848M057169K883101J172985k4705o52629
2447C904214j463273k298603j908040j2098J760819J842181N84473p13478j593632
2438A02563k136410j867862n48567N35916l9235j216368l12034K838343M672122
2429B028468K391631j927655l905722k572689q59131o13272k88166J352927K212865
2420b180744o2217l825983n025308k302410J838869M454392M520572K360581p60770
$$ y = [-7103823, -1838139, 2854890, 6058970, 7786198, 8258798, 7672245, 7016356, 8121265, 11541529, 14667629, 13666992, 7960390, 1393507, -2001296, -2120717, -1393652, -678739, 1161126, 4072062, 5782420, 4656053, 1690963, -1297385, -4008746, -7014278, -9880575, -11261889, -10385892, -7538555, -3531707, 525462, 3408563, 4581548, 4556843, 3904214, 2440941, 142338, -1765702, -1777800, -16981, 1825200, 2409673, 1696195, 102563, -2033847, -3901709, -4450276, -3914360, -3953595, -5169963, -5481997, -2643654, 2028468, 4420099, 2492444, -1413278, -3985967, -4845098, -5458370, -5746536, -4393609, -2180744, -2242961, -6068944, -11094252, -13396662, -11557793, -7103401, -2582829, -222248, -983018]
2411i83018k506678j435204O51175P04351j049770j387820O43864K076976R92749
2402b293375k35796J002016L192303L392395J960589J170351Q64313o87794k645018
2393E719984k368802j36110Q62489l10500r28098O33371K275745J956385R05727
2384H610191R39751J247977L52124q99213j000478p52581j666946k648404j408333
2375B774088J364083K379893M51571k004065k698059k050217j116588M27115K519429
2366B047250L067370M98990l114369l955034j332898J389804J100347j514792
2358a813332l446758l093222j419677q2508M21636P07385J410125K536770L613342
2349a166239M089884L541008J762012r47979l568116m828579m186643k169104
$$ y = [-983018, -3489696, -4924900, -4273725, -3569374, -4619144, -6006964, -5363100, -3286124, -2293375, -2529171, -1527155, 1665148, 5057543, 7018132, 8188483, 9052796, 8365002, 5719984, 3351182, 3215072, 4077561, 3767061, 2838963, 3472334, 5748079, 7704464, 8610191, 9549942, 10797919, 11150043, 10250830, 9250352, 8497771, 6830825, 4182421, 2774088, 4138171, 6518064, 6969635, 4965570, 2267511, 217294, -899294, -472179, 2047250, 5114620, 5613610, 2499241, -1455793, -2788691, -1398887, -298540, -1813332, -5260090, -8353312, -9772989, -9855497, -9433861, -8726476, -7316351, -4779581, -1166239, 2923645, 6464653, 8226665, 7278686, 3710570, -1118009, -5304652, -7473756]
2341g473756K92391K409418L337180K359276L6258j538338p56214J526056L038879
2332C231150K790337J554157J09313j386570k410074k361239k061543k935913
2324c470382m229587l355332L2542K780900K570754J045073N66316L71232j165611
2315d854095k634005j643265O81769J327337O94054J859336M635961N099618J986826
2306G153536j017387j190254p40083k334494m410566m148570k154815p42605J02235
2297i483003J498283K309351P66786j738115k133591l37143Q96854N05478L12351
2288g402749J573892L151741L551854K549492N56031j629316k457845j089540
2280a196440Q28138Q92107o54858j382308l74446Q67091J203505J024590M00456
$$ y = [-7473756, -7181365, -4771947, -1434767, 924509, 960767, -577571, -1333785, 192271, 3231150, 6021487, 7575644, 7684957, 6298387, 3888313, 1527074, -534469, -3470382, -7699969, -11055301, -11022759, -8241859, -5671105, -4626032, -4059716, -3688484, -4854095, -7488100, -9131365, -8449596, -7122259, -6428205, -4568869, 67092, 5166710, 7153536, 6136149, 4945895, 4205812, 1871318, -2539248, -6687818, -8842633, -9585238, -9483003, -7984720, -5675369, -4908583, -6646698, -8780289, -9117432, -8220578, -7715100, -7402749, -5828857, -2677116, 874738, 3424230, 3980261, 2350945, -106900, -1196440, -368302, 523805, -131053, -1513361, -1887807, -1020716, 182789, 1207379, 1607835]
2271A607835j290572l229103l169149o30677K047650K893216K518361K018012
2263B765573P43959k028590m611933m146117j44865M374520N530961K261083k415515
2254B329076m172206j985679P84650R03877m47468P3676K546017L701792K108883
$$ y = [1607835, 317263, -2911840, -6080989, -6711666, -4664016, -1770800, 747561, 2765573, 3509532, 1480942, -3130991, -7277108, -7421973, -3047453, 2483508, 4744591, 2329076, -1843130, -3828809, -3044159, -2140282, -2587750, -2514074, 31943, 3733735, 5842618]
$$ [...]
##END NTUPLES=NMR SPECTRUM
##END=
