##TITLE=31Pdec_DE-176rm_3h
 , 64 sc
19.8.2026
##JCAMPDX= 6.0         $$ Bruker NMR JCAMP-DX V2.0
##DATA TYPE= NMR SPECTRUM
##DATA CLASS= NTUPLES
##ORIGIN= UXNMR, Bruker Analytische Messtechnik GmbH
##OWNER= root
$$ XWIN-NMR		Version 3.5
$$ Wed Aug 19 14:28:17 2026 Russian Standard Time (UT+4h)  she@DPX200
##.OBSERVE FREQUENCY= 81.013821
##.OBSERVE NUCLEUS= ^31P
##.ACQUISITION MODE= SIMULTANEOUS
##.ACQUISITION SCHEME= undefined
##.AVERAGES= 64
##.DIGITISER RES= 17
##SPECTROMETER/DATA SYSTEM= spect
##.PULSE SEQUENCE= zgpg30
##.SOLVENT NAME= DMSO
##.SHIFT REFERENCE= (INTERNAL, DMSO, 0, 197.392)
##AUDIT TRAIL= $$ (NUMBER, WHEN, WHO, WHERE, WHAT)
$$ ##TITLE= Audit trail, XWIN-NMR		Version 3.5
$$ ##JCAMPDX= 5.01
$$ ##ORIGIN= Bruker BioSpin GmbH
$$ ##OWNER= she
$$ F:/spectra/data/she/nmr/P31/2/pdata/1/auditp.txt
$$ ##AUDIT TRAIL=  $$ (NUMBER, WHEN, WHO, WHERE, WHAT)
(   1,<2026-08-19 14:26:46.43 +0400>,<she>,<DPX200>,
      <created by zg, POWCHK disabled, PULCHK disabled
       configuration hash MD5:
       00 E9 B6 7A A2 85 ED C7 34 08 36 98 17 FE 4E 26
       data hash MD5: 32K
       41 08 CC 9F B7 EA B1 6E 21 0B B9 E9 9A A4 99 5C>)
(   2,<2026-08-19 14:26:51.00 +0400>,<she>,<DPX200>,
      <Start of raw data processing
       efp BC_mod = 2 LB = 1.5 FT_mod = 6 PKNL = 1 PHC0 = 1993.072 PHC1 = -21.70161 SI = 64K 
       data hash MD5: 64K
       FA 4C 01 84 CB F4 5E 4F E4 AB EF 1C 69 D5 60 8D>)
(   3,<2026-08-19 14:27:16.34 +0400>,<she>,<DPX200>,
      <pk PHC0 = -46.21304 PHC1 = 133.8 
       data hash MD5: 64K
       34 46 26 D5 0F C3 C7 A6 25 FF 66 F4 6E 20 59 1F>)
(   4,<2026-08-19 14:27:22.93 +0400>,<she>,<DPX200>,
      <abs ABSG = 5 
       data hash MD5: 64K
       CB 19 FD FA CB 28 2E 5D B2 52 A9 5C A8 75 D5 8C>)
(   5,<2026-08-19 14:27:50.48 +0400>,<she>,<DPX200>,
      <pk PHC0 = 31.50117 PHC1 = -64.39999 
       data hash MD5: 64K
       09 5F 06 EC D8 B5 58 89 9B 44 5C 7E 14 D1 83 C7>)
$$ ##END=
$$ 
$$ hash MD5
$$ 40 1E A9 4B 71 CF 48 5D 1D 19 8F 3E 25 AA 92 74
##$RELAX= 
##$RELAX= 
##$RELAX= 
##$RELAX= 
##$RELAX= 
##$RELAX= 
##$RELAX= 
##$RELAX= 
$$ Bruker specific parameters
$$ --------------------------
##$DU= <F:/spectra>
##$EXPNO= 2
##$NAME= <P31>
##$PROCNO= 1
##$TYPE= <nmr>
##$USER= <she>
##$AMP= (0..31)
100 100 100 100 100 100 100 100 100 100 100 100 100 100 100 100 100 100 
100 100 100 100 100 100 100 100 100 100 100 100 100 100 
##$AQSEQ= 0
##$AQ_mod= 1
##$AUNM= <au_zg>
##$AUTOPOS= <>
##$BF1= 81.014009
##$BF2= 200.13
##$BF3= 200.13
##$BF4= 200.13
##$BF5= 200.13
##$BF6= 200.13
##$BF7= 200.13
##$BF8= 200.13
##$BYTORDA= 1
##$CFDGTYP= 0
##$CFRGTYP= 5
##$CHEMSTR= <none>
##$CNST= (0..31)
1 1 145 1 1 1 1 1 1 1 1 1 1 1 1 1 1 1 1 1 1 1 1 1 1 1 1 1 1 1 1 1 
##$CPDPRG= <waltz16>
##$CPDPRG1= <>
##$CPDPRG2= <waltz16>
##$CPDPRG3= <>
##$CPDPRG4= <mlev>
##$CPDPRG5= <mlev>
##$CPDPRG6= <mlev>
##$CPDPRG7= <mlev>
##$CPDPRG8= <mlev>
##$CPDPRGB= <>
##$CPDPRGT= <>
##$D= (0..31)
0 1 0 0 0 0 0 0 0 0.06 0 0.03 2e-05 3e-06 0 0 0.0002 0 0 0 0 0 0 0 0 0 
$$ [...]
##$SUBNAM3= <"">
##$SUBNAM4= <"">
##$SUBNAM5= <"">
##$SUBNAM6= <"">
##$SUBNAM7= <"">
##$SUBNAM8= <"">
##$SUBNAM9= <"">
##$SW= 400.765351723535
##$SWIBOX= (0..15)
0 1 3 0 0 0 0 0 0 0 0 0 0 0 0 0 
##$SW_h= 32467.5324675325
##$TD= 32768
##$TD0= 1
##$TE= 0
##$TE2= 300
##$TE3= 300
##$TEG= 300
##$TL= (0..7)
0 120 53 12 22 120 120 120 
##$TP= (0..7)
150 150 150 150 150 150 150 150 
##$TP07= 0
##$TPNAME0= <>
##$TPNAME1= <>
##$TPNAME2= <>
##$TPNAME3= <>
##$TPNAME4= <>
##$TPNAME5= <>
##$TPNAME6= <>
##$TPNAME7= <>
##$TPOAL= (0..7)
0.5 0.5 0.5 0.5 0.5 0.5 0.5 0.5 
##$TPOFFS= (0..7)
0 0 0 0 0 0 0 0 
##$TUNHIN= 0
##$TUNHOUT= 0
##$TUNXOUT= 0
##$USERA1= <user>
##$USERA2= <user>
##$USERA3= <user>
##$USERA4= <user>
##$USERA5= <user>
##$V9= 5
##$VALIST= <valist>
##$VCLIST= <CCCCCCCCCCCCCCC>
##$VD= 0
##$VDLIST= <DDDDDDDDDDDDDDD>
##$VPLIST= <PPPPPPPPPPPPPPP>
##$VTLIST= <TTTTTTTTTTTTTTT>
##$WBST= 1024
##$WBSW= 4
##$XGAIN= (0..3)
0 0 0 0 
##$XL= 0
##$YL= 0
##$YMAX_a= 140253
##$YMIN_a= -82099
##$ZGOPTNS= <>
##$ZL1= 120
##$ZL2= 120
##$ZL3= 120
##$ZL4= 120
##$ABSF1= 197.3918
##$ABSF2= -203.3724
##$ABSG= 5
##$ABSL= 3
##$ALPHA= 0
##$AQORDER= 0
##$ASSFAC= 0
##$ASSFACI= 0
##$ASSFACX= 0
##$ASSWID= 0
##$AUNMP= <proc_1d>
##$AZFE= 0.1
##$AZFW= 0.5
##$BCFW= 0
##$BC_mod= 2
##$BYTORDP= 0
##$COROFFS= 0
##$CY= -3
##$DATMOD= 1
##$DC= 0
##$DFILT= <>
##$DTYPP= 0
##$F1P= 0
##$F2P= 0
##$FCOR= 1
##$FTSIZE= 65536
##$FT_mod= 6
##$GAMMA= 0
##$GB= 0
##$INTBC= 1
##$INTSCL= 9.790993e-09
##$ISEN= 30
##$LB= 1.5
##$LEV0= 0
##$LPBIN= 0
##$MAXI= 10000
##$MC2= 0
##$MEAN= 0
##$ME_mod= 0
##$MI= 50
##$NCOEF= 0
##$NC_proc= -5
##$NLEV= 6
##$NOISF1= 182.463
##$NOISF2= 159.3651
##$NSP= 0
##$NTH_PI= 0
##$NZP= 0
##$OFFSET= 197.3918
##$PC= 4
##$PHC0= 1978.36
##$PHC1= 47.69841
##$PH_mod= 1
##$PKNL= yes
##$PPARMOD= 0
##$PSCAL= 0
##$PSIGN= 0
##$REVERSE= no
##$SF= 81.014063255964
##$SI= 65536
##$SIGF1= 159.3651
##$SIGF2= -187.1042
##$SINO= 113.3802
##$SIOLD= 16384
##$SREGLST= <1H.CDCl3>
##$SSB= 0
##$STSI= 65536
##$STSR= 0
##$SW_p= 32467.5324675325
##$SYMM= 0
##$S_DEV= 0
##$TDeff= 32768
##$TDoff= 0
##$TI= <>
##$TILT= no
##$TM1= 0
##$TM2= 0
##$TOPLEV= 0
##$USERP1= <user>
##$USERP2= <user>
##$USERP3= <user>
##$USERP4= <user>
##$USERP5= <user>
##$WDW= 1
##$XDIM= 65536
##$YMAX_p= 498717077
##$YMIN_p= -50365870
$$ End of Bruker specific parameters
$$ ---------------------------------
##NTUPLES= NMR SPECTRUM
##VAR_NAME=  FREQUENCY,     SPECTRUM/REAL,   SPECTRUM/IMAG
##SYMBOL=    X,             R,               I
##VAR_TYPE=  INDEPENDENT,   DEPENDENT,       DEPENDENT
##VAR_FORM=  AFFN,          ASDF,            ASDF
##VAR_DIM=   65536,         65536,           65536
##UNITS=     HZ,            ARBITRARY UNITS, ARBITRARY UNITS
##FACTOR=    0.49542278885378, 1,            1
##FIRST=     15991.5117654749, 0,            0
##LAST=      -16476.0207020576, 0,           0
##MIN=       -16476.0207020576, -50365870,   0
##MAX=       15991.5117654749, 498717077,    0
$$ Real data points
##PAGE= N=1
##DATA TABLE= (X++(R..R)), XYDATA
$$ [...]
36557F79531m14579k39221j09416j16964j97126k43203j63552L5325J89952J64641
36547d14612Q2294J53852K98591K18990j21272m02142l97399k17510k3634J72106
36537f50736K99275J68002j85961l90375j99720J64736L41410K69938J14619j6289
36527h5101o1170O3374L00638M21704L48181K86734L60057L82851K32520J22578
36517B372366K00681K08217n1108k15294J28878O54254O30106q186n49937n31843
36507B838134k62496j53172j19240K2037N7201k56622o48941o43478k54955M2332
36497F20800k6621k74663m24903m11003k72650m1942J85705K86273K79584K74649
36487A95229K08977j04784n72970p43475l66267J69575K71158p2402k77963L0028
$$ plain form
36557 679531 264952 25731 -83685 -200649 -397775 -640978 -804530 -769205 -579253 -414612
36547 -414612 -332318 -178466 120125 339115 217843 -184299 -581698 -799208 -822842 -650736
36537 -650736 -351461 -183459 -369420 -759795 -959515 -794779 -453369 -183431 -68812 -85101
36527 -85101 -146271 -82897 217741 639445 987626 1274360 1634417 2017268 2249788 2372366
36517 2372366 2573047 2781264 2730156 2514862 2643740 3297994 3928100 3919914 3369977 2838134
36507 2838134 2575638 2422466 2303226 2325263 2382464 2125842 1476901 833423 578468 620800
36497 620800 594179 319516 -105387 -516390 -789040 -830982 -645277 -359004 -79420 195229
36487 195229 404206 299422 -273548 -1017023 -1383290 -1213715 -942557 -1014959 -1292922 -1262894
36477a262894N38315P08938M42822M7329k44372m13159m31917k56648m2363l7442
36467i51391j80740j07359K98435O34159M83713k0891l97848m19936k41970l4753
36457i38581J80302L36870K80888K5026j80198j58272l5355m0172j92560l03398
36447a025450k05868R8856M56849O52070N56826K69613M1830l923j5708j84798
36437F40297m39144m97108k31433J43315L10610K01468J3104q0141j02699j31237
36427a72968j16089J1263J32542M7554k03724l36813k26748j03897j77456k55625
36417a401961j5379M49723O83086M89376J86267J11572J66786P2229j38589j84184
36407D18926j0545J06385l0809k78510l91416l25368j73254K7936K37249K75037
$$ plain form
36477 -1262894 -724579 -15641 427181 474510 230138 -183021 -614938 -871586 -913949 -951391
36467 -951391 -1132131 -1239490 -941055 -306896 176817 155926 -241922 -661858 -903828 -938581
36457 -938581 -758279 -421409 -140521 -115495 -295693 -453965 -489320 -529492 -722052 -1025450
36447 -1025450 -1231318 -1132462 -675613 -23543 533283 802896 844726 840803 825095 640297
36437 640297 201153 -295955 -527388 -384073 -73463 128005 141109 60968 -41731 -172968
36427 -172968 -289057 -277794 -145252 -97698 -301422 -638235 -864983 -968880 -1146336 -1401961
36417 -1401961 -1417340 -967617 -284531 204845 391112 502684 669470 741699 603110 418926
36407 418926 408381 514766 483957 205447 -185969 -511337 -684591 -656655 -419406 -144369
36397a44369l209m11602n59096l41628q5691o8000j15962O7073L44726K88717
36387a029041j24731l62569o6722L85327L78999n7594k67435J36294P39642Q53457
36377E85627L41766k87208n15406l29244q8335m8211j40611j91141j96423k62408
36367a131594l42945k54371k434J33759J2802p5223J92516O04590O23745J69803
36357f9352k18188j61978O318j96825n84091n09620J57996P49587O37256K4502
36347a64395l57417j54192K81508M06872R9125l00452m05151j55106J79171K97804
36337b72233J57910m0498j26672j40989k04071k86984k33174l154K26915K70222
36327f52728J50321L5332M210r647l8891L0291K96292O19856O97471M05798k1204
$$ plain form
36397 -144369 -147578 -559180 -1118276 -1459904 -1545595 -1613595 -1729557 -1662484 -1317758 -1029041
36387 -1029041 -1153772 -1516341 -1583063 -1197736 -818737 -876331 -1143766 -1007472 -267830 585627
36377 585627 927393 640185 124779 -204465 -292800 -341011 -481622 -672763 -869186 -1131594
36367 -1131594 -1474539 -1728910 -1731344 -1597585 -1584783 -1660006 -1467490 -862900 -239155 -69352
36357 -69352 -287540 -449518 -443200 -640025 -1224116 -1733736 -1575740 -826153 -188897 -164395
36347 -164395 -521812 -676004 -394496 12376 111501 -188951 -594102 -749208 -570037 -272233
36337 -272233 -114323 -154821 -281493 -422482 -626553 -913537 -1146711 -1149865 -922950 -652728
36327 -652728 -502407 -467075 -462865 -472512 -511403 -481112 -184820 435036 1132507 1538305 1517101
36316A517101k57312k69202k93812m37997m97118k78436O7252K30944J51666Q24
36306f6090j63750m13644o10401m32715R2021M38801K58912q2977k2764L71461
36296f31146N56120L89667K92516M62202M97840Q3193m10444m14435J6401K93707
36286A135621P9249l84161o69913n84253j98498K62314N22988M42758J42204j44137
36276F04172k92310k82489j13950J08977J63999Q843o1007J69671M15681K64228
36266I85815j27423j74108K53303N59972K34210m64892q85845p53883k93242J62145
36256e03948L71486J94819k55963n54088l44988K17018O33668O26811L42659N9602
36246G87076p0814k3527J06336R2553k00147n37751n00097l3079M09606M17405
$$ plain form
36316 1517101 1259789 990587 696775 258778 -238340 -516776 -449524 -218580 -66914 -66090
36306 -66090 -229840 -643484 -1253885 -1686600 -1594579 -1155778 -896866 -979843 -1002607 -631146
36296 -631146 -75026 314641 607157 1069359 1567199 1650392 1239948 825513 841914 1135621
36286 1135621 1214870 830709 160796 -423457 -621955 -359641 163347 606105 748309 604172
36276 604172 311862 29373 -84577 24400 188399 197242 136235 305906 721587 985815
36266 985815 858392 684284 937587 1497559 1731769 1266877 381032 -372851 -666093 -503948
36256 -503948 -132462 62357 -193606 -747694 -1092682 -875664 -241996 384815 727474 787076
36246 787076 716262 692735 799071 891624 691477 153726 -346371 -379450 30156 447561
36236D47561J11079j12942j43269j70706k37705j42023J23660J84921j98608o55647
36226g93679o03470n0825L95106L85026K72925M66343P00515M04664l72829r10849
36216a07073p39608j91628J32587R1735n2470j39225k16443k68756j68394Q4408
36206a574867K99424L33419K49376J91301J95660J74807M5640j51023k66756k10496
36196g13515p7854l9682j24473k36557l62892n46156o24278l00204L61779Q07693
36186a856139O55449K46316J50270L02305J49965l67277n94272j34141M98515
36177i49009O16871L45211K96967N03956L59438l22831q65539o65749p0343J60812
36167e90216n5760j36132J99697N52126N15552K09610p5784l30670o07533o98207
$$ plain form
36236 447561 558640 445698 302429 131723 -105982 -248005 -124345 60576 -138032 -793679
36226 -793679 -1397149 -1447974 -1052868 -667842 -394917 71426 771941 1176605 803776 -107073
36216 -107073 -846681 -1038309 -905722 -813987 -866457 -1005682 -1222125 -1490881 -1659275 -1574867
36206 -1574867 -1275443 -942024 -692648 -501347 -305687 -130880 -85240 -236263 -503019 -713515
36196 -713515 -791369 -831051 -955524 -1192081 -1554973 -2101129 -2725407 -3025611 -2663832 -1856139
36186 -1856139 -1200690 -954374 -804104 -501799 -351834 -719111 -1313383 -1447524 -949009
36177 -949009 -332138 13073 310040 813996 1173434 850603 -14936 -680685 -751028 -590216
36167 -590216 -645976 -782108 -582411 -30285 485267 694877 619093 288423 -319110 -1017317
36157a017317m22519k5104J09651K198l7629M7854N4981j0268R2610L59280M75022
36146c71241L22000J36326M1344j33992l93388m02505p0435J41663j13469m73190
36136a316887m02402j9271J51319K9528n064J57499K30475J44435J77785L44642
36126e07941K37051k65253o39817m36602N3289K58793J54886J56139L58652L95975
36116b34828P0944k95267l09377l2251J47060M0139j29076n0512K48427M04961
36106a39780J63091k81547n00382l61265j60914j79839k98436k10212J11210L68396
36096a489678L41139J46531M4745J07272J71749Q8290p3280j00533R8463L67303
36086b97999M68828L31431P0277j79493l40549l38112j28250J75826L45091K83408
$$ plain form
36157 -1017317 -1439836 -1464940 -1355289 -1353091 -1390720 -1342866 -1287885 -1298153 -1205543 -846263 -371241
36146 -371241 -49241 87085 128429 -5563 -398951 -801456 -871891 -730228 -843697 -1316887
36136 -1316887 -1719289 -1738560 -1587241 -1557713 -1562777 -1405278 -1174803 -1030368 -852583 -507941
36126 -507941 -270890 -536143 -1175960 -1612562 -1559273 -1300480 -1145594 -989455 -630803 -234828
36116 -234828 -163884 -459151 -768528 -800779 -653719 -613580 -742656 -793168 -544741 -139780
36106 -139780 23311 -258236 -758618 -1119883 -1280797 -1460636 -1759072 -1969284 -1858074 -1489678
36096 -1489678 -1148539 -1002008 -957263 -849991 -678242 -589952 -663232 -763765 -665302 -297999
36086 -297999 170829 502260 572537 393044 52495 -285617 -413867 -238041 107050 390458
36076C90458J32499N2826Q531j22937l20913m44441m40446l83706l13626j75500
36066a617255K8771J55641R0281o0742p3743R5948K52875K55484K37745L87654
36056b47341N91439N32523J64994j63016j78791n1586r4982k90417l67832k37490
36046c42499m9105J11249K68966L20576Q6132l22064m93831k30460J78040L33177
36036a39819J86176k3073r8121j3451J24273J11613j86966n82402o54457k59255
36026a535482K27272L47968R9988j41290j02732J51711L55353K65957j25561n05919
36016i62735n16646k15287l3089j49829k21014M6830L89515M11113K22458J94283
36006h34401K88457J75084r3974j21100J07122J24866k19269m33304j41020K90053
$$ plain form
36076 390458 522957 575783 584314 461377 140464 -303977 -744423 -1128129 -1441755 -1617255
36066 -1617255 -1588484 -1432843 -1342562 -1403304 -1477047 -1381099 -1128224 -872740 -634995 -247341
36056 -247341 344098 876621 1041615 878599 699808 648222 553240 262823 -105009 -342499
36046 -342499 -391604 -280355 -11389 309187 395319 73255 -420576 -651036 -472996 -139819
36036 -139819 46357 23284 -74837 -88288 35985 147598 -39368 -621770 -1276227 -1535482
36026 -1535482 -1308210 -960242 -860254 -1001544 -1104276 -952565 -597212 -331255 -456816 -962735
36016 -962735 -1479381 -1694668 -1727757 -1877586 -2098600 -2051770 -1662255 -1251142 -1028684 -834401
36006 -834401 -545944 -370860 -464834 -585934 -478812 -353946 -573215 -1006519 -1147539 -857486
35996h57486K70689j70476m74543l07695J21121M09947L53184K8580k98540l89929
35986a315148k72896j83246k01222j30117J36500L60298K94967Q2876L5917J52601
35976a039470J51644q1239l62376m97836m50247k41272N8745K46241J45289j13831
35966b184352k05026k7491K10618L54505M74765N95231N40834K33097j00281k31928
35956c40028k62737l90104m96889k88812J98516N45588M64864J18666j68511k74186
35946h93633k14420M0312M30114O41126M04433o1488k31023K4849K22517o0792
35936C01995n60906o72336k64198K03782L43665K45517J37266Q93k34175l68801
35926h67298j40024L27399N73474L48202r9429l43323k38297K8773K28318K92755
$$ plain form
35996 -857486 -586797 -757273 -1231816 -1539511 -1418390 -1008443 -655259 -626679 -925219 -1315148
35986 -1315148 -1588044 -1771290 -1972512 -2102629 -1966129 -1605831 -1310864 -1227988 -1192071 -1039470
35976 -1039470 -887826 -969065 -1331441 -1829277 -2279524 -2520796 -2462051 -2215810 -2070521 -2184352
35966 -2184352 -2389378 -2416869 -2206251 -1851746 -1376981 -781750 -240916 -7819 -108100 -340028
35956 -340028 -602765 -992869 -1489758 -1778570 -1580054 -1034466 -569602 -450936 -619447 -893633
35946 -893633 -1108053 -1067741 -637627 3499 407932 346444 115421 140270 362787 301995
35936 301995 -258911 -931247 -1195445 -991663 -647998 -402481 -265215 -264322 -498497 -867298
35926 -867298 -1007322 -679923 -106449 241753 142324 -200999 -439296 -410523 -182205 110550
35916A10550K48676P7246k34765n08405m10626J42591P01408O79110R3678l75313
35906E24150k38710J76176K38203r4455l23132k30932j36605k65049l79830k68750
35896i98934j43661k08766k02129J75660O31364O11848J56754j37040k2483R2437
35886d4950r0634k46440k8145K63195J11435l69102n64318k60819R5879J05925
35876a027974p0036p0600J42217L44632L93291K85854N5813j95275k94012j85156
35866f21246m512J45353L05554M22758K66467j80159n05836l85107r7206j14537
35856g68471l30463k25961K23630M15227O1248l08464j40688L04618L80245k782
35846c91861l77677m83884m73293l99923o2910N04193Q44378O28886J04044k44456
$$ plain form
35916 110550 359226 436472 201707 -306698 -717324 -574733 126675 805785 899463 524150
35906 524150 285440 461616 699819 605364 282232 51300 -85305 -350354 -730184 -998934
35896 -998934 -1142595 -1351361 -1553490 -1377830 -746466 -134618 22136 -114904 -137387 -44950
35886 -44950 -135584 -382024 -410169 -146974 -35539 -404641 -968959 -1229778 -1133899 -1027974
35876 -1027974 -1098010 -1168610 -1026393 -681761 -288470 -2616 53197 -142078 -436090 -621246
35866 -621246 -625758 -480405 -174851 247907 514374 334215 -171621 -556728 -653934 -768471
35856 -768471 -1098934 -1324895 -1101265 -686038 -624790 -933254 -1073942 -769324 -389079 -391861
35846 -391861 -769538 -1253422 -1726715 -2126638 -2189548 -1685355 -840977 -212091 -108047 -352503
35836c52503k48018o1363J74656M01491M94989L35606J9980k10033k68774k80064
35826E967k98932j75447J79220N23219M80471Q554m98790o55346m95559l12886
35816a239529k04212j3057K88561M50661L07939N9933j3962M9353J9277j34606
35806d29642k33791k03838j30537m1912R7875J93338R5941j11779j94799j49832
35796a108976j93536l14051k06863J87925M47924K28413k18228l78395j36569
35787a692356J82533K81350J38914q7413j84947l0375K03969J63003j77440l56937
35777a559699p0688L07798K46117j25817k18486J08751L96293L42906J53692K1151
35767c97982j87498m91205n40267j49380K82691K66499j12770l65342k38106J25461
$$ plain form
35836 -352503 -600521 -661884 -487228 -85737 409252 744858 764838 554805 286031 5967
35826 5967 -292965 -468412 -289192 234027 714498 723052 224262 -431084 -926643 -1239529
35816 -1239529 -1443741 -1456798 -1168237 -717576 -409637 -349704 -363666 -314313 -295036 -429642
35806 -429642 -663433 -867271 -997808 -1039720 -941845 -748507 -652566 -764345 -959144 -1108976
35796 -1108976 -1302512 -1616563 -1823426 -1635501 -1187577 -959164 -1177392 -1555787 -1692356
35787 -1692356 -1509823 -1228473 -1089559 -1176972 -1361919 -1392294 -1188325 -1025322 -1202762 -1559699
35777 -1559699 -1630387 -1322589 -1076472 -1202289 -1420775 -1312024 -915731 -572825 -419133 -397982
35767 -397982 -585480 -1076685 -1616952 -1766332 -1483641 -1217142 -1329912 -1695254 -1933360 -1807899
35757a807899M89509O71268N22419R2365k66749k48750L658J00528m9889j68980
35747f62520n6289J63345K75760K32755J07685l0047j25637j41936j05252q0347
35737d22483r3085j27048j54101j11595O5031K97496L56543J29316j88616l03553
35727e52095j50237J15023L41131M43872L47498O8167j97278k47442j07274N0578
35717A11943J29594J07354n8265l11460m14190k40180n0919j75435m78578m87974
35707a868110n2868M59018O73081N95242L99096J37968j69248l93699m07153k11869
35697h38542J02333L85439M18532J06691k99314m25085k44687o0865m563R1842
35687g68219K57840K44507N490r0319J81564M68622L24603j21740l55071j77160
$$ plain form
35757 -1807899 -1318390 -647122 -124703 -32338 -299087 -547837 -544179 -443651 -493540 -662520
35747 -662520 -718809 -555464 -279704 -46949 60736 30689 -94948 -236884 -342136 -422483
35737 -422483 -515568 -642616 -796717 -908312 -843281 -545785 -189242 -59926 -248542 -552095
35727 -552095 -702332 -587309 -246178 197694 545192 613359 416081 168639 61365 111943
35717 111943 241537 348891 290626 -20834 -435024 -675204 -726123 -901558 -1380136 -1868110
35707 -1868110 -1920978 -1461960 -788879 -193637 205459 343427 174179 -219520 -626673 -838542
35697 -838542 -736209 -350770 67762 174453 -124861 -549946 -794633 -855498 -860061 -768219
35687 -768219 -510379 -265872 -260382 -350701 -169137 299485 624088 502348 147277 -29883
35677b9883J19841J93687j6601l29610m71344k78018P2086J74949p6417k99658
35667i40968j77960N7605K7858j62599j26985J36525K67780J69875J12779J82350
35657d53740J12930j97443m33716l35740r0429k0692j32255j95325r3964J11576
35647a728798L39841N22333N57084L70044J2730l42570m93845l58521j14188q0977
35637a316867l05765l98730m1826M56122M84571J865l37995n8556N13806P28046
35627b75329M28970K0095j25411m5684k8207k39106n19690n22447j11670M07344
35617a011135O10975M63252K67029J46323p8124m28029n67929k80173J58562L28381
35607c90868J73105o9031k23694k30635m2690K60754M26239L38411K07603K01595
$$ plain form
35677 -29883 89958 283645 267044 -62566 -533910 -811928 -739842 -564893 -641310 -940968
35667 -940968 -1118928 -1061323 -1033465 -1196064 -1323049 -1186524 -918744 -748869 -636090 -453740
35657 -453740 -340810 -538253 -971969 -1307709 -1398138 -1418830 -1551085 -1746410 -1840374 -1728798
35647 -1728798 -1388957 -866624 -309540 60504 73234 -269336 -763181 -1121702 -1235890 -1316867
35637 -1316867 -1622632 -2021362 -2063188 -1607066 -1122495 -1120630 -1458625 -1517181 -1003375 -275329
35627 -275329 153641 173736 48325 2641 -25566 -264672 -784362 -1306809 -1418479 -1011135
35617 -1011135 -400160 63092 330121 476444 398320 -29709 -597638 -877811 -719249 -390868
35607 -390868 -217763 -286794 -510488 -741123 -783813 -523059 -96820 241591 449194 650789
35597F50789J10017k89867p20745o85107j86359K55970L24803K23846J88772R6725
35587c1156k05727m99708m45059r0543J73816J52069O7966J78236L63096K88452
35577d8558r4039m29362m12270j80411r1257k21342l10637j66416J17469L60648
35567a476175M75337L98629J03411k24429k71242k161K37095J74696m2809j13466
35557g41114L0557K57004M27891L95535O9664l18290l23880Q7953L64091J29513
35547C78924k30008j89300O5395j130l16910l27678R361J23270j81850l81523
35537a051449j44978P5505k00234o52886o11947j2135N86774P47791N04403R0494
35527f68662k83660m26929k62989M0427K31380K49374K04654J58225Q4597o493
$$ plain form
35597 650789 760806 470939 -249806 -934913 -1121272 -865302 -540499 -316653 -127881 -31156
35587 -31156 -236883 -736591 -1181650 -1272193 -1098377 -946308 -878342 -700106 -337010 -48558
35577 -48558 -142597 -571959 -984229 -1164640 -1255897 -1477239 -1787876 -1954292 -1836823 -1476175
35567 -1476175 -1000838 -602209 -498798 -723227 -994469 -996630 -759535 -584839 -627648 -741114
35557 -741114 -710557 -453553 -25662 369873 439537 121247 -202633 -114680 249411 378924
35547 378924 148916 -40384 25011 23881 -293029 -620707 -611346 -488076 -669926 -1051449
35537 -1051449 -1196427 -1120922 -1321156 -1974042 -2585989 -2598124 -2011350 -1263559 -759156 -668662
35527 -668662 -952322 -1379251 -1642240 -1601813 -1370433 -1121059 -916405 -758180 -673583 -680076
35517f80076o2670o4976j0422J11678K33150J92034p4825l83641m48205j51774
35507a339727L42873O96279O41150K56608m7279J0451K01568J10325k40789m44802
35497A86657l75545l45470m93745n06220j84397J64604K35198K00887K90257K88071
35487e39703l5774l27802q5539M96221P25647L82170r9250l82554n58216o48843
35477a073643m13216J24610M68683K89726j02476k17589j3404K00410K18561M0134
35467d78204k53099m65572l38816J24453N56474O45133M74105K66538M1613k23322
35457C49303l44237j88382M191o2194k26126r4427K70649L58694p040l47331k25248
35446e12148R2176L0980m29849p06137m12020J35845L59374J33382j53258j48617
$$ plain form
35517 -680076 -742746 -807722 -818144 -706466 -473316 -281282 -356107 -739748 -1187953 -1339727
35507 -1339727 -996854 -300575 340575 597183 549904 560355 761923 872248 631459 186657
35497 186657 -188888 -534358 -1028103 -1534323 -1718720 -1554116 -1318918 -1118031 -827774 -539703
35487 -539703 -575477 -903279 -988818 -492597 233050 615220 515970 133416 -424800 -1073643
35477 -1073643 -1486859 -1362249 -893566 -603840 -706316 -923905 -937309 -736899 -518338 -478204
35467 -478204 -731303 -1196875 -1535691 -1411238 -854764 -209631 264474 531012 572625 349303
35457 349303 5066 -183316 -179125 -241319 -467445 -561872 -291223 67471 60431 -286900 -512148
35446 -512148 -419972 -388992 -818841 -1524978 -1936998 -1801153 -1441779 -1308397 -1461655 -1610272
35436a610272P3387J94210M9591k37681m18845l16122O7619N22083P48840O19979
35426c07211L09956Q2983j5771j35405l20034m18467l31396j62109j9221J63646
35416a153029M48617O53934N10441M2312l92282m85360k81957n8563q168j05068
35406h29123j96533j51647L2957K08022J85661n4114k94072k98647j03405J4070
35396a486831r6487k22069n3872L56021N99775M33302R7671l5789J2910p8081
35386d73450l75097n29307k67890K05425M70242L75120Q2454k20091m27653m41503
35376a601750k44978k6019K3110K4911K67068O92744Q48629M91997l1624k59420
35366A84668k31763l12435n30726n18962j34715K49305K53614j48j26113j9528
$$ plain form
35436 -1610272 -1536885 -1342675 -1293084 -1530765 -1949610 -2265732 -2198113 -1676030 -927190 -307211
35426 -307211 2745 85728 69957 -65448 -385482 -803949 -1135345 -1297454 -1316675 -1153029
35416 -1153029 -704412 -50478 459963 502275 109993 -375367 -657324 -715887 -724055 -829123
35406 -829123 -1025656 -1177303 -1144346 -936324 -750663 -804777 -1098849 -1397496 -1500901 -1486831
35396 -1486831 -1583318 -1805387 -1859259 -1503238 -903463 -470161 -372490 -408279 -395369 -473450
35386 -473450 -848547 -1377854 -1645744 -1440319 -970077 -594957 -512503 -732594 -1160247 -1601750
35376 -1601750 -1846728 -1872747 -1849637 -1824726 -1557658 -864914 -16285 475712 444088 184668
35366 184668 -47095 -359530 -890256 -1409218 -1543933 -1294628 -1041014 -1041162 -1167275 -1186803
35356a186803R9827P6807j0231l6969L1172J87264L77720M48550K81931K081j32391
35345A38958o3063K2833P871m438P3353J29328K5648k05015m43663o02138n55000
35334a475326j68975M20490P59914N55912P5045j90307j49960j15464k34195k79861
35324h02727p7826J75040J89305j9007j93264j84899p6377n210J4712Q7597K82757
35313f09899M90243M86914K18837o3441j01752J93q0480l85458n76011m01038
35303a021892j4143K96558M54940M99673L69116M4659k31470j76464J19121K36747
35293E76845p5703o08486r07848o86852n7821N19790N80672J08897l73185l30255
35283a253946J94485O69506P04699L74325o0142m53968p17585p25358m74572j67228
$$ plain form
35356 -1186803 -1086976 -1010169 -1020400 -1057369 -1026197 -838933 -461213 -12663 269268 271349 138958
35345 138958 75895 98728 106599 102161 175514 304842 330490 125475 -318188 -920326 -1475326
35334 -1475326 -1644301 -1223811 -463897 92015 167060 -23247 -173207 -288671 -522866 -802727
35324 -802727 -880553 -705513 -516208 -535215 -728479 -913378 -989755 -994965 -980253 -892656 -609899
35313 -609899 -119656 367258 586095 522654 420902 421095 340615 -44843 -620854 -1021892
35303 -1021892 -1036035 -739477 -284537 215136 584252 628911 397441 220977 340098 576845
35293 576845 501142 -107344 -1015192 -1702044 -1759865 -1240075 -659403 -550506 -923691 -1253946
35283 -1253946 -1059461 -389955 314744 689069 628927 174959 -542626 -1267984 -1742556 -1909784
35273a909784L2789J76331L10206K69928o5424m42282m56200p9298L03279L90467
35263a469988K38031J0198k37009m08722l00930J02110M61394M56458J91738K255
35253i54465k3927o5869j89477k36720r9462J39785L59559M75695L74101K5466
35243a95314l13883l04616L267J91623O4062j03023n1938N6696j0379j22791l9659
35232h25955J31049J15104l3186k2616J58559K16130M0214j47761j88741j91336
35222g48539k54618k78508j67346P250J46284K38519K80693K64303K53041K71511
35212A2590J52995k25699n87381m90249L7146M71717M99106L51154K99352K31190
35202G51921j9964k92462l59818k96054k74515k44976j01855N3762J01053J20479
$$ plain form
35273 -1909784 -1876995 -1700664 -1390458 -1120530 -1185954 -1628236 -2084436 -2163734 -1860455 -1469988
35263 -1469988 -1231957 -1221759 -1458768 -1867490 -2168420 -2066310 -1604916 -1148458 -956720 -954465
35253 -954465 -978392 -1044261 -1233738 -1470458 -1569920 -1430135 -1070576 -594881 -220780 -195314
35243 -195314 -509197 -813813 -810546 -618923 -554861 -657884 -709822 -653126 -663505 -786296 -825955
35232 -825955 -694906 -579802 -612988 -635604 -477045 -260915 -220701 -368462 -557203 -748539
35222 -748539 -1003157 -1281665 -1449011 -1441761 -1295477 -1056958 -776265 -511962 -258921 12590
35212 12590 165585 -60114 -647495 -1137744 -1100598 -628881 -129775 221379 520731 751921
35202 751921 731957 439495 79677 -216377 -490892 -735868 -837723 -783961 -682908 -562429
35192e62429J62462O6848j83525k39051R5340M12383K57247j20755j40184J59509
35182i2155J91824j74795l69947l4363M17665M30587M1921l24584m38290l24244
35172f76381m1989K70709L37676M2266l20351l36068L4556M23617M78348K07533
35162D19916o8388p3044J00391Q6024k52788n75984n25486k50836j41062j84471
35152a465728o2629J87695J82944p0248p3057L11323N25206K02895j93822j27091
35142e82512J43886P5209j73428j6292N00367P05169L58442k9669p3258m1375
35132H66539k46905m59566l17290M5772J89317k064k06997j15644K24486M89353
35122D67001M08347M2804k65830k92170j79135j45849j08445J05062L01984J37968
$$ plain form
35192 -562429 -399967 -333119 -516644 -755695 -660355 -247972 9275 -111480 -251664 -92155
35182 -92155 99669 -75126 -445073 -479436 -61771 368816 410737 86153 -352137 -676381
35172 -676381 -718370 -447661 -109985 -67719 -388070 -724138 -689582 -265965 212383 419916
35162 419916 351528 278484 378875 464899 212111 -363873 -889359 -1140195 -1281257 -1465728
35152 -1465728 -1528357 -1340662 -1157718 -1227966 -1301023 -989700 -464494 -261599 -455421 -582512
35142 -582512 -438626 -363417 -536845 -553137 -52770 652399 1010841 981172 907914 866539
35132 866539 619634 160068 -157222 -111450 77867 75803 -131194 -246838 -22352 467001
35122 467001 875348 918152 652322 360152 181017 35168 -73277 31785 333769 471737
35112D71737k42562l05617K6038J80451j64828n38660m23952o3206R819j38312
35102a189092n3502K34798K55257m2107j49093J56662M35879K85912q8840k89491
35092d43617k79993k07130k8676K95810N11314L67704M7541p6149J0780J4975
35082B12559j46367k45998j49676K1651J59656K85143L44022J95688r0465k06116
35072C80097k1750J91986J24386j75440m21926m63634l63290k25255j05140k0005
35062a099971N9849J51870J42956j07186m57385n04067r7563L60603L98844J07440
35052a044610k3633J78559L68819K36086o9499k04028r5495L8313K0612q9435
35042f84311j11642J0499J03759k9403k72438k35981K00685N79238M00322j46223
$$ plain form
35112 471737 229175 -76442 -50404 130047 -34781 -573441 -997393 -1060599 -1050780 -1189092
35102 -1189092 -1242594 -1007796 -752539 -794646 -943739 -787077 -351198 -65286 -154126 -443617
35092 -443617 -723610 -930740 -959416 -663606 -152292 215412 262953 186804 197584 212559
35082 212559 66192 -179806 -329482 -307831 -148175 136968 480990 676678 586213 380097
35072 380097 358347 550333 674719 499279 77353 -386281 -749571 -974826 -1079966 -1099971
35062 -1099971 -1040122 -888252 -745296 -852482 -1309867 -1813934 -1911497 -1550894 -1152050 -1044610
35052 -1044610 -1068243 -889684 -520865 -284779 -354278 -558306 -653801 -615488 -594876 -684311
35042 -684311 -795953 -785454 -681695 -711098 -983536 -1219517 -1018832 -439594 -39272 -185495
35032a85495l92636j21916J74175Q3310j50252j03751J65577L09170K52466J78138
35022B08786J36740N7003M605O2915P5521j20211l17123k07534N8545M9225k44176
35011b35704l89598k49445j72888k89627k05681K53308N39797J54010m71986m94071
35001a561885J37215O45140N68073K78196K19517K41367L0530k59009k70950p0702
34991d2508k8899k01161k78746j51629q0730j86155j58208K55531P44982P68343
34981F40820K80609k08229l10074j74201j14071j14275K4193K08659Q5547l96072
34971g7094p50618n07314J46660N42897L53204k6623n1937K18147K26730k58176
34961a84124p47073o24493N8679O44320O57193K81322M982J5594R4401o103k51596
$$ plain form
35032 -185495 -578131 -700047 -525872 -442562 -592814 -696565 -530988 -221818 30648 208786
35022 208786 345526 402529 407134 470049 545570 425359 108236 -99298 -40753 8472 -235704
35011 -235704 -625302 -874747 -1047635 -1337262 -1542943 -1289635 -749838 -595828 -1067814 -1561885
35001 -1561885 -1424670 -779530 -211457 66739 286256 527623 558153 299144 28194 -42508
34991 -42508 -71407 -272568 -551314 -702943 -783673 -969828 -1128036 -872505 -127523 640820
34981 640820 921429 713200 403126 228925 114854 579 24772 233431 318978 -77094
34971 -77094 -827712 -1335026 -1188366 -645469 -292265 -318888 -370825 -152678 74052 -184124
34961 -184124 -931197 -1555690 -1497011 -852691 -195498 85824 90806 106400 200801 194698 -56898
34950e6898l99210k99533q5088k9152j96152l20000j59683R7665L6828l47158
34940a758381n10913n7562O65301R54944O10909Q2072j91526k27754k28391j99364
34930h60665n2319J32326J89092J18580N5610M0433n21p2846r1820o0370r8475
34919g00975k16848k04204J08489N33438O61074L52296o6293k17780j53251k09928
34909a13982m55355n60984l10211M2539J24372m1817j39327n1292M5309L1098
34899a429650j9641p2950j94818k98037j45269K31767M09247J24177k75233k60345
34889a930752J29642L50803J55686p1891N8996L29222K37734k26650n27364l14225
34879a808799J27790L19696K08631R5665J32014K17162L13687M83140N80825L21138
$$ plain form
34950 -56898 -456108 -755641 -840729 -869881 -1066033 -1386033 -1545716 -1448051 -1411223 -1758381
34940 -1758381 -2269294 -2326856 -1661555 -706611 -95702 -13630 -205156 -432910 -661301 -860665
34930 -860665 -912984 -780658 -591566 -472986 -417376 -376943 -377464 -450310 -542130 -602500 -700975
34919 -700975 -917823 -1122027 -1013538 -480100 180974 533270 466977 249197 95946 -113982
34909 -113982 -569337 -1130321 -1440532 -1397993 -1273621 -1315438 -1454765 -1506057 -1460748 -1429650
34899 -1429650 -1449291 -1522241 -1717059 -2015096 -2160365 -1928598 -1519351 -1395174 -1670407 -1930752
34889 -1930752 -1801110 -1450307 -1294621 -1366512 -1307516 -978294 -740560 -967210 -1494574 -1808799
34879 -1808799 -1681009 -1361313 -1152682 -1057017 -925003 -707841 -394154 88986 669811 990949
34869I90949j97603m23911q6155L34697K32015k83329n98525m75818k24409q5314
34859h17403K6067J34375P6046j18850j73313m3554j4849j54635j44657J09531
34849a121242K02869q8696l23617n6547L95826L94364p5271m51871m36577k38479
34839a799241o7088R2753K05180J60955O7129J42468L01736K52341J8287p0238
34829f95718M7965O6945j05436j42436J26316L52181J55830l14638n69092l30392
34819a408475K46460P28280P18527K53784j13874M9118L78425J39776o35100j057577
34809g00656o35682K6825J70306q4026j73936n7122o6638j73805j06563L7102
34799a764195k329j3908L52986P45365M47158l86713p23084j33638N49443M97132
$$ plain form
34869 990949 793346 369435 283280 617977 849992 566663 -31862 -507680 -732089 -817403
34859 -817403 -791336 -656961 -580915 -699765 -873078 -916632 -931481 -1086116 -1230773 -1121242
34849 -1121242 -918373 -1007069 -1330686 -1387233 -991407 -597043 -672314 -1124185 -1560762 -1799241
34839 -1799241 -1866329 -1773576 -1568396 -1407441 -1340312 -1197844 -896108 -643767 -625480 -695718
34829 -695718 -647753 -580808 -686244 -828680 -702364 -350183 -194353 -508991 -1078083 -1408475
34819 -1408475 -1162015 -433735 284792 538576 424702 473820 852245 992021 356921 -700656
34809 -700656 -1336338 -1309513 -1139207 -1223233 -1397169 -1454291 -1520929 -1694734 -1801297 -1764195
34799 -1764195 -1766524 -1780432 -1427446 -682081 -234923 -621636 -1344720 -1478358 -928915 -431783
34789d31783N4851K6895L72008L93084p8440m71013l89215p9802R8712J35288
34779c69415J39767Q3693l0501n3926N5607R5591q5362l28518l61269j24581K10701
34768g68213M27792L74940N5273k70223k39737J64491M64489K20871l49930n76320
34758d96567j86926L14988K94258k05849n50890l32470J79617M54005L30286P6282
34748a23266m6578n8878j03433j75018j08028J94232N72875P00319M00284j27442
34738A125067m83244m90453l37478k49999j78407L4527K98031L34123Q8537j60711
34728b0007j88983j24274k19980m56235n41390k87436J37831L64980J96378j80572
34718a319688l63220j44272K75010N31848M98767L19772J17865j19979l43075
$$ plain form
34789 -431783 -376932 -350037 21971 415055 336615 -134398 -523613 -603415 -504703 -369415
34779 -369415 -229648 -145955 -176456 -230382 -174775 -79184 -164546 -493064 -854333 -978914 -768213
34768 -768213 -340421 34519 89792 -180431 -420168 -255677 208812 429683 79753 -496567
34758 -496567 -683493 -368505 -74247 -280096 -830986 -1163456 -983839 -529834 -199548 -123266
34748 -123266 -169844 -228722 -332155 -507173 -615201 -420969 151906 852225 1252509 1125067
34738 1125067 641823 151370 -186108 -436107 -614514 -579987 -281956 52167 140704 -20007
34728 -20007 -208990 -333264 -553244 -1009479 -1550869 -1838305 -1700474 -1335494 -1139116 -1319688
34718 -1319688 -1682908 -1827180 -1552170 -1020322 -521555 -201783 -83918 -203897 -546972
34709e46972l65606j34041J08983J09798m8453n5494K21431N82036P06609M30357
34699A008648j21122n63777n24104l0726M39420M68778J75006q662O3100J42585
34689A049146O8095L711P3553P0175k07162n23185m59231n4875J40055k28813
34679f8531q04995r17497l78265L29353O33334M42196R2009p5175N0883L78221
34669c18467O71632O42244K04174l28970m93324j90446J92256K38546o6027m19621
34659A31997n42439l36187R7374M48329L97012J4877k05009M6841M25363L68660
34649H46818j16969m86265m32067k10864j09378j4522K43911M54457K82716j78739
34639B79098m44833k12566L09853O55438N36661L9444m89183p19203n71865k11339
$$ plain form
34709 -546972 -912578 -1046619 -937636 -827838 -876291 -931785 -710354 -128318 578291 1008648
34699 1008648 887526 323749 -200355 -231081 208339 677117 852123 843461 906561 1049146
34689 1049146 1117241 1120952 1194505 1264680 1057518 534333 75102 20227 160282 -68531
34679 -68531 -873526 -1791023 -2169288 -1839935 -1206601 -764405 -672396 -747571 -696688 -318467
34669 -318467 353165 995409 1199583 870613 377289 186843 379099 617645 551618 131997
34659 131997 -410442 -746629 -649255 -200926 196086 210963 5954 52795 478158 846818
34649 846818 729849 243584 -188483 -399347 -508725 -523247 -279336 175121 457837 279098
34639 279098 -165735 -378301 -68448 586990 1123651 1163095 673912 -45291 -617156 -828495
34629h28495J61825M35319N31642L94021R6090j60021k41472j94269j16113m3949
34619C4578n265k0480P95J79434M14419M36175K11664K6282Q886r9689m39090
34608G47709o29438l03722K07351K61785j23174k70065J33594N79463N15303Q6207
34598A205013k10827k21040j11794M5757K63662L81647K20429q8226k54413k47698
34588I82510k47844k46194o6415K04221J95475j95732n59500m87962r5207K14135
34578c02513K98757L06662K69127M0874l11744m16150r4412K80348K21632j91456
34568A01125m06433j72470J34114J07789r4309o3671J81529K46963L0194j04792
34558c9961P5345K95508K19143k9549r2722O7540J71773Q6153l1900m1224n3m389
$$ plain form
34629 -828495 -666670 -231351 300291 694312 790402 630381 388909 194640 78527 34578
34619 34578 29313 8833 9628 189062 603481 1039656 1251320 1277602 1286488 1186799 747709
34608 747709 118271 -185451 21900 283685 160511 -109554 24040 603503 1118806 1205013
34598 1205013 994186 773146 661352 707109 970771 1352418 1572847 1484621 1230208 982510
34588 982510 734666 488472 422057 626278 821753 626021 66521 -421441 -516648 -302513
34578 -302513 -3756 302906 572033 612907 301163 -114987 -209399 70949 292581 101125
34568 101125 -305308 -477778 -343664 -235875 -330184 -393855 -212326 34637 64831 -39961
34558 -39961 35384 330892 550035 520486 427764 495304 667077 753230 721330 680106 680053 675664
34546F75664o0718j66596l27006m38117l38442n5641J52921J03306q4173j42679
34536f81481L9413L36760N21336M27956Q1207k81727m00305k63107j14849j43185
34526d77982k50952k10029L7268L13127L96678K27828m3291j87612j26977k1008
34516c42950l5917o8805J12692M46693N52259K55445j06730j32664Q8470J59735
34506I28228j3704j47028p9943M958n0043j15613m5500M4113k7771k03339k82045
34495A2313k01204m7905J01625J93275J60612N5618R8598L85552O37495M90472
34485A886451j713m04476m43814k64761j19772o3487n4342j13384k14202j96369
34475A0131J4929K16077J46741j45395l27462j66149K21185N00368M34230Q0200
$$ plain form
34546 675664 614946 448350 121344 -316773 -655215 -710856 -557935 -454629 -538802 -681481
34536 -681481 -642068 -305308 216028 643984 725191 443464 43159 -219948 -334797 -477982
34526 -477982 -728934 -938963 -901695 -588568 -191890 35938 -7353 -194965 -321942 -342950
34516 -342950 -378867 -447672 -334980 111713 663972 919417 812687 680023 768493 928228
34506 928228 914524 767496 687553 692511 642468 526855 481355 525468 497697 294358 12313
34495 12313 -188891 -236796 -135171 58104 218716 274334 372932 758484 1395979 1886451
34485 1886451 1884738 1480262 1036448 771687 651915 588428 534086 420702 206500 10131
34475 10131 25060 241137 387878 242483 -84979 -251128 -29943 470425 904655 984855
34465I84855k64827l34567j47887L2594Q184j51355k27920r8101J70034L78180
34455C49190L41752Q0385j30934m7862K01650K65922Q6492j8121J04221J50980
34445A383675j29503m54395m06111r7566J5842j21478j13318J72917L39796R2525
34435F82384k62269k29160K07313N84953N08972K7100m43588m78306n1124L84938
34425I31213L77455J8218k26292j92778j61666k66702k25871J10021L70358J94022
34415I27978j76245k49791j0372J55975R7807N273m3184j80706l79796l95680
34405b48741j65277Q1860J97544K78132L58727K75020j0361k33060j87416m2611
34395C03817p6979k56441l09813j38207O7087J04315o085j04333j00993l6021
$$ plain form
34465 984855 720028 385461 237574 270168 278352 126997 -100923 -199024 -28990 349190
34455 349190 690942 771327 640393 592531 794181 1060103 1146595 1128474 1232695 1383675
34445 1383675 1254172 799777 393666 296100 311942 190464 77146 250063 589859 682384
34435 682384 420115 190955 398268 983221 1492193 1519293 1075705 597399 546275 931213
34425 931213 1308668 1326886 1100594 907816 746150 479448 253577 363598 733956 927978
34415 927978 751733 501942 491570 647545 745352 750625 707441 526735 146939 -248741
34405 -248741 -414018 -332158 -134614 143518 502245 777265 766904 533844 346428 303817
34395 303817 226838 -29603 -339416 -477623 -410536 -306221 -312306 -416639 -517632 -553653
34385e53653L5218J30790K64889L37332K27014N240j00954k3279M2194m3743j26650
34374A94398k0375J76977K65618K81599L65199M28308K96864R7823J16844K93728
34364B496983K67719l6203k84344k94150k91308m37383n17569l56159j75071k16573
34354A55942l09040j66399J12050K16586J33896R9723J53652J21655K252O712
34344E27029J84500L21903K83547J94650J94999K27519J74787M1279r9036k15497
34334A835680l01412l36267l29992l31408l47044l11090j70677L9816K29073L33432
34324C10111L71590M06850M17733K52556j51308n18117m42510M4643L72896J31148
34314A195592l29429l30005J90787N64127K86884l33398o28658m11189r4135q3840
$$ plain form
34385 -553653 -518435 -387645 -122756 214576 441590 446830 345876 322597 364791 321048 194398
34374 194398 174023 351000 616618 898217 1263416 1691724 1988588 2086411 2203255 2496983
34364 2496983 2764702 2728499 2444155 2150005 1858697 1421314 903745 547586 372515 155942
34354 155942 -153098 -319497 -207447 9139 143035 242758 396410 518065 520317 527029
34344 527029 711529 1033432 1316979 1511629 1706628 1934147 2108934 2150213 2051177 1835680
34334 1835680 1534268 1198001 868009 536601 189557 -121533 -292210 -252394 -23321 310111
34324 310111 681701 1088551 1506284 1758840 1607532 1089415 646905 691548 1064444 1195592
34314 1195592 866163 536158 726945 1291072 1577956 1244558 615900 204711 110576 26736
34304B6736l16806m29989k23031J36110L15129J72353j01032j97224l5810J57312
34294d96252J32948q3070k44617k06198p4933N419J05835L82106P11404O87509
34284I20151J29853n55419p61096l83267R6227K39666J06349p613j6814l7729
34274b69692j09473j55200j39543p0329R5452L57943N27558L82769O710k12511
34264D13684j6113L86639N27352K17610k12917k93193P712K25997J0578l80688
34254H86661m06465L3813M94400N93085L96965J24741j75543m52262m72126j22307
34244I00962L03388M17533K18633R401m4669k2249n565J7091N0864P8409R0634
34233B014432K7603j62418l01600q4975M02620N97043K02120k91488k68752J08509
$$ plain form
34304 26736 -290070 -720059 -943090 -806980 -491851 -319498 -420530 -617754 -653564 -496252
34294 -496252 -363304 -446374 -690991 -897189 -972122 -966703 -860868 -478762 232642 920151
34284 920151 1050004 494585 -266511 -649778 -553551 -313885 -207536 -215149 -231963 -269692
34274 -269692 -379165 -534365 -673908 -744237 -648785 -290842 236716 619485 626195 413684
34264 413684 397571 784210 1311562 1529172 1316255 1023062 1030774 1256771 1267349 886661
34254 886661 480196 514009 1008409 1601494 1998459 2123200 1947657 1495395 1023269 900962
34244 900962 1204350 1621883 1840516 1849917 1805248 1782999 1777434 1794525 1845389 1923798 2014432
34233 2014432 2042035 1879617 1578017 1493042 1895662 2492705 2694825 2403337 2134585 2243094
34223B243094K11729m4546j62521K4618J09762r3358j93182N8552K76176O8026
34213B498350l03331l45089r6392L009j81071l41467k38513R857J69540J82092
34203A356985J59677K01234K45042J12442k35495n45964n55335l64411k64030
34194A10145k23051O4756N61592P67563M35552j2430r5586O0094N1601j07936
34184A612300r6801R2395J30056q7914k83694k40013m3884J68205L82360N25279
34174B158289M02890o511l85522l84997j8861L66709M71445K98230N3438j13809
34164B841301k04334k32391j37320O9167J88430O6066j20722n5175K43300M21557
34154C079879L24503K01996K45760K49470j9609l70719m22964j35372J81263K84410
$$ plain form
34223 2243094 2454823 2410277 2247756 2272374 2382136 2288778 2095596 2154148 2430324 2498350
34213 2498350 2195019 1849930 1753538 1756547 1575476 1234009 995496 1005353 1174893 1356985
34203 1356985 1516662 1717896 1962938 2075380 1839885 1293921 738586 374175 110145
34194 110145 -112906 -48150 513442 1281005 1716557 1704127 1608541 1668635 1720236 1612300
34184 1612300 1515499 1607894 1737950 1650036 1366342 1126329 1082445 1250650 1633010 2158289
34174 2158289 2561179 2554668 2169146 1784149 1765288 2131997 2603442 2901672 2955110 2841301
34164 2841301 2636967 2404576 2267256 2336423 2524853 2590919 2470197 2415022 2658322 3079879
34154 3079879 3404382 3606378 3852138 4101608 4081999 3711280 3288316 3152944 3334207 3618617
34144C618617J89851K5118r3241j06093r5651k09237l60975k17363K91981O75239
34134C718246M40451j74375m29747l2062N13823N81948J59969k42067k35020N6303
34124D357469J96871l7910l82732l92547k0935K88716J70816k07454m18618l15410
34114C238266r0405M6195J1535j99805m58475m84771j41535L08610M55964K14690
34104B900269j29844k74480j39915J42256L17655J89948j33950l05546j68230
34095B398163N6366J41889J46077J46227K7596j86710j63514J97494M05254M6160
34085C215002n05514o10933l23616j66593j70083Q9173N51636O13720J41679k19208
34075B615263k2662L47774L66179J24465J7707J07591J85526J56164N0044r2337
$$ plain form
34144 3618617 3808468 3833586 3740345 3634252 3538601 3329364 2968389 2751026 3043007 3718246
34134 3718246 4158697 3984322 3554575 3522513 4036336 4618284 4778253 4536186 4301166 4357469
34124 4357469 4554340 4516430 4133698 3741151 3720216 4008932 4179748 3972294 3553676 3238266
34114 3238266 3147861 3194056 3205591 3005786 2547311 2062540 1921005 2229615 2685579 2900269
34104 2900269 2770425 2495945 2356030 2498286 2815941 3005889 2871939 2566393 2398163
34095 2398163 2454529 2596418 2742495 2888722 2916318 2729608 2566094 2763588 3168842 3215002
34085 3215002 2709488 2098555 1774939 1608346 1438263 1527436 2079072 2692792 2834471 2615263
34075 2615263 2592601 2940375 3306554 3431019 3448726 3556317 3741843 3898007 3948051 3855714
34065C855714j47545M743J93452R1537k50719m07725k34841o5723r5092o8972
34055B874829J74642L57998K52593N4892k8565j15949k65165k36035K0314J26816
34045C216370q6426k23330j8732J46542o2571k73603n6396K71730K12716J4764
34035C141064K06902N55064M05290j30579l00894J3873J27481k29751m55937j45629
34025C186884K27999J42663j48603j41086J01711J92730J03387P2587Q4292p5610
34015C746954l64295m81902k85283P0530L60768M65163L79997K17387J29188J24996
34005D363503O2133j01291j85698l5838K38068L81655K68002k2127k83977l07919
33995D376511n8879K05349J55297j86224l94393j31522M23196P44988N10470q6288
$$ plain form
34065 3855714 3708169 3712912 3906364 3997901 3747182 3339457 3104616 3038893 2943801 2874829
34055 2874829 3049471 3407469 3660062 3714954 3686389 3570440 3305275 3069240 3089554 3216370
34045 3216370 3129944 2906614 2887882 3034424 2971853 2698250 2641854 2913584 3126300 3141064
34035 3141064 3347966 3903030 4308320 4177741 3876847 3890720 4018201 3788450 3332513 3186884
34025 3186884 3414883 3557546 3408943 3267857 3369568 3562298 3665685 3738272 3822564 3746954
34015 3746954 3382659 2900757 2615474 2686004 3046772 3511935 3891932 4109319 4238507 4363503
34005 4363503 4425636 4324345 4138647 4102809 4340877 4722532 4990534 4968407 4684430 4376511
33995 4376511 4317632 4522981 4678278 4492054 4097661 3966139 4389335 5134323 5644793 5558505
33985E558505n24688m56745n6185J82018M7667j19275P4259M81056O10719L25464
33975F122795k8498j90849k95205m89111o09436m58010j38135J19433K72953L91802
33965D697739M28810L07998J31647P2133J08652O5468j00548k06234o1023L00547
33955E745189O12669N79548J37634m31484p02812m89122j0900L25949K90117k0433
33945F036355l01305k96781j7L56176N17014M11883J54813q8267k02345j80673
33935F406853j31876j48440j47488J6449K57347L05793J38723P5747K70043M14027
33925G457178K25417q1497j71969j37939k05759j76425K34489O77315N17548j03952
33915H234406l28340J40541N73029L65052n8438j1529L53866L76014m7676m01942
$$ plain form
33985 5558505 5033817 4577072 4520887 4702905 4750572 4631297 4705556 5186612 5797331 6122795
33975 6122795 6094297 5903448 5608243 5119132 4509696 4051686 3913551 4032984 4305937 4697739
33965 4697739 5126549 5434547 5566194 5638327 5746979 5812447 5711899 5505665 5444642 5745189
33955 5745189 6357858 6937406 7075040 6643556 5940744 5451622 5440722 5766671 6056788 6036355
33945 6036355 5735050 5438269 5438252 5794428 6311442 6723325 6878138 6789871 6587526 6406853
33935 6406853 6274977 6126537 5979049 5995498 6252845 6558638 6697361 6773108 7043151 7457178
33925 7457178 7682595 7601098 7429129 7291190 7085431 6909006 7143495 7820810 8338358 8234406
33915 8234406 7906066 8046607 8619636 8984688 8926250 8914721 9268587 9644601 9596925 9194983
33905I194983m03971k84193k32070j16436J22810K41129O2414j84287j31287K39817
33895H508909N62089N31287K59532Q4929R0522K7863j99868k65730Q0448M74342
33885A0154323L60220j50278l84260r9386K12975J70306M7937J88064M07514M07280
33875A1314695L18155L71191L92931J20541k65781m01847k98968k06468j47345
33866A1197104k6155L9721m3158j1376L55935P19456N97445J29930j31161o1234
33856A2766507r120q8400l3443K27279M22141M21283L75799L39018K29832J74570
33846A4825466L69316O01689M72134J10230N0333L28930L92550O3483j31517J12005
33836A7194619L37487J46329r1818J02488M83460N27896L14696K98566M75812
$$ plain form
33905 9194983 8791012 8506819 8274749 8158313 8281123 8522252 8584666 8400379 8269092 8508909
33895 8508909 9070998 9602285 9861817 9946746 10037268 10065131 9865263 9599533 9679981 10154323
33885 10154323 10514543 10364265 9980005 9880619 10093594 10263900 10311837 10499901 10907415 11314695
33875 11314695 11632850 12004041 12396972 12517513 12251732 11849885 11550917 11344449 11197104
33866 11197104 11170949 11210670 11167512 11156136 11512071 12231527 12828972 12958902 12827741 12766507
33856 12766507 12757387 12668987 12635544 12862823 13284964 13706247 14082046 14421064 14650896 14825466
33846 14825466 15194782 15796471 16268605 16378835 16429168 16758098 17150648 17214131 17082614 17194619
33836 17194619 17532106 17678435 17586617 17689105 18172565 18700461 19015157 19313723 19789535
33827A9789535M36316J17889r5606m109J89893L00197L48607L18753J39910k8097
33817B1513288J11044N02183O86914L98839m7432j41716K07365O02199O32181
33808B4464865L21913J01783L22445Q04143R87317O03180L9361j19045K21561
33799B7747523O46889Q11913P65267O96271O22695M54275K22931J00478J91578
33790C2259820L77058M24273K87788K30677N12013R80312J185978R53509O17404
33781C7828832N66395P74581R70783J068805J166353J240556J127404P81304L54769
33772D5879782M6143J0551L25512Q60605J282880J401145J400440J508174J578343
33763E4293575J350259J019866J090542J587079J885186J567363J075855J144058
$$ plain form
33827 19789535 20225851 20343740 20248134 20244025 20433918 20734115 21082722 21401475 21541385 21513288
33817 21513288 21624332 22126515 22813429 23212268 23164836 23023120 23230485 23832684 24464865
33808 24464865 24786778 24888561 25211006 26015149 27002466 27605646 27645007 27525962 27747523
33799 27747523 28394412 29206325 29971592 30667863 31290558 31744833 31967764 32068242 32259820
33790 32259820 32636878 33061151 33348939 33579616 34091629 35071941 36257919 37211428 37828832
33781 37828832 38395227 39169808 40140591 41209396 42375749 43616305 44743709 45525013 45879782
33772 45879782 45925925 45936476 46261988 47122593 48405473 49806618 51207058 52715232 54293575
33763 54293575 55643834 56663700 57754242 59341321 61226507 62793870 63869725 65013783
33755F5013783J795950K335024K288070J954739J880127K086036K117156J751273
33747H1222158J348442J383849J842829K298940K502289K609301K782633K862223
33739I8852664K661105K405567K559440L210031L893114M126919L948917L798651
33731A25456408L968232M308637M478644M390320M325038M581443N080152N448373
33723A62037247N504079N482950N687837O082198O411763O606530O824941P148551
33715B11786096P482428P778859Q129667Q562243Q932446R122937R214465R369660
33707B80378801R649818J0009593J0366095J0621565J0740012J0858663J1177513
33700C53802060J1641540J1875584J1589429J0966598J0491689J0416217J0521931
$$ plain form
33755 65013783 66809733 69144757 71432827 73387566 75267693 77353729 79470885 81222158
33747 81222158 82570600 83954449 85797278 88096218 90598507 93207808 95990441 98852664
33739 98852664 101513769 103919336 106478776 109688807 113581921 117708840 121657757 125456408
33731 125456408 129424640 133733277 138211921 142602241 146927279 151508722 156588874 162037247
33723 162037247 167541326 173024276 178712113 184794311 191206074 197812604 204637545 211786096
33715 211786096 219268524 227047383 235177050 243739293 252671739 261794676 271009141 280378801
33707 280378801 290028619 300038212 310404307 321025872 331765884 342624547 353802060
33700 353802060 365443600 377319184 388908613 399875211 410366900 420783117 431305048
33693D31305048J0401440R853343Q988240Q058301P238477O507092N675744M566760
33685D92594445L220739J914953Q99520Q7420r09786k342639l963248n241993
33677D86259411n961659o445455p123474q030593q878048r492693r967355j0414534
33669D19945600j0790201j1006814j1068676j1041411j0983932j0922999j0809042
33662C43322525j0541053j0162381r947896j0074263j0256542j0020644r371347
33655B72948399q842268q750733q767434q478061q027806p806064p727039p339154
33647B07209840o602402o039893n987630o123581n973933n556069n224965n106972
33639A60594395n008096m775531m463314m175541l975169l929230m041095m144199
$$ plain form
33693 431305048 441706488 451559831 460548071 468606372 475844849 482351941 488027685 492594445
33685 492594445 495815184 497730137 498629657 498717077 497807291 495464652 491501404 486259411
33677 486259411 480297752 473852297 466728823 458698230 449820182 440327489 430360134 419945600
33669 419945600 409155399 398148585 387079909 376038498 365054566 354131567 343322525
33662 343322525 332781472 322619091 312671195 302596932 292340390 282319746 272948399
33655 272948399 264106131 255355398 246587964 238109903 230082097 222276033 214548994 207209840
33647 207209840 200607438 194567545 188579915 182456334 176482401 170926332 165701367 160594395
33639 160594395 155586299 150810768 146347454 142171913 138196744 134267514 130226419 126082220
33631A26082220m048518l790687l561503l395529l144997k793601k571252k650391
33623A00125742k890212k992748k797122k353974j857401j581175j704450k068957
33615H1879703k258206k056025j684035j454912j384892j344768j378152j563394
33607F8755319j719015j627475j470049j606504j919904j872691j356620r83722
33599E6199339j216322j638492j561608j062442q40693j137455j402934j171546
33591D6167847p38265o48482q88310j008790q70865q01228r84644j116221q63597
33582C8247445m01259j90274l51646n73067o28050o59288q20705r27958p23647
33573C2971551l23564j05557k14418m41468n74467o09203o01807n62055n32668
$$ plain form
33631 126082220 122033702 118243015 114681512 111285983 108140986 105347385 102776133 100125742
33623 100125742 97235530 94242782 91445660 89091686 87234285 85653110 83948660 81879703
33615 81879703 79621497 77565472 75881437 74426525 73041633 71696865 70318713 68755319
33607 68755319 67036304 65408829 63938780 62332276 60412372 58539681 57183061 56199339
33599 56199339 54983017 53344525 51782917 50720475 49879782 48742327 47339393 46167847
33591 46167847 45429582 44781100 43892790 42884000 42013135 41211907 40227263 39111042 38247445
33582 38247445 37846186 37655912 37304266 36731199 36103149 35443861 34623156 33695198 32971551
33573 32971551 32647987 32542430 32328012 31886544 31312077 30702874 30101067 29539012 29006344
33564B9006344n42989m56870j26873K59827K90944j18342n74185p20079o02496
33555B6415281m03229j75966m6467k70812p75258j002111o21424r8639r2407n22826
33545B2406142p48582n13037j77586q5346k19750m85361q13018r44590o14243
33536A7804629l6152K51551J24865j1413N1646J7988k91250n26899l51694K1433
33526A7054704J82694Q3193r7074l26849o00606o90610m08276M3908L03501K94723
33516A5839308J74419j628k63047n08116n93698n61630n44896n31961m16100j87186
33506A2405465P1078K54086K20191q2768l81861k81303J42662L19303o603l51440
33496A2308810k21800J45181K32708P3901O5347K11619J70024r3588k82763l20939
$$ plain form
33564 29006344 28463355 28006485 27879612 28139439 28430383 28312041 27737856 27017777 26415281
33555 26415281 26012052 25836086 25789619 25518807 24743549 23741438 23120014 23021375 22928968 22406142
33545 22406142 21657560 21144523 20966937 20881591 20661841 20176480 19363462 18418872 17804629
33536 17804629 17768477 18020028 18144893 18133480 18185126 18203114 17911864 17384965 17033271 17054704
33526 17054704 17237398 17320591 17223517 16896668 16296062 15605452 15197176 15241084 15544585 15839308
33516 15839308 16013727 16012099 15749052 15240936 14647238 14085608 13540712 13008751 12592651 12405465
33506 12405465 12476543 12730629 12950820 12868052 12486191 12204888 12347550 12666853 12660250 12308810
33496 12308810 12087010 12232191 12464899 12538800 12604147 12815766 12985790 12892202 12609439 12288500
33486A2288500l73587m01891k52643j11282k63183m64232k15427L38856N11937
33477A1057048J59161r9166O9962K12844m0987l58781l88672l69775n26631m86286
33467I228717O0116O33500O04039J55334q5518m5176r9724k42238j49157N9073
33457A0118966p2857m68466n25310r1292K68019J60758j11608j67129r6720j08011
33447H906350j17034j9568M7569J1291K9400P9917j65159p04855r13643l72082
33437F782186L83356N29881J25779m7858K85954N33510K18688k90284l74141m0891
33427H106180K09227J44318r183n6042j06835k77380m13033l06616l9085J03232
33417G354783K617j84814l01187l66141m04991k98939K794K54281J58212j87588
$$ plain form
33486 12288500 11914913 11513022 11260379 11149097 10885914 10421682 10206255 10545111 11057048
33477 11057048 11216209 11117043 11187005 11399849 11358862 11000081 10611409 10241634 9715003 9228717
33467 9228717 9288833 9922333 10526372 10681706 10596188 10551012 10451288 10209050 10059893 10118966
33457 10118966 10046109 9577643 9052333 8961041 9229060 9389818 9278210 9111081 9014361 8906350
33447 8906350 8789316 8769748 8817317 8828608 8858008 8937925 8772766 8067911 7154268 6782186
33437 6782186 7165542 7695423 7821202 7773344 8059298 8592808 8811496 8521212 8147071 8106180
33427 8106180 8315407 8459725 8450542 8394500 8287665 8010285 7597252 7290636 7251551 7354783
33417 7354783 7357400 7172586 6871399 6505258 6100267 5801328 5804122 6058403 6216615 6029027
33407F029027l45827p7569M08021P82001Q99331O89598R4098o41724r15453l99818
33397F521685M14226P06432L17223j41593j87300m8559j74206n30409p00419m77189
33387E699891l4552L93263O92944P50575M64155l605k18939N7224M89308M87320
33377H777584n7411n60723m18427K39615O97637N24807J9348l00613l40771l16689
33367H264357k50438K054K96921K44913j69968m16462j10519M12168N30303J49817
33357H953146k58315l35722j96413q5833j816J87888M36600N29075L80062J91160
33347I799832K29517M70530N80691L53777M8861P1373L73488N03521L04952J56988
33337A2893530L13731M38709J90945r7816J08004O34183Q08158N10660L17747
$$ plain form
33407 6029027 5683200 5605631 6013652 6795653 7694984 8384582 8478680 7836956 6921503 6521685
33397 6521685 6935911 7642343 7959566 7817973 7630673 7582114 7407908 6877499 6177080 5699891
33387 5699891 5665339 6058602 6751546 7502121 7966276 7962671 7743732 7800956 8290264 8777584
33377 8777584 8720173 8159450 7741023 7980638 8678275 9203082 9222430 8921817 8581046 8264357
33367 8264357 8013919 8015973 8312894 8557807 8387839 7971377 7860858 8273026 8803329 8953146
33357 8953146 8694831 8359109 8162696 8076863 8075047 8262935 8699535 9228610 9608672 9799832
33347 9799832 10029349 10499879 11080570 11434347 11483208 11554581 11928069 12431590 12736542 12893530
33337 12893530 13207261 13645970 13836915 13739099 13847103 14481286 15289444 15800104 16117851
33328A6117851N10797O57791M38592K20500L95633P04958P33658O25921P31762
33319B1137463Q99752P54974M38887M13229O60402P43069O18826P16144J119552
33310B7502298J343142J131918R05810J102303J563840J920735K159153K413808
33302D0043007K540776K346325K032436J995150K285881K612701K795234K922527
33294E9574037L122965L432581L831955M199981M323173M165412M014556M129865
33286I0794525M374898M464179M420249M429525M349529L812232K864779K073750
33278A21583666J808952J752218J346718M90348m66951j242857j864723k454916
33270A20952455l014411l464820l780377m018514m241325m417934m437799m277059
$$ plain form
33328 16117851 16628648 17286439 17725031 17945531 18341164 19046122 19779780 20405701 21137463
33319 21137463 22037215 22792189 23231076 23644305 24304707 25047776 25666602 26382746 27502298
33310 27502298 28845440 29977358 30883168 31985471 33549311 35470046 37629199 40043007
33302 40043007 42583783 44930108 46962544 48957694 51243575 53856276 56651510 59574037
33294 59574037 62697002 66129583 69961538 74161519 78484692 82650104 86664660 90794525
33286 90794525 95169423 99633602 104053851 108483376 112832905 116645137 119509916 121583666
33278 121583666 123392618 125144836 126491554 126981902 126514951 125272094 123407371 120952455
33270 120952455 117938044 114473224 110692847 106674333 102433008 98015074 93577275 89300216
33262H9300216m103157m082510m101529l869285l354665k923859k911052l209822
33254F0744337l453910l464412l305173l003551k515747j984664j725458j803710
33246C9487712j863066j604147j271411j343208j777811j949589j488418q50053
33238B7340009p27577j095845j273991r17516m82127n15542q76311j000967p23965
33229A9726168m42281n23254q73666j116633r63446m13883J98161L89793K518
33220A5983477n35535o83247m78550m13737o30331p06207m03470j42244l62653
33211A1627503p75054p36100j97999K19061R0732l18906n28930m42761k91538
33202H646008k24233j77421m9852J55911L40806L86455K48550k297k49550m12277
$$ plain form
33262 89300216 85197059 81114549 77013020 73143735 69789070 66865211 63954159 60744337
33254 60744337 57290427 53826015 50520842 47517291 45001544 43016880 41291422 39487712
33246 39487712 37624646 36020499 34749088 33405880 31628069 29678480 28190062 27340009
33238 27340009 26612432 25516587 24242596 23325080 22842953 22327411 21451100 20450133 19726168
33229 19726168 19283887 18760633 17886967 16770334 15806888 15393005 15591166 15980959 15983477
33220 15983477 15447942 14764695 14286145 13872408 13242077 12535870 12132400 11990156 11627503
33211 11627503 10852449 10116349 9918350 10137411 10228143 9909237 9380307 8937546 8646008
33202 8646008 8421775 8244354 8194502 8350413 8691219 9077674 9326224 9323927 9074377 8662100
33192H662100m36178l05738j51822k12611n14448p04274m42434R2998L67641J61030
33182F516264k00900l30957k15175o0600J8174K38j23973k52736j84870Q0048
33172E245513K34279N9346k40213l32724k31431j91860k52529k03684R072J62922
33162D258691R5297q7727k15238k49879k00830l8008J93023L24754K56077Q2836
33152D418996m6546j05934j44312j60558j11395J4796J76778K71674J54631k03279
33142D264851n60937n82630k38072J38297K79313K88386L61275M01800J79337
33133D531620k30805m76839m24979l37722m36785n29317k96465J72245M10372
33124B381325J68443k49726l72620j34383J23288J51277N8209L2782L6585o0273
$$ plain form
33192 8662100 8225922 7920184 7768362 7555751 7041303 6337029 5894595 5987593 6355234 6516264
33182 6516264 6315364 5984407 5769232 5708632 5726806 5727044 5603071 5350335 5165465 5245513
33172 5245513 5479792 5539138 5298925 4966201 4734770 4542910 4290381 4086697 4095769 4258691
33162 4258691 4353988 4266261 4051023 3801144 3600314 3562306 3755329 4080083 4336160 4418996
33152 4418996 4372450 4266516 4122204 3961646 3850251 3865047 4041825 4313499 4468130 4264851
33142 4264851 3703914 3121284 2883212 3021509 3300822 3589208 3950483 4352283 4531620
33133 4531620 4300815 3823976 3398997 3061275 2624490 2095173 1798708 1970953 2381325
33124 2381325 2549768 2300042 1927422 1793039 1916327 2067604 2125813 2158595 2195180 2134907
33114B134907j96214j96147o0775M8325Q7606J64314K81307K97107J99535J66989
33104B926954K47956K29011j3219k61218k75888j66139j74067k48608j46162J25898
33094B244518K84592J77153p0330l10282m97460n36412l12923L6788J74228J0837
33084A200709j31384L4902L70006N27561L81877O5631k45212m03260l13148q7091
33074A400591k8424k38289l81242j12155L69477N13706J48282l13015m50266l12826
33064E95839j64437k5487K61555O35845P77277N02151J6653l13294l43113k06991
33054A735998o4604O3804J85345K04778M0642j95568k99050k39876j61311j02165
33044A167993N3866K72001K72753n4431l65693k81309N8699J97120L6016p6961
$$ plain form
33114 2134907 1938693 1742546 1681771 1730096 1817702 1982016 2263323 2560430 2759965 2926954
33104 2926954 3174910 3403921 3390702 3129484 2853596 2687457 2513390 2264782 2118620 2244518
33094 2244518 2529110 2706263 2635933 2325651 1828191 1291779 978856 1015644 1189872 1200709
33084 1200709 1069325 1104227 1474233 2001794 2383671 2449302 2204090 1800830 1487682 1400591
33074 1400591 1372167 1133878 752636 640481 1009958 1523664 1671946 1358931 908665 595839
33064 595839 431402 405915 667470 1303315 2080592 2582743 2599396 2286102 1942989 1735998
33054 1735998 1671394 1735198 1920543 2125321 2165963 1970395 1671345 1431469 1270158 1167993
33044 1167993 1221859 1493860 1766613 1712182 1346489 1065180 1123879 1320999 1357015 1280054
33034A280054N3251J99051J56313O3572O1094p838k48689l71954r3416L22773
33024A414211L63374J4917k41471j82001j09101k37576k70666J07458O32936P42123
33014B234204L18662j80937l24799j52475J2845j9074j70344k57902k03266j03084
33004A153830j01759j94230k24854j17067Q419K8872K870K1054P621j22270k09731
32993B52755k7822L20741M72179L03340P8824J7808J2760p1965j14618J5847J62877
32982A422726J19257j1287L935J08409N4806j46388k29703j22879l4909l8753
32972A125214O7384L35638M48074J64761k67567m41623l37925k34395j93390n464
32962F60707L47503N20391K46998k63855n57871m52991j72502j8442o0417j52608
$$ plain form
33034 1280054 1333305 1532356 1688669 1752241 1813335 1805497 1556808 1184854 1091438 1414211
33024 1414211 1777585 1792502 1551031 1369030 1259929 1022353 751687 859145 1492081 2234204
33014 2234204 2552866 2371929 2047130 1894655 1907500 1888426 1718082 1460180 1256914 1153830
33004 1153830 1052071 857841 632987 515920 524339 553211 556081 577135 584756 462486 252755
32993 252755 224933 545674 1017853 1321193 1400017 1417825 1430585 1358620 1244002 1259849 1422726
32982 1422726 1541983 1530696 1534631 1643040 1697846 1551458 1321755 1198876 1163967 1125214
32972 1125214 1192598 1528236 1976310 2141071 1873504 1431881 1093956 859561 666171 660707
32962 660707 1008210 1528601 1775599 1511744 953873 500882 328380 309938 249521 96913
32952I6913j37874K3037K53139M05076L31346J2349l52448m78059l03259r4904
32942b44684j25037k96455k57942J04655M83081N25633K34912j22505l49274m04586
32932d52202k82662j2097K62084L76139L28868K35713J31272l1908k13429k94564
32922D7214k65723k21347j45978P7492L71689M19286R1627k67926k40638R1783
32912d2521K50974K9582k30313j18883L12136O58140O44038L30922m7426k75804
32902A510845k55310q6861j9400j59839k93386j79676M4853L5532k03790k80920
32892A12048l3955J76478K5616k52759k47601k1679N6279j9330R8940M32924N37044
32881H64005K05884j31280k5818L07194K96872j53831n12049k94770L40787P71197
$$ plain form
32952 96913 -40961 -17924 235215 640291 971637 983986 631538 153479 -149780 -244684
32942 -244684 -369721 -666176 -924118 -819463 -336382 189251 424163 301658 -47616 -452202
32932 -452202 -734864 -746961 -484877 -108738 220130 455843 587115 555207 341778 47214
32922 47214 -218509 -439856 -585834 -508342 -136653 282633 374260 106334 -134304 -42521
32912 -42521 208453 238035 7722 -111161 200975 859115 1503153 1834075 1786649 1510845
32902 1510845 1255535 1168674 1149274 989435 696049 516373 561226 596758 392968 112048
32892 112048 78093 254571 280187 27428 -220173 -241852 -185573 -204903 -105963 326961 864005
32881 864005 1069889 938609 912791 1219985 1516857 1363026 850977 556207 896994 1668191
32871A668191N79098j6444m32362m12055k86630m15569n94788l86857R3438K61731
32861E7753j3585j70960J16941L76503J39643k13356n5708M10484M45474j5335
32851A077854k42637J19362N18279M04168N1047L1493K93872K78069k17057p24979
32841A589471p02060j73183K98883K11515l48406p94683o85703j93233J68573
32832f28826J57899m1331j72287j46864J6022K14636K40324L823k22492q0511
32822f59607L48032N98415M34180R2193j18104j35091j6887J62094K14030j3580
32812I05675l09437k80298N4883K50930J17074m1949j7873k6960j97994k45616
32802B08435o739J74641K6525j27367P1881L23082J26238l43641m68375j36770
$$ plain form
32871 1668191 2247289 2230845 1798483 1386428 1099798 684229 89441 -297416 -203978 57753
32861 57753 44168 -126792 -9851 366652 506295 292939 237231 647715 1093189 1077854
32851 1077854 835217 954579 1472858 1877026 1928073 1959566 2253438 2531507 2314450 1589471
32841 1589471 887411 714228 1013111 1224626 876220 81537 -604166 -797399 -628826
32832 -628826 -470927 -512258 -684545 -831409 -815387 -600751 -360427 -356604 -579096 -659607
32822 -659607 -311575 286840 721020 813213 695109 560018 543131 705225 919255 905675
32812 905675 596238 315940 370823 621753 738827 696878 679005 652045 454051 208435
32802 208435 201696 376337 402862 275495 347376 670458 796696 453055 -15320 -152090
32792a52090J71532J97935J89795L27992M23995L21470J50942L5624r0546k45024
32782A331625k99984k30402j70361j48658n5462P4208N1766j22544k17437j54885
32772E7866j33339k63529l71872k94062j08393M6231J48903J81746O9620j44069
32762h10898k67926k14160q7767M1939K25904M09400L85634J20091j05473m5047
32752c48303J84361K77815J08993j90859l88631l07979J3253K66019J61635j56685
32742c80381k29541Q8892L88679K81816l1764p1864J97322L01402o4380n77034
32732i6853o63762k04621L28586M47221K02800L3135J41244K82427K23243J11639
32722H05059J65799K39513M2680l39992n33219m27811k72764k08549j06546N8037
$$ plain form
32792 -152090 19442 217377 407172 735164 1159159 1480629 1631571 1667195 1576649 1331625
32782 1331625 1031641 801239 630878 482220 426758 500966 552732 430188 212751 57866
32772 57866 -75473 -339002 -710874 -1004936 -1113329 -1067098 -918195 -736449 -666829 -810898
32762 -810898 -1078824 -1292984 -1380751 -1338812 -1112908 -703508 -317874 -197783 -303256 -348303
32752 -348303 -163942 113873 222866 32007 -356624 -664603 -651350 -385331 -223696 -380381
32742 -380381 -609922 -521030 -132351 149465 117701 45837 243159 544561 480181 -96853
32732 -96853 -760615 -965236 -636650 -189429 13371 46506 187750 470177 693420 805059
32722 805059 970858 1210371 1253051 913059 379840 -47971 -320735 -529284 -635830 -577793
32712e77793P7977q7836j48817P6746L51550L68238J59461n1210j79095k40828
32702b51607j84403K2145K72684M50499N20218L94344l8906n90795p61557l27078
32692d94456K72271M22116O9518l06353l34860p5370K27269M11000M05861K13405
32682H10401m3255j73089q8108J05580J88936K1612k83982m19624k30088N3831
32672e7786J12631n750k597J45827J50375o6920k27207j94002j87751l10189k97693
32661i41062k5876J67903J9616j94945j31484N2558N9172L5248K50452M69956
32651b38462K73426j63934k53990R2476L53066K15961p2796k62433m22526n57982
32641a037194m36186l8564K62568K38112J32299K05378L12808K45966J80433M09549
$$ plain form
32712 -577793 -499816 -587652 -736469 -659723 -308173 60065 219526 168316 -10779 -251607
32702 -251607 -436010 -413865 -141181 309318 829536 1223880 1184974 594179 -167378 -494456
32692 -494456 -222185 199931 269449 -36904 -371764 -447134 -219865 191135 596996 810401
32682 810401 767146 594057 505949 611529 800465 822077 538095 118471 -111617 -57786
32672 -57786 54845 49095 46498 192325 342700 275780 48573 -145429 -333180 -643369 -941062
32661 -941062 -966938 -799035 -779419 -974364 -1105848 -1053290 -994118 -958870 -708418 -238462
32651 -238462 34964 -128970 -382960 -290484 62582 278543 205747 -56686 -479212 -1037194
32641 -1037194 -1473380 -1511944 -1249376 -1011264 -878965 -673587 -360779 -114813 65620 475169
32631D75169P99500Q60729L41194m61020r79458q86549l72782L4109M690k44382
32621d28800k64025J8785K42205J60843l8435p1432O0096J79056K16709K10224
32611B85226J68756R8662N0747L1811j3902n5929L2435K31771K94305N8823k78965
32600I03740l81915j83266P4001J69796J24095O0664j6623k00081m49586n23546
32590d22721k57299J55732L48011K46654J34536J86411K17555M0626k08987l28552
32580A11966l62259l87653k59980Q8935L60130L05905J87523L28913M58982J18294
32570I50756m39406m86232M5127M27328K67848Q620M0063P4714j74147l67675
32560C46996j49637J61018R4536j71773j66902N1262Q2991k9677J06605M41261
$$ plain form
32631 475169 1274669 2135398 2476592 2015572 1036114 149565 -223217 -189108 -184418 -428800
32621 -428800 -692825 -674040 -431835 -270992 -309427 -380859 -320763 -141707 75002 285226
32611 285226 453982 552644 603391 635202 621300 565371 597806 829577 1123882 1182705 903740
32600 903740 521825 338559 412560 582356 706451 767115 750492 550411 100825 -422721
32590 -422721 -680020 -524288 -176277 70377 204913 391324 608879 649505 440518 111966
32580 111966 -250293 -637946 -897926 -808991 -448861 -142956 44567 373480 832462 950756
32570 950756 511350 25118 70245 497573 765421 774041 814104 888818 714671 346996
32560 346996 197359 358377 452913 281140 114238 165500 248491 218814 325419 766680
32550G66680M41445o1430n40645m90294p4760J72102L9744k07883k67776j76448
32540c99265j77342k76986j40359L93997Q78787P30449R0871k87156j12982N7555
32530G57569k29888o00512n32854k35886k18513l77741k37854J33300K00839j09754
32520a451294k69983N465L85190N10219M20589K58556L1656j71780j58513K1571
32510d18324P2000q9724k23115j93694j32115r4550K7932J77056J35483k6907
32500g65958L0559L16945M02802J14795j42561k4505K47285L26568K62869K20640
32490I89439Q0352k53006m78216l04117J8595L2998k46426m36549l96482k69540
32480a262952n0197L69496P54225O58109J05242l16477k20047Q6831Q7795k49239
$$ plain form
32550 766680 1208125 1146695 606050 115756 40996 213098 252842 44959 -222817 -399265
32540 -399265 -576607 -853593 -993952 -599955 278832 1009281 1100152 812996 700014 757569
32530 757569 527681 -72831 -605685 -841571 -1060084 -1437825 -1675679 -1542379 -1341540 -1451294
32520 -1451294 -1721277 -1715812 -1330622 -820403 -399814 -141258 -109602 -281382 -439895 -418324
32510 -418324 -346324 -436048 -659163 -852857 -984972 -1079522 -1051590 -874534 -739051 -765958
32500 -765958 -735399 -418454 -15652 99143 -43418 -67923 179362 505930 768799 989439
32490 989439 1069791 816785 338569 34452 53047 86045 -160381 -596930 -993412 -1262952
32480 -1262952 -1313149 -943653 -189428 468681 573923 257446 37399 124230 212025 -37214
32470c7214n15247m18835p2833J93701J53333j35022l59100k25958K30492O64737
32460e21946P66345N16583J11039k26157l21988j32200J54861K37029M5588j51465
32450D77689j21550P830r692j16677o7289R3190L7239k70523l88403l4028M01612
32439I398L48547j16484l76494j58193J50328J52518k8731r5966p2492j22649
32429c10218j41933Q3841M38214N65568L77128J50268R8399J14500J3505j84943
32419A204329l17212k88022j45018j5250o36r1438j86509k10502j44842N1107
32409a43993L85780O60077N79493J72643j43396j09870M437j65416n18502o82573
32399C8680n69387l62947j14694K33059N21296N00348K39605K3546r9974k66180
$$ plain form
32470 -37214 -552461 -971296 -1044129 -850428 -697095 -832117 -1191217 -1417175 -1186683 -521946
32460 -521946 244399 760982 872021 645864 323876 191676 346537 583566 629154 477689
32450 477689 356139 363969 354277 237600 170311 263501 300740 30217 -358186 -392214 9398
32439 9398 357945 241461 -135033 -293226 -142898 9620 -19111 -115077 -187569 -310218
32429 -310218 -452151 -368310 69904 635472 1012600 1162868 1261267 1375767 1389272 1204329
32419 1204329 887117 599095 454077 438827 438191 346753 160244 -50258 -195100 -143993
32409 -143993 241787 901864 1481357 1654000 1510604 1400734 1405171 1239755 721253 38680
32399 38680 -530707 -893654 -1008348 -775289 -253993 246355 485960 509506 409532 143352
32389A43352l80877k43507k7377r2815l13066j77936L41837O54026M54056J57278
32379E14971J41716J59339r9135l79814l01781k7276R195k23770l94317l20603
32369i21475p9588J97246L33292J53341j95210k61837O9398L16340J28262j24973
32359c85204L2240L58729K88754j28162l38171j82114k6112m5795j6336J39821
32349c02350J74666o225j76797k10754k26433k23507k0198L31438M90054L22915
32339A52809Q4577j4163l8832l1594J11478L17781K94079j1432k70042k75165
32329C19496k08204k07261q6973K24290L64614N1572l81490m05789o4103J40003
32319b53845L0558l4880J95896M46976L38588m4243k86059k25075j20315k09651
$$ plain form
32389 143352 -237525 -481032 -508409 -601224 -914290 -1092226 -750389 -96363 357693 514971
32379 514971 656687 816026 716891 337077 35296 8020 17215 -206555 -600872 -921475
32369 -921475 -1001063 -803817 -470525 -317184 -512394 -774231 -704833 -388493 -260231 -385204
32359 -385204 -352964 5765 294519 166357 -171814 -353928 -380040 -425835 -442171 -302350
32349 -302350 -127684 -133909 -310706 -521460 -747893 -971400 -991598 -660160 -170106 152809
32339 152809 237386 223223 184391 152797 264275 582056 876135 864703 594661 319496
32329 319496 111292 -95969 -182942 41348 405962 457534 76044 -329745 -393848 -253845
32319 -253845 -223287 -258167 -62271 384705 723293 679050 392991 167916 47601 -162050
32309a62050l49427k60343K1089J93389J58356J43790K74006L16292O5637k57512
32299A43227k85108k8593J72860J39070q331j20526j40646L518L11397N24518
32289G11386L44555j26699m42336l48435k5275K20934K52909Q5089j56593k41158
32279B74377n8846J64098J44364j3856J1350J94399J92738l4063j06176J48916
32269I17301L93403K95270l7858l36906n16075n38347l08915N9933K21716P5189
32259B24711n7779M0538J41998J6520j66902j95808j89999k62362j90776J34062
32249e05797L02174l0380m36266k24698M95313R04680O12121Q3177j70715k48011
32239G81598m44223o41237m92443m207M00161L70110O990k69192j83458R1448
$$ plain form
32309 -162050 -511477 -771820 -750731 -557342 -398986 -255196 18810 335102 400739 143227
32299 143227 -141881 -170474 2386 141456 133125 12599 -128047 -124529 186868 711386
32289 711386 1055941 929242 486906 138471 113196 334130 587039 672128 515535 274377
32279 274377 215531 379629 523993 510137 521487 715886 908624 874561 768385 917301
32269 917301 1310704 1605974 1568116 1231210 715135 176788 -132127 -72194 149522 224711
32259 224711 166932 207470 349468 365988 199086 3278 -186721 -449083 -639859 -505797
32249 -505797 -203623 -234003 -670269 -894967 -399654 505026 1117147 1200324 1029609 781598
32239 781598 337375 -303862 -796305 -800512 -400351 -30241 -23251 -292443 -475901 -384453
32229c84453J58994p2923k61592j30989J13613J02235j43312k82426j93272r3425
32219a187550j23654j40161p163J67934K20938J70788J47580J92639K27137J63139
32209a68373K329j42771j38187J9285J80248K15992J44274L8117q5584k17954
32199a52624l10006l43253l35582k39643l225K34034K39591N1757l7118M5766
32189h50303N0052p5733M511L93225O00214K46113k53852k48460J87794M30289
32179D83850K36809r4132l44539n22596m77929m0740M55867M55009L4150j73383
32169A2366o76K4657l34984n61250k58496J69185J99169L712M2570K59046K46333
32158a98368n1949l11127l20545j11510K30314N31010N08056J31014j91212j14811
$$ plain form
32229 -384453 -225459 -298382 -559974 -690963 -577350 -475115 -618427 -900853 -1094125 -1187550
32219 -1187550 -1311204 -1451365 -1458528 -1290594 -1069656 -898868 -751288 -558649 -331512 -168373
32209 -168373 -166044 -308815 -447002 -427717 -247469 -31477 112797 150914 65330 -152624
32199 -152624 -462630 -805883 -1141465 -1381108 -1384333 -1150299 -910708 -858951 -896069 -850303
32189 -850303 -800251 -875984 -871473 -478248 121966 368079 114227 -134233 53561 483850
32179 483850 720659 626527 281988 -240608 -718537 -759277 -303410 151599 185749 12366
32169 12366 11690 36347 -298637 -859887 -1118383 -949198 -750029 -746317 -703747 -444701 -198368
32158 -198368 -250317 -561444 -881989 -993499 -763185 -232175 275881 406895 215683 100872
32148A00872J52156J97957J3259j24895j61999k39334l12906k22761m7020j94
32138f44865o0624n8568l2741j16571j66893O5045M30359M86533J39843k07408
32128a65890k20118L747K03399K72396K19633R2414J7602Q4623J61753P1183q3350
32117F57392p3470J0404j23023l88421l49782M1295K46691l5538l25004o9246
32107d08702M63592N46951N6204m07376m18756j98064p2817j246R9086p341m73051
32096h21520q79407o61535M9347N09168L66410J00874K21700M77294L13725j67180
32086d91124l03316J07784M76248K98664j21357j81039J29735K80418R54l80395
32076a83428m20700r0381K67135L35817J09361j61234k70107k74780l23180l24465
$$ plain form
32148 100872 253028 450985 464244 339349 177350 -61984 -374890 -597651 -644671 -644865
32138 -644865 -705489 -764057 -796798 -913369 -1080262 -1015217 -584858 -98325 41518 -165890
32128 -165890 -386008 -382261 -178862 93534 313167 405581 423183 507806 669559 740742 657392
32117 657392 583922 594326 471303 82882 -266900 -225605 21086 -14452 -339456 -408702
32107 -408702 54890 601841 658045 250669 -168087 -366151 -438968 -440214 -341128 -348469 -821520
32096 -821520 -1700927 -2362462 -2313115 -1803947 -1437537 -1336663 -1114963 -637669 -323944 -491124
32086 -491124 -794440 -686656 -210408 88256 -33101 -214140 -84405 196013 196967 -183428
32076 -183428 -604128 -694509 -427374 -91557 17804 -143430 -413537 -688317 -1011497 -1335962
32066a335962n2482L75664M72205M0615m47120m45083n3254K20182K05429J52613
32056h67193K02879K39602K24661K48804K50445R4633p5583k592J69782L7478
32046E22916l51200m69961j48094J40461P3132j3057K05043L95276J42711k55743
32036B41484k16133J64612K48791j13462l59896j12291K77900L02886q629k43235
32026A82027j73886O0080J80952K5112l07785m86777k83666R2700K00263n5268
32016e66248k89342j79832J15888K40472J13985o3709j25329n0078J19733K86904
32006c97556L00043J03912j68525l60745m48390m26369k05668J91338M86125M56062
31996d69773K98082L80991O62349O83440K18096l81016o39771n19252l20646k34726
$$ plain form
32066 -1335962 -1388444 -1012780 -540575 -499960 -947080 -1392163 -1445417 -1225235 -1019806 -867193
32056 -867193 -664314 -424712 -200051 48753 299198 393831 318248 315656 485438 522916
32046 522916 171716 -298245 -446339 -305878 -232746 -245803 -40760 354516 497227 241484
32036 241484 25351 189963 438754 325292 -34604 -146895 131005 433891 425262 182027
32026 182027 8141 68221 249173 274285 -33500 -520277 -803943 -711243 -510980 -566248
32016 -566248 -855590 -1035422 -919534 -679062 -565077 -628786 -754115 -804193 -684460 -397556
32006 -397556 -97513 6399 -162126 -522871 -971261 -1397630 -1603298 -1411960 -925835 -469773
31996 -469773 -171691 209300 871649 1555089 1773185 1392169 752398 233146 -87500 -322226
31986c22226k25096k30329k29681j63418j0741P9986n3517l11137m10213k46835
31976b123207K3086K67920M98440O45580N06392Q5104k46514j78048J03101J74520
31966b43626k4374j72951j21414j01867k72214l83012j65706J63963J49748k11379
31956a382832l93838p8381L51872L11679j74586m97459k67371K36495N09100M09478
31946i75843J24446j91257m40773m19547J918N45853P19706M18950O4009L9496
31936a13042K51749L69243K59157J2719k60873m65712m88534l21613j17041P800
31926h66147R5537J82303J87009R3614L7579N4077l0408k60788l60895j34913
31916a003032J82628K78643K20263K12898J58518r2793k68970j1375M29703M41092
$$ plain form
31986 -322226 -547322 -777651 -1007332 -1170750 -1181491 -1101505 -1155022 -1466159 -1876372 -2123207
31976 -2123207 -2100121 -1832201 -1333761 -688181 -181789 -96685 -343199 -521247 -418146 -243626
31966 -243626 -268000 -440951 -562365 -664232 -936446 -1319458 -1485164 -1321201 -1171453 -1382832
31956 -1382832 -1776670 -1855051 -1503179 -1191500 -1366086 -1863545 -2130916 -1894421 -1385321 -975843
31946 -975843 -851397 -1042654 -1483427 -1902974 -1901056 -1355203 -635497 -216547 -152538 -113042
31936 -113042 138707 507950 767107 779826 518953 53241 -435293 -756906 -873947 -866147
31926 -866147 -770610 -588307 -401298 -307684 -270105 -216028 -246436 -507224 -868119 -1003032
31916 -1003032 -820404 -541761 -321498 -108600 49918 -42875 -311845 -323220 106483 547575
31906E47575j5373l25631j73492M8302l2689k18570k08503r2993m0197N3029K39133
31895b19409K77488Q8867K5841K66326L67324n1728n57516m63770J10349M13575
31885B57347J69199j60509k07979j51534k13970k74109j84740m1283O3596J89324
31875e54658K96351K10396m309j3730K41032L38801l597m22668l63993J50902
31865a25473N57740M62472L2415l09576l62327k77389l20619n32135o33103l57924
31855a865919J31508L52357J02702k37074j70531K79671O06134M42529k7121l20899
31845g06643k05845R2132K10074R0766m778Q5992J94868J30379J7369P7965K17483
31834A99762J75751L2434J41099M90996N72114Q7953n71107q58509p65478o32308
$$ plain form
31906 547575 532202 206571 33079 81381 48692 -169878 -378381 -471374 -511571 -458542 -219409
31895 -219409 58079 146946 172787 439113 806437 754709 197193 -266577 -156228 257347
31885 257347 426546 266037 58058 -93476 -307446 -581555 -766295 -807578 -743982 -554658
31875 -554658 -258307 -47911 -52220 -65950 175082 513883 510286 87618 -276375 -125473
31865 -125473 432267 894739 927154 617578 255251 -22138 -342757 -874892 -1507995 -1865919
31855 -1865919 -1734411 -1382054 -1279352 -1516426 -1686957 -1407286 -801152 -358623 -385744 -706643
31845 -706643 -912488 -820356 -610282 -519516 -524294 -438302 -243434 -113055 -95686 -17721 199762
31834 199762 375513 407947 549046 1040042 1612156 1700109 1129002 270493 -494985 -1127293
31824a127293n22349k32354J89216M03096L00511J78084K76779M54066M65622
31815C85378L22770J87865J04008K8380j70N6681N7318j91632o08731q23588n71969
31804a053690L393N19099P19569N93498K41423j87127m55473l61709J0085L11028
31794C40096L06649J15421k4857o8713q9301o0659M8883P9485j38665m50328n12844
31783d54833k72919k1406N2130N3735P1486k475j99363l24181k56034j34928p2174
31772a560962N3784L07512M80269M12349K70415K31434J61937o5014k14804o3590
31762A3330J24208j3101k63661j56574J58666N1271m99383p01363j47237M69521
31752i64323L56694j86136k60788K54038N89649L12996p6892o972L13877L19923
$$ plain form
31824 -1127293 -1649642 -1881996 -1692780 -1289684 -989173 -811089 -534310 -80244 385378
31815 385378 708148 896013 1000021 1028401 1028231 1084912 1142230 950598 341867 -481721 -1053690
31804 -1053690 -1050297 -531198 188371 781869 1023292 836165 380692 18983 29068 340096
31794 340096 646745 762166 737309 668596 579295 518636 567519 647004 508339 58011 -454833
31783 -454833 -727752 -749158 -697028 -643293 -571807 -574282 -773645 -1097826 -1353860 -1488788 -1560962
31772 -1560962 -1507178 -1199666 -719397 -307048 -36633 194801 356738 291724 76920 13330
31762 13330 137538 124437 -139224 -295798 -137132 -85861 -585244 -1286607 -1433844 -964323
31752 -964323 -607629 -793765 -1054553 -800515 -210866 102130 25238 18266 332143 652066
31742F52066j3338k16936j27496j05667l63298n23721j58152N00350P78431M42343
31732H64582l1031j52793k9981m1146j98864k10307k8463Q1543K5860J9585J36444
31721D35429J16301j60311l52497j38910K34242K77522j2113j75853k2266J13114
31711C14658m1986k46508j48222J40683K04746o7753l63215m01584k24776J0069
31701h23888K42808L95338L00109l3620k51683l6797M07271N51670K39921j22956
31691H68173j85418j20740k31551l71876j85319K05243K49559k03165n94413m21724
31681i91231O0384K63002J12354K1244J43465J68315q4707l29214k61667J5347
31671h82708K60668M70571O82461O70125K36649l34789n50601l87533k85313m29375
$$ plain form
31742 652066 638728 421792 294296 188629 -174669 -698390 -856542 -356192 422239 864582
31732 864582 833551 680758 650777 609631 410767 200460 171997 253540 279400 298985 435429
31721 435429 551730 391419 38922 -99988 134254 411776 399663 223810 201544 314658
31711 314658 272672 26164 -122058 18625 223371 155618 -207597 -609181 -833957 -823888
31701 -823888 -581080 -185742 114367 80747 -170936 -207733 199538 751208 991129 868173
31691 868173 682755 562015 330464 -41412 -226731 -21488 228071 24906 -569507 -991231
31681 -991231 -930847 -667845 -555491 -534247 -390782 -222467 -307174 -636388 -898055 -882708
31671 -882708 -622040 -151469 530992 1201117 1437766 1102977 552376 164843 -120470 -549845
31661e49845m82091j77147K26997L40300J62487p0210k67189l88324k46164J82567
31651a268619M61181J95102k91063l04565K19651O29006N12398J59633r4049l47187
31641a28512o30243n39965R9575O88231N91900R8050m5047J98205K01338j87847
31631C45685l85119p8599K63760J96752m7582j06208j14370k93140l78868n6114
31621f53803L61870L17394r6495k48147O2538L39901J93654j22398j86702k0028
31611e2216N2979j15435m05443o38858o69219m08108M2222L84998M28766L15426
31601a064888L04336M04686L85083J19753k24401l71159k17910Q5716K86561K40343
31591e1880J3647j99509k52465j38293M5545J65478J18309o8328j95761o9414
$$ plain form
31661 -549845 -1031936 -1209083 -982086 -641786 -479299 -549509 -816698 -1205022 -1451186 -1268619
31651 -1268619 -807438 -612336 -903399 -1207964 -988313 -359307 153091 312724 218675 -128512
31641 -128512 -758755 -1298720 -1199145 -510914 80986 179036 133989 332194 533532 345685
31631 345685 -39434 -118033 145727 342479 294897 188689 74319 -218821 -597689 -653803
31621 -653803 -291933 25461 -71034 -319181 -256643 83258 276912 154514 -32188 -52216
31611 -52216 763 -114672 -520115 -1158973 -1828192 -2236300 -2194078 -1809080 -1380314 -1064888
31601 -1064888 -760552 -355866 29217 148970 -75431 -446590 -664500 -578784 -292223 -51880
31591 -51880 -38233 -237742 -490207 -628500 -582955 -417477 -299168 -367496 -563257 -632671
31581f32671K39611M15712K60734n3532j97871q5850O6816O0052n4660r9024k1948
31570a02631N9899L6296o6677j46903j64737j73097k10696k13577q3869J58404
31560i07588L51309L52414J89098J5135m2984M4787K35964M15023M04375J13264
31550A170797k96306n21336m56508k96134k16623j18816J39824L95139L39000
31541A39037M638k17202j24895K1235o4941k46564k03721N8054K37405J90606
31531b06348O8260K1250L0794M5478N6417J1177j31179k38370j27268J16626J86673
31520a66490j0453k13908j99512o6045J293J5755O2440R2402M1747q950J4294
31509d37427K5103k9763J4408K91060N89591N57592J69071k33507l46189j77446
$$ plain form
31581 -632671 -393060 22652 283386 229854 31983 -53867 12949 73001 18341 -80683 -102631
31570 -102631 -42732 -6436 -73113 -220016 -384753 -557850 -768546 -982123 -1065992 -907588
31560 -907588 -556279 -203865 -14767 368 -42616 2171 238135 653158 1057533 1170797
31550 1170797 874491 353155 -103353 -399487 -616110 -734926 -595102 -199963 139037
31541 139037 143675 -73527 -198422 -177187 -242128 -488692 -692413 -634359 -396954 -206348
31531 -206348 -138088 -116838 -86044 -40566 15851 27028 -104151 -342521 -469789 -353163 -166490
31520 -166490 -176943 -390851 -590363 -656408 -655115 -639360 -576920 -484518 -442771 -451721 -437427
31509 -437427 -412324 -442087 -427679 -136619 452972 1010564 1179635 946128 599939 422493
31499D22493N3446J35276J2337j68445k11827j41659j62984k72210j73408K08045
31489b98936M38115J69418k35758j86576J79305J38891m75562r19268n75025J79987
31479a585409N35831K95380q3928k45027k52547k35477j29028J43341M74818O52356
31469d29690N26916J16405l67392o43431o12090m28744k63249j02094J13143L00325
31459a789901L52720L23666L15356K81819J42195J0832Q0592K97526L82548K12486
31449F09839k2100j10333r7641j55663l01005l91141l49717k47777j41804K9893
31439a177449K83522M16647J98105k47259m68318k39865J15582J80128K8530K8246
31429h82131J80508J28100j57789k26328J07734L59465Q5710l90231m44587p6060
$$ plain form
31499 422493 475939 611215 623552 455107 243280 101621 -61363 -333573 -506981 -298936
31489 -298936 139179 308597 72839 -113737 65568 204459 -271103 -1190371 -1765396 -1585409
31479 -1585409 -1049578 -754198 -838126 -1083153 -1335700 -1571177 -1700205 -1556864 -1082046 -429690
31469 -429690 97226 213631 -153761 -797192 -1409282 -1838026 -2101275 -2203369 -2090226 -1789901
31459 -1789901 -1437181 -1113515 -798159 -516340 -374145 -363313 -282721 14805 397353 609839
31449 609839 587739 477406 379765 224102 -76903 -468044 -817761 -1065538 -1207342 -1177449
31439 -1177449 -893927 -477280 -279175 -526434 -994752 -1234617 -1119035 -938907 -910377 -882131
31429 -882131 -701623 -573523 -731312 -957640 -849906 -490441 -404731 -794962 -1239549 -1315609
31419a315609J78093J11304N6258K05292K79786O7682j52430k0438L48268N14596
31409B72802K93830m9922j46137P5616L07429J69486l44706p71074o66584j60305
31399a019565J94818J16478j19203j45266K0573J26982R0399K9680L3053R0040
31389e82011J76508K41778J73698o8718l24701l70820j80324O0509J88671K26374
31379d59036K91669M08987M51541K83068n4121l42473m12671l04412j52761o836
31369b97045J32836J95800J29241L9883N6394R5732j3901k02941k09977J4708
31359e9270K15810K05642P7944l3879j55565l09130l87425l29208k15163q1028
31349a071272J33515L43555L11681M4517r8532Q7396L14333K27845q6911l09313
$$ plain form
31419 -1315609 -1137516 -1026212 -969954 -764662 -484876 -417194 -569624 -590062 -241794 272802
31409 272802 566632 516710 370573 446189 753618 923104 578398 -192676 -859260 -1019565
31399 -1019565 -824747 -708269 -827472 -972738 -952165 -825183 -734784 -705104 -672051 -582011
31389 -582011 -405503 -163725 9973 -58745 -383446 -754266 -934590 -874081 -685410 -459036
31379 -459036 -167367 241620 693161 976229 922108 579635 166964 -137448 -290209 -297045
31369 -297045 -164209 31591 160832 200715 257109 352841 338940 135999 -73978 -59270
31359 -59270 156540 362182 440126 406247 250682 -58448 -445873 -775081 -990244 -1071272
31349 -1071272 -937757 -594202 -282521 -238004 -336536 -249140 65193 293038 206127 -103186
31339a03186l44729k67096m6970K89774M38859J66787k64934m26857l24653k47299
31329a130304j79633R7359M10827L20323j10726k83773K5152L09237J58128j00950
31319d84360J2744L42950L79445O4918j73134r3616O8269m922l03261n15965l43203
31308a050135J81555O23479N42161L0068l46322k49109L8929R0415p3904j30817
31298c43680J8584J68032J36542n9586k72232k98629m7464K33869J38881l09625
31288f35308n55731k55900K10196L31858K16870K56798L54030J27945k72165k80833
31278e02240J40770L73225J03661k20309j60272O6144O6533p1569l4909J36014
31268a02952J43894p9933l19440l74760k01818R1167K36333J9427l58659m17734
$$ plain form
31339 -103186 -447915 -715011 -761981 -472207 -33348 133439 -131495 -558352 -883005 -1130304
31329 -1130304 -1309937 -1212578 -801751 -481428 -592154 -875927 -850775 -541538 -383410 -484360
31319 -484360 -471616 -128666 250779 315697 142563 48947 117216 112294 -190967 -706932 -1050135
31308 -1050135 -868580 -245101 297060 327128 -19194 -268303 -229374 -138959 -212863 -343680
31298 -343680 -325096 -157064 -20522 -80108 -352340 -650969 -698433 -464564 -325683 -635308
31288 -635308 -1191039 -1446939 -1236743 -904885 -688015 -431217 -77187 50758 -221407 -502240
31278 -502240 -361470 11755 115416 -104893 -265165 -199021 -132488 -204057 -238966 -102952
31268 -102952 40942 -38991 -358431 -733191 -935009 -843842 -607509 -588082 -946741 -1364475
31258a364475n5935K68042K14251K6729K2684L5431j98644m46644l05869R7412
31248a707018K76033J23940j9457K8340J16450J51672J99128K02522M9097r7051
31238f76344K0584K44736J73602j48804k53065l3225O7967j57759l05042o2244
31228a129594K36406J69319r8613j48589L0873J71443K31235L09439K85159J9867
31218G6945k49623j96897M1643P5880q0580q0945P3135j728l40694m46717o5776
31207a195357L63388L74249J67746K07400M22623L41849r5579l94230k50317J414
31197e6814q4030l97611m56248j02490L01466L85536K02290L3165l2096j23053
31187c29885k81241l42145j64862J57179L86442L76050J76020l5885r8989K873
$$ plain form
31258 -1364475 -1420410 -1152368 -938117 -911388 -888704 -853273 -1051917 -1498561 -1804430 -1707018
31248 -1707018 -1430985 -1307045 -1326502 -1298162 -1181712 -1030040 -830912 -628390 -579293 -676344
31238 -676344 -655760 -411024 -237422 -386226 -639291 -672516 -604549 -762308 -1067350 -1129594
31228 -1129594 -893188 -723869 -822482 -971071 -940198 -768755 -537520 -228081 57078 76945
31218 76945 -172678 -369575 -327932 -252052 -332632 -413577 -340442 -342170 -682864 -1129581 -1195357
31207 -1195357 -831969 -457720 -289974 -82574 340049 681898 586319 192089 -58228 -56814
31197 -56814 -140844 -538455 -994703 -1097193 -795727 -410191 -207901 -174736 -206832 -329885
31187 -329885 -611126 -953271 -1118133 -960954 -574512 -198462 -22442 -58327 -157316 -154443
31177a54443J36120J75413J49007J61085K05515J75085M9304o2514q5893n7003
31167F91676j2593M8655O7229m1872k05327k36130j36657j36871l09473l89019
31157f60382j72963J18310J52629q188l2877J38150K17813M5191j79639k17732
31147e99688j00571M123N7731J45855L02988M46882M61356L15357J13017j2563
31137A134487q0019k31710m61252n31944l18507o0987l8231j22925K1658L63008
31127c26422M83702J97455j61157k11225k4713M0922j63508m36649m89738k30422
31117a321755J60259L82930L17290J56874J41062K05167R2053k08902l89207k47691
31107g11920M4442K02873J52059j6651k17206l70910l85024k47758m5494J61485
$$ plain form
31177 -154443 -18323 157090 306097 467182 672697 847782 897086 834572 748679 691676
31167 691676 679083 727738 794967 753095 547768 311638 174981 38110 -271363 -660382
31157 -660382 -833345 -715035 -562406 -570594 -603471 -465321 -247508 -202317 -381956 -599688
31147 -599688 -700259 -696136 -638405 -492550 -189562 257320 718676 1034033 1147050 1134487
31137 1134487 1054468 822758 361506 -170438 -488945 -549932 -588163 -711088 -689430 -326422
31127 -326422 157280 354735 193578 -17647 -42360 -1438 -164946 -601595 -1091333 -1321755
31117 -1321755 -1161496 -778566 -461276 -304402 -163340 41827 133880 -75022 -464229 -711920
31107 -711920 -667478 -464605 -312546 -329197 -546403 -917313 -1302337 -1550095 -1595589 -1434104
31097a434104L56673M62369M04367K86289K74603L02389J59869j00693j89318
31088E22444p8788r0668l25665m17931j18942K48930K65858L3529o5982J2062
31078a5153J4141j15409j82759j04338K0259J12557J04110j37203n45833o89939
31068a539567k64940L63349N46956K24288n2419N4004K81720K85538R2816r4472
31058a02727j76595q7854K07704N00882M37465j220m01610m48049k64840r0992
31048d27836O2847K31229K71692Q9659j35347j95503j48307j51933j91874j88516
31038g83889j93311k39510j66813J34492M29365L75052l610l30712l51010j63958
31028a293904P454O4623P104j57655l72037m81210l37071K6265L56844L99809
$$ plain form
31097 -1434104 -1077431 -615062 -210695 75594 350197 652586 812455 711762 522444
31088 522444 443656 352988 27323 -390608 -509550 -260620 5238 38767 -27215 -15153
31078 -15153 -1012 -116421 -299180 -403518 -383259 -270702 -166592 -303795 -849628 -1539567
31068 -1539567 -1804507 -1441158 -894202 -669914 -722333 -668329 -386609 -101071 -8255 -102727
31058 -102727 -279322 -367176 -159472 341410 778875 777655 376045 -72004 -336844 -427836
31048 -427836 -364989 -133760 137932 227591 92244 -103259 -251566 -403499 -595373 -783889
31038 -783889 -977200 -1216710 -1383523 -1249031 -819666 -444614 -448224 -778936 -1129946 -1293904
31028 -1293904 -1286450 -1221827 -1214723 -1372378 -1744415 -2225625 -2562696 -2536431 -2179587 -1779778
31018a779778J92241N5731J85474L47857J91899k02835l81786j45735J94677L10296
31008a031959K79037L14851L60019K44210N1144l822M2624l9159k55377l22094
30998c60526p3377K66869L21198p659l90536l81268O7869M49902K48062l71167
30988b30633o98097l92110J04534K64885J94470K79814M55745L50789m588j78330
30978A46479k9055J18943N8051k3370K7922N6516o3414j95140k37774l07995m21955
30967h70792l44211L932L13707L41675K78600L43624L16257r7335o31669o79611
30957a025823j06955N53098P46878M19758j25867n66705o89404m77304j77090
30948a449414p4131j39344r8106J26558K95375K41363J05733O7068R0980J06627
$$ plain form
31018 -1779778 -1587537 -1531806 -1346332 -998475 -806576 -1009411 -1391197 -1536932 -1342255 -1031959
31008 -1031959 -752922 -438071 -78052 166158 217302 213480 256104 216945 -38432 -360526
30998 -360526 -433903 -167034 154164 146505 -244031 -625299 -557430 -107528 140534 -230633
30988 -230633 -928730 -1320840 -1216306 -951421 -756951 -477137 -21392 329397 324809 146479
30978 146479 117424 236367 294418 271048 298970 355486 292072 96932 -140842 -448837 -870792
30967 -870792 -1215003 -1211071 -897364 -555689 -277089 66535 382792 285457 -346212 -1025823
30957 -1025823 -1132778 -579680 167198 586956 461089 -105616 -795020 -1272324 -1449414
30948 -1449414 -1523545 -1662889 -1760995 -1634437 -1339062 -1097699 -991966 -924898 -833918 -727291
30938g27291J85559L31945L11961l0072m27661m69188j62703P0069k2213k13508
30928a153102j60699J46491M27270M62888K78504N4242l4506O7326K47775L09656
30918F45845J56675j03574k72021k68624k04350k25052k95928k13015J02310M00934
30908b76800L75584J11778O257J63233K09646o7330k69767k671L62138J60775
30898G72843m52197o22407j22641K44569p9407n06423k77548K99005M00699N2621
30888b90886o32M01708O31249M10266K20420L31981K85752k38198p62009p44399
30878B45252l88716j55765K4300M10887P14583M26774k93084p33766n98623k85267
30868f33425j82581k02287j01607J42507L95293M98655L00418j67376n42653m73748
$$ plain form
30938 -727291 -541732 -209787 102174 72102 -355559 -824747 -987450 -917381 -939594 -1153102
30928 -1153102 -1313801 -1167310 -740040 -277152 1352 55594 21088 88414 336189 645845
30918 645845 802520 698946 426925 158301 -46049 -271101 -567029 -780044 -677734 -276800
30908 -276800 98784 210562 216819 380052 589698 522368 252601 249930 612068 772843
30898 772843 320646 -301761 -424402 -179833 -259240 -765663 -1043211 -744206 -343507 -290886
30888 -290886 -291518 110190 741439 1151705 1372125 1704106 1989858 1751660 989651 245252
30878 245252 -143464 -299229 -274929 135958 850541 1277315 984231 250465 -348158 -633425
30868 -633425 -816006 -1018293 -1119900 -977393 -582100 -83445 216973 49597 -493056 -966804
30858i66804j04433R4542k7676j62638o6906J28697J98088Q4999j76479m90229
30848a488839n86237k23202L95058P35960N92308K98166J68477R2232j05756k52620
30838c74453j00992K13157L14735P8642k77938n04314n08565l20421n3197J37291
30828a396055J81948J42788P9803k079k4467J46385M37226N29417K55233j39196
$$ plain form
30858 -966804 -1071237 -976695 -1004371 -1167009 -1233915 -1105218 -907130 -822131 -998610 -1488839
30848 -1488839 -2075076 -2298278 -1903220 -1167260 -574952 -276786 -108309 -16077 -121833 -374453
30838 -374453 -475445 -262288 52447 131089 -146849 -651163 -1159728 -1480149 -1533346 -1396055
30828 -1396055 -1214107 -1071319 -991516 -993595 -1018062 -871677 -434451 94966 350199 211003
$$ [...]
##END NTUPLES=NMR SPECTRUM
##END=
