##TITLE=31Pdec_DE-175rm_3h_2
 D, 64 sc
14.8.2026
##JCAMPDX= 6.0         $$ Bruker NMR JCAMP-DX V2.0
##DATA TYPE= NMR SPECTRUM
##DATA CLASS= NTUPLES
##ORIGIN= UXNMR, Bruker Analytische Messtechnik GmbH
##OWNER= root
$$ XWIN-NMR		Version 3.5
$$ Fri Aug 14 14:54:59 2026 Russian Standard Time (UT+4h)  she@DPX200
##.OBSERVE FREQUENCY= 81.013821
##.OBSERVE NUCLEUS= ^31P
##.ACQUISITION MODE= SIMULTANEOUS
##.ACQUISITION SCHEME= undefined
##.AVERAGES= 64
##.DIGITISER RES= 17
##SPECTROMETER/DATA SYSTEM= spect
##.PULSE SEQUENCE= zgpg30
##.SOLVENT NAME= CDCl3
##.SHIFT REFERENCE= (INTERNAL, CDCl3, 0, 197.392)
##AUDIT TRAIL= $$ (NUMBER, WHEN, WHO, WHERE, WHAT)
$$ ##TITLE= Audit trail, XWIN-NMR		Version 3.5
$$ ##JCAMPDX= 5.01
$$ ##ORIGIN= Bruker BioSpin GmbH
$$ ##OWNER= she
$$ F:/spectra/data/she/nmr/P31/2/pdata/1/auditp.txt
$$ ##AUDIT TRAIL=  $$ (NUMBER, WHEN, WHO, WHERE, WHAT)
(   1,<2026-08-14 14:54:01.95 +0400>,<she>,<DPX200>,
      <created by zg, POWCHK disabled, PULCHK disabled
       configuration hash MD5:
       00 E9 B6 7A A2 85 ED C7 34 08 36 98 17 FE 4E 26
       data hash MD5: 32K
       90 6E BE EF 03 ED 46 35 19 D5 45 62 2D 14 7F 8B>)
(   2,<2026-08-14 14:54:09.84 +0400>,<she>,<DPX200>,
      <Start of raw data processing
       efp BC_mod = 2 LB = 1.5 FT_mod = 6 PKNL = 1 PHC0 = 1948.885 PHC1 = 116.2984 SI = 64K 
       data hash MD5: 64K
       68 60 5F 9F 0D 5B 55 40 A8 B1 71 70 9A 42 0A 35>)
(   3,<2026-08-14 14:54:24.96 +0400>,<she>,<DPX200>,
      <pk PHC0 = -22.26495 PHC1 = 39 
       data hash MD5: 64K
       9E 18 BD 77 CB B0 DE D2 DB 97 FA 45 60 6F D7 86>)
(   4,<2026-08-14 14:54:28.28 +0400>,<she>,<DPX200>,
      <abs ABSG = 5 
       data hash MD5: 64K
       16 1B B5 76 9B 85 F1 1F AA 72 DB 90 34 09 B4 F5>)
$$ ##END=
$$ 
$$ hash MD5
$$ 90 B4 24 F0 0F AE FD E4 70 C9 6D E9 44 6B E1 70
##$RELAX= 
##$RELAX= 
##$RELAX= 
##$RELAX= 
##$RELAX= 
##$RELAX= 
##$RELAX= 
##$RELAX= 
$$ Bruker specific parameters
$$ --------------------------
##$DU= <F:/spectra>
##$EXPNO= 2
##$NAME= <P31>
##$PROCNO= 1
##$TYPE= <nmr>
##$USER= <she>
##$AMP= (0..31)
100 100 100 100 100 100 100 100 100 100 100 100 100 100 100 100 100 100 
100 100 100 100 100 100 100 100 100 100 100 100 100 100 
##$AQSEQ= 0
##$AQ_mod= 1
##$AUNM= <au_zg>
##$AUTOPOS= <>
##$BF1= 81.014009
##$BF2= 200.13
##$BF3= 200.13
##$BF4= 200.13
##$BF5= 200.13
##$BF6= 200.13
##$BF7= 200.13
##$BF8= 200.13
##$BYTORDA= 1
##$CFDGTYP= 0
##$CFRGTYP= 5
##$CHEMSTR= <none>
##$CNST= (0..31)
1 1 145 1 1 1 1 1 1 1 1 1 1 1 1 1 1 1 1 1 1 1 1 1 1 1 1 1 1 1 1 1 
##$CPDPRG= <waltz16>
##$CPDPRG1= <>
##$CPDPRG2= <waltz16>
##$CPDPRG3= <>
##$CPDPRG4= <mlev>
##$CPDPRG5= <mlev>
##$CPDPRG6= <mlev>
##$CPDPRG7= <mlev>
##$CPDPRG8= <mlev>
##$CPDPRGB= <>
##$CPDPRGT= <>
##$D= (0..31)
0 1 0 0 0 0 0 0 0 0.06 0 0.03 2e-05 3e-06 0 0 0.0002 0 0 0 0 0 0 0 0 0 
0 0 0 0 0 0 
##$DATE= 1786704841
##$DBL= (0..7)
120 120 120 11 120 120 24 19 
##$DBP= (0..7)
150 150 150 150 150 150 150 150 
##$DBP07= 0
##$DBPNAM0= <>
##$DBPNAM1= <>
$$ [...]
##$SUBNAM3= <"">
##$SUBNAM4= <"">
##$SUBNAM5= <"">
##$SUBNAM6= <"">
##$SUBNAM7= <"">
##$SUBNAM8= <"">
##$SUBNAM9= <"">
##$SW= 400.765351723535
##$SWIBOX= (0..15)
0 1 3 0 0 0 0 0 0 0 0 0 0 0 0 0 
##$SW_h= 32467.5324675325
##$TD= 32768
##$TD0= 1
##$TE= 0
##$TE2= 300
##$TE3= 300
##$TEG= 300
##$TL= (0..7)
0 120 53 12 22 120 120 120 
##$TP= (0..7)
150 150 150 150 150 150 150 150 
##$TP07= 0
##$TPNAME0= <>
##$TPNAME1= <>
##$TPNAME2= <>
##$TPNAME3= <>
##$TPNAME4= <>
##$TPNAME5= <>
##$TPNAME6= <>
##$TPNAME7= <>
##$TPOAL= (0..7)
0.5 0.5 0.5 0.5 0.5 0.5 0.5 0.5 
##$TPOFFS= (0..7)
0 0 0 0 0 0 0 0 
##$TUNHIN= 0
##$TUNHOUT= 0
##$TUNXOUT= 0
##$USERA1= <user>
##$USERA2= <user>
##$USERA3= <user>
##$USERA4= <user>
##$USERA5= <user>
##$V9= 5
##$VALIST= <valist>
##$VCLIST= <CCCCCCCCCCCCCCC>
##$VD= 0
##$VDLIST= <DDDDDDDDDDDDDDD>
##$VPLIST= <PPPPPPPPPPPPPPP>
##$VTLIST= <TTTTTTTTTTTTTTT>
##$WBST= 1024
##$WBSW= 4
##$XGAIN= (0..3)
0 0 0 0 
##$XL= 0
##$YL= 0
##$YMAX_a= 96762
##$YMIN_a= -54470
##$ZGOPTNS= <>
##$ZL1= 120
##$ZL2= 120
##$ZL3= 120
##$ZL4= 120
##$ABSF1= 197.3918
##$ABSF2= -203.3724
##$ABSG= 5
##$ABSL= 3
##$ALPHA= 0
##$AQORDER= 0
##$ASSFAC= 0
##$ASSFACI= 0
##$ASSFACX= 0
##$ASSWID= 0
##$AUNMP= <proc_1d>
##$AZFE= 0.1
##$AZFW= 0.5
##$BCFW= 0
##$BC_mod= 2
##$BYTORDP= 0
##$COROFFS= 0
##$CY= -3
##$DATMOD= 1
##$DC= 0
##$DFILT= <>
##$DTYPP= 0
##$F1P= 0
##$F2P= 0
##$FCOR= 1
##$FTSIZE= 65536
##$FT_mod= 6
##$GAMMA= 0
##$GB= 0
##$INTBC= 1
##$INTSCL= 9.790993e-09
##$ISEN= 30
##$LB= 1.5
##$LEV0= 0
##$LPBIN= 0
##$MAXI= 10000
##$MC2= 0
##$MEAN= 0
##$ME_mod= 0
##$MI= 50
##$NCOEF= 0
##$NC_proc= -5
##$NLEV= 6
##$NOISF1= 182.463
##$NOISF2= 159.3651
##$NSP= 0
##$NTH_PI= 0
##$NZP= 0
##$OFFSET= 197.3918
##$PC= 4
##$PHC0= 1926.62
##$PHC1= 155.2984
##$PH_mod= 1
##$PKNL= yes
##$PPARMOD= 0
##$PSCAL= 0
##$PSIGN= 0
##$REVERSE= no
##$SF= 81.014063255964
##$SI= 65536
##$SIGF1= 159.3651
##$SIGF2= -187.1042
##$SINO= 113.3802
##$SIOLD= 16384
##$SREGLST= <1H.CDCl3>
##$SSB= 0
##$STSI= 65536
##$STSR= 0
##$SW_p= 32467.5324675325
##$SYMM= 0
##$S_DEV= 0
##$TDeff= 32768
##$TDoff= 0
##$TI= <>
##$TILT= no
##$TM1= 0
##$TM2= 0
##$TOPLEV= 0
##$USERP1= <user>
##$USERP2= <user>
##$USERP3= <user>
##$USERP4= <user>
##$USERP5= <user>
##$WDW= 1
##$XDIM= 65536
##$YMAX_p= 299929754
##$YMIN_p= -22023961
$$ End of Bruker specific parameters
$$ ---------------------------------
##NTUPLES= NMR SPECTRUM
##VAR_NAME=  FREQUENCY,     SPECTRUM/REAL,   SPECTRUM/IMAG
##SYMBOL=    X,             R,               I
##VAR_TYPE=  INDEPENDENT,   DEPENDENT,       DEPENDENT
##VAR_FORM=  AFFN,          ASDF,            ASDF
##VAR_DIM=   65536,         65536,           65536
##UNITS=     HZ,            ARBITRARY UNITS, ARBITRARY UNITS
##FACTOR=    0.49542278885378, 1,            1
##FIRST=     15991.5117654749, 0,            0
##LAST=      -16476.0207020576, 0,           0
##MIN=       -16476.0207020576, -22023961,   0
##MAX=       15991.5117654749, 299929754,    0
$$ Real data points
##PAGE= N=1
##DATA TABLE= (X++(R..R)), XYDATA
$$ [...]
$$ plain form
36669 642185 390958 196900 -3346 -298107 -589736 -627223 -285867 290016 852790 1232956
36659 1232956 1332737 1131512 797047 614299 663424 711935 559434 326966 235572 257017
36649 257017 195692 -8283 -276557 -574842 -861653 -970727 -819650 -644429 -720148 -916202
36639 -916202 -878071 -618677 -520018 -698347 -814189 -673155 -567370 -727986 -837106 -514028
36629 -514028 -19270 31681 -440668 -861288 -801674 -461777 -228121 -141307 -41120 33319
36619 33319 -113217 -501182 -916738 -1133232 -1038658 -614074 39284 672556 1043285 1125796
36609 1125796 1092494 1100141 1166875 1224278 1200377 1078450 950494 949927 1023359 864487 279331
36598 279331 -422793 -672004 -331630 125912 283225 334495 696383 1281683 1584047 1444892
$$ packed form
36669F42185k51227j94058k00246k94761k91629l7487L41356N75883N62774L80166
36659A232956R9781k01225l34465j82748M9125M8511j52501k32468r1394K1445
36649B57017o1325k03975k68274k98285k86811j09074J51077J75221p5719j96054
36639i16202L8131K59394R8659j78329j15842J41034J05785j60616j09120L23078
36629e14028M94758N0951m72349m20620N9614L39897K33656Q6814J00187P4439
36619C3319j46536l87965m15556k16494R4574M24584O53358O33272L70729Q2511
36609A125796l3302P647O6734N7403k3901j21927j27956n67P3432j58872n85156
36598B79331p02124k49211L40374M57542J57313N1270L61888N85300L02364j39155
$$ plain form
36588 1444892 1282686 1420874 1590627 1393128 967710 803995 1006612 1144099 855850
36579 855850 280715 -209364 -419947 -338826 16660 535068 944474 1039675 912040 778387
36569 778387 651545 379834 -18251 -275180 -173995 229452 722098 1120978 1301917 1217673
36559 1217673 999425 907601 1041735 1181882 1051166 669929 308807 143403 122607 160159
36549 160159 258681 386076 409091 281464 187076 340530 684050 917497 833059 518642
36539 518642 217546 78909 79439 121106 157923 249430 492256 862873 1158622 1196544 1083003
36528 1083003 1153087 1554995 2002598 2089352 1806107 1580215 1770402 2267495 2673541 2761031
36518 2761031 2632908 2489226 2380096 2215011 1933955 1629672 1516509 1745831 2192311
$$ packed form
36588A444892j62206J38188J69753j97499m25418j63715K02617J37487k88249
36579H55850n75135m90079k10583Q1121L55486N18408M09406R5201j27635j33653
36569G78387j26842k71711l98085k56929J01185M03447M92646L98880J80939q4244
36559A217673k18248r1824J34134J40147j30716l81237l61122j65404k0796L7552
36549A60159R8522J27395K3015j27627r4388J53454L43520K33447q4438l14417
36539E18642l01096j38637N30M1667L6817R1507K42826L70617K95749L7922j13541
36528A083003P0084M01908M47603Q6754k83245k25892J90187M97093M06046Q7490
36518B761031j28123j43682j09130j65085k81056l04283j13163K29322M46480
$$ plain form
36509 2192311 2459021 2201926 1469456 646640 64085 -241831 -393897 -472637 -519044 -560413
36499 -560413 -482467 -23119 875271 1774041 2068803 1656559 1046602 723946 627196 412259
36489 412259 30263 -222852 -164284 31854 94612 -32621 -228992 -400211 -512757 -491962
36479 -491962 -237042 217486 629937 727586 481485 171656 131390 419509 769289 856574
36469 856574 592977 180729 -66114 17950 278888 349572 49678 -322340 -271375 259249
36459 259249 728234 614601 36120 -438064 -460708 -154769 216739 515941 637081 453225
36449 453225 17688 -361846 -424705 -251307 -139769 -255806 -506269 -712486 -810352 -873515
36439 -873515 -982495 -1097688 -1099867 -970105 -843289 -810231 -772002 -622687 -460040 -399854
$$ packed form
36509B192311K66710k57095p32470q22816n82555l05916j52066p8740m6407m1369
36499e60413P7946M59348Q98390Q98770K94762m12244o09957l22656r6750k14937
36489D12259l81996k53115N8568J96138O2758j27233j96371j71219j12546K0795
36479d91962K54920M54528M12451R7649k46101l09829m0266K88119L49780Q7285
36469H56574k63597m12248k46843Q4064K60938P0684k99894l72018N0965N30624
36459B59249M68985j13633n78481m74184k2644L05939L71508K99202J21140j83856
36449D53225m35537l79534o2859J73398J11538j16037k50463k06217r7866o3163
36439h73515j08980j15193k179J29762J26816L3058L8229J49315J62647O0186
$$ plain form
36429 -399854 -271000 201861 915781 1426878 1550638 1572704 1686057 1577085 907002 -24963
36419 -24963 -502945 -231430 362859 677406 544142 271645 267070 644948 1091112 1140125
36409 1140125 691213 157760 -32816 50562 36244 -202616 -498497 -774257 -1077359 -1234151
36399 -1234151 -920084 -231921 202820 -40971 -619390 -870683 -610064 -159690 223910
36390 223910 537002 689786 425914 -257922 -920620 -1140848 -997410 -865184 -870352 -823862
36380 -823862 -637982 -472008 -370882 -83023 505677 982660 830710 176759 -283857 -193415
36370 -193415 20609 -189822 -716407 -1016791 -903737 -726721 -832982 -1189368 -1549091 -1711305
36360 -1711305 -1577491 -1181391 -705570 -303579 64734 452937 709783 724193 757693 1117830
$$ packed form
36429c99854J28854M72861P13920N11097J23760K2066J13353j08972o70083r31965
36419b4963m77982K71515N94289L14547j33264k72497m575L77878M46164M9013
36409A140125m48912n33453j90576Q3378j4318k38860k95881k75760l03102j56792
36399a234151L14067O88163M34741k43791n78419k51293K60619M50374L83600
36390B23910L13092J52784k63872o83836o62698k20228J43438J32226n168M6490
36380h23862J85880J65974J01126K87859N88700M76983j51950o53951m60616R0442
36370a93415K14024k10431n26585l00384J13054J77016j06261l56386l59723j62214
36360a711305J33814L96100M75821M01991L68313L88203K56846J4410L3500L60137
$$ plain form
36350 1117830 1546965 1438265 739664 111361 -20749 -30952 -368542 -774384 -746206 -419859
36340 -419859 -347144 -562080 -529224 -59919 309682 63823 -590164 -1020235 -909991 -496172
36330 -496172 -255824 -513100 -1194193 -1831457 -1931620 -1442375 -759231 -244135 94326 390688
36320 390688 612227 626052 462703 340586 426049 638382 710680 468819 70745 -120616
36310 -120616 11412 139390 -79791 -498785 -671495 -490705 -306026 -383485 -593855 -732782
36300 -732782 -797010 -774849 -517936 -88200 78076 -295501 -848326 -1017566 -788809 -604061
36290 -604061 -626869 -570271 -273304 28136 156158 296659 602571 835573 735035 506899
36280 506899 565155 898437 1072107 860586 532403 414240 472764 520629 627266 1058860
$$ packed form
36350A117830M29135j08700o98601o28303j32110j0203l37590m05842K8178L26347
36340d19859P2715k14936L2856M69305L69601k45859o53987m30071J10244M13819
36330d96172K40348k57276o81093o37264j00163M89245O83144N15096L38461K96362
36320C90688K21539J3825j63349j22117Q5463K12333P2298k41861l98074j91361
36310a20616J32028J27978k19181m18994j72710J80790J84679p7459k10370j38927
36300g32782o4228K2161K56913M29736J66276l73577n52825j69240K28757J84748
36290f04061k2808N6598K96967L01440J28022J40501L05912K33002j00538k28136
36280E06899N8256L33282J73670k11521l28183j18163N8524M7865J06637M31594
$$ plain form
36270 1058860 1867379 2772783 3500244 4070430 4650768 5203790 5414951 4990112 3960669
36261 3960669 2671744 1529735 807271 610939 865012 1259865 1364752 984202 402017
36252 402017 126662 364635 867031 1305603 1602673 1793358 1787529 1514414 1183278 1097392
36242 1097392 1207578 1134000 706123 219354 13161 14838 -103580 -474886 -950292 -1342963
36232 -1342963 -1540668 -1458763 -1106635 -665592 -306079 26063 431464 725900 581008 35498
36222 35498 -422419 -411647 -76705 190757 247989 237733 283639 358835 382347 277208 -7398
36211 -7398 -384133 -602890 -497958 -217182 -54736 -97612 -196310 -240375 -256388 -227242 -48092
36200 -48092 239995 366527 149302 -214143 -353655 -189659 -28213 -178812 -610700 -1035626
$$ packed form
36270A058860Q08519R05404P27461N70186N80338N53022K11161m24839j029443
36261C960669j288925j142009p22464j96332K54073L94853J04887l80550n82185
36252D02017k75355K37973N02396M38572K97070J90685n829k73115l31136q5886
36242A097392J10186p3578m27877m86769k06193J677j18418l71306m75406l92671
36232a342963j97705Q1905L52128M41043L59513L32142M05401K94436j44892n45510
36222C5498m57917J0772L34942K67462N7232j0256M5906P5196K3512j05139k84606
36211g398l76735k18757J04932K80776J62446m2876r8698m4065j6013K9146J79150
36200d8092K88087J26532k17225l63445j39512J63996J61446j50599m31888m24926
$$ plain form
36190 -1035626 -1220838 -1142478 -913230 -671267 -517788 -471817 -488131 -577600 -853000 -1327031
36180 -1327031 -1712564 -1657592 -1253691 -1063987 -1440629 -2001802 -2087455 -1644684 -1299814 -1505168
36170 -1505168 -1962169 -2060211 -1615176 -939858 -380074 -57443 33694 -39687 -110651 -11875
36160 -11875 246380 508861 662672 681360 550297 311374 128814 112588 96196 -191380
36150 -191380 -707699 -1072922 -1037832 -771920 -575866 -503436 -441417 -414434 -570673 -889984
36140 -889984 -1105019 -968348 -498696 62836 452235 516667 257730 -165606 -503312 -566179
36130 -566179 -354410 -31998 228722 366725 412750 411276 406205 456081 572531 649862 559484
36119 559484 337808 168581 131881 99336 -40241 -198801 -270828 -349827 -549321 -713349
$$ packed form
36190a035626j85212P8360K29248K41963J53479M5971j6314q9469k75400m74031
36180a327031l85533N4972M03901J89704l76642n61173q5653M42771L44870k05354
36170a505168m57001r8042M45035O75318N59784L22631R1137p3381p0964R8776
36160a1875K58255K62481J53811J8688j31063k38923j82560j6226j6392k87576
36150a91380n16319l65223L5090K65912J96054P2430O2019K6983j56239l19311
36140h89984k15035J36671M69652N61532L89399O4432k58937m23336l37706o2867
36130e66179K11769L22412K60720J38003M6025j474n071M9876J16450P7331r0378
36119E59484k21676j69227l6700l2545j39577j58560p2027p8999j99494j64028
$$ plain form
36109 -713349 -585581 -247633 -98676 -344620 -774546 -1125804 -1383430 -1566907 -1508851 -1103350
36099 -1103350 -573518 -209509 18493 294256 517933 387731 -88519 -506283 -580372 -474575
36089 -474575 -489936 -650652 -755375 -668257 -400522 -35985 275000 370811 296027 365177
36079 365177 814856 1436666 1749996 1546714 1089034 725349 488748 204566 -122787 -245390
36069 -245390 -43060 196508 35891 -584744 -1234663 -1480752 -1358396 -1216930 -1204338 -1144105
36059 -1144105 -922424 -721159 -726596 -820505 -778705 -645282 -653234 -816730 -867153 -651667 -379055
36048 -379055 -340385 -508444 -546838 -177438 532423 1218862 1524469 1397268 1111112 950764
36038 950764 896265 706234 294452 -122855 -293621 -192846 63410 417349 834192 1160798
$$ packed form
36109g13349J27768L37948J48957k45944m29926l51258k57626j83477N8056M05501
36099a103350N29832L64009K28002K75763K23677j30202m76250m17764p4089J05797
36089d74575j5361j60716j04723Q7118K67735L64537L10985R5811p4784O9150
36079C65177M49679O21810L13330k03282m57680l63685k36601k84182l27353j22603
36069b45390K02330K39568j60617o20635o49919k46089J22356J41466J2592O0233
36059a144105K21681K01265n437r3909M1800J33423p952j63496n0423K15486K72612
36048c79055L8670j68059l8394L69400P09861O86439L05607j27201k86156j60348
36038I50764n4499j90031m11782m17307j70766J00775K56256L53939M16843L26606
$$ plain form
36028 1160798 1195463 892864 392203 -132537 -550593 -756062 -724938 -595924 -564897 -679976
36018 -679976 -849155 -1039431 -1298800 -1534056 -1461029 -936290 -238339 160443 88790 -186715
36008 -186715 -311711 -193512 24145 190417 258224 256696 256610 302292 281261 -44967 -697136
35997 -697136 -1219058 -1050393 -258337 382003 266901 -298711 -565543 -368628 -225462 -423297
35987 -423297 -568438 -287472 99239 32003 -460758 -864715 -938470 -878444 -791777 -516263
35977 -516263 -43170 327595 416571 394016 416930 369583 162935 -10015 41151 197266
35967 197266 232151 120970 -54227 -295424 -569858 -703811 -621771 -503425 -489711 -453724
35957 -453724 -308205 -286915 -588271 -953867 -989314 -749017 -593812 -583554 -453959 -145367
$$ packed form
36028A160798L4665l02599n00661n24740m18056k05469L1124J29014L1027j15079
36018f79976j69179j90276k59369k35256P3027N24739O97951L98782p1653k75505
36008a86715j24996J18199K17657J66272O7807j528q6M5682k1031l26228o52169
35997f97136n21922J68665P92056O40340j15102n65612k66832J96915J43166j97835
35987d23297j45141K80966L86711o7236m92761m03957p3755O0026Q6667K75514
35977e16263M73093L70765Q8976k2555K2914m7347k06648j72950N1166J56115
35967A97266L4885j11181j75197k41197k74434j33953Q2040J18346J3714L5987
35957d53724J45519K1290l01356l65596l5447K40297J55205J0258J29595L08592
$$ plain form
35947 -145367 97460 167619 213365 273827 216177 99120 171362 408381 481844 321355 254321
35936 254321 397892 381890 -35634 -508187 -622092 -521110 -609839 -927269 -1234103 -1474626
35926 -1474626 -1702539 -1739213 -1382543 -845828 -526926 -397351 -72173 519921 983971 1040845
35916 1040845 862256 711131 584064 347229 -28993 -469667 -817353 -837848 -463226 -27030
35906 -27030 50149 -189763 -359254 -380933 -554345 -883736 -902737 -443759 -52604 -203489
35896 -203489 -535481 -419972 22188 110140 -329641 -742372 -725749 -523219 -468794 -481340
35886 -481340 -404750 -411552 -672984 -919407 -763877 -329972 -153239 -464913 -903504 -1003931
35876 -1003931 -719738 -358150 -190987 -265659 -479475 -688266 -766028 -655923 -387734 -38433
$$ packed form
35947a45367K42827P0159M5746O0462n7650j17057P2242K37019P3463j60489o7034
35936B54321J43571j6002m17524m72553j13905J00982q8729l17430l06834k40523
35926a474626k27913l6674L56670N36715L18902J29575L25178N92094M64050N6874
35916A040845j78589j51125j27067k36835l76222m40674l47686k0495L74622M36196
35906b7030P7179k39912j69491k1679j73412l29391j9001M58978L91155j50885
35896b03489l31992J15509M42160Q7952m39781m12731J6623K02530N4425j2546
35886d81340P6590o802k61432k46423J55530M33905J76733l11674m38591j00427
35876a003931K84193L61588J67163p4672k13816k08791p7762J10105K68189L49301
$$ plain form
35866 -38433 295868 489674 432736 156663 -119406 -156994 65884 331005 410117 284745
35856 284745 120760 70341 148247 280683 402130 470396 430016 225080 -128679 -500832
35846 -500832 -705238 -640420 -399997 -223880 -282615 -493321 -605821 -518170 -459817 -769559
35836 -769559 -1471099 -2138212 -2246297 -1655483 -719479 62964 447290 497809 365245 155336
35826 155336 4765 84410 376298 569878 407877 99604 111249 479108 654104 262173
35816 262173 -257865 -178847 474345 901917 628655 137172 109248 418064 343959 -372576
35806 -372576 -1193102 -1528680 -1397209 -1177049 -1044591 -911703 -720560 -532013 -393884 -314170
35796 -314170 -323405 -423493 -524041 -550728 -553130 -582938 -553755 -393277 -268224 -432927 -835815
$$ packed form
35866c8433L34301J93806n6938k76073k76069l7588K22878K65121P9112j25372
35856B84745j63985n0419P7906J32436J21447O8266m0380k04936l53759l72153
35846e00832k04406O4818K40423J76117n8735k10706j12500Q7651N8353l09742
35836g69559p01540o67113j08085N90814R36004P82443L84326N0519j32564k09909
35826A55336j50571P9645K91888J93580j62001l08273J1645L67859J74996l91931
35816B62173n20038P9018O53192M27572k73262m91483k7924L08816p4105p16535
35806c72576q20526l35578J31471K20160J32458J32888J91143J88547J38129P9714
35796c14170r235j00088j00548k6687k402k9808K9183J60478J25053j64703m02888
$$ plain form
35785 -835815 -1083938 -883769 -370996 88488 301601 339438 319980 253728 109996 -71267
35775 -71267 -196156 -221879 -198300 -187271 -180199 -160250 -226033 -523426 -990571 -1301700 -1210928
35764 -1210928 -881686 -711498 -860327 -1115221 -1207651 -1086444 -863365 -680141 -688063 -983047
35754 -983047 -1462833 -1868781 -2037618 -2001117 -1816568 -1479396 -1066584 -766623 -659779 -656148
35744 -656148 -760742 -1162085 -1861552 -2432247 -2426584 -1903434 -1295452 -864243 -564346 -352362
35734 -352362 -292275 -350010 -389923 -424144 -592085 -831924 -855321 -568205 -268440 -260784 -464199
35723 -464199 -578484 -507927 -444323 -592787 -935824 -1232367 -1201239 -779825 -232378 98753
35713 98753 170417 237113 455098 670568 671020 459158 161542 -168433 -515574 -810537 -1023230
$$ packed form
35785h35815k48123K00169N12773M59484K13113L7837j9458o6252j43732j81263
35775g1267j24889k5723K3579J1029P072J9949o5783k97393m67145l11129R0772
35764a210928L29242J70188j48829k54894r2430J21207K23079J83224p922k94984
35754i83047m79786m05948j68837L6501J84549L37172M12812K99961J06844L631
35744f56148j04594m01343o99467n70695N663N23150O07982M31209K99897K11984
35734c52362O0087n7735l9913l4221j67941k39839k3397K87116K99765P656k03415
35723d64199j14285P0557O3604j48464l43037k96543L1128M21414N47447L31131
35713I8753P1664O6696K17985K15470M52k11862k97616l29975l47141k94963k12693
$$ plain form
35702 -1023230 -1237047 -1487520 -1632166 -1533080 -1289495 -1148134 -1242006 -1519744 -1840072 -2023459
35692 -2023459 -1920526 -1572337 -1217133 -1012845 -854816 -593417 -295440 -121087 -73870 -68997
35682 -68997 -119253 -223185 -198088 85384 383419 311603 -129530 -570848 -797657 -910056
35672 -910056 -949056 -779332 -474993 -414597 -746723 -1091018 -1058181 -782611 -608362 -503102
35662 -503102 -206103 199523 344725 198371 183424 553003 1011440 1124579 818766 291393
35652 291393 -309756 -881537 -1239955 -1269643 -1096171 -889091 -593110 -89419 459702 711925
35642 711925 590120 359644 213686 47014 -243789 -486052 -466282 -281933 -221769 -360803
35632 -360803 -486953 -417448 -200692 18633 169789 234820 189481 49779 -96308 -170829
$$ packed form
35702a023230k13817k50473j44646R9086K43585J41361r3872k77738l20328j83387
35692b023459J02933L48189L55204K04288J58029K61399K97977J74353M7217M873
35682f8997n0256j03932K5097K83472K98035p1816m41133m41318k26809j12399
35672i10056l9000J69724L04339O0396l32126l44295L2837K75570J74249J05260
35662e03102K96999M05626J45202j46354j4947L69579M58437J13139l05813n27373
35652B91393o01149n71781l58418k9688J73472K07080K95981N03691N49121K52223
35642G11925j21805k30476j45958j66672k90803k42263J9770J84349O0164j39034
35632c60803j26150O9505K16756K19325J51156O5031m5339j39702j46087p4521
$$ plain form
35622 -170829 -181301 -186569 -230839 -319864 -405609 -392089 -225982 15687 203673 311378 382833
35611 382833 350717 56803 -461163 -847406 -747218 -198979 409766 745748 782647 672023
35601 672023 490831 181528 -298018 -828565 -1179982 -1232314 -1116968 -1084412 -1247443 -1507558
35591 -1507558 -1684210 -1610999 -1165290 -403669 310761 535392 200057 -343132 -798217 -1210001
35581 -1210001 -1619313 -1731989 -1274496 -521149 -70332 -113549 -285709 -280646 -246050 -422042
35571 -422042 -712613 -859084 -818198 -699891 -478169 -66760 363617 452471 124314 -227655
35561 -227655 -196764 124122 281075 73054 -196548 -163515 110729 308312 376867 552317
35551 552317 842096 858195 369417 -276335 -588892 -587489 -653427 -872784 -965280 -845540
$$ packed form
35622a70829j0472n268m4270q9025q5745J3520J66107K41669J87986J07705P1455
35611C82833l2116k93914n17966l86243J00188N48239O08745L35982L6899j10624
35601F72023j81192l09303m79546n30547l51417n2332J15346L2556j63031k60115
35591a507558j76652P3211M45709P61621P14430K24631l35335n43189m55085m11784
35581a210001m09312j12676M57493P53347M50817m3217j72160N063L4596j75992
35571d22042k90571j46471M0886J18307K21722M11409M30377Q8854l28157l51969
35561b27655L0891L20886J56953k08021k69602L3033K74244J97583O8555J75450
35551E52317K89779J6099m88778o45752l12557J403o5938k19357r2496J19740
$$ plain form
35541 -845540 -778942 -849639 -712128 -137397 520856 727621 421099 -43922 -437892 -789795
35531 -789795 -1054415 -1025879 -681168 -355516 -412045 -839701 -1293942 -1493672 -1484255 -1477287 -1484894
35520 -1484894 -1248197 -629764 37356 233176 -102126 -461770 -415555 -104596 94705 170591
35510 170591 444701 1046414 1704686 2046385 1885310 1251823 380537 -317725 -512736 -277995
35500 -277995 -21537 -46096 -291015 -510758 -550471 -410662 -190928 -32762 -6751 -7861
35490 -7861 145212 481847 839473 1045665 1026850 762157 309666 -92585 -153538 128454
35480 128454 386346 276885 -122686 -404915 -256143 277142 862270 1134703 952464 504771
35470 504771 147067 72140 182271 313637 477502 767697 1103764 1235043 1031389 655300
$$ packed form
35541h45540O6598p0697J37511N74731O58253K06765l06522m65021l93970l51903
35531g89795k64620K8536L44711L25652n6529m27656m54241j99730R417O968p607
35520a484894K36697O18433O67120J95820l35302l59644M6215L10959J99301P5886
35510A70591K74110O01713O58272L41699j61075o33487q71286o98262j95011K34741
35500b77995K56458k4559k44919k19743l9713J39809K19734J58166K6011j110
35490g861J53073L36635L57626K06192j8815k64693m52491m02251o0953K81992
35480A28454K57892j09461l99571k82229J48772N33285N85128K72433j82239m47693
35470E04771l57704p4927J10131J31366J63865K90195L36067J31279k03654l76089
$$ plain form
35460 655300 378711 290081 253134 129373 -39994 -107791 -27652 87410 126666 132922 226361
35449 226361 408309 534645 512335 437858 451987 490597 311847 -161150 -631912 -732347
35439 -732347 -526664 -508620 -980232 -1608869 -1817073 -1502670 -1085738 -866530 -684106 -326325
35429 -326325 50929 159826 8701 -189399 -382684 -650718 -899368 -911634 -705684 -556793
35419 -556793 -612737 -727335 -735279 -661921 -570549 -415074 -182033 -22436 -82628 -276940 -352356
35408 -352356 -164406 165075 358136 251342 -29750 -225852 -308156 -553541 -1134817 -1784499
35398 -1784499 -2079961 -1958663 -1699877 -1481810 -1264690 -1069950 -1014232 -1027909 -897221 -666582
35388 -666582 -629297 -793956 -764989 -376563 -54356 -217424 -637332 -782884 -567607 -331600
$$ packed form
35460F55300k76589q8630l6947j23761j69367o7797Q0139J15062L9256O256R3439
35449B26361J81948J26336k2310p4477J4129L8610j78750m72997m70762j00435
35439g32347K05683J8044m71612o28637k08204L14403M16932K19208J82424L57781
35429c26325L77254J08897j51125j98100j93285k68034k48650j2266K05950J48891
35419e56793n5944j14598p944P3358R1372J55475K33041J59597o0192j94312p5416
35408c52356J87950L29481J93061j06794k81092j96102q2304k45385n81276o49682
35398a784499k95462J21298K58786K18067K17120J94740N5718j3677J30688K30639
35388f66582L7285j64659K8967L88426L22207j63068m19908j45552K15277K36007
$$ plain form
35378 -331600 -239103 -150434 -42645 -107711 -351486 -446268 -122826 508231 1103793 1366749
35368 1366749 1145359 482050 -347763 -1006055 -1367340 -1512134 -1477334 -1224946 -877031 -726317
35358 -726317 -883401 -1085979 -1004444 -631508 -244103 -56883 -47768 -114142 -280042 -644394
35348 -644394 -1105945 -1263569 -796273 25180 450520 62670 -682826 -960976 -504258 225973
35338 225973 687359 740974 509473 131923 -209784 -313206 -194520 -126058 -291964 -564140
35328 -564140 -733946 -783020 -776286 -659841 -366028 -21395 135968 7638 -317542 -705136
35318 -705136 -1038728 -1196628 -1113945 -886023 -722793 -761700 -936205 -1029564 -879522 -562338
35308 -562338 -333008 -323736 -374730 -280019 -116448 -130005 -331055 -448645 -326523 -127556
$$ packed form
35378c31600R2497Q8669J07789o5066k43775r4782L23442O31057N95562K62956
35368A366749k21390o63309q29813o58292l61285j44794L4800K52388L47915J50714
35358g26317j57084k02578Q1535L72936L87405J87220R115o6374j65900l64352
35348f44394m61551j57624M67296Q21453M25340l87850p45496k78150M56718P30231
35338B25973M61386N3615k31501l77550l41707j03422J18686O8462j65906k72176
35328e64140j69806m9074O734J16445K93813L44633J57363j28330l25180l87594
35318g05136l33592j57900Q2683K27922J63230l8907j74505r3359J50042L17184
35308e62338K29330R272n0994R4711J63571j3557k01050j17590J22122J98967
$$ plain form
35298 -127556 -60029 -115367 -177924 -187292 -77809 228752 622779 795378 590797 200037
35288 200037 -135099 -398945 -613783 -625361 -339657 25709 222609 339156 562679 725811
35278 725811 489315 -70117 -458954 -401034 -123924 61605 130037 166549 142874 64882
35268 64882 106201 372627 677236 736206 502344 184661 25117 130288 400762 554063
35258 554063 362485 -49978 -309274 -282067 -270387 -569820 -1030274 -1276192 -1213845 -1046604
35248 -1046604 -860872 -505933 61018 560997 668066 376224 -23752 -263593 -296785 -218782
35238 -218782 -96157 76518 279832 397545 296346 -28591 -429656 -718202 -757583 -503975
35228 -503975 -94767 106715 -242221 -1046286 -1734548 -1799288 -1303317 -722718 -383557 -245091
$$ packed form
35298a27556O7527n5338o2557r368J09483L06561L94027J72599k04581l90760
35288B00037l35136k63846k14838j1578K85704L65366J96900J16547K23523J63132
35278G25811k36496n59432l88837N7920K77110J85529O8432L6512k3675p7992
35268F4882M1319K66426L04609N8970k33862l17683j59544J05171K70474J53301
35258E54063j91578m12463k59296K7207J1680k99433m60454k45918O2347J67241
35248a046604J85732L54939N66951M99979J07069k91842l99976k39841l3192P8003
35238b18782J22625J72675K03314J17713j01199l24937m01065k88546l9381K53608
35228e03975M09208K01482l48936q04065o88262o4740M95971N80599L39161J38466
$$ plain form
35218 -245091 -180015 -208211 -370842 -552672 -563751 -336148 19577 293535 294782 -4786
35208 -4786 -399555 -623365 -646113 -691871 -897196 -1078280 -956523 -513443 34223 541258
35198 541258 1012805 1375697 1398871 975991 362586 -30703 -50276 114495 233088 270977
35188 270977 275826 168807 -188946 -732006 -1141219 -1151661 -852401 -581683 -539288 -609093
35178 -609093 -589093 -469565 -373872 -310556 -168570 25417 35698 -269003 -642051 -665417
35168 -665417 -205715 467091 1000523 1254883 1270354 1116789 874648 648011 472476 260901
35158 260901 -75270 -503660 -938023 -1347499 -1701932 -1888723 -1820976 -1587721 -1364263 -1201452
35148 -1201452 -1033819 -857505 -729048 -595043 -323193 43226 249887 156948 -41286 -42966
$$ packed form
35218b45091O5076k8196j62631j81830j1079K27603L55725K73958J247k99568
35208d786l94769k23810k2748m5758k05325j81084J21757M43080N47666N07035
35198E41258M71547L62892K3174m22880o13405l93289j9573J64771J18593L7889
35188B70977M849j07019l57753n43060m09213j0442K99260K70718M2395o9805
35178f09093K0000J19528R5693O3316J41986J93987J0281l04701l73048k3366
35168f65417M59702O72806N33432K54360J5471j53565k42141k26637j75535k11575
35158B60901l36171m28390m34363m09476l54433j86791O7747K33255K23458J62811
35148a201452J67633J76314J28457J34005K71850L66419K06661r2939j98234j680
$$ plain form
35138 -42966 213742 531356 687149 588453 295077 9491 -30446 224511 557113 710571
35128 710571 625991 385084 47528 -310059 -509990 -443697 -294516 -390246 -809622 -1279728
35118 -1279728 -1475269 -1292062 -840855 -336519 -14699 1187 -185252 -344078 -334711 -139154
35108 -139154 238881 723710 1074041 1097472 971475 1071788 1410316 1539555 1163271 561312
35098 561312 188356 92810 16086 -114466 -134989 -22535 -4579 -252669 -674133 -1030221
35088 -1030221 -1110999 -834124 -352669 -23018 -65504 -288446 -346774 -214725 -146646 -210480
35078 -210480 -189185 -1172 104924 -82236 -428428 -666229 -702772 -580396 -356903 -184281
35068 -184281 -275322 -588504 -752153 -525646 -140850 61460 124763 279804 429099 254469
$$ packed form
35138d2966K56708L17614J55793r8696k93376k85586l9937K54957L32602J53458
35128G10571q4580k40907l37556l57587j99931O6293J49181r5730m19376m70106
35118a279728j95541J83207M51207N04336L21820J5886j86439j58826R367J95557
35108a39154L78035M84829L50331K3431j25997J00313L38528J29239l76284o01959
35098E61312l72956r5546p6724j30552k0523J12454J7956k48090m21464l56088
35088a030221q0778K76875M81455L29651m2486k22942n8328J32049O8079o3834
35078b10480K1295J88013J06096j87160l46192k37801l6543J22376K23493J72622
35068a84281r1041l13182j63649K26507L84796K02310O3303J55041J49295j74630
$$ plain form
35058 254469 -207256 -537186 -556374 -567008 -806690 -1031114 -913292 -580480 -402635 -392804
35048 -392804 -195676 317879 767738 710065 176170 -382680 -583732 -406285 -59643 269562
35038 269562 489129 542725 413713 192018 44049 58522 151438 160243 12904 -217122
35028 -217122 -395593 -449779 -445170 -552772 -875394 -1277543 -1471218 -1326986 -1013263 -755602
35018 -755602 -570440 -364034 -187048 -187985 -344666 -449310 -391587 -284535 -263597 -312858 -336309
35007 -336309 -253699 7584 430312 754137 630454 85340 -359894 -248734 242834 523515
34997 523515 304775 -136349 -396393 -383723 -226022 40111 483237 1047459 1491371 1602841
34987 1602841 1388545 1002761 555814 83719 -311974 -432118 -190389 199741 368161
$$ packed form
35058B54469m61725l29930j9188j0634k39682k24424J17822L32812J77845R831
35048c92804J97128N13555M49859n7673n33895n58850k01052J77447L46642L29205
35038B69562K19567N3596j29012k21695j47969J4473R2916Q805j47339k30026
35028b17122j78471n4186M609j07602l22622m02149j93675J44232L13723K57661
35018g55602J85162K06406J76986r37j56681j04644N7723J07052K0938m9261k3451
35007c36309Q2610K61283M22728L23825j23683n45114m45234J11160M91568K80681
34997E23515k18740m41124k60044J2670J57701K66133M43126N64222M43912J11470
34987A602841k14296l85784m46947m72095l95693j20144K41729L90130J68420
$$ plain form
34978 368161 129179 -380734 -865414 -1069198 -870302 -353202 190941 496817 591858 677828
34968 677828 754831 626157 348899 341692 803805 1310093 1342235 1037842 973809 1263394
34958 1263394 1353369 839886 60630 -383310 -387372 -296940 -288706 -180603 144246 445123
34948 445123 399312 14874 -373059 -462912 -244951 74450 303379 383320 352059 272950
34938 272950 186061 56051 -216887 -637764 -986257 -1010008 -789973 -710656 -946608 -1195679
34928 -1195679 -1139572 -970240 -1121314 -1572967 -1820471 -1569775 -1089853 -750415 -551805 -314890
34918 -314890 -51075 115124 186070 192509 19098 -395260 -800527 -877965 -701556 -682706
34908 -682706 -1030253 -1491468 -1684748 -1503551 -1110103 -676290 -257908 118287 349657 312533
$$ packed form
34978C68161k38982n09913m84680k03784J98896N17100N44143L05876R5041Q5970
34968F77828P7003j28674k77258p207M62113N06288L2142l04393o4033K89585
34958A263394Q9975n13483p79256m43940m062R0432Q234J08103L24849L00877
34948D45123m5811l84438l87933q9853K17961L19401K28929P9941l1261p9109
34938B72950q6889j30010k72938m20877l48493k3751K20035P9317k35952k49071
34928a195679N6107J69332j51074m51653k47504K50696M79922L39438J98610K36915
34918c14890K63815J66199P0946O439j73411m14358m05267p7438J76409J8850
34908f82706l47547m61215j93280J81197L93448M33813M18382L76195K31370l7124
$$ plain form
34898 312533 45891 -192951 -185577 -51307 -112690 -427146 -671259 -597902 -374134 -279625
34888 -279625 -289332 -214509 -81785 -58887 -113921 -74933 31023 16009 -136663 -305659 -549251
34877 -549251 -998764 -1429663 -1388417 -862667 -392177 -330179 -424201 -383026 -401831 -707136
34867 -707136 -958072 -672755 -73502 87791 -439964 -1070352 -1192048 -869450 -525061 -299704
34857 -299704 -42943 282643 523735 604645 620834 639127 562778 256480 -248914 -706125
34847 -706125 -816169 -489983 37847 407978 470271 375502 339601 405050 468069 452830 379506
34836 379506 289284 163975 -64129 -422633 -819724 -1087973 -1133040 -993885 -724666 -312738
34826 -312738 185149 519582 447054 46096 -333170 -459310 -403126 -303287 -140683 144513
$$ packed form
34898C12533k66642k38842P374J34270o1383l14456k44113P3357K23768R4509
34888b79625r707P4823J32724K2898n5034L8988J05956j5014j52672j68996k43592
34877e49251m49513m30899M1246N25750M70490O1998r4022M1175j8805l05305
34867g07136k50936K85317N99253J61293n27755o30388j21696L22598L44389K25357
34857b99704K56761L25586K41092Q0910J6189J8293p6349l06298n05394m57211
34847g06125j10044L26186N27830L70131O2293r4769l5901O5449O3019j5239p3324
34836C79506r0222j25309k28104l58504l97091k68249m5067J39155K69219M11928
34826c12738M97887L34433p2528m00958l79266j26140N6184R9839J62604K85196
$$ plain form
34816 144513 451429 581888 464858 245766 184582 460222 967917 1306137 1126808 552070
34806 552070 79668 6215 128624 107416 -103613 -359477 -630640 -949867 -1203656 -1256118
34796 -1256118 -1188158 -1148321 -1056861 -759562 -411842 -355395 -594335 -744802 -587191 -334620
34786 -334620 -223519 -167344 -24828 70146 -75626 -347795 -445547 -278629 -34883 74434
34776 74434 -27058 -289072 -551646 -647736 -613185 -662272 -827707 -819958 -443668 47768 287216
34765 287216 311017 407910 582279 575600 392949 377402 668108 961045 971747 830863 832278
34754 832278 1032204 1278651 1423562 1333877 908899 288929 -139576 -161514 -5110 1501
34744 1501 -117502 -114919 30303 70389 -151304 -527257 -847319 -945909 -738721 -315704 41532
$$ packed form
34816A44513L06916J30459j17030k19092o1184K75640N07695L38220j79329n74738
34806E52070m72402p3453J22409k1208k11029k55864k71163l19227k53789n2462
34796a256118O7960L9837R1460K97299L47720N6447k38940j50467J57611K52571
34786c34620J11101N6175J42516R4974j45772k72169r7752J66918K43746J09317
34776G4434j01492k62014k62574r6090L4551m9087j65435P749L76290M91436K39448
34765B87216K3801R6893J74369o679j82651j5547K90706K92937J0702j40884J415
34754H32278J99926K46447J44911q9685m24978o19970m28505k1938J56404O611
34744A501j19003K583J45222M0086k21693l75953l20062r8590K07188M23017L57236
$$ plain form
34733 41532 141338 148608 355503 718007 878509 670341 333142 148563 117150 128835 213836
34722 213836 404495 500184 233131 -345797 -836954 -887641 -513562 -11675 341979 461192
34712 461192 401537 253794 114379 89677 215842 341564 200593 -283672 -822570 -1038074
34702 -1038074 -909812 -796779 -985530 -1376114 -1687240 -1809126 -1817667 -1768645 -1669063 -1595178
34692 -1595178 -1635131 -1698252 -1564002 -1196106 -872984 -900491 -1275009 -1725534 -2018329 -2103130
34682 -2103130 -2004524 -1727205 -1313293 -883506 -543580 -301357 -128245 -44302 -73392 -158962
34672 -158962 -209747 -215236 -243623 -331980 -444939 -537909 -596608 -616826 -606629 -599918 -604977 -564985
34660 -564985 -456325 -397396 -537793 -842732 -1119452 -1264921 -1334402 -1342617 -1194393 -905675
$$ packed form
34733D1532R9806P270K06895L62504J60502k08168l37199j84579l1413J1685Q5001
34722B13836J90659R5689k67053n78928m91157n0687L74079N01887L53654J19213
34712D61192n9655j47743j39415k4702J26165J25722j40971m84265n38898k15504
34702a038074J28262J13033j88751l90584l11126j21886q541M9022R9582P3885
34692a595178l9953o3121J34250L67896L23122k7507l74518m50525k92795q4801
34682b103130R8606K77319M13912M29787L39926K42223J73112Q3943k9090q5570
34672a58962n0785n489k8387q8357j12959r2970n8699k0218J0197O711n059L9992
34660e64985J08660N8929j40397l04939k76720j45469o9481q215J48224K88718
$$ plain form
34650 -905675 -707453 -772590 -961218 -992054 -780373 -479984 -291859 -364467 -758467 -1315051
34640 -1315051 -1631268 -1375033 -636570 142961 558076 490347 121587 -149808 38495 614117
34630 614117 1036326 904235 482511 327935 504573 560740 262084 -94654 -201340 -158893
34620 -158893 -185386 -256794 -282792 -342788 -466895 -429827 -79595 309864 348202 82525 -84522
34609 -84522 14784 124062 6052 -192981 -146983 228223 677115 881798 770667 543960
34599 543960 410733 363595 281843 172281 124504 63394 -183426 -510933 -533179 -129258
34589 -129258 274096 216719 -199034 -501405 -479381 -320482 -229410 -226281 -283326 -372395 -379537
34578 -379537 -225430 -74058 -184610 -543789 -867413 -984656 -1006933 -1083811 -1184674 -1170243
$$ packed form
34650i05675J98222o5137j88628l0836K11681L00389J88125p2608l94000n56584
34640a315051l16217K56235P38463P79531M15115o7729l68760k71395J88303N75622
34630F14117M22209j32091m21724j54576J76638N6167k98656l56738j06686M2447
34620a58893k6493p1408k5998n9996j24107L7068L50232L89459L8338k65677j67047
34609h4522R9306J09278j18010j99033M5998L75206M48892K04683j11131k26707
34599E43960j33227m7138q1752j09562m7777o1110k46820l27507k2246M03921
34589a29258M03354n7377m15753l02371K2024J58899R1072L129n7045q9069p142
34578c79537J54107J51372j10552l59179l23624j17243k2277p6878j00863J4431
$$ plain form
34568 -1170243 -946932 -554209 -215156 -214469 -546193 -792943 -606699 -209300 -90597 -266582
34558 -266582 -238320 251285 809315 906727 507693 14657 -182490 37311 493693 794110
34548 794110 672091 353068 355092 821891 1323895 1447993 1270066 1049349 783254 359092
34538 359092 -112144 -441545 -652886 -826714 -844432 -612354 -361015 -354669 -449347 -342616
34528 -342616 -146505 -236624 -548754 -536488 37982 708889 910291 619339 170524 -241267
34518 -241267 -573601 -707603 -556522 -276101 -73239 92491 334803 478669 236335 -257271
34508 -257271 -468487 -161085 249821 269798 12780 2642 394410 736653 565063 -30711
34498 -30711 -565075 -709546 -542712 -359250 -374398 -559535 -659024 -421449 95715 527045
$$ packed form
34568a170243K23311L92723L39053O87l31724k46750J86244L97399J18703j75985
34558b66582K8262M89605N58030R7412l99034m93036j97147K19801M56382L00417
34548G94110j22019l19023K024M66799N02004J24098j77927k20717k66095m24162
34538C59092m71236l29401k11341j73828j7718K32078K51339O346r4678J06731
34528c42616J96111r0119l12130J2266N74470O70907K01402k90952m48815m11791
34518b41267l32334j34002J51081K80421K02862J65730K42312J43866k42334m93606
34508b57271k11216L07402M10906J9977k57018j0138L91768L42243j71590n95774
34498c0711n34364j44471J66834J83462j5148j85137r9489K37575N17164M31330
$$ plain form
34488 527045 610399 503335 533996 714968 720861 353432 -172156 -469996 -378377 -64158
34478 -64158 160833 107623 -99990 -107612 286859 878229 1332892 1634179 1991919 2363449
34468 2363449 2433917 2147182 1870515 1836404 1768240 1349505 784787 533002 651122 763211
34458 763211 601146 257815 -59354 -251063 -322272 -380683 -589259 -907968 -986100 -590145
34448 -590145 -51560 52470 -348495 -722172 -625332 -169513 269363 479529 427188 144547
34438 144547 -200582 -335268 -176905 29282 -4161 -304160 -697038 -1006999 -1096177 -876749
34428 -876749 -425790 13765 247455 268682 160347 -2109 -115441 -84457 46945 146838
34418 146838 197620 262468 248792 -30258 -504319 -851447 -953359 -1018137 -1097693 -868210
$$ packed form
34488E27045Q3354j07064L0661J80972N893l67429n25588k97840R1619L14219
34478f4158K24991n3210k07613p622L94471N91370M54663L01287L57740L71530
34468B363449P0468k86735k76667l4111o8164m18735n64718k51785J18120J12089
34458G63211j62065l43331l17169j91709p1209n8411k08576l18709p8132L95955
34448e90145N38585J04030m00965l73677R6840M55819M38876K10166n2341k82641
34438A44547l45129j34686J58363K06187l3443k99999l92878l09961q9178K19428
34428h76749M50959M39555K33690K1227j08335j62456j13332L0984J31402R9893
34418A46838N0782O4848j3676k79050m74061l47128j01912o4778p9556K29483
$$ plain form
34408 -868210 -191216 439363 436128 -81344 -451348 -342160 -46880 67045 -10684 -127352
34398 -127352 -233124 -293581 -189476 118387 467811 663644 676271 615120 603634 712174
34388 712174 911314 1069998 1087876 1013416 938133 844289 707914 665396 846111 1079912
34378 1079912 1043174 713881 400916 265778 128708 -113919 -199431 115872 611480 861234
34368 861234 819241 825322 1045918 1213324 1011804 509726 73195 -32796 163151 475607
34358 475607 762942 975836 1088558 1067577 938769 836778 900609 1102183 1251228 1206084
34348 1206084 1011706 788241 572127 349571 167610 86435 57464 -16266 -98219 -35175
34338 -35175 201493 415777 409619 212450 -7431 -173322 -295258 -282501 24398 548865
$$ packed form
34408h68210O76994O30579l235n17472l70004J09188K95280J13925p7729j16668
34398a27352j05772o0457J04105L07863L49424J95833J2627o1151j1486J08540
34388G12174J99140J58684J7878p4460p5283r3844j36375m2518J80715K33801
34378A079912l6738l29293l12965j35138j37070k42627q5512L15303M95608K49754
34368H61234m1993O081K20596J67406k01520n02078m36531j05991J95947L12456
34358D75607K87335K12894J12722k0981j28808j01991O3831K01574J49045m5144
34348A206084j94378k23465k16114k22556j81961q1175k8971p3730q1953O3044
34338c5175K36668K14284o158j97169k19881j65891j21936J2757L06899N24467
$$ plain form
34328 548865 878018 656508 32840 -464136 -511679 -304588 -232398 -396136 -556437 -459528
34318 -459528 -78931 417309 814458 989423 1012706 1095641 1328004 1489429 1261007 643074
34308 643074 22902 -234319 -148553 21 61712 164504 501073 1068681 1638190 1933084
34298 1933084 1826341 1394139 815925 257074 -153826 -321720 -265196 -178686 -285983 -582277
34288 -582277 -811504 -762353 -516898 -334091 -339710 -416251 -381850 -203607 -15369 48429 25518
34277 25518 121939 502561 1083144 1574408 1737708 1545375 1099994 511964 -81477 -481826
34267 -481826 -544906 -314955 41323 414843 781897 1074784 1162588 1034274 919865 1109115
34257 1109115 1631496 2192073 2472615 2441223 2286269 2096653 1779274 1347369 1090138 1247439
$$ packed form
34328E48865L29153k21510o23668m96976m7543K07091P2190j63738j60301R6909
34318d59528L80597M96240L97149J74965K3283Q2935K32363J61425k28422o17933
34308F43074o20172k57221Q5766J48574O1691J02792L36569N67608N69509K94894
34298A933084j06743m32202n78214n58851m10900j67894N6524Q6510j07297k96294
34288e82277k29227M9151K45455J82807n619p6541L4401J78243J88238O3798k2911
34277B5518R6421L80622N80583M91264J63300j92333m45381n88030n93441m00349
34267d81826o3080K29951L56278L73520L67054K92887Q7804j28314j14409J89250
34257A109115N22381N60577K80542l1392j54954j89616l17379m31905k57231J57301
$$ plain form
34247 1247439 1617922 1761573 1590574 1466082 1618067 1780781 1627354 1300944 1162298
34238 1162298 1160183 894112 329947 11300 340762 976799 1270085 1115009 1000352 1257325
34228 1257325 1627955 1699157 1483967 1350059 1518271 1864108 2163811 2317616 2310980 2155015
34218 2155015 1952361 1872558 1946456 1993374 1870595 1688865 1625287 1612873 1429646 1072772
34208 1072772 813629 830863 988256 1052540 944276 683781 298935 -62230 -122757 206352
34198 206352 637552 854471 927324 1129071 1434810 1521415 1267064 944777 837397 913651
34188 913651 999996 1059098 1154400 1294676 1449745 1609426 1727247 1714158 1577333 1471645
34178 1471645 1549588 1840476 2272642 2667859 2739617 2346329 1790794 1584770 1808984 2004838
$$ packed form
34247A247439L70483J43651j70999j24492J51985J62714j53427l26410j38646
34238A162298k115k66071n64165l18647L29462O36037K93286j55076j14657K56973
34228A257325L70630P1202k15190j33908J68212L45837K99703J53805o636j55965
34218B155015k02654p9803P3898M6918j22779j81730o3578j2414j83227l56874
34208A072772k59143J7234J57393O4284j08264k60495l84846l61165o0527L29109
34198B06352M31200K16919P2853K01747L05739Q6605k54351l22287j07380P6254
34188I13651Q6345N9102R5302J40276J55069J59681J17821j3089j36825j05688
34178A471645P7943K90888M32166L95217P1758l93288n55535k06024K24214J95854
$$ plain form
34168 2004838 1857181 1644475 1743359 2009632 2045926 1864306 1832580 2064447 2300792 2374497
34158 2374497 2392147 2437550 2462142 2490082 2570145 2517496 2115478 1609849 1528238 1892213 2115386
34147 2115386 1896513 1685946 1916703 2271224 2217781 1891743 1827950 2037481 2013421 1622975
34137 1622975 1368346 1623153 2112180 2365502 2310747 2185711 2152654 2221024 2332691 2326732
34127 2326732 1999321 1383434 842599 744479 1127338 1734168 2218653 2286714 1881911 1349428
34117 1349428 1183202 1449066 1671829 1477507 1121135 1112902 1497863 1848418 1913472 1926395
34107 1926395 2194057 2653516 2993801 3055304 2931738 2740724 2470038 2106929 1813366 1826666
34097 1826666 2152011 2477110 2512020 2336943 2247998 2305852 2268852 2005089 1713967 1611556
$$ packed form
34168B004838j47657k12706R8884K66273L6294j81620l1726K31867K36345P3705
34158B374497J7650M5403K4592K7940Q0063n2649m02018n05629q1611L63975K23173
34147B115386k18873k10567K30757L54521n3443l26038o3793K09531k4060l90446
34137A622975k54629K54807M89027K53322n4755j25036l3057O8370J11667n959
34127B326732l27411o15887n40835r8120L82859O06830M84485O8061m04803n32483
34117A349428j66226K65864K22763j94322l56372q233L84961L50555O5054J2923
34107A926395K67662M59459L40285O1503j23566j91014k70686l63109k93563J3300
34097A826666L25345L25099L4910j75077q8945N7854l7000k63763k91122j02411
$$ plain form
34087 1611556 1617657 1538808 1384525 1284913 1229081 1128256 1059392 1202610 1563039 1967048
34077 1967048 2320209 2663725 2973189 3111518 3031974 2863652 2740192 2673027 2636778 2663869
34067 2663869 2806500 3075758 3419905 3697659 3727881 3481085 3170200 3020988 3018284 3034884
34057 3034884 3112374 3364925 3651020 3650952 3330036 3042432 3057781 3230917 3293246 3254765 3319124
34046 3319124 3546997 3801042 3944973 3949413 3863401 3785265 3789353 3810474 3703721 3473036 3283583
34035 3283583 3167940 2926811 2479725 2120221 2193742 2650526 3152516 3519284 3799989 3955248
34025 3955248 3771505 3170652 2407071 1862191 1742431 1993897 2385078 2645186 2639295 2458173
34015 2458173 2291247 2239020 2306472 2484210 2704786 2814758 2776697 2821635 3163710 3605808
$$ packed form
34087A611556O101p8849j54283r9612n5832j00825o8864J43218L60429M04009
34077A967048L53161L43516L09464J38329p9544j68322j23460o7165l6249K7091
34067B663869J42631K69258L44147K77754L0222k46796l10885j49212k704J6600
34057C034884P7490K52551K86095o8l20916k87604J5349J73136O2329l8481O4359
34046C319124K27873K54045J43931M440q6012p8136M088K1121j06753k30685j89453
34035C283583j15643k41129m47086l59504P3521M56784N01990L66768K80705J55259
34025C955248j83743o00853p63581n44880j19760K51466L91181K60108n891j81122
34015B458173j66926n2227O7452J77738K20576J09972l8061M4938L42075M42098
$$ plain form
34005 3605808 3722467 3475667 3343100 3693063 4281715 4562318 4306397 3718430 3101428
33996 3101428 2665998 2588220 2976524 3714097 4471283 4927712 4948609 4610507 4155617 3859595
33986 3859595 3818043 3895702 3969439 4113620 4392194 4593786 4440966 4029661 3768813 3843992
33976 3843992 4036492 4163179 4359640 4724700 5007499 4978024 4864357 5007004 5240637 5124345
33966 5124345 4749554 4740134 5294436 5789080 5667577 5235809 5098161 5200740 5071052 4776847
33956 4776847 4881942 5414815 5635756 5118732 4446275 4388399 4854473 5188254 5189125 5246980
33946 5246980 5583669 5924884 5972340 5755316 5414126 5006577 4660371 4600808 4861348 5201000
33936 5201000 5440896 5658857 5925601 6097315 6062954 5995787 6125896 6391555 6549727 6561771
$$ packed form
34005C605808J16659k46800j32567L49963N88652K80603k55921n87967o17002
33996C101428m35430p7778L88304P37573P57186M56429K0897l38102m54890k96022
33986C859595m1552P7659P3737J44181K78574K01592j52820m11305k60848P5179
33976C843992J92500J26687J96461L65060K82799k9475j13667J42647K33633j16292
33966E124345l74791r420N54302M94644j21503m31768j37648J02579j29688k94205
33956D776847J05095N32873K20941n17024o72457n7876M66074L33781Q71N7855
33946E246980L36689L41215M7456k17024l41190m07549l46206n9563K60540L39652
33936E201000K39896K17961K66744J71714l4361o7167J30109K65659J58172J2044
$$ plain form
33926 6561771 6641398 6922354 7270755 7481120 7531288 7568096 7702424 7887748 7996841 7976426
33916 7976426 7891605 7827598 7814460 7881938 8095911 8436097 8710515 8752380 8682178 8797927
33906 8797927 9180420 9578891 9740081 9680254 9551729 9411421 9251239 9133440 9159259 9376713
33896 9376713 9799124 10400066 10997309 11288442 11157299 10844304 10660424 10624539 10547156 10383878
33886 10383878 10301349 10421226 10681539 10952414 11144704 11222815 11260892 11461698 11944366 12516501
33876 12516501 12845292 12881484 12921381 13188691 13549234 13752019 13784907 13830474 13983400 14202213
33866 14202213 14499890 14985277 15654033 16262180 16516780 16372220 16068868 15871562 15829015
33857 15829015 15825681 15800786 15800702 15824211 15781021 15701808 15851783 16450352 17329085 18068028 18486202
$$ packed form
33926F561771P9627K80956L48401K10365N0168L6808J34328J85324J09093k0415
33916G976426q4821o4007j3138O7478K13973L40186K74418M1865p0202J15749
33906H797927L82493L98471J61190n9827j28525j40308j60182j17799K5819K17454
33896I376713M22411O00942N97243K91133j31143l12995j83880l5885p7383j63278
33886A0383878q2529J19877K60313K70875J92290P8111L8077K00806M82668N72135
33876A2516501L28791L6192L9897K67310L60543K02785L2888M5567J52926K18813
33866A4202213K97677M85387O68756O08147K54600j44560l03352j97306m2547
33857A5829015l334k4895q4K3509m3190p9213J49975N98569Q78733P38943M18174
$$ plain form
33846 18486202 18803509 19254817 19746623 20055383 20231360 20580662 21248874 22005095 22518482
33837 22518482 22745480 22939028 23312055 23810716 24272868 24728369 25403175 26390730 27444500
33828 27444500 28225094 28707236 29196444 29929700 30801102 31546545 32077282 32513979 32959614
33819 32959614 33387176 33778742 34274016 35085999 36251598 37512377 38520254 39194867 39801898
33810 39801898 40592743 41451126 42085687 42565551 43398528 44910611 46732851 48158354 48942794
33801 48942794 49504800 50345428 51540626 52890026 54308106 55863063 57565985 59332799
33793 59332799 61106485 62859709 64526834 66096036 67728413 69600637 71642441 73640257
33785 73640257 75630340 77944463 80740915 83709613 86459494 89062158 91953456 95338480
$$ packed form
33846A8486202L17307M51308M91806L08760J75977L49302O68212P56221N13387
33837B2518482K26998J93548L73027M98661M62152M55501O74806R87555J053770
33828B7444500P80594M82142M89208P33256Q71402P45443N30737M36697M45635
33819C2959614M27562L91566M95274Q11983J165599J260779J007877O74613O07031
33810C9801898P90845Q58383O34561M79864Q32977J512083J822240J425503P84440
33801D8942794N62006Q40628J195198J349400J418080J554957J702922J766814
33793E9332799J773686J753224J667125J569202J632377J872224K041804J997816
33785G3640257J990083K314123K796452K968698K749881K602664K891298L385024
$$ plain form
33777 95338480 98946112 102406818 105651016 108846139 112134839 115594720 119344205 123497732
33769 123497732 128001621 132618922 137129732 141544162 146116505 151120123 156560046 162138062
33761 162138062 167586876 173013266 178779482 185036903 191540989 197994910 204413122 211012064
33753 211012064 217850781 224728970 231388810 237711602 243780541 249849722 256157472 262622314
33745 262622314 268784276 274203222 278884696 283175294 287282289 291060466 294246182 296709028
33737 296709028 298442850 299485423 299929754 299901379 299438680 298434068 296707062 294103177
33729 294103177 290588502 286356422 281776583 277079207 272130152 266697461 260892180 255085865
33721 255085865 249366941 243379517 236852246 230056848 223538684 217534569 211839433 206137147
$$ packed form
33777I5338480L607632L460706L244198L195123L288700L459881L749485M153527
33769A23497732M503889M617301M510810M414430M572343N003618N439923N578016
33761A62138062N448814N426390N766216O257421O504086O453921O418212O598942
33753B11012064O838717O878189O659840O322792O068939O069181O307750O464842
33745B62622314O161962N418946M681474M290598M106995L778177L185716K462846
33737B96709028J733822J042573M44331k8375m62699j004612j727006k603885
33729B94103177l514675m232080m579839m697376m949055n432691n805281n806315
33721B55085865n718924n987424o527271o795398o518164o004115n695136n702286
$$ plain form
33713 206137147 200283000 194332512 188451167 182761014 177193539 171589592 166017884 160807079
33705 160807079 156088249 151491737 146576645 141450987 136633279 132316840 128134594 123766860
33697 123766860 119456476 115672689 112451012 109348718 106007274 102521049 99208153 96193618
33689 96193618 93332075 90471508 87673831 85131403 82894769 80746081 78403391 75854610
33681 75854610 73416385 71390549 69690060 67913959 65845432 63781070 62222009 61239360
33673 61239360 60315101 58919416 57117448 55421279 54103920 52903695 51462527 49827247
33665 49827247 48347777 47206860 46244636 45219972 44093738 43028342 42189874 41575920
33657 41575920 41011068 40315062 39465555 38548496 37588637 36564257 35587086 34867303 34418198
$$ packed form
33713B06137147n854147n950488n881345n690153n567475n603947n571708n210805
33705A60807079m718830m596512m915092n125658m817708m316439m182246m367734
33697A23766860m310384l783787l221677l102294l341444l486225l312896l014535
33689I6193618k861543k860567k797677k542428k236634k148688k342690k548781
33681G5854610k438225k025836j700489j776101k068527k064362j559061r82649
33673F1239360r24259j395685j801968j696169j317359j200225j441168j635280
33665D9827247j479470j140917r62224j024664j126234j065396q38468o13954
33657D1575920n64852o96006q49507r17059r59859j024380r77171p19783m49105
$$ plain form
33648 34418198 33993531 33446707 32941074 32606537 32200441 31418062 30411764 29638562 29216433
33639 29216433 28799849 28159640 27525944 27174301 26953085 26484022 25690261 24885051 24373980
33630 24373980 24134220 23893219 23436211 22820741 22295298 21989066 21743134 21345615 20854305
33621 20854305 20498241 20304430 20080143 19786741 19632424 19684375 19681810 19415136 19018637 18647504
33611 18647504 18129767 17290922 16450552 16161735 16452373 16699443 16364220 15578658 14879499
33602 14879499 14590704 14627574 14739838 14750375 14615752 14410283 14266290 14254512 14298222 14222903
33592 14222903 13909311 13430144 13041421 12965045 13121290 13150615 12801745 12251205 11923072 12012910
33582 12012910 12302453 12445801 12342500 12207691 12315136 12647364 12789002 12293007 11244456
$$ packed form
33648C4418198m24667n46824n05633l34537m06096p82379j006298p73202m22129
33639B9216433m16584o40209o33696l51643k21216m69063p93761q05210n11071
33630B4373980k39760k41001m57008o15470n25443l06232k45932l97519m91310
33621B0854305l56064j93811k24287k93402j54317N1951k565k66674l96499l71133
33611A8647504n17737q38845q40370k88817K90638K47070l35223p85562o99159
33602A4879499k88795L6870J12264J0537j34623k05469j43993j1778M3710p5319
33592A4222903l13592m79167l88723p6376J56245K9325l48870n50540l28133Q9838
33582A2012910K89543J43348j03301j34809J07445L32228J41638m95995j048551
$$ plain form
33573 11244456 10307693 10032965 10243208 10347152 10149457 10008101 10190716 10458703 10440969
33564 10440969 10116379 9714006 9366858 9100900 8990073 9064425 9174049 9182944 9213978 9460372
33554 9460372 9813984 9948728 9780723 9588321 9600923 9685829 9567892 9200825 8766276 8392570
33544 8392570 8029614 7592970 7129683 6821204 6858227 7286542 7916448 8403526 8507413 8308710
33534 8308710 8120752 8151630 8303920 8354139 8251568 8118899 8003643 7824000 7604584 7543014
33524 7543014 7689505 7759235 7516284 7205401 7259757 7609635 7671097 7136261 6423191 6123458
33514 6123458 6288552 6546644 6700184 6843146 6989687 6975625 6781504 6653902 6776099 7000952
33504 7000952 7032557 6762590 6332028 5935327 5659208 5509416 5532234 5817195 6304471 6670534
$$ packed form
33573A1244456r36763k74728K10243J03944j97695j41356J82615K67987j7734
33564A0440969l24590m02373l47148k65958j10827P4352J09624Q895L1034K46394
33554I460372L53612J34744j68005j92402J2602Q4906j17937l67067m34549l73706
33544H392570l62956m36644m63287l08479L7023M28315O29906M87078J03887j98703
33534H308710j87958L0878J52290N0219j02571j32669j15256j79643k19416o1570
33524G543014J46491O9730k42951l10883N4356L49878O1462n34836p13070k99733
33514F123458J65094K58092J53540J42962J46541j4062j94121j27602J22197K24853
33504G000952L1605k69967m30562l96701k76119j49792K2818K84961M87276L66063
$$ plain form
33494 6670534 6612134 6266256 6098408 6267617 6381311 6083954 5602840 5388126 5453372 5498853
33484 5498853 5522622 5782644 6178091 6234218 5851505 5569978 5822665 6315681 6454686 6085630
33474 6085630 5503949 4978997 4600699 4425452 4450164 4520430 4496344 4426544 4390306 4316558
33464 4316558 4159099 4094669 4309400 4696383 4971605 4992651 4808640 4547029 4403054 4527867
33454 4527867 4746204 4666732 4324257 4357006 5124444 5965324 5923117 5046906 4315539 4279022
33444 4279022 4460802 4284514 3953328 4031274 4594773 5224522 5583737 5648978 5533964 5374575
33434 5374575 5285929 5239976 5091734 4843313 4717987 4862605 5164451 5458500 5691154 5787169
33424 5787169 5639366 5370593 5307923 5528327 5741956 5801319 5936747 6222468 6255938 5809464
$$ packed form
33494F670534n8400l45878j67848J69209J13694k97357m81114k14714O5246M5481
33484E498853K3769K60022L95447N6127l82713k81527K52687M93016J39005l69056
33474F085630n81681n24952l78298j75247K4712P0266k4086o9800l6238p3748
33464D316558j57459o4430K14731L86983K75222K1046j84011k61611j43975J24813
33454D527867K18337p9472l42475L2749P67438Q40880m2207q76211p31367l6517
33444D279022J81780j76288l31186P7946N63499O29749L59215O5241j15014j59389
33434E374575q8646m5953j48242k48421j25326J44618L01846K94049K32654R6015
33424E787169j47803k68773o2670K20404K13629N9363J35428K85721L3470m46474
$$ plain form
33414 5809464 5422007 5757736 6601147 7117405 7013730 6794110 6835933 6891560 6730151 6675202
33404 6675202 7095071 7752101 8107704 8064657 8000974 8167549 8428214 8612107 8802406 9136185
33394 9136185 9516191 9732626 9833292 10170715 10976900 12023843 12899360 13558271 14328332
33385 14328332 15338829 16286655 16956476 17652558 18803022 20382672 22097561 23929525
33377 23929525 26036362 28244336 30182845 31935311 34032321 36701212 39628295 42622306
33369 42622306 45985967 49943178 54168925 58280043 62426335 66941934 71638512 75869520
33361 75869520 79156813 81400472 82624250 82908091 82487659 81532726 79834213 77039196
33353 77039196 73214795 68901650 64593910 60422402 56361925 52474322 48857506 45540762
$$ packed form
33414E809464l87457L35729Q43411N16258j03675k19620M1823N5627j61409n4949
33404F675202M19869O57030L55603m3047o3683J66575K60665J83893J90299L33779
33394I136185L80006K16435J00666L37423Q06185J046943Q75517O58911P70061
33385A4328332J010497R47826O69821O96082J150464J579650J714889J831964
33377B3929525K106837K207974J938509J752466K097010K668891K927083K994011
33369D2622306L363661L957211M225747M111118M146292M515599M696578M231008
33361G5869520L287293K243659J223778K83841m20432r54933j698513k795017
33353G7039196l824401m313145m307740m171508m060477l887603l616816l316744
$$ plain form
33345 45540762 42505358 39691097 36975551 34271980 31638341 29191050 26984320 25093155
33337 25093155 23669598 22696921 21813131 20670872 19411726 18474023 17950545 17470915 16758373
33328 16758373 15957196 15289254 14698718 14024664 13287551 12596597 11935280 11221912 10468859
33319 10468859 9750459 9131328 8721535 8633766 8755191 8743750 8434041 8088109 8017235 8078295
33309 8078295 7829392 7156816 6459818 6136494 6121426 6085519 5929905 5859428 6005637 6203612
33299 6203612 6231445 6105528 5968437 5783984 5395850 4902721 4678686 4847261 4981438 4630838
33289 4630838 4020393 3858095 4423247 5177967 5412560 5017589 4437920 4053068 3823727
33280 3823727 3477618 2875740 2195781 1806811 1913855 2315925 2627399 2753211 2971550
$$ packed form
33345D5540762l035404k814261k715546k703571k633639k447291k206730j891165
33337B5093155j423557r72677q83790j142259j259146r37703n23478m79630p12542
33328A6758373q01177o67942n90536o74054p37113o90954o61317p13368p53053
33319A0468859p18400o19131m09793q7769J21425j1441l09709l45932p0874O1060
33309H078295k48903o72576o96998l23324j5068l5907j55614p0477J46209J97975
33299F203612K7833j25917j37091j84453l88134m93129k24035J68575J34177l50600
33289D630838o10445j62298N65152P54720K34593l94971n79669l84852k29341
33280C823727l46109o01878o79959l88970J07044M02070L11474J25812K18339
$$ plain form
33271 2971550 3476214 4031103 4231465 3979225 3542327 3231174 3157385 3240270 3312469 3254074
33261 3254074 3116146 3069692 3173351 3266030 3147869 2783480 2291539 1857886 1685891 1840668
33251 1840668 2068044 1991154 1609669 1362227 1523104 1805560 1814238 1623969 1567739 1685772
33241 1685772 1821604 2089037 2695238 3334695 3357212 2685010 2019515 1877088 1918451 1621893
33231 1621893 1189707 1222103 1705117 1939744 1525665 915949 790431 1211906 1661708 1722979
33221 1722979 1461383 1179283 1025090 936544 866282 918890 1208188 1644962 1977832 2057744
33211 2057744 1965575 1851986 1772407 1745546 1835890 2042881 2209125 2203747 2127589 2147767 2174361
33200 2174361 1944212 1463264 1111345 1162414 1398047 1413413 1187422 1079969 1268291 1460662
$$ packed form
33271B971550N04664N54889K00362k52240m36898l11153p3789Q2885P2199n8395
33261C254074j37928m6454J03659R2679j18161l64389m91941m33653j71995J54777
33251A840668K27376p6890l81485k47442J60877K82456Q678j90269n6230J18033
33241A685772J35832K67433O06201O39457K2517o72202o65495j42427M1363k96558
33231A621893m32186L2396M83014K34627m14079o09716j25518M21475M49802O1271
33221A722979k61596k82100j54193q8546p0262N2608K89298M36774L32870P9912
33211B057744r2169j13589p9579k6861R0344K06991J66244n378p6158K0178K6594
33200B174361k30149m80948l51919N1069K35633J5366k25991j07453J88322J92371
$$ plain form
33190 1460662 1303796 888579 642693 788755 1118711 1327384 1379528 1438785 1565904 1660474
33180 1660474 1673991 1717052 1895615 2138850 2274382 2235214 2117301 2041024 2027193 2035161 2056708
33169 2056708 2091806 2058043 1858513 1606024 1638214 2116762 2663463 2656218 1966792 1164678
33159 1164678 827584 871070 808881 487683 200707 151465 229607 381949 779219 1403198
33149 1403198 1824619 1711431 1325110 1174306 1330795 1434230 1273283 990504 736980
33140 736980 500888 332020 375676 557927 565540 323394 201477 511241 1046068 1406568
33130 1406568 1569089 1773961 1988286 1912042 1524889 1208717 1201488 1296056 1281247 1336501
33120 1336501 1662930 1973138 1775979 1089568 459262 237807 235339 194286 217906 470371
$$ packed form
33190A460662j56866m15217k45886J46062L29956K08673N2144N9257J27119R4570
33180A660474J3517M3061J78563K43235J35532l9168j17913p6277j3831P968K1547
33169B056708L5098l3763j99530k52489L2190M78548N46701p245o89426q02114
33159A164678l37094M3486o2189l21198k86976m9242P8142J52342L97270O23979
33149A403198M21421j13188l86321j50804J56489J03435j60947k82779k53524
33140G36980k36092j68868M3656J82251P613k42146j21917L09764N34827L60500
33130A406568J62521K04872K14325p6244l87153l16172p229R4568j4809N5254
33120A336501L26429L10208j97159o86411o30306k21455k468m1053K3620K52465
$$ plain form
33110 470371 758287 774454 596814 566437 717441 698145 319488 -140598 -325011 -252363
33100 -252363 -209929 -349293 -552589 -600870 -350062 167566 705704 956763 847770 605110
33090 605110 451791 370298 279148 293530 605793 1163226 1649875 1794694 1594816 1271392
33080 1271392 1102582 1229734 1500307 1563492 1249569 780514 463394 278198 -19609 -452142
33070 -452142 -730829 -637231 -283562 47369 155127 5163 -256026 -356769 -161953 114865
33060 114865 170832 74501 184719 570595 855586 792642 670207 888321 1367314 1668369
33050 1668369 1550417 1143776 704172 469838 655151 1273530 1981190 2354714 2338213 2220023
33040 2220023 2196370 2182229 2042905 1778607 1453590 1145730 981468 1010170 1027900 765853
$$ packed form
33110D70371K87916J6167j77640l0377J51004j9296l78657m60086j84413P2648
33100b52363M2434j39364k03296m8281K50808N17628N38138K51059j08993k42660
33090F05110j53319q1493r1150J4382L12263N57433M86649J44819j99878l23424
33080A271392j68810J27152K70573O3185l13923m69055l17120j85196k97807m32533
33070d52142k78687R3598L53669L30931J07758j49964k61189j00743J94816K76818
33060A14865N5967r6331J10218L85876K84991o2944j22435K18114M78993L01055
33050A668369j17952m06641m39604k34334J85313O18379P07660L73524j6501j18190
33040B220023k3653j4141j39324k64298l25017l07860j64262K8702J7730k62047
$$ plain form
33030 765853 309107 77429 270254 547805 438338 -71213 -509335 -407383 287668 1191202
33020 1191202 1757876 1656094 997040 208232 -332611 -513300 -406873 -139220 141416
33011 141416 323694 429356 536843 591901 465445 241102 224700 542620 914165 976494
33001 976494 689206 276554 -66909 -242741 -195732 -28898 -43202 -392642 -759276 -633249
32991 -633249 89912 1007375 1679367 1963479 1891308 1513393 987859 604972 549286 723707
32981 723707 898105 949658 905386 847233 830309 817649 684068 389039 135253 194807 553003
32970 553003 898487 1011800 967755 874949 645998 204231 -252449 -418866 -236129 102362
32960 102362 429186 706190 903145 974568 967058 991160 1059911 1070585 952405 726875 440390
$$ packed form
33030G65853m56746k31678J92825K77551j09467n09551m38122J01952O95051R03534
33020A191202N66674j01782o59054p88808n40843j80689J06427K67653K80636
33011A41416J82278J05662J07487N5058j26456k24343j6402L17920L71545O2329
33001I76494k87288m12652l43463j75832M7009J66834j4304l49440l66634J26027
32991f33249P23161R17463O71992K84112p2171l77915n25534l82887n5686J74421
32981G23707J74398N1553m4272n8153j6924j2660j33581k95029k53786N9554L58196
32970E53003L45484J13313m4045r2806k28951m41767m56680j66417J82737L38491
32960A02362L26824K77004J96955P1423p510K4102O8751J0674j18180k25530k86485
$$ plain form
32949 440390 166318 56284 222106 533058 683831 529258 228049 -7940 -172481 -371064
32939 -371064 -579884 -645131 -489892 -206798 55283 218813 290823 313601 320097 315801 314730
32928 314730 402414 701206 1200708 1652068 1732399 1360678 816000 511920 656969 1117799
32918 1117799 1560320 1705625 1503936 1128217 810093 653007 595312 562814 622698 909917
32908 909917 1379419 1726777 1664633 1251033 824668 613756 559278 569150 734442 1099986
32898 1099986 1374719 1192495 674811 414651 752768 1329733 1590946 1536411 1635558 2067373
32888 2067373 2418436 2240856 1626067 1038377 764397 736471 788395 855177 927644 984277
32878 984277 1010368 991913 883178 665306 432385 327395 385958 520051 646730 740038
$$ packed form
32949D40390k74072j10034J65822L10952J50773j54573l01209k35989j64541j98583
32939c71064k08820o5247J55239K83094K62081J63530P2010K2778O496m296j071
32928C14730Q7684K98792M99502M51360Q0331l71721n44678l04080J45049M60830
32918A117799M42521J45305k01689l75719l18124j57086n7695l2498N9884K87219
32908I09917M69502L47358o2144m13600m26365k10912n4478R872J65292L65544
32898A099986K74733j82224n17684k60160L38117N76965K61213n4535R9147M31815
32888B067373L51063j77580o14789n87690k73980k7926N1924O6782P2467N6633
32878I84277K6091j8455j08735k17872k32921j04990N8563J34093J26679R3308
$$ plain form
32868 740038 762637 665855 490457 363281 345543 374929 410667 535928 817647 1123444
32858 1123444 1202368 973463 666245 616194 912641 1283155 1376655 1151502 889565 798722
32848 798722 758636 594122 436642 541219 812322 857542 567925 294783 303148 404599
32838 404599 384896 451972 862201 1348260 1417424 1124420 1033835 1377782 1733826 1671229
32828 1671229 1282210 882589 589821 444716 571657 892685 996698 656462 213893
32819 213893 66389 28191 -312077 -786455 -804150 -309821 26629 -233313 -675508 -686745
32809 -686745 -316629 -68838 -100351 -110062 50467 112005 -149031 -496354 -502159 -106711 284236
32798 284236 277178 -42711 -214104 34714 436636 515102 194734 -111423 -43288 303804
$$ packed form
32868G40038K2599r6782j75398j27176j7738K9386L5738J25261K81719L05797
32858A123444P8924k28905l07218n0051K96447L70514R3500k25153k61937r0843
32848G98722m0086j64514j57480J04577K71103M5220k89617k73142Q365J01451
32838D04599j9703O7076M10229M86059O9164k93004r0585L43947L56044o2597
32828A671229l89019l99621k92768j45105J26941L21028J04013l40236m42569
32819B13893j47504l8198l40268m74378j7695M94329L36450k59942m42195j1237
32809f86745L70116K47791l1513r711J60529O1538k61036l47323n805L95448L90947
32798B84236p058l19889j71393K48818M01922P8466l20368l06157O8135L47092
$$ plain form
32788 303804 629592 854041 1060971 1168697 976183 537816 205196 199796 363917 463792
32778 463792 539201 745581 974213 899574 429470 -103629 -309452 -184000 -80314 -300724
32768 -300724 -812405 -1321221 -1527585 -1332423 -892649 -480685 -220404 10818 325344 540473
32758 540473 365850 -99397 -328025 2727 552216 744695 506823 255650 223587 190970
32748 190970 -31360 -236838 -169630 35187 49045 -162658 -328079 -268994 -70109 110186
32738 110186 175412 57838 -232018 -508094 -556000 -415047 -352320 -524802 -813429 -1003412
32728 -1003412 -964557 -649912 -130898 319495 424593 305553 447379 1068843 1730250 1843607
32718 1843607 1445099 1126307 1212012 1360803 1120158 593762 296675 475988 841499 965557
$$ packed form
32788C03804L25788K24449K06930J07726j92514m38367l32620n400J64121R9875
32778D63792P5409K06380K28632p4639m70104n33099k05823J25452J03686k20410
32768c00724n11681n08816k06364J95162M39774M11964K60281K31222L14526K15129
32758E40473j74623m65247k28628L30752N49489J92479k37872k51173l2063l2617
32748A90970k22330k05478O7208K04817J3858k11703j65421N9085J98885J80295
32738A10186O5226j17574k89856k76076m7906J40953O2727j72482k88627j89983
32728a003412L8855L14645N19014M50393J05098j19040J41826O21464O61407J13357
32718A843607l98508l18792Q5705J48791k40645n26396k97087J79313L65511J24058
$$ plain form
32708 965557 738357 375668 149933 213486 554244 979159 1205057 1113444 898891 837692
32698 837692 933294 964685 900243 1020832 1480881 1952058 1972877 1565097 1202980 1164385
32688 1164385 1229817 1134872 1000779 1054640 1145057 905265 354425 -11682 177345 725173
32678 725173 1154952 1232526 1042381 712593 305294 -60044 -193405 -20684 303174 510298
32668 510298 418453 42428 -415112 -691190 -661214 -433511 -215521 -106714 -59939 15561
32658 15561 199200 539597 945808 1130059 847695 239102 -230733 -246671 80521 464069
32648 464069 767306 953997 926528 655926 354959 266859 347221 404567 485336 793652
32638 793652 1229387 1388352 1144914 864668 812195 698522 182118 -436935 -507202 59387
$$ packed form
32708I65557k27200l62689k25735O3553L40758M24915K25898r1613k14553o1199
32698H37692R5602L1391o4442J20589M60049M71177K0819m07780l62117l8595
32688A164385O5432r4945j34093N3861R0417k39792n50840l66107J89027N47828
32678G25173M29779P7574j90145l29788m07299l65338j33361J72721L23858K07124
32668E10298r1845l76025m57540k76078K9976K27703K17990J08807M6775P5500
32658A5561J83639L40397M06211J84251k82364o08593m69835j5938L27192L83548
32648D64069L03237J86691k7469k70602l00967q8100Q0362N7346Q0769L08316
32638G93652M35735J58965k43438k80246n2473j13673n16404o19053p0267N66589
$$ plain form
32628 59387 639706 744810 593989 661735 1001420 1293634 1325534 1110358 670535 29136
32618 29136 -600664 -888089 -710012 -251448 230241 593877 781585 797700 775137 890821
32608 890821 1124817 1230909 1032504 637990 286929 107440 123023 357518 763621 1130349
32598 1130349 1251351 1165578 1071370 1021974 891429 655155 486258 476556 457602 273054
32588 273054 94304 231067 656830 958169 837833 495917 359302 513370 585798 233826
32578 233826 -394248 -818504 -811773 -663493 -778010 -1125671 -1268164 -927782 -357148 -45248
32568 -45248 -154877 -369818 -268821 233710 807115 1010456 698368 159312 -169460 -120718
32558 -120718 129985 372231 562990 671428 551966 167663 -205401 -231536 95091 512183
$$ packed form
32628E9387N80319J05104j50821O7746L39685K92214L1900k15176m39823o41399
32618B9136o29800k87425J78077M58564M81689L63636J87708J6115k2563J15684
32608H90821K33996J06092j98405l94514l51061j79489J5583K34495M06103L66728
32598A130349J21002q5773r4208m9396j30545k36274j68897r702j8954j84548
32588B73054j78750J36763M25763L01339j20336l41916j36615J54068P2428l51972
32578B33826o28074m24256O731J48280j14517l47661j42493L40382N70634L11900
32568d5248j09629k14941J00997N02531N73405K03341l12088n39056l28772M8742
32558a20718K50703K42246J90759J08438j19462l84303l73064k6135L26627M17092
$$ plain form
32548 512183 847321 1071774 1086566 786945 353581 154972 282403 472481 569328 731046
32538 731046 1032590 1209942 1043435 709975 475532 290849 8005 -237342 -249426 -207050
32528 -207050 -427716 -765410 -710072 -141331 436289 539522 226396 -192458 -612295 -1037882
32518 -1037882 -1282409 -1101887 -563093 -30935 216512 219335 199396 313350 544624 752698
32508 752698 793946 609227 223685 -261635 -629432 -618626 -209874 212940 198900 -253811
32498 -253811 -709814 -845470 -757620 -655959 -505816 -156593 351568 817756 1125802 1295554
32488 1295554 1361831 1348073 1304050 1246919 1120384 917822 774137 818079 997811 1169683
32478 1169683 1291663 1391775 1394635 1140536 596538 -53085 -547389 -723451 -571644 -203811
$$ packed form
32548E12183L35138K24453J4792k99621m33364j98609J27431J90078R6847J61718
32538G31046L01544J77352j66507l33460k34443j84683k82844k45347j2084M2376
32528b07050k20666l37694N5338N68741N77620J03233l13126m18854m19837m25587
32518a037882k44527J80522N38794N32158K47447K823j9939J13954K31274K08074
32508G52698M1248j84719l85542m85320l67797J0806M08752M22814j4040m52711
32498b53811m56003j35656Q7850J01661J50143L49223N08161M66188L08046J69752
32488A295554O6277j3758m4023n7131j26535k02562j43685M3942J79732J71872
32478A169683J21980J00112K860k54099n43998o49623m94304j76062J51807L67833
$$ plain form
32468 -203811 204994 478594 488768 214560 -180038 -387680 -222427 153313 413943 494821
32458 494821 645256 1007318 1360746 1412958 1150636 746647 302378 -114231 -333680 -248030
32448 -248030 -37926 -5295 -208087 -441478 -531909 -468454 -304011 -133820 -132926 -400818 -779802
32437 -779802 -1020325 -1108064 -1230501 -1444838 -1603504 -1607416 -1499393 -1284262 -894966 -389286
32427 -389286 42703 321218 501325 514583 180648 -400513 -775574 -691218 -482906 -616965
32417 -616965 -1005311 -1121154 -753153 -295196 -187856 -338394 -293373 134300 611589 666686
32407 666686 204239 -413329 -744660 -667778 -414863 -284159 -361420 -491665 -475330 -297834
32397 -297834 -179562 -354178 -770575 -1096308 -1090587 -881508 -739354 -652086 -340610 285040
$$ packed form
32468b03811M08805K73600J0174k74208l94598k07642J65253L75740K60630Q0878
32458D94821J50435L62062L53428N2212k62322m03989m44269m16609k19449Q5650
32448b48030K10104L2631k02792k33391r0431O3455J64443J70191Q94k67892l78984
32437g79802k40523q7739j22437k14337j58666l912J08023K15131L89296N05680
32427c89286M31989K78515J80107J3258l33935n81161l75061Q4356K08312j34059
32417f16965l88346j15843L68001M57957J07340j50538M5021M27673M77289N5097
32407F66686m62447o17568l31331P6882K52915J30704p7261j30245J6335J77496
32397b97834J18272j74616m16397l25733N721K09079J42154Q7268L11476O25650
$$ plain form
32387 285040 904675 1145210 1022778 886950 993252 1256066 1396086 1226248 791740 315528
32377 315528 39623 61783 253105 326496 73023 -371645 -548710 -147485 512865 713238
32367 713238 209060 -355408 -207846 523155 944408 562499 -124407 -363859 -93591 161160
32357 161160 82772 -129571 -170228 -3827 218698 369978 358913 92013 -418495 -924274
32347 -924274 -1029602 -509430 424183 1231449 1506280 1315434 1022160 857321 811012 862801
32337 862801 1051356 1285050 1357414 1261276 1238643 1365152 1328560 846295 117826 -399464
32327 -399464 -553973 -594726 -769574 -1050423 -1236479 -1171267 -882601 -592053 -475098 -331255
32317 -331255 285203 1418173 2426829 2629437 2038912 1158529 289211 -514733 -1000599
$$ packed form
32387B85040O19635K40535j22432j35828J06302K62814J40020j69838m34508m76212
32377C15528k75905K2160J91322P3391k53473m44668j77065M01225O60350K00373
32367G13238n04178n64468J47562P31001M21253l81909o86906k39452K70268K54751
32357A61160p8388k12343m0657J66401K22525J51280j1065k66900n10508n05779
32347i24274j05328N20172R33613Q07266K74831j90846k93274j64839m6309N1789
32337H62801J88555K33694P2364r6138k2633J26509l6592m82265p28469n17290
32327c99464j54509m0753j74848k80849j86056O5212K88666K90548J16955J43843
32317c31255O16458J132970J008656K02608n90525q80383q69318q03944m85866
$$ plain form
32308 -1000599 -864658 -386737 -303769 -830851 -1314267 -1137656 -516504 -48696 100022 118816
32298 118816 15083 -288645 -520935 -322274 86635 59396 -539764 -1045899 -866356 -249613
32288 -249613 132426 99614 86642 449349 993433 1260879 1073115 667236 378248 302005
32278 302005 296111 251019 246039 372456 504705 422205 148698 -31537 32773 147297 98900
32267 98900 19159 180787 518776 647163 393936 57793 -433 176166 267367 137792
32257 137792 -41680 -77822 50692 280499 538725 678865 536601 172330 -78968 45358
32247 45358 408893 640189 588087 471000 565015 868312 1123433 1093156 762950 322041
32237 322041 1879 -76596 63046 330081 636484 887878 977839 864612 634837 431130
$$ packed form
32308a000599J35941M77921Q2968n27082m83416J76611O21152M67808J48718J8794
32298A18816j03733l03728k32290J98661M08909k7239n99160n06135J79543O16743
32288b49613L82039l2812j2972L62707N44084K67446j87764m05879k88988p6243
32278C02005n894m5092m980J26417J32249q2500k73507j80235O4310J14524m8397
32267I8900p9741J61628L37989J28387k53227l36143n8226J76599R1201j29575
32257A37792j79472l6142J28514K29807K58226J40140j42264l64271k51298J24326
32247D5358L63535K31296n2102j17087R4015L03297K55121l0277l30206m40909
32237C22041l20162p8475J39642K67035L06403K51394Q9961j13227k29775k03707
$$ plain form
32227 431130 324547 303541 359265 501579 685232 792994 730905 522404 304644 236099
32217 236099 362151 532599 512897 256533 12545 44587 273249 350740 113037 -203922
32207 -203922 -283898 -133727 -30745 -132892 -287987 -242915 53391 390647 495719 274764
32197 274764 -107645 -374803 -383827 -244372 -196494 -368238 -640756 -744862 -515253 -71407
32187 -71407 287263 399254 393631 450528 492352 289535 -135376 -434722 -369044 -119058 8950
32176 8950 33974 209521 557704 785698 712306 523298 479818 564210 568985 401722 150128
32165 150128 -42058 -13735 365116 962919 1292651 934084 79462 -586764 -628052 -263367
32155 -263367 44516 153859 215759 297279 315150 262037 232093 220430 113938 -83355 -193779
$$ packed form
32227D31130j06583k1006N5724J42314J83653J07762o2089k08501k17760o8545
32217B36099J26052J70448j9702k56364k43988L2042K28662P7491k37703l16959
32207b03922p9976J50171J02982j02147j55095M5072K96306L37256J05072k20955
32197B74764l82409k67158r024J39455M7878j71744k72518j04106K29609M43846
32187g1407L58670J11991n623N6897M1824k02817m24911k99346O5678K49986J28008
32176H950K5024J75547L48183K27994p3392j89008m3480Q4392M775j67263k51594
32165A50128j92186K8323L78851N97803L29732l58567q54622o66226m1288L64685
32155b63367L07883J09343O1900Q1520J7871n3113k9944j1663j06492j97293j10424
$$ plain form
32144 -193779 -94843 114300 215859 67653 -282285 -580345 -538344 -176566 83796 -100128
32134 -100128 -469001 -409079 252452 1013425 1343139 1233719 949677 570754 63645 -453539
32124 -453539 -855174 -1248521 -1743583 -2112029 -2023091 -1557159 -1152724 -1057177 -1125760 -1145568
32114 -1145568 -1040858 -741080 -179812 484709 928592 1045358 1033524 1032497 944070 719138
32104 719138 530114 485116 424131 211666 24646 111895 415368 659560 707581 613607
32094 613607 415086 102370 -243270 -484696 -604041 -697094 -807157 -896504 -957708 -1007751
32084 -1007751 -975466 -745397 -362288 -88902 -183039 -630785 -1120597 -1288428 -1020784 -538213
32074 -538213 -169321 -66462 -190431 -505796 -1024196 -1628870 -2032749 -2023001 -1656532 -1150895
$$ packed form
32144a93779R8936K09143J01559j48206l49938k98060M2001L61778K60362j83924
32134a00128l68873N9922O61531P60973L29714j09420k84042l78923n07109n17184
32124d53539m01635l93347m95062l68446Q8938M65932M04435R5547o8583j9808
32114a145568J04710K99778N61268O64521M43883J16766j1834j027q8427k24932
32104G19138j89024m4998o0985k12465j87020Q7249L03473K44192M8021r3974
32094F13607j98521l12716l45640k41426j19345r3053j10063q9347o1204n0043
32084a007751L2285K30069L83109K73386r4137m47746m89812j67831K67644M82571
32074e38213L68892J02859j23969l15365n18400o04674m03879R748L66469N05637
$$ plain form
32064 -1150895 -695938 -424074 -387861 -439081 -296843 80772 327020 93314 -442433 -754742
32054 -754742 -636466 -410666 -419051 -573370 -591281 -477980 -500580 -733278 -904315 -790576
32044 -790576 -555480 -497764 -577048 -457794 -47912 281914 176595 -210471 -436846 -358017
32034 -358017 -226959 -258406 -370290 -386641 -271516 -122178 -110745 -408493 -933683 -1220761
32024 -1220761 -878613 -201431 70434 -293167 -714773 -665681 -375212 -338362 -497144 -395866
32014 -395866 63825 519030 722963 800747 932633 1123722 1294341 1328385 1077827 587741
32004 587741 225776 275120 498051 468598 244903 260246 566027 695355 396027 18790
31994 18790 -47004 78134 62727 -101780 -182591 -122913 -94426 -238875 -543980 -873985 -1013106
$$ packed form
32064a150895M54957K71864L6213n1220J42238L77615K46248k33706n35747l12309
32054g54742J18276K25800q385j54319j7911J13301k2600k32698j71037J13739
32044g90576K35096N7716p9284J19254M09882L29826j05319l87066k26375P8829
32034c58017J31058l1447j11884j6351J15125J49338J1433k97748n25190k87078
32024a220761L42148O77182K71865l63601m21606M9092K90469L6850j58782J01278
32014c95866M59691M55205K03933P7784J31886J91089J70619L4044k50558m90086
32004E87741l61965M9344K22931k9453k23695J5343L05781J29328k99328l77237
31994A8790o5794J25138j5407j64507q0811N9678K8487j44449l05105l30005j39121
$$ plain form
31983 -1013106 -844583 -603660 -748111 -1411882 -2168462 -2512313 -2410536 -2199249 -2096292
31974 -2096292 -2027231 -1823473 -1398091 -792228 -183580 228582 438869 618578 814413 856656
31964 856656 681819 513795 531654 573369 417654 179148 133484 276521 357477 263499
31954 263499 68727 -232594 -698544 -1137098 -1177686 -752321 -229021 77615 301151 745461
31944 745461 1372134 1788488 1719762 1335491 1057028 1096116 1240067 1125078 696042 292632
31934 292632 232946 436046 577380 505861 320229 107974 -137360 -323937 -251407 91998
31924 91998 429215 545454 568135 696779 788840 500250 -162886 -715816 -755386 -459678
31914 -459678 -327840 -519176 -691728 -511452 -83808 251246 378377 450419 552014 564855
$$ packed form
31983a013106J68523K40923j44451o63771p56580l43851J01777K11287J02957
31974b096292O9061K03758M25382O05863O08648M12162K10287J79709J95835M2243
31964H56656j74837j68024J7859M1715j55715k38506m5664J43037Q0956r3978
31954B63499j94772l01321m65950m38554m0588M25365N23300L06636K23536M44310
31944G45461O26673M16354o8726l84271k78463L9088J43951j14989m29036m03410
31934B92632n9686K03100J41334p1519j85632k12255k45334j86577P2530L43405
31924I1998L37217J16239K2681J28644R2061k88590o63136n52930l9570K95708
31914d59678J31838j91336j72552J80276M27644L35054J27131P2042J01595J2841
$$ plain form
31904 564855 406528 192582 37426 -164617 -585617 -1132821 -1436968 -1236395 -704238 -316040
31894 -316040 -384158 -767086 -1069727 -1081785 -928352 -812837 -777686 -786467 -861538 -978344 -968332
31883 -968332 -747068 -531751 -563036 -674501 -457967 136911 708802 981686 1119806 1311613
31873 1311613 1391933 1150865 761104 581406 678264 807219 757962 501168 127060 -144399
31863 -144399 -47049 394224 767223 778668 679631 858726 1186311 1196148 831758 524556
31853 524556 507698 551365 509392 635225 1087097 1529825 1588299 1400322 1325330 1315372 1024000
31842 1024000 468992 135613 315884 677586 677419 207375 -352181 -607427 -497511 -204112
31832 -204112 111043 399719 625936 681357 467496 53933 -315808 -443820 -397481 -445328
$$ packed form
31904E64855j58327k13946j55156k02043m21000n47204l04147K00573N32157L88198
31894c16040o8118l82928l02641j2058J53433J15515L5151q781p5071j16806J0012
31883i68332K21264K15317l1285j11465K16534N94878N71891K72884J38120J91807
31873A311613Q0320k41068l89761j79698R6858J28955m9257k56794l74108k71459
31863a44399R7350M41273L72999J1445r9037J79095L27585R837l64390l07202
31853E24556j6858M3667m1973J25833M51872M42728N8474j87977p4992r958k91372
31842A024000n55008l33379J80271L61702j67m70044n59556k55246J09916K93399
31832b04112L15155K88676K26217N5421k13861m13563l69741j28012M6339m7847
$$ plain form
31822 -445328 -743552 -1139613 -1347462 -1274529 -1065969 -829383 -484178 12703 448687 577127
31812 577127 488465 507545 710320 808354 595750 246824 17704 -107829 -269705 -436799
31802 -436799 -503469 -507333 -490339 -313844 71560 321024 59924 -501807 -740612 -434689
31792 -434689 1623 178823 190735 232799 197372 -23790 -164772 72112 481192 575766
31782 575766 284958 52693 212172 584135 798848 764553 661921 636989 675428 722425
31772 722425 782520 871152 926142 821475 506678 138946 18706 320653 887126 1342038
31762 1342038 1432576 1233811 999026 835413 588809 90721 -533919 -933597 -939201 -759843
31752 -759843 -648218 -505166 -46826 678181 1223032 1290445 1116330 1127953 1364877 1457163
$$ packed form
31822d45328k98224l96061k07849P2933K08560K36586L45205M96881M35984J28440
31812E77127q8662J9080K02775R8034k12604l48926k29120j25533j61876j67094
31802d36799o6670l864J6994J76495L85404K49464k61100n61731k38805L05923
31792d34689M36312J77200J1912M2064l5427k21162j40982K36884M09080R4574
31782E75766k90808k32265J59479L71963K14713l4295j02632k4932L8439M6997
31772G22425O0095Q8632N4990j04667l14797l67732j20240L01947N66473M54912
31762A342038R0538j98765k34785j63613k46604m98088o24640l99678n604J79358
31752g59843J11625J43052M58340P25007N44851O7413j74115J1623K36924R2286
$$ plain form
31742 1457163 1137812 579134 168856 75866 136337 141004 126711 283716 591226 713764
31732 713764 395555 -149990 -452236 -347703 -91938 114038 416572 973844 1571375 1833528
31722 1833528 1709183 1507445 1496347 1674191 1909069 2082466 2070823 1798393 1391418 1105081
31712 1105081 982675 740061 160068 -498548 -718475 -366544 96826 158135 -174910 -516491
31702 -516491 -679909 -826343 -1049828 -1138380 -903873 -514677 -278402 -236338 -189799 -21075
31692 -21075 233631 543094 869744 1046438 903733 508605 76631 -306528 -654089 -848058
31682 -848058 -748525 -513897 -479688 -685640 -853058 -871315 -920338 -1008612 -828825 -308499
31672 -308499 89576 -50093 -504323 -741034 -593846 -259847 134812 538075 698266 369034
$$ packed form
31742A457163l19351n58678m10278r2990O0471M667j4293J57005L07510J22538
31732G13764l18209n45545l02246J04533K55765K05976L02534N57272N97531K62153
31722A833528j24345k01738j1098J77844K34878J73397j1643k72430m06975k86337
31712A105081j22406k42614n79993o58616k19927L51931M63370O1309l33045l41581
31702e16491j63418j46434k23485q8552K34507L89196K36275M2064M6539J68724
31692b1075K54706L09463L26650J76694j42705l95128m31974l83159l47561j93969
31682h48058R9533K34628L4209k05952j67418j8257m9023q8274J79787N20326
31672c08499L98075j39669m54230k36711J47188L33999L94659M03263J60191l29232
$$ plain form
31662 369034 -219733 -511532 -306940 39602 171475 151661 226968 476468 861807 1372845
31652 1372845 1896670 2111018 1778276 1117363 663139 689475 913461 882661 556031 299007
31642 299007 294278 235574 -183685 -699498 -769174 -356328 18552 67069 89435 339901 524073
31631 524073 317272 14 72109 471768 712678 668821 668329 816883 775290 344768 -170152
31620 -170152 -376656 -241332 45307 354984 589456 611789 414880 211349 222273 483083
31610 483083 884729 1231906 1256847 822561 164779 -310117 -518668 -730212 -1060110 -1269227
31600 -1269227 -1196254 -1042620 -1003203 -913132 -553224 -84161 146677 99984 40868 104715
31590 104715 137259 -44582 -446221 -939650 -1318840 -1313139 -759246 148071 897039 1061962
$$ packed form
31662C69034n88767k91799K04592L46542J31873j9814P5307K49500L85339N11038
31652A372845N23825K14348l32742o60913m54224K6336K23986l0800l26630k57024
31642B99007m729n8704m19259n15813o9676M12846L74880M8517K2366K50466J84172
31631E24073k06801l17258P2095L99659K40910m3857m92J48554m1593m30522n14920
31620a70152k06504J35324K86639L09677K34472K2333j96909k03531J0924K60810
31610D83083M01646L47177K4941m34286o57782m74896k08551k11544l29898k09117
31600a269227P2973J53634L9417R0071L59908M69063K30838m6693n9116O3847
31590A04715L2544j81841m01639m93429l79190N701N53893R07317P48968J64923
$$ plain form
31580 1061962 663488 110930 -193723 -184840 -92284 -133033 -319397 -556698 -769450 -837042
31570 -837042 -585740 -63032 310096 169610 -244580 -312990 141073 599548 550632 109183
31560 109183 -268589 -382985 -316793 -118615 161291 249024 -129927 -773390 -1073525 -688310
31550 -688310 55700 538289 477629 91265 -241875 -326273 -192422 47021 283716 396244
31540 396244 275183 -51720 -370031 -447193 -247543 64816 289635 303650 112723 -89107
31530 -89107 -15094 389473 806949 931457 888287 994592 1190014 1086422 599435 112706
31520 112706 -110364 -272119 -588988 -879597 -911795 -847571 -970066 -1188268 -1210805 -1082048
31510 -1082048 -1142550 -1478050 -1756152 -1666987 -1273531 -856320 -589440 -431562 -229009 103861
$$ packed form
31580A061962l98474n52558l04653Q883R2556m0749j86364k37301k12752o7592
31570h37042K51302N22708L73128j40486m14190o8410M54063M58475m8916m41449
31560A09183l77772j14396O6192J98178K79906Q7733l78951o43463l00135L85215
31550f88310P44010M82589o0660l86364l33140q4398J33851K39443K36695J12528
31540C96244j21061l26903l18311p7162J99650L12359K24819J4015j90927k01830
31530h9107P4013M04567M17476J24508m3170J06305J95422j03592m86987m86729
31520A12706k23070j61755l16869k90609l2198O4224j22495k18202k2537J28757
31510a082048o0502l35500k78102Q9165L93456M17211K66880J57878K02553L32870
$$ plain form
31500 103861 466223 679021 728538 762573 796193 638465 243321 -98949 -128303 28262
31490 28262 104734 109173 201370 311020 202013 -162366 -604837 -1004683 -1299614 -1309158 -892957
31479 -892957 -266071 154212 237162 222982 329401 526880 688543 706454 476946 29673
31469 29673 -355206 -429613 -342137 -429118 -693495 -848562 -860612 -1014351 -1342678 -1419924 -946930
31458 -946930 -226104 199085 174748 7933 71379 492439 1090580 1501143 1484092 1177708
31448 1177708 923812 861828 901389 1040141 1367412 1724595 1755342 1419920 1087331 959813
31438 959813 807303 497021 353881 634062 1002671 980688 646933 417845 326870 61092
31428 61092 -365124 -542690 -363126 -284741 -686634 -1318858 -1654628 -1543070 -1252887 -1029701
$$ packed form
31500A03861L62362K12798M9517L4035L3620j57728l95144l42270k9354J56565
31490B8262P6472M439R2197J09650j09007l64379m42471l99846k94931r544M16201
31479h92957O26886M20283Q2950j4180J06419J97479J61663J7911k29508m47273
31469B9673l84879p4407Q7476q6981k64377j55067j2050j53739l28327p7246M72994
31458i46930P20826M25189k4337j66815O3446M21060N98141M10563j7051l06384
31448A177708k53896o1984L9561J38752L27271L57183L0747l35422l32589j27518
31438I59813j52510l10282j43140K80181L68609k1983l33755k29088r0975k65778
31428F1092m26216j77566J79564P8385m01893o32224l35770J11558K90183K23186
$$ plain form
31418 -1029701 -874368 -707603 -534727 -403782 -311975 -207456 -57065 99668 159488 36481
31408 36481 -242772 -517375 -572672 -286505 238493 688194 767073 464220 47367 -223034
31398 -223034 -305275 -294573 -248652 -163620 -37270 114248 239858 228236 21112 -193566
31388 -193566 -60959 541048 1301589 1812621 1992367 2021761 1987004 1821631 1559108 1386959
31378 1386959 1383605 1377067 1158761 739498 328176 121438 146497 251057 235380 62491
31368 62491 -55161 139794 630867 1086052 1186706 965189 771247 903858 1296793 1582599
31358 1582599 1463678 986901 438987 48978 -119237 -58754 209431 542854 743946 796895
31348 796895 877637 1040265 1073920 815944 445698 274752 361589 538343 721183 949878
$$ packed form
31418a029701J55333J66765J72876J30945R1807J04519J50391J56733N9820j23007
31408C6481k79253k74603n5297K86167N24998M49701P8879l02853m16853k70401
31398b23034q2241J0702M5921Q5032J26350J51518J25610j1622k07124k14678
31388a93566J32607O02007P60541N11032J79746K9394l4757j65373k62523j72149
31378A386959l354o538k18306m19263m11322k06738K5059J04560j5677j72889
31368F2491j17652J94955M91073M55185J00654k21517j93942J32611L92935K85806
31358A582599j18921m76777n47914l90009j68215O0483K68185L33423K01092N2949
31348G96895Q0742J62628L3655k57976l70246j70946Q6837J76754J82840K28695
$$ plain form
31338 949878 1159462 1169092 937696 629301 369030 106568 -210432 -477179 -534676 -338574
31328 -338574 23734 387571 549431 381838 -198 -270030 -188264 144886 386245 294639
31318 294639 -30640 -244703 -104860 258571 460754 285987 -71812 -253692 -139823 92104
31308 92104 233528 221419 89893 -87717 -204623 -215003 -236609 -424070 -731064 -942853
31298 -942853 -956554 -866768 -752335 -577442 -375796 -322245 -478301 -639479 -620541 -558909
31288 -558909 -707777 -1002814 -1097739 -853087 -541983 -457091 -510512 -413780 -139411 42111
31278 42111 -11113 -94743 3359 132179 -22807 -436185 -703954 -564535 -228862 -57633
31268 -57633 -95931 -123900 -46293 2212 -99336 -320726 -587834 -841752 -980296 -929372 -810474
$$ packed form
31338I49878K09584R630k31396l08395k60271k62462l17000k66747n7497J96102
31328c38574L62308L63837J61860j67593l82036k69832Q1766L33150K41359r1606
31318B94639l25279k14063J39843L63431K02183j74767l57799j81880J13869K31927
31308I2104J41424j2109j31526j77610j16906j0380k1606j87461l06994k11789
31298i42853j3701Q9786J14433J74893K01646N3551j56056j61178J8938O1632
31288e58909j48868k95037r4925K44652L11104Q4892n3421R6732K74369J81522
31278D2111n3224q3630R8102J28820j54986m13378k67769J39419L35673J71229
31268e7633l8298k7969P7607M8505j01548k21390k67108k53918j38544N0924J18898
$$ plain form
31257 -810474 -853792 -1077061 -1212836 -1033985 -606285 -145030 216255 412689 373671 122894
31247 122894 -154896 -296627 -328508 -330387 -252392 -40469 153056 106443 -150474 -357343
31237 -357343 -371607 -303833 -279385 -262719 -190575 -103659 -39535 60447 208688 248360 20495
31226 20495 -408632 -817992 -1083931 -1235015 -1290819 -1195253 -931361 -586481 -263286 -8974
31216 -8974 137065 112944 -88623 -360635 -548523 -559556 -402327 -166452 27077 119930
31206 119930 192983 395325 758681 1123101 1280257 1161697 877770 622588 549253 667795
31196 667795 840425 937060 990288 1089533 1124435 822885 144049 -540778 -835091 -771197
31186 -771197 -684125 -712286 -652442 -309537 210142 602654 633455 287816 -223050 -606964
$$ packed form
31257h10474m3318k23269j35775J78851M27700M61255L61285J96434l9018k50777
31247A22894k77790j41731l1881j879P7995K11923J93525m6613k56917k06869
31237c57343j4264O7774K4448J6666P2144Q6916O4124R9982J48241L9672k27865
31226B0495m29127m09360k65939j51084n5804R5566K63892L44880L23195K54312
31216h974J46039k4121k01567k72012j87888j1033J57229K35875J93529R2853
31206A19930P3053K02342L63356L64420J57156j18560k83927k55182p3335J18542
31196F67795J72630R6635N3228R9245L4902l01550o78836o84827k94313O3894
31186g71197Q7072k8161N9844L42905N19679L92512L0801l45639n10866l83914
$$ plain form
31176 -606964 -754363 -828144 -982549 -1095623 -977873 -738646 -645451 -662446 -490578 -111197
31166 -111197 102451 -33436 -192242 -36756 280592 415107 355427 298051 208146 -79789
31156 -79789 -428862 -499673 -300274 -245814 -544041 -819408 -548307 275959 1070657 1213289
31146 1213289 605753 -269120 -822250 -884128 -722643 -589168 -445980 -210272 -12875 4520
31136 4520 -32201 78646 267609 323170 283709 392649 679018 865300 718700 272482
31126 272482 -290658 -745893 -849690 -531323 -73771 147640 108143 61137 61536 -90850
31116 -90850 -398220 -542004 -364841 -155873 -260754 -653797 -1076501 -1371325 -1484784 -1340456
31106 -1340456 -927955 -400570 71734 446111 715251 821036 756054 605722 416819 184402
$$ packed form
31176f06964j47399p3781j54405j13074J17750K39227R3195j6995J71868L79381
31166a11197K13648j35887j58806J55486L17348J34515n9680n7376q9905k87935
31156g9789l49073p0811J99399N4460k98227k75367K71101Q24266P94698J42632
31146A213289o07536q74873n53130o1878J61485J33475J43188K35708J97397J7395
31136D520l6721J10847J88963N5561l9461J08940K86369J86282j46600m46218
31126B72482n63140m55235j03797L18367M57552K21411l9497m7006L99j52386
31116i0850l07370j43784J77163K08968j04881l93043m22704k94824j13459J44328
31106a340456M12501N27385M72304L74377K69140J05785o4982j50332j88903k32417
$$ plain form
31096 184402 3538 1454 59249 -111344 -494062 -678005 -429411 -60545 18491 -146073
31086 -146073 -242151 -220920 -288945 -489577 -623039 -554282 -351197 -137498 -392 -171 -96937
31075 -96937 -117312 56885 328659 527314 601024 561873 406508 235767 256810 476534
31065 476534 595314 427343 207260 205682 270258 108347 -164183 -194123 -12054 -20126 -356982
31054 -356982 -706243 -799683 -712501 -559974 -288687 67755 264963 186922 42992 26735
31044 26735 13943 -187412 -490972 -675197 -730135 -817696 -958422 -984731 -812245 -587387
31034 -587387 -498590 -518984 -419034 -59782 367245 489019 175684 -286998 -519803 -419923
31024 -419923 -105175 337982 840361 1216014 1313122 1234881 1150621 964094 494359 -51657
$$ packed form
31096A84402j80864k084N7795j70593l82718j83943K48594L68866P9036j64564
31086a46073r6078K1231o8025k00632j33462O8757K03085K13699J37106K21r6766
31075i6937k0375J74197K71774J98655P3710l9151j55365j70741K1043K19724
31065D76534J18780j67971k20083j578O4576j61911k72530k9940J82069q072l36856
31054c56982l49261r3440Q7182J52527K71287L56442J97208p8041j43930j6257
31044B6735j2792k01355l03560j84225n4938q7561j40726k6309J72486K24858
31034e87387Q8797k0394R9950L59252M27027J21774l13335m62682k32805R9880
31024d19923L14748M43157N02379L75653R7108p8241q4260j86527m69735n46016
$$ plain form
31014 -51657 -186853 192648 619474 676610 470264 290835 126628 -202830 -660720 -1046263
31004 -1046263 -1301051 -1500514 -1636865 -1646980 -1587221 -1567739 -1559552 -1451243 -1258552 -1113456
30994 -1113456 -1077691 -1110843 -1187228 -1307201 -1420175 -1455517 -1401868 -1259659 -970387 -509536
30984 -509536 -7767 335279 434618 335660 101634 -208030 -486968 -628821 -636395 -623612
30974 -623612 -706939 -907451 -1117304 -1161833 -980166 -755484 -754019 -1014886 -1334660 -1573793
30964 -1573793 -1778267 -1931134 -1825882 -1352977 -723142 -224786 66676 157829 -56275 -566358
30954 -566358 -1008233 -1010982 -702343 -502675 -462989 -228334 290774 662584 554248 232871
30944 232871 141010 239558 141297 -238740 -547264 -509174 -259827 -67134 37173 194605
$$ packed form
31014e1657j35196L79501M26826N7136k06346j79429j64207l29458m57890l85543
31004a046263k54788j99463j36351j0115N9759J9482Q187J08309J92691J45096
30994a113456L5765l3152p6385j19973j12974l5342N3649J42209K89272M60851
30984e09536N01769L43046R9339r8958k34026l09664k78938j41853p574J2783
30974f23612q3327k00512k09853m4529J81667K24682J465k60867l19774k39133
30964a573793k04474j52867J05252M72905O29835M98356K91462R1153k14104n10083
30954e66358m41875k749L08639J99668L9686K34655N19108L71810j08336l21377
30944B32871r1861R8548r8261l80037l08524L8090K49347J92693J04307J57432
$$ plain form
30934 194605 433928 622311 658304 575389 441528 259909 25798 -179761 -246389 -194942
30924 -194942 -204365 -420224 -771290 -1032412 -1043360 -810109 -437258 -70013 112121 -3907
30914 -3907 -305201 -512365 -489306 -391357 -388209 -343914 29086 712632 1288266 1380259 1049903
30903 1049903 652501 420445 309049 167955 -78775 -387828 -614390 -610536 -420369 -324782
30893 -324782 -536781 -884927 -994990 -799817 -648584 -830022 -1200513 -1425901 -1406445 -1272501
30883 -1272501 -1107177 -909383 -750519 -722825 -748916 -657273 -450305 -296031 -242453 -155666
30873 -155666 12692 115488 61003 -23686 -15727 -21302 -202874 -477498 -570241 -356062 -22308
30862 -22308 127570 -30736 -343002 -531567 -454212 -222676 -52835 -27648 -72455 -131887
$$ packed form
30934A94605K39323J88383L5993q2915j33861j81619k34111k05559o6628N1447
30924a94942r423k15859l51066k61122j0948K33251L72851L67245J82134j16028
30914c907l01294k07164K3059R7949L148M4295L73000O83546N75634R1993l30356
30903A049903l97402k32056j11396j41094k46730l09053k26562L854J90167R5587
30893c24782k11999l48146j10063J95173J51233j81438l70491k25388J9456J33944
30883a272501J65324J97794J58864K7694k6091R1643K06968J54274N3578Q6787
30873a55666J68358J02796n4485q4689P959n575j81572k74624r2743K14179L33754
30862b2308J49878j58306l12266j88565P7355K31536J69841K5187m4807n9432
$$ plain form
30852 -131887 -244013 -406849 -485748 -329492 69001 551949 879906 852109 466092 -10224
30842 -10224 -239796 -145209 42979 83615 -40366 -204873 -316721 -335918 -249112 -100219
30832 -100219 42046 191785 416255 673631 817989 792372 651553 380592 -58407 -429247
$$ packed form
30852a31887j12126j62836p8899J56256L98493M82948L27957k7797l86017m76316
30842a0224k29572R4587J88188M0636j23981j64507j11848j9197Q6806J48893
30832a00219J42265J49739K24470K57376J44358k5617j40819k70961m38999l70840
$$ [...]
##END NTUPLES=NMR SPECTRUM
##END=
