##TITLE=31Pdec_DE-175rm_3h
 D, 64 sc
14.8.2026
##JCAMPDX= 6.0         $$ Bruker NMR JCAMP-DX V2.0
##DATA TYPE= NMR SPECTRUM
##DATA CLASS= NTUPLES
##ORIGIN= UXNMR, Bruker Analytische Messtechnik GmbH
##OWNER= root
$$ XWIN-NMR		Version 3.5
$$ Fri Aug 14 14:29:34 2026 Russian Standard Time (UT+4h)  she@DPX200
##.OBSERVE FREQUENCY= 81.013821
##.OBSERVE NUCLEUS= ^31P
##.ACQUISITION MODE= SIMULTANEOUS
##.ACQUISITION SCHEME= undefined
##.AVERAGES= 64
##.DIGITISER RES= 17
##SPECTROMETER/DATA SYSTEM= spect
##.PULSE SEQUENCE= zgpg30
##.SOLVENT NAME= DMSO
##.SHIFT REFERENCE= (INTERNAL, DMSO, 0, 197.392)
##AUDIT TRAIL= $$ (NUMBER, WHEN, WHO, WHERE, WHAT)
$$ ##TITLE= Audit trail, XWIN-NMR		Version 3.5
$$ ##JCAMPDX= 5.01
$$ ##ORIGIN= Bruker BioSpin GmbH
$$ ##OWNER= she
$$ F:/spectra/data/she/nmr/P31/2/pdata/1/auditp.txt
$$ ##AUDIT TRAIL=  $$ (NUMBER, WHEN, WHO, WHERE, WHAT)
(   1,<2026-08-14 14:28:25.31 +0400>,<she>,<DPX200>,
      <created by zg, POWCHK disabled, PULCHK disabled
       configuration hash MD5:
       00 E9 B6 7A A2 85 ED C7 34 08 36 98 17 FE 4E 26
       data hash MD5: 32K
       9F 16 13 28 C0 F4 79 66 46 98 23 E0 2D 8D EE 84>)
(   2,<2026-08-14 14:28:27.81 +0400>,<she>,<DPX200>,
      <Start of raw data processing
       efp BC_mod = 2 LB = 1.5 FT_mod = 6 PKNL = 1 PHC0 = 2040.326 PHC1 = -137.3017 SI = 64K 
       data hash MD5: 64K
       CD 5D 92 59 D7 0C 62 B4 32 86 C5 CF 4D 63 C5 2D>)
(   3,<2026-08-14 14:28:55.78 +0400>,<she>,<DPX200>,
      <pk PHC0 = -91.44067 PHC1 = 253.6001 
       data hash MD5: 64K
       07 67 AF 83 E7 B7 09 8A C8 B7 91 2B 3B 61 2B 6F>)
(   4,<2026-08-14 14:29:01.23 +0400>,<she>,<DPX200>,
      <abs ABSG = 5 
       data hash MD5: 64K
       72 E5 D3 7A 8B BA 30 53 0C CB EA 9D D5 A3 DB 34>)
$$ ##END=
$$ 
$$ hash MD5
$$ 91 C7 34 74 8C E7 34 D6 C1 61 67 9E 7D 4A D5 5B
##$RELAX= 
##$RELAX= 
##$RELAX= 
##$RELAX= 
##$RELAX= 
##$RELAX= 
##$RELAX= 
##$RELAX= 
$$ Bruker specific parameters
$$ --------------------------
##$DU= <F:/spectra>
##$EXPNO= 2
##$NAME= <P31>
##$PROCNO= 1
##$TYPE= <nmr>
##$USER= <she>
##$AMP= (0..31)
100 100 100 100 100 100 100 100 100 100 100 100 100 100 100 100 100 100 
100 100 100 100 100 100 100 100 100 100 100 100 100 100 
##$AQSEQ= 0
##$AQ_mod= 1
##$AUNM= <au_zg>
##$AUTOPOS= <>
##$BF1= 81.014009
##$BF2= 200.13
##$BF3= 200.13
##$BF4= 200.13
##$BF5= 200.13
##$BF6= 200.13
##$BF7= 200.13
##$BF8= 200.13
##$BYTORDA= 1
##$CFDGTYP= 0
##$CFRGTYP= 5
##$CHEMSTR= <none>
##$CNST= (0..31)
1 1 145 1 1 1 1 1 1 1 1 1 1 1 1 1 1 1 1 1 1 1 1 1 1 1 1 1 1 1 1 1 
##$CPDPRG= <waltz16>
##$CPDPRG1= <>
##$CPDPRG2= <waltz16>
##$CPDPRG3= <>
##$CPDPRG4= <mlev>
##$CPDPRG5= <mlev>
##$CPDPRG6= <mlev>
##$CPDPRG7= <mlev>
##$CPDPRG8= <mlev>
##$CPDPRGB= <>
##$CPDPRGT= <>
##$D= (0..31)
0 1 0 0 0 0 0 0 0 0.06 0 0.03 2e-05 3e-06 0 0 0.0002 0 0 0 0 0 0 0 0 0 
0 0 0 0 0 0 
##$DATE= 1786703304
##$DBL= (0..7)
120 120 120 11 120 120 24 19 
##$DBP= (0..7)
150 150 150 150 150 150 150 150 
##$DBP07= 0
##$DBPNAM0= <>
##$DBPNAM1= <>
$$ [...]
##$SUBNAM3= <"">
##$SUBNAM4= <"">
##$SUBNAM5= <"">
##$SUBNAM6= <"">
##$SUBNAM7= <"">
##$SUBNAM8= <"">
##$SUBNAM9= <"">
##$SW= 400.765351723535
##$SWIBOX= (0..15)
0 1 3 0 0 0 0 0 0 0 0 0 0 0 0 0 
##$SW_h= 32467.5324675325
##$TD= 32768
##$TD0= 1
##$TE= 0
##$TE2= 300
##$TE3= 300
##$TEG= 300
##$TL= (0..7)
0 120 53 12 22 120 120 120 
##$TP= (0..7)
150 150 150 150 150 150 150 150 
##$TP07= 0
##$TPNAME0= <>
##$TPNAME1= <>
##$TPNAME2= <>
##$TPNAME3= <>
##$TPNAME4= <>
##$TPNAME5= <>
##$TPNAME6= <>
##$TPNAME7= <>
##$TPOAL= (0..7)
0.5 0.5 0.5 0.5 0.5 0.5 0.5 0.5 
##$TPOFFS= (0..7)
0 0 0 0 0 0 0 0 
##$TUNHIN= 0
##$TUNHOUT= 0
##$TUNXOUT= 0
##$USERA1= <user>
##$USERA2= <user>
##$USERA3= <user>
##$USERA4= <user>
##$USERA5= <user>
##$V9= 5
##$VALIST= <valist>
##$VCLIST= <CCCCCCCCCCCCCCC>
##$VD= 0
##$VDLIST= <DDDDDDDDDDDDDDD>
##$VPLIST= <PPPPPPPPPPPPPPP>
##$VTLIST= <TTTTTTTTTTTTTTT>
##$WBST= 1024
##$WBSW= 4
##$XGAIN= (0..3)
0 0 0 0 
##$XL= 0
##$YL= 0
##$YMAX_a= 100993
##$YMIN_a= -55561
##$ZGOPTNS= <>
##$ZL1= 120
##$ZL2= 120
##$ZL3= 120
##$ZL4= 120
##$ABSF1= 197.3918
##$ABSF2= -203.3724
##$ABSG= 5
##$ABSL= 3
##$ALPHA= 0
##$AQORDER= 0
##$ASSFAC= 0
##$ASSFACI= 0
##$ASSFACX= 0
##$ASSWID= 0
##$AUNMP= <proc_1d>
##$AZFE= 0.1
##$AZFW= 0.5
##$BCFW= 0
##$BC_mod= 2
##$BYTORDP= 0
##$COROFFS= 0
##$CY= -3
##$DATMOD= 1
##$DC= 0
##$DFILT= <>
##$DTYPP= 0
##$F1P= 0
##$F2P= 0
##$FCOR= 1
##$FTSIZE= 65536
##$FT_mod= 6
##$GAMMA= 0
##$GB= 0
##$INTBC= 1
##$INTSCL= 9.790993e-09
##$ISEN= 30
##$LB= 1.5
##$LEV0= 0
##$LPBIN= 0
##$MAXI= 10000
##$MC2= 0
##$MEAN= 0
##$ME_mod= 0
##$MI= 50
##$NCOEF= 0
##$NC_proc= -5
##$NLEV= 6
##$NOISF1= 182.463
##$NOISF2= 159.3651
##$NSP= 0
##$NTH_PI= 0
##$NZP= 0
##$OFFSET= 197.3918
##$PC= 4
##$PHC0= 1948.885
##$PHC1= 116.2984
##$PH_mod= 1
##$PKNL= yes
##$PPARMOD= 0
##$PSCAL= 0
##$PSIGN= 0
##$REVERSE= no
##$SF= 81.014063255964
##$SI= 65536
##$SIGF1= 159.3651
##$SIGF2= -187.1042
##$SINO= 113.3802
##$SIOLD= 16384
##$SREGLST= <1H.CDCl3>
##$SSB= 0
##$STSI= 65536
##$STSR= 0
##$SW_p= 32467.5324675325
##$SYMM= 0
##$S_DEV= 0
##$TDeff= 32768
##$TDoff= 0
##$TI= <>
##$TILT= no
##$TM1= 0
##$TM2= 0
##$TOPLEV= 0
##$USERP1= <user>
##$USERP2= <user>
##$USERP3= <user>
##$USERP4= <user>
##$USERP5= <user>
##$WDW= 1
##$XDIM= 65536
##$YMAX_p= 298967838
##$YMIN_p= -30066128
$$ End of Bruker specific parameters
$$ ---------------------------------
##NTUPLES= NMR SPECTRUM
##VAR_NAME=  FREQUENCY,     SPECTRUM/REAL,   SPECTRUM/IMAG
##SYMBOL=    X,             R,               I
##VAR_TYPE=  INDEPENDENT,   DEPENDENT,       DEPENDENT
##VAR_FORM=  AFFN,          ASDF,            ASDF
##VAR_DIM=   65536,         65536,           65536
##UNITS=     HZ,            ARBITRARY UNITS, ARBITRARY UNITS
##FACTOR=    0.49542278885378, 1,            1
##FIRST=     15991.5117654749, 0,            0
##LAST=      -16476.0207020576, 0,           0
##MIN=       -16476.0207020576, -30066128,   0
##MAX=       15991.5117654749, 298967838,    0
$$ Real data points
##PAGE= N=1
##DATA TABLE= (X++(R..R)), XYDATA
$$ [...]
$$ plain form
36613 -1138411 -479760 -228226 -583320 -1133411 -1351166 -1104763 -668924 -349103 -195048
36604 -195048 -55231 193955 521269 776899 780912 416606 -250194 -924226 -1258348 -1146425
36594 -1146425 -787305 -428531 -139588 108775 276555 314501 317784 438933 641675 688904
36584 688904 420099 -53487 -462028 -615773 -521717 -329272 -159800 56132 514136 1214405
36574 1214405 1781647 1783696 1225226 551601 134756 -73093 -318219 -657113 -916681 -942064
36564 -942064 -759544 -519866 -343121 -215612 -54294 92897 -3104 -463337 -1017991 -1215147
36554 -1215147 -922070 -424788 -17315 265822 449097 440214 241874 124403 346200 804722
36544 804722 1153240 1185074 949360 578814 177128 -167331 -395712 -495643 -457938 -299481
$$ packed form
36613a138411O58651K51534l55094n50091k17755K46403M35839L19821J54055
36604a95048J39817K49186L27314K55630M013l64306o66800o74032l34122J11923
36594a146425L59120L58774K88943K48363J67780L7946L283J21149K02742M7229
36584F88904k68805m73586m08541j53745R4056J92445J69472K15932M58004P00269
36574A214405N67242K049n58470o73625m16845k07849k45126l38894k59568k5383
36564i42064J82520K39678J76745J27509J61318J47191r6001m60233n54654j97156
36554a215147K93077M97282M07473K83137J83275q883j98340j17471K21797M58522
36544H04722L48518L1834k35714l70546m01686l44459k28381r9931L7705J58457
$$ plain form
36534 -299481 -157300 -193873 -327245 -246192 170464 623760 732953 440065 -52349 -522184
36524 -522184 -721476 -388692 432814 1256481 1620276 1551926 1321781 967392 435171 -9946
36514 -9946 -7643 330364 550113 552821 695810 1134945 1522624 1506611 1157807 768757 569297
36503 569297 745525 1360588 2108924 2509459 2494401 2450214 2551540 2499849 2131097 1805589
36493 1805589 1862000 2098813 2183337 2204657 2386585 2581951 2546524 2455478 2616689 2856041
36483 2856041 2739493 2296231 1963026 1854533 1664472 1334199 1230958 1483092 1663476
36474 1663476 1428563 1075821 1129649 1631948 2139624 2242733 1848726 1135673 471060 229660
36464 229660 431054 635593 422984 -77961 -340363 -87517 415779 734725 721103 499965
$$ packed form
36534b99481J42181l6573j33372Q1053M16656M53296J09193k92888m92414m69835
36524e22184j99292L32784Q21506Q23667L63795o8350k30145l54389n32221m45117
36514i946K303L38007K19749K708J42989M39135L87679j6013l48804l89050j99460
36503E69297J76228O15063P48336M00535j5058m4187J01326n1691l68752l25508
36493A805589N6411K36813Q4524K1320J81928J95366l5427r1046J61211K39352
36483B856041j16548m43262l33205j08493j90061l30273j03241K52134J80384
36474A663476k34913l52742N3828N02299N07676J03109l94007p13053o64613k41400
36464B29660K01394K04539k12609n00945k62402K52846N03296L18946j3622k21138
$$ plain form
36454 499965 168924 -270693 -696495 -823007 -552791 -235728 -310892 -701488 -866044 -543508
36444 -543508 -123430 -55169 -191684 -76648 328994 653142 750480 844304 986603 857668
36434 857668 297618 -340166 -620917 -545844 -403057 -335227 -310203 -340439 -455945 -546374
36424 -546374 -454471 -194768 54973 127057 -50091 -430607 -837060 -1100795 -1280307 -1551082
36414 -1551082 -1800545 -1608867 -830001 60986 481279 417122 286099 277618 194117 -106622
36404 -106622 -471606 -692624 -699694 -475890 -54055 341085 419742 204571 50004 164779
36394 164779 336221 284790 85639 8762 65757 -14201 -351110 -680848 -668251 -345623
36384 -345623 -97468 -200574 -489073 -569104 -317404 -15072 59201 7181 132895 486069
$$ packed form
36454D99965l31041m39617m25802j26512K70216L17063p5164l90596j64556L22536
36444e43508M20078O8261j36515J15036M05642L24148R7338R3824J42299j28935
36434H57668n60050o37784k80751P5073J42787O7830K5024l0236j15506r0429
36424e46374R1903K59703K49741P2084j77148l80516m06453k63735j79512k70775
36414a551082k49463J91678P78866Q90987M20293o4157j31023q481q3501l00739
36404a06622l64984k21018p070K23804M21835L95140P8657k15171j54567J14775
36394A64779J71442n1431j99151p6877N6995p9958l36909l29738J2597L22628
36384c45623K48155j03106k88499q0031K51700L02332P4273n2020J25714L53174
$$ plain form
36374 486069 789391 812290 619402 397238 216387 75857 38944 154443 296336 248608
36364 248608 -29030 -351366 -586328 -864197 -1355588 -1878176 -1952362 -1386715 -645090 -377099
36354 -377099 -628025 -812616 -540081 -145572 -188435 -675594 -1101196 -1122380 -854198 -536658
36344 -536658 -254293 -40405 39380 20917 31997 51232 -103002 -435189 -655419 -555704
36334 -555704 -299477 -147776 -77096 96186 337092 405053 210697 -73004 -270370 -379207
36324 -379207 -446321 -436633 -311256 -127888 27224 155202 318806 511342 602574 454210
36314 454210 102675 -213798 -282957 -168249 -134800 -302919 -495631 -500999 -361256 -269684
36304 -269684 -266257 -207745 -26292 141664 130550 -51804 -250191 -336418 -323584 -333871 -460175
$$ packed form
36374D86069L03322K2899j92888k22164j80851j40530l6913J15499J41893m7728
36364B48608k77638l22336k34962k77869m91391n22588p4186N65647P41625K67991
36354c77099k50926j84591K72535L94509m2863m87159m25602k1184K68182L17540
36344e36658K82365K13888P9785j8463J1080J9235j54234l32187k20230R9715
36334e55704K56227J51701P0680J73282K40906O7961j94356k83701j97366j08837
36324c79207o7114R688J25377J83368J55112J27978J63604J92536R1232j48364
36314D54210l51535l16473o9159J14708L3449j68119j92712n368J39743R1572
36304b69684L427N8512J81453J67956j1114j82354j98387q6227J2834j0287j26304
$$ plain form
36293 -460175 -645342 -724959 -613228 -397843 -217234 -122602 -126786 -284692 -586047 -834251
36283 -834251 -812333 -569524 -376499 -371701 -427867 -435143 -527344 -864089 -1298398 -1466859 -1218116
36272 -1218116 -798350 -545739 -489017 -336788 149044 828138 1256074 1084912 401623 -311836
36262 -311836 -558801 -215278 403247 847408 934265 854662 881024 1030401 1113747 1084424
36252 1084424 1147278 1426729 1696349 1639906 1304734 1066315 1142929 1387144 1646045 2097864
36242 2097864 3014730 4279610 5353003 5751381 5446031 4770080 4038815 3323935 2545067
36233 2545067 1694227 924507 422409 239072 292235 499501 811538 1102203 1165246 943595
36223 943595 696087 775033 1211206 1645311 1734846 1521609 1286715 1119404 805205 166046
$$ packed form
36293d60175j85167p9617J11731K15385J80609R4632m184j57906l01355k48204
36283h34251K1918K42809J93025M798n6166p276r2201l36745m34309j68461K48743
36272a218116M19766K52611N6722J52229M85832O79094M27936j71162o83289p13459
36262c11836k46965L43523O18525M44161Q6857p9603K6362J49377Q3346k9323
36252A084424O2854K79451K69620n6443l35172k38419P6614K44215K58901M51819
36242B097864R16866J264880J073393L98378l05350o75951p31265p14880p78868
36233B545067q50840p69720n02098j83337N3163K07266L12037K90665O3043k21651
36223I43595k47508P8946M36173M34105Q9535k13237k34894j67311l14199o39159
$$ plain form
36213 166046 -646797 -1289924 -1541989 -1375823 -856624 -177516 277376 195890 -266360 -595319
36203 -595319 -540644 -399249 -513412 -728403 -630349 -168664 286634 452118 389106 271083
36193 271083 193324 232101 398632 491936 289005 -75253 -246899 -236727 -461132 -1029552
36183 -1029552 -1422377 -1199457 -665046 -404667 -437495 -342623 -81213 -113907 -633246 -1175442
36173 -1175442 -1213956 -812858 -452883 -411407 -537969 -554119 -408852 -326437 -532115 -934757
36163 -934757 -1163689 -990084 -588513 -251503 -4634 278013 532331 592918 539542 609881
36153 609881 790011 838089 717458 632461 590219 332618 -175217 -582349 -660068 -615884
36143 -615884 -687626 -762712 -661087 -502459 -504993 -649892 -802402 -940594 -1021859 -870969
$$ packed form
36213A66046q12843o43127k52065J66166N19199O79108M54892q1486m62250l28959
36203e95319N4675J41395j14163k14991R8054M61685M55298J65484o3012j18023
36193B71083p7759L8777J66531R3304k02931l64258j71646J0172k24405n68420
36183a029552l92825K22920N34411K60379l2828R4872K61410l2694n19339n42196
36173a175442l8514M01098L59975M1476j26562j6150J45267Q2415k05678m02642
36163i34757k28932J73605M01571L37010K46869K82647K54318O0587n3376P0339
36153F09881J80130M8078j20631q4997m2242k57601n07835m07132p7719M4184
36143f15884p1742p5086J01625J58628k534j44899j52510j38192q1265J50890
$$ plain form
36133 -870969 -475789 -159862 -174873 -347751 -413110 -426460 -504124 -433787 6893 539225
36123 539225 667739 361864 11473 -187089 -334031 -408828 -270383 -60787 -92195 -286942
36113 -286942 -235719 99335 242128 -94620 -634106 -1023512 -1225275 -1227915 -869470 -254012
36103 -254012 98376 -107613 -497594 -589334 -482108 -581596 -900090 -1082516 -984013 -803640
36093 -803640 -704989 -653615 -607610 -584689 -548368 -440856 -295184 -151835 44114 298515
36083 298515 455435 422658 367648 476961 668200 768792 815440 900300 873026 532759
36073 532759 39748 -193951 -12470 349277 609688 669581 543891 333837 248863 409147
36063 409147 645672 718886 669863 687471 696345 411783 -186505 -755633 -1025924 -1070567 -1081581
$$ packed form
36133h70969L95180L15927j5011j72878o5359j3350p7664P0337M40680N32332
36123E39225J28514l05875l50391j98562j46942p4797J38445K09596l1408j94747
36113b86942N1223L35054J42793l36748n39486l89406k01763k640L58445O15458
36103b54012L52388k05989l89981r1740J07226r9488l18494j82426R8503J80373
36093h03640R8651N1374M6005K2921L6321J07512J45672J43349J95949K54401
36083B98515J56920l2777n5010J09313J91239J00592M6648Q4860k7274l40267
36073E32759m93011k33699J81481L61747K60411N9893j25690k10054q4974J60284
36063D09147K36525P3214m9023J7608Q874k84562n98288n69128k70291m4643j1014
$$ plain form
36052 -1081581 -1119245 -1144875 -1095278 -889246 -543065 -256004 -173249 -138449 44324 201687
36042 201687 24952 -336299 -384482 -44444 158696 -134326 -619254 -840939 -798687 -738307
36032 -738307 -700719 -638696 -692897 -954642 -1160854 -1021616 -709109 -630900 -798404 -800795 -404129
36021 -404129 144835 447713 338624 -73262 -507711 -639201 -350065 84148 243592 50026
36011 50026 -153977 -59269 234064 386249 257366 53583 32503 145435 78485 -308250
36001 -308250 -709293 -721595 -405157 -233835 -447801 -744067 -741346 -471245 -202731 -36297
35991 -36297 56060 5590 -202388 -293157 20840 572044 860446 635821 93952 -472357
35981 -472357 -921130 -1160021 -1112255 -873825 -680897 -644468 -681324 -711543 -724572 -662216 -481938
$$ packed form
36052a081581l7664k5630M9597K06032L46181K87061Q2755L4800J82773J57363
36042B01687j76735l61251m8183L40038K03140k93022m84928k21685M2252O0380
36032g38307L7588O2023n4201k61745k06212J39238L12507P8209j67504k391L96666
36021d04129N48964L02878j09089m11886m34449j31490K89136M34213J59444j93566
36011E0026k04003R4708K93333J52185j28883k03783k1080J12932o6950l86735
36001c08250m01043j2302L16438J71322k13966k96266K721K70101K68514J66434
35991c6297R2357n0470k07978r0769L13997N51204K88402k24625n41869n66309
35981d72357m48773k38891M7766K38430J92928L6429l6856l0219j3029O2356J80278
$$ plain form
35970 -481938 -348230 -486521 -788409 -840975 -466524 6527 155771 -49515 -327467 -484196
35960 -484196 -558532 -652523 -769250 -826158 -797271 -834370 -1148274 -1671032 -1972597 -1721458
35950 -1721458 -1119387 -611975 -272423 162464 692822 952883 792626 510529 338337
35941 338337 140263 -131674 -144111 271330 655105 478933 -82450 -422417 -369847 -282304
35931 -282304 -365708 -422926 -310033 -176650 -148575 -162476 -230623 -495351 -859730 -912419 -456519
35920 -456519 137368 346823 94945 -274790 -474432 -500473 -463354 -399101 -284662 -149484
35910 -149484 -121646 -322009 -673924 -903487 -857057 -736864 -820938 -1009455 -926349 -479156
35900 -479156 -5053 217528 273705 283785 120042 -281981 -617733 -571603 -299742 -196392
$$ packed form
35970d81938J33708j38291l01888n2566L74451M73051J49244k05286k77952j56729
35960d84196p4336r3991j16727n6908K8887l7099l13904n22758l01565K51139
35950a721458O02071N07412L39552M34887N30358K60061j60257k82097j72192
35941C38337j98074k71937j2437M15441L83775j76172n61383l39967N2570Q7543
35931b82304q3404n7218J12893J33383K8075j3901o8147k64728l64379n2689M55900
35920d56519N93887K09455k51878l69735j99642k6041L7119O4253J14439J35178
35910a49484K7838k00363l51915k29563M6430J20193q4074j88517Q3106M47193
35900d79156M74103K22581N6177J0080j63743m02023l35752M6130K71861J03350
$$ plain form
35890 -196392 -301409 -325755 -217437 -290064 -712497 -1219737 -1474122 -1440624 -1246570 -911451
35880 -911451 -422227 88335 445429 614971 617468 365113 -212873 -928723 -1428614 -1569089
35870 -1569089 -1562849 -1686388 -1932456 -2030816 -1780242 -1288597 -859732 -673584 -630682 -525709
35860 -525709 -309741 -116672 -76868 -197135 -393918 -526490 -414676 9408 518037 714865
35850 714865 442242 -58642 -475941 -753507 -950434 -959059 -637911 -166272 30441 -222674
35840 -222674 -643536 -868486 -847942 -769169 -774681 -913104 -1213900 -1602583 -1832754 -1733613
35830 -1733613 -1502070 -1513102 -1791613 -1898666 -1475590 -727660 -170670 2112 55872 216581
35820 216581 297427 -24446 -706557 -1319171 -1496930 -1256639 -863699 -536621 -342205 -269087
$$ packed form
35890a96392j05017k4346J08318p2627m22433n07240k54385L3498J94054L35119
35880i11451M89224N10562L57094J69542K497k52355n77986p15850m99891j40475
35870a569089O240j23539k46068r8360K50574M91645M28865J86148M2902J04973
35860e25709K15968J93069L9804j20267j96783j32572J11814M24084N08629J96828
35850G14865k72623n00884m17299k77566j96927q625L21148M71639J96713k53115
35840b22674m20862k24950K0544P8773n512j38423l00796l88683k30171R9141
35830a733613K31543j1032k78511j07053M23076P47930N56990J72782N3760J60709
35820B16581Q0846l21873o82111o12614j77759K40291L92940L27078J94416P3118
$$ plain form
35810 -269087 -308676 -483884 -806526 -1157266 -1257593 -923286 -366011 -42980 -108424 -213005
35800 -213005 -9277 345752 454959 305333 282523 582782 958670 1128589 1122640 1072926
35790 1072926 940219 670038 422850 410131 613507 848429 988084 959188 676213 205140
35780 205140 -146858 -171558 -80536 -187893 -365700 -202223 287916 541842 199800 -387437
35770 -387437 -652943 -513820 -258938 10477 386841 699689 547773 -91985 -688365 -833071
35760 -833071 -806461 -1146160 -1819515 -2198793 -1852150 -1034521 -316317 -9231 -94324 -440689
35750 -440689 -839087 -989386 -751572 -353656 -104253 47537 387518 888861 1119337 796697
35740 796697 161592 -346630 -554777 -549606 -444069 -345824 -357515 -396223 -195936 285575
$$ packed form
35810b69087l9589j75208l22642l50740j00327L34307N57275L23031o5444j04581
35800b13005K03728L55029J09207j49626k2810L00259L75888J69919n949m9714
35790A072926j32707k70181k47188j2719K03376K34922J39655k8896k82975m71073
35780B05140l51998k4700R1022j07357j77807J63477M90139K53926l42042n87237
35770c87437k65506J39123K54882K69415L76364L12848j51916o39758n96380j44706
35760h33071K6610l39699o73355l79278L46643Q17629P18204L07086q5093l46365
35750d40689l98398j50299K37814L97916K49403J51790L39981N01343K30476l22640
35740G96697o35105n08222k08147N171J05537R8245j1691l8708K00287M81511
$$ plain form
35730 285575 651237 528890 93147 -176765 -125263 25614 133294 249575 319763 185875
35720 185875 -62774 -130048 11372 57160 -109185 -225892 -148964 -141443 -406056 -671373
35710 -671373 -569148 -170981 168226 280276 177741 -192094 -784878 -1197701 -1015899 -409398
35700 -409398 -8225 -156006 -610754 -1001511 -1221388 -1285058 -1157913 -913320 -781744 -820285
35690 -820285 -733976 -259711 401814 761929 586702 83278 -398548 -655449 -629392 -325374
35680 -325374 158136 605541 808844 735373 543582 431103 481154 645530 832245 972745
35670 972745 1026072 982402 881131 767158 591976 219494 -391018 -1028390 -1345995 -1182926
35660 -1182926 -751164 -468538 -575139 -896216 -1005297 -660026 -63066 349182 340344 22212
$$ packed form
35730B85575L65662j22347m35743k69912N1502J50877J07680J16281P0188j33888
35720A85875k48649o7274J41420M5788j66345j16707P6928P521k64613k65317
35710f71373J02225L98167L39207J12050j02535l69835n92784m12823J81802O06501
35700d09398M01173j47781m54748l90757k19877o3670J27145K44593J31576l8541
35690h20285Q6309M74265O61525L60115j75227n03424m81826k56901K6057L04018
35680c25374M83510M47405K03303p3471j91791j12479N0051J64376J86715J40500
35670I72745N3327m3670j01271j13973j75182l72482o10512o37372l17605J63069
35660a182926M31762K82626j06601l21077j09081L45271N96960M12248q838l18132
$$ plain form
35650 22212 -374223 -709669 -898174 -857586 -634923 -456380 -483179 -570128 -423632 3477
35640 3477 400679 412980 -3491 -549949 -857806 -792756 -531042 -347691 -338305 -384719 -377440
35629 -377440 -382247 -559950 -999197 -1649664 -2327090 -2760533 -2753923 -2360001 -1809237 -1257935
35619 -1257935 -747756 -415900 -494075 -958611 -1384840 -1358675 -932122 -515217 -419123 -642020
35609 -642020 -976710 -1166254 -1070850 -847528 -850842 -1193265 -1532998 -1472677 -1029420 -523147
35599 -523147 -166205 1454 -57640 -301789 -465604 -303250 74109 366091 502427 604952
35589 604952 622374 353112 -180457 -692095 -971031 -1010870 -871196 -703116 -801170 -1250375
35579 -1250375 -1607294 -1375246 -757192 -447293 -663317 -921225 -850827 -655594 -569889 -435353
$$ packed form
35650B2212l96435l35446j88505M0588K22663J78543k6799q6949J46496M27109
35640C477L97202J2301m16471n46458l07857O5050K61714J83351R386m6414P279
35629c77440m807j77703m39247o50467o77426m33443O610L93922N50764N51302
35619a257935N10179L31856p8175m64536m26229K6165M26553M16905R6094k22897
35609f42020l34690j89544R5404K23322l314l42423l39733O0321M43257N06273
35599e23147L56942J67659n9094k44149j63815J62354L77359K91982J36336J02525
35589F04952J7422k69262n33569n11638k78936l9839J39674J68080r8054m49205
35579a250375l56919K32048O18054L09899k16024k57908P0398J95233Q5705J34536
$$ plain form
35569 -435353 -135769 42984 -125443 -381436 -402398 -321010 -444717 -745927 -989155 -1103352
35559 -1103352 -1101245 -909200 -606688 -527291 -754796 -837479 -429237 84472 82536 -424913
35549 -424913 -936259 -1233349 -1437871 -1458427 -1040491 -374313 -48376 -270609 -611389 -646395
35539 -646395 -442296 -289305 -331474 -578414 -942340 -1162214 -1004779 -614041 -359586 -313732
35529 -313732 -226801 -40002 -9550 -237824 -496204 -646694 -842839 -1146188 -1318735 -1190716
35519 -1190716 -900631 -594055 -225876 161915 341057 299697 369216 677436 842472 540591
35509 540591 32876 -271256 -470208 -904440 -1434578 -1528093 -1042660 -446166 -173641 -153210
35499 -153210 -113644 -49023 -157708 -485474 -839092 -1029736 -1088756 -1208475 -1486527 -1768430
$$ packed form
35569d35353K99584J78753j68427k55993k0962Q1388j23707l01210k43228j14197
35559a103352K107J92045L02512P9397k27505q2683M08242N13709j936n07449
35549d24913n11346k97090k04522k0556M17936O66178L25937k22233l40780l5006
35539f46395K04099J52991m2169k46940l63926k19874J57435L90738K54455M5854
35529c13732Q6931J86799L0452k28274k58380j50490j96145l03349j72547J28019
35519a190716K90085L06576L68179L87791J79142m1360O9519L08220J65036l01881
35509E40591n07715l04132j98952m34232n30138r3515M85433N96494K72525K0431
35499a53210L9566O4621j08685l27766l53618j90644n9020j19719k78052k81903
$$ plain form
35489 -1768430 -1798413 -1507389 -1059408 -628171 -272790 -49560 -58449 -297818 -628660 -951471
35479 -951471 -1250750 -1419857 -1292996 -964936 -800790 -933052 -1008505 -684770 -135583 250758
35469 250758 466119 786066 1202009 1381920 1202928 929792 770791 590510 225177 -167624
35459 -167624 -285480 -93369 109266 26222 -295886 -493096 -284166 181342 510802 608144
35449 608144 768428 1115794 1283038 959929 474410 373485 599237 615980 300636 116422
35439 116422 307195 500498 342806 10703 -223449 -466379 -856310 -1154740 -1148771 -1120311
35429 -1120311 -1394657 -1697169 -1548190 -1107364 -958826 -1118823 -979402 -351411 159929
35420 159929 127634 4581 368254 957939 1067874 605163 132013 -16496 -51980 -164169
$$ packed form
35489a768430k9983K91024M47981M31237L55381K23230q889k39369l30842l22811
35479i51471k99279j69107J26861L28060J64146j32262p5453L23735N49187L86341
35469B50758K15361L19947M15943J79911j78992k73136j59001j80281l65333l92801
35459a67624j17856J92111K02635q3044l22108j97210K08930M65508L29460R7342
35449F08144J60284L47366J67244l23109m85519j00925K25752J6743l15344j84214
35439A16422J90773J93303j57692l32103k34152k42930l89931k98430N969K8460
35429a120311k74346l02512J48979M40826J48538j59997J39421O27991N11340
35420A59929l2295j23053L63673N89685J09935m62711m73150j48509l5484j12189
$$ plain form
35410 -164169 -205036 -98796 -99860 -388802 -740425 -854686 -780880 -765194 -851637 -871475 -720294
35399 -720294 -451984 -171262 30389 110974 141879 220409 252195 8877 -487541 -865352
35389 -865352 -865256 -676100 -582258 -514548 -277001 -30624 -137024 -589991 -1006989 -1180154 -1239540
35378 -1239540 -1237745 -1009610 -590659 -372371 -590532 -957109 -1069425 -951997 -905300 -984993
35368 -984993 -942473 -633165 -240086 -69786 -250046 -620421 -862643 -802625 -619112 -636114
35358 -636114 -875108 -997457 -778768 -432355 -300049 -388313 -402886 -138472 328361 750288
35348 750288 892789 706706 409556 266237 230414 18179 -373334 -532530 -237879 107036
35338 107036 -15581 -504417 -800177 -650420 -331067 -183280 -308504 -676369 -1134606 -1302842
$$ packed form
35410a64169m0867J06240j064k88942l51623j14261P3806J5686q6443j9838J51181
35399g20294K68310K80722K01651Q0585L0905P8530L1786k43318m96418l77811
35389h65352R6J89156R3842O7710K37547K46377j06400m52967m16998j73165n9386
35378a239540J795K28135M18951K18288k18161l66577j12316J17428M6697p9693
35368i84993M2520L09308L93079J70300j80260l70375k42222O0018J83513j7002
35358f36114k38994j22349K18689L46413J32306q8264j4573K64414M66833M21927
35348G50288J42501j86083k97150j43319l5823k12235l91513j59196K94651L44915
35338A07036j22617m88836k95760J49757L19353J47787j25224l67865m58237j68236
$$ plain form
35328 -1302842 -869846 -90429 381774 289398 63850 165453 471988 586215 495701 579357
35318 579357 1025335 1523597 1606693 1178386 632305 437926 622411 747992 468257 -28587
35308 -28587 -313464 -336138 -446926 -800074 -1078657 -960559 -590380 -369566 -444633 -625569
35298 -625569 -716353 -708279 -657546 -547633 -341962 -102649 17312 -74886 -292892 -465702
35288 -465702 -554142 -667250 -827860 -888422 -798567 -773602 -983792 -1221005 -1145599 -767429
35278 -767429 -379447 -80804 278348 673334 806838 544725 139342 -115975 -196695 -195343
35268 -195343 -118211 27307 157470 240177 310656 314258 179353 75053 270825 665770
35258 665770 825795 617961 415620 485516 578350 388795 28567 -276836 -584994 -955477
$$ packed form
35328a302842M32996P79417M72203r2376k25548J01603L06535J14227r0514Q3656
35318E79357M45978M98262Q3096m28307n46081j94379J84485J25581k79735m96844
35308b8587k84877k2674j10788l53148k78583J18098L70179K20814p5067j80936
35298f25569r0784Q074N0733J09913K05671K39313J19961r2198k18006j72810
35288d65702q8440j13108j60610o0562Q9855K4965k10190k37213P5406L78170
35278g67429L87982K98643L59152L94986J33504k62113m05383k55317q0720J352
35268a95343P7132J45518J30163Q2707P0479L602j34905j04300J95772L94945
35258F65770J60025k07834k02341O9896R2834j89555l60228l05403l08158l70483
$$ plain form
35248 -955477 -1134363 -972190 -844060 -1128446 -1503641 -1346645 -709027 -303128 -528670 -1065107
35238 -1065107 -1482811 -1721274 -1819709 -1669501 -1285424 -962290 -907388 -970119 -930942 -820762
35228 -820762 -759756 -688784 -481514 -206388 -98555 -308969 -753889 -1171445 -1329906 -1251064
35218 -1251064 -1177434 -1228588 -1216083 -965915 -658412 -569509 -607023 -455784 -101666 183335
35208 183335 328643 477230 497422 22770 -851753 -1422780 -1221025 -602088 -200550 -175281
35198 -175281 -333184 -620968 -1038293 -1330047 -1258848 -1040213 -1057160 -1244576 -1205699 -881999
35188 -881999 -632811 -615402 -551533 -251862 36456 39090 -100303 -73006 87939 53431 -312048
35177 -312048 -753681 -944458 -831731 -603030 -418484 -289641 -202684 -231293 -426700 -657790
$$ packed form
35248i55477j78886J62173J28130k84386l75195J56996O37618M05899k25542n36437
35238a065107m17704k38463r8435J50208L84077L23134N4902o2731L9177J10180
35228h20762O1006P0972K07270K75126J07833k10414m44920m17556j58461P8842
35218a251064P3630n1154J2505K50168L07503Q8903l7514J51239L54118K85001
35208A83335J45308J48587K0192m74652q74523n71027K01755O18937M01538K5269
35198a75281j57903k87784m17325k91754P1199K18635j6947j87416L8877L23700
35188h81999K49188J7409O3869K99671K88318K634j39393K7297J60945l4508l65479
35177c12048m41633j90777J12727K28701J84546J28843Q6957k8609j95407k31090
$$ plain form
35167 -657790 -718731 -609133 -531724 -546465 -438763 -95389 189378 62577 -340139 -527379
35157 -527379 -331508 -118759 -222211 -482946 -564624 -479821 -507431 -701533 -789595 -574935
35147 -574935 -201328 62531 137959 137347 157080 178766 148664 97168 169975 500311 981577
35136 981577 1222818 903180 209229 -259744 -130894 351469 706417 799217 801352 725047
35126 725047 384872 -160178 -519634 -492486 -366282 -480024 -752885 -906203 -914919 -913000
35116 -913000 -836436 -546536 -207931 -139080 -311513 -397822 -334075 -399065 -632610 -633833 -183347
35105 -183347 318915 377716 91984 -56257 62509 89674 -257453 -814548 -1215252 -1283099
35095 -1283099 -1117570 -943086 -927812 -1058322 -1157803 -1063429 -768378 -381537 -34513 141611
$$ packed form
35167f57790o0941J09598P7409j4741J07702L43374K84767j26801m02716j87240
35157e27379J95871K12749j03452k60735q1678Q4803k7610j94102q8062K14660
35147e74935L73607K63859P5428o12J9733K1686l0102n1496P2807L30336M81266
35136I81577K41241l19638o93951m68973J28850M82363L54948R2800K135p6305
35126G25047l40175n45050l59456K7148J26204j13742k72861j53318q716J919
35116i13000P6564K89900L38605O8851j72433q6309O3747o4990k33545j223M50486
35105a83347N02262N8801k85732j48241J18766K7165l47127n57095m00704o7847
35095a283099J65529J74484J5274j30510r9481R4374K95051L86841L47024J76124
$$ plain form
35085 141611 73432 -150207 -339381 -416142 -434611 -377094 -159493 95940 85834 -224514
35075 -224514 -479157 -475421 -504999 -838876 -1189383 -1116383 -717383 -400836 -161733 300023
35065 300023 808231 762360 100247 -452168 -387092 -95127 -146725 -402587 -363045 -35450
35055 -35450 144622 65431 33481 180062 302156 310972 343554 345843 34297 -536104 -808611
35044 -808611 -439652 146540 278171 -106767 -510616 -657178 -781391 -1093260 -1358436 -1238795
35034 -1238795 -811276 -478632 -455393 -567233 -537881 -288675 60994 331846 383582 209682
35024 209682 -15511 -99156 -83118 -205129 -544923 -856256 -861925 -592678 -308204 -200104
35014 -200104 -312328 -615435 -954447 -1039990 -759190 -436773 -484340 -787742 -779869 -218214
$$ packed form
35085A41611o8179k23639j89174p6761j8469N7517K17601K55433j0106l10348
35075b24514k54643L736k9578l33877l50507P3000L99000L16547K39103M61756
35065C00023N08208m5871o62113n52415O5076K91965n1598k55862L9542L27595
35055c5450J80072p9191l1950J46581J22094Q816L2582K289l11546n70401k72507
35044h08611L68959N86192J31631l84938m03849j46562j24213l11869k65176J19641
35034a238795M27519L32644K3239j11840K9352K49206L49669K70852N1736j73900
35024B09682k25193q3645J6038j22011l39794l11333n669K69247K84474J08100
35014b00104j12224l03107l39012q5543K80800L22417m7567l03402P873N61655
$$ plain form
35004 -218214 443848 659266 476667 345174 432055 491543 360187 238757 379777 707699
34994 707699 893994 737301 388280 207022 394851 754606 877277 605959 205465 -23247
34984 -23247 -154788 -463542 -924697 -1176031 -1016833 -673619 -434289 -250376 70843 434788
34974 434788 527479 304175 108950 179444 262578 -51121 -732122 -1318611 -1505254 -1450193
34964 -1450193 -1406860 -1321764 -1020937 -606740 -354957 -277235 -110605 218277 431886 330158
34954 330158 98697 -10302 -68412 -276847 -554389 -637980 -516104 -435776 -476316 -429290
34944 -429290 -169613 146426 376610 613713 923354 1099995 955091 695980 697725 934757
34934 934757 954587 490219 -160609 -505675 -407367 -82943 281501 653258 931012 889503
$$ packed form
35004b18214O62062K15418j82599j31493Q6881N9488j31356j21430J41020L27922
34994G07699J86295j56693l49021j81258J87829L59755J22671k71318m00494k28712
34984b3247j31541l08754m61155k51334J59198L43214K39330J83913L21219L63945
34974D34788R2691k23304j95225P0494Q3134l13699o81001n86489j86643N5061
34964a450193M3333Q5096L00827M14197K51783P7722J66630L28882K13609j01728
34954C30158k31461j08999n8110k08435k77542q3591J21876Q0328m0540M7026
34944d29290K59677L16039K30184K37103L09641J76641j44904k59111J745K37032
34934I34757J9830m64368o50828l45066R8308L24424L64444L71757K77754m1509
$$ plain form
34924 889503 473253 -20736 -218409 -62423 198025 364154 487984 708464 1020144 1262802
34914 1262802 1259720 916811 264821 -517323 -1162117 -1478137 -1467224 -1260695 -966635 -604856
34904 -604856 -153638 379476 905256 1244255 1228865 882115 459439 229025 217577 253120
34894 253120 259834 395794 813242 1340530 1537517 1131525 341635 -315535 -536286 -459453
34884 -459453 -369355 -303663 -94420 262251 479666 300448 -179936 -611896 -749321 -627639
34874 -627639 -447042 -376445 -445407 -544688 -537471 -414114 -298506 -249463 -128475 221793 707880
34863 707880 1047243 1127391 1151947 1316865 1435197 1069733 93493 -1009679 -1550295 -1330266
34853 -1330266 -804077 -508864 -497026 -472465 -334377 -292570 -441135 -538387 -378528 -154217
$$ packed form
34924H89503m16250m93989j97673J55986K60448J66129J23830K20480L11680K42658
34914A262802l082l42909o51990p82144o44794l16020J0913K06529K94060L61779
34904f04856M51218N33114N25780L38999j5390l46750m22676k30414j1448L5543
34894B53120O714J35960M17448N27288J96987m05992p89890o57170k20751P6833
34884d59453R0098O5692K09243L56671K17415j79218m80384m31960j37425J21682
34874f27639J80597P0597o8962r9281P217J23357J15608M9043J20988L50268M86087
34863G07880L39363Q0148K4556J64918J18332l65464r76240j103172n40616K20029
34853a330266N26189K95213J1838K4561J38088M1807j48565r7252J59859K24311
$$ plain form
34843 -154217 -214078 -585912 -967605 -1113168 -1011412 -741538 -385435 -69603 123658 290318
34833 290318 544693 739113 604329 212021 9471 256261 667170 800862 614982 423923
34823 423923 442895 599107 717961 690058 492544 221141 76170 168148 370073 497196
34813 497196 566782 700618 822701 682467 201946 -394349 -833486 -1004200 -897332 -566398
34803 -566398 -230924 -188071 -461021 -707503 -650576 -445755 -415567 -556575 -579642 -378257
34793 -378257 -158120 -64818 38652 296328 569698 593505 300328 -155513 -603097 -941014
34783 -941014 -1094391 -1050077 -926235 -887933 -982172 -1124442 -1229802 -1285889 -1309616 -1286633 -1148249
34772 -1148249 -819041 -376056 -150430 -465753 -1164620 -1608875 -1368692 -748177 -357553
$$ packed form
34843a54217n9861l71834l81693j45563J01756K69874L56103L15832J93261J66660
34833B90318K54375J94420j34784l92308k02550K46790M10909J33692j85880j91059
34823D23923J8972J56212J18854k7903j97514k71403j44971R1978K01925J27123
34813D97196O9586J33836J22083j40234m80521n96295m39137j70714J06868L30934
34803e66398L35474M2853k72950k46482N6927K04821L0188j41008k3067K01385
34793c78257K20137R3302J03470K57676K73370K3807k93177m55841m47584l37917
34783i41014j53377M4314J23842L8302r4239j42270j05360n6087k3727K2983J38384
34772a148249L29208M42985K25626l15323o98867m44255K40183O20515L90624
$$ plain form
34763 -357553 -309547 -206517 139895 422398 357515 81481 -154217 -332814 -497874 -552084
34753 -552084 -496230 -574351 -868890 -1018469 -707679 -217306 -66432 -263544 -371575 -232380
34743 -232380 -135567 -253236 -393314 -431762 -553596 -870015 -1150777 -1161989 -1000190 -889948
34733 -889948 -879408 -907286 -943868 -898283 -611437 -117012 295981 438079 422614 372157 185692
34722 185692 -200933 -574604 -706277 -642412 -511607 -271967 94642 376389 425183 441575
34712 441575 629381 766057 509660 -11862 -338321 -320917 -216960 -198695 -197637 -221185
34702 -221185 -365613 -460075 -163762 434758 736496 367481 -341950 -829096 -937582 -840968
34692 -840968 -619701 -239744 210443 568224 828966 1113483 1414616 1503021 1093358 117310
$$ packed form
34763c57553M8006J03030L46412K82503o4883k76034k35698j78597j65060n4210
34753e52084N5854p8121k94539j49579L10790M90373J50874j97112j08031J39195
34743b32380R6813j17669j40078l8448j21834l16419k80762j1212J61799J10242
34733h89948J0540k7878l6582M5585K86846M94425M12993J42098j5465n0457j86465
34722A85692l86625l73671j31673O3865J30805K39640L66609K81747M8794J6392
34712D41575J87806J36676k56397n21522l26459J7404J03957J8265J058k3548
34702b21185j44428r4462K96313N98520L01738l69015p09431m87146j08486R6614
34692h40968K21267L79957M50187L57781K60742K84517L01133Q8405m09663r76048
$$ plain form
34682 117310 -1066263 -1786929 -1629132 -919526 -403383 -391758 -527110 -461082 -358456 -501506
34672 -501506 -769641 -868371 -818849 -843657 -940373 -935012 -839731 -812235 -847640 -831046 -809751
34661 -809751 -891533 -957642 -820008 -597034 -570234 -711864 -746946 -680829 -843115 -1331884
34651 -1331884 -1810847 -1982841 -1908055 -1726622 -1442233 -1162655 -1184243 -1575602 -1971630 -2045843
34641 -2045843 -1922835 -1849577 -1724690 -1300504 -666881 -175610 11796 -13097 -196545 -545570
34631 -545570 -900778 -998760 -784945 -439764 -113274 146746 255396 146295 -50091 -146719
34621 -146719 -210610 -456268 -819822 -948356 -688389 -303334 -104730 -130018 -293162 -568691
34611 -568691 -853422 -903079 -636825 -324412 -254109 -363603 -401716 -302898 -169236 -2835
$$ packed form
34682A17310j183573p20666J57797P09606N16143J1625j35352O6028J02626j43050
34672e01506k68135r8730M9522k4808r6716N361R5281K7496l5405J6594K1295
34661h09751q1782o6109J37634K22974K6800j41630l5082O6117j62286m88769
34651a331884m78963j71994P4786J81433K84389K79578k1588l91359l96028p4213
34641b045843J23008P3258J24887M24186O33623M91271J87406k4893j83448l49025
34631e45570l55208r7982K13815L45181L26490K60020J08650j09101j96386r6628
34621a46719o3891k45658l63554j28534K59967L85055J98604k5288j63144k75529
34611e68691k84731m9657K66254L12413P0303j09494l8113R8818J33662J66401
$$ plain form
34601 -2835 289337 684352 1054217 1334717 1489292 1387505 963836 456178 226683 328577
34591 328577 469113 406750 149893 -248912 -800710 -1367852 -1602157 -1295660 -660886 -112209
34581 -112209 130097 117811 2264 -70295 -5977 128274 107641 -194231 -588811 -729980
34571 -729980 -470114 2651 323980 204331 -349989 -949255 -1071848 -574165 107817 412193
34561 412193 243601 -39343 -142923 -117099 -132756 -227758 -346656 -436792 -404947 -142007
34551 -142007 287784 617521 683816 667369 864488 1266178 1541147 1460010 1178924 1007136
34541 1007136 994518 901364 572597 185085 25343 122741 256977 282869 245137 143043
34531 143043 -175899 -729140 -1189932 -1200164 -809771 -386480 -146686 -13289 87542 65465
$$ packed form
34601b835K92172L95015L69865K80500J54575j01787m23669n07658k29495J01894
34591C28577J40536o2363k56857l98805n51798n67142k34305L06497O34774N48677
34581a12209K42306j2286j15547p2559O4318J34251k0633l01872l94580j41169
34571g29980K59866M72765L21329j19649n54320n99266j22593M97683O81982L04376
34561D12193j68592k82944j03580K5824j5657r5002j18898r0136L1845K62940
34551a42007M29791L29737O6295j6447J97119M01690K74969q1137k81086j71788
34541A007136j2618r3154l28767l87512j59742R7398J34236K5892l7732j02094
34531A43043l18942n53241m60792j0232L90393M23291K39794J33397J00831k2077
$$ plain form
34521 65465 -136423 -420434 -708014 -1030786 -1336772 -1400182 -1079203 -528752 -21795 320109
34511 320109 501311 510063 379278 289968 423532 733514 987668 1013729 829380 591064
34501 591064 482663 564631 660472 509202 115933 -193005 -173914 46881 239082 417516
34491 417516 677876 849485 651782 157480 -222530 -264968 -189280 -312067 -641978 -893668
34481 -893668 -774786 -246778 371253 609105 340593 7870 108460 518712 650870 281983
34471 281983 -155168 -208585 44751 277716 391966 440337 349840 68714 -167168 -47929
34461 -47929 384896 773837 863636 696662 466063 355721 437476 551301 408762 18488
34451 18488 -149677 274863 940862 1079078 445793 -377393 -722496 -572123 -381681 -389173
$$ packed form
34521F5465k01888k84011k87580l22772l05986o3410L20979N50451N06957L41904
34511C20109J81202Q752j30785q9310J33564L09982K54154K6061j84349k38316
34501E91064j08401Q1968R5841j51270l93269l08938J9091K20795J92201J78434
34491D17516K60360J71609j97703m94302l80010m2438P5688j22787l29911k51690
34481h93668J18882N28008O18031K37852k68512l32723J00590M10252J32158l68887
34471B81983m37151n3417K53336K32965J14250M8371r0497k81126k35882J19239
34461d7929M32825L88941Q9799j66974k30599j10342Q1755J13825j42539l90274
34451A8488j68165M24540O65999J38216o33285q23186l45103J50373J90442p492
$$ plain form
34441 -389173 -359230 21402 671737 1128498 1029088 520013 71434 -102894 -218444 -418886
34431 -418886 -420111 20338 509999 391843 -317490 -852181 -673787 -78400 361776 526547
34421 526547 601876 570682 288993 -112566 -323273 -292867 -250727 -328434 -466233 -667151
34411 -667151 -1029616 -1486518 -1775082 -1733956 -1435279 -1008987 -569477 -341449 -565405 -1134890
34401 -1134890 -1553328 -1451339 -1023215 -768411 -864089 -961048 -620422 133619 746651 646905
34391 646905 -156909 -1053107 -1465711 -1412658 -1290293 -1249542 -1101841 -815626 -685814 -828970
34381 -828970 -877575 -505315 -3006 78606 -263063 -468693 -215140 196702 371219 351612
34371 351612 394486 511485 548979 548200 691504 945918 1058282 926459 727865 620008
$$ packed form
34441c89173K9943L80632O50335M56761r9410n09075m48579j74328j15550k00442
34431d18886j225M40449M89661j18156p09333n34691J78394N95387M40176J64771
34421E26547P5329l1194k81689m01559k10707L0406M2140p7707j37799k00918
34411f67151l62465m56902k88564M1126K98677M26292M39510K28028k23956n69485
34401a134890m18438J01989M28124K54804r5678r6959L40626P54041O13032r9746
34391F46905q03814q96198m12604N3053J22365M0751J47701K86215J29812j43156
34381h28970m8605L72260N02309Q1612l41669k05630K53553M11842J74517j9607
34371C51612M2874J16999L7494p79J43304K54414J12364j31823j98594j07857
$$ plain form
34361 620008 535540 386187 288474 414713 709067 925977 945379 911024 1000253 1143963
34351 1143963 1088649 755259 431936 476358 832564 1020710 721510 221665 64985 337934
34341 337934 585388 467775 194160 140793 304209 402604 348645 295070 279706 174123
34331 174123 23317 96551 445228 681177 430369 -155695 -582393 -612969 -453170 -378897
34321 -378897 -423745 -474030 -462929 -368192 -162074 115548 320926 351365 269013 189742 113556
34310 113556 -16892 -137047 -99898 88452 232205 219193 182987 251434 245465 -149443 -905714
34299 -905714 -1552383 -1644641 -1209008 -640338 -280167 -197793 -262751 -276329 -93800 239790
34289 239790 507299 573464 548085 577912 592360 455101 276330 307032 548433 756623
$$ packed form
34361F20008q4468j49353r7713J26239K94354K16910J9402l4355Q9229J43710
34351A143963n5314l33390l23323M4422L56206J88146k99200m99845j56680K72949
34341C37934K47454j17613k73615n3367J63416R8395n3959n3575j5364j05583
34331A74123j50806P3234L48677K35949k50808n86064m26698l0576J59799P4273
34321c78897m4848n0285J1101R4737K06118K77622K05378L0439q2352p9271p6186
34310A13556j30448j20155L7149J88350J43753j3012l6206O8447n969l94908p56271
34299i05714o46669r2258M35633N68670L60171Q2374o4958j3578J82529L33590
34289B39790K67509O6165k5379K9827J4448j37259j78771L0702K41401K08190
$$ plain form
34279 756623 859586 1047156 1345003 1434526 1107870 631070 394680 416452 468859 505633
34269 505633 620370 710561 572826 313460 294879 609308 923595 953539 817289 783784
34259 783784 912396 1106747 1322108 1516697 1527534 1200816 609986 20935 -329297 -354706
34249 -354706 -99431 308765 714388 996020 1066451 866663 473650 167818 197229 455112
34239 455112 598427 530019 516567 729369 946198 905355 707173 586288 467136 78958
34229 78958 -562712 -1099466 -1244441 -1004470 -520567 36720 413023 411096 164492 30567
34219 30567 136672 262175 237756 193607 284562 427401 490121 514165 540240 432041 143511
34208 143511 -17036 266645 780894 942164 528444 -45984 -260897 -27000 413264 851480
$$ packed form
34279G56623J02963J87570K97847Q9523l26656m76800k36390K1772N2407L6774
34269E05633J14737R0191j37735k59366j8581L14429L14287K9944j36250l3505
34259G83784J28612J94351K15361J94589J0837l26718n90830n89051l50232k5409
34249c54706K55275M08196M05623K81632P0431j99788l93013l05832K9411K57883
34239D55112J43315o8408j3452K12802K16829m0843j98182j20885j19152l88178
34229G8958o41670n36754j44975K39971M83903N57287L76303j927k46604j33925
34219C0567J06105J25503k4419m4149R0955J42839O2720K4044K6075j08199k88530
34208A43511j60547K83681N14249J61270m13720n74428k14913K33897M40264M38216
$$ plain form
34198 851480 1182747 1307891 1221518 1121472 1215739 1437816 1514021 1298864 903862 515830
34188 515830 240085 119198 144639 218131 239019 255047 380244 548692 561775 462521 612982
34177 612982 1185479 1765901 1779759 1260253 870013 1094911 1690152 2059490 1957022 1617686
34167 1617686 1352633 1262138 1297083 1367854 1340809 1089257 647361 248305 136393 351491
34157 351491 717204 1020339 1186844 1292170 1413215 1496043 1406363 1104784 717500 417038
34147 417038 279048 263647 272753 210892 69844 -17584 103500 394873 621164 613620 446356
34136 446356 309535 337639 616557 1158402 1713010 1801180 1207583 355752 -77379 104631
34126 104631 507763 731029 763625 776529 841990 989907 1281484 1656398 1894154 1870194
$$ packed form
34198H51480L31267J25144q6373j00046R4267K22077P6205k15157l95002l88032
34188E15830k75745j20887K5441P3492K0888J6028J25197J68448J3083r9254J50461
34177F12982N72497N80422J3858n19506l90240K24898N95241L69338j02468l39336
34167A617686k65053r0495L4945P0771k7045k51552m41896l99056j11912K15098
34157C51491L65713L03135J66505J05326J21045Q2828q9680l01579l87284l00462
34147D17038j37990j5401R106o1861j41048q7428J21084K91373K26291p544j67264
34136D46356j36821K8104K78918N41845N54608Q8170n93597q51831m33131J82010
34126A04631M03132K23266L2596J2904O5461J47917K91577L74914K37756k3960
$$ plain form
34116 1870194 1689951 1489804 1341515 1442496 2040850 2922611 3332957 2832299 1997501
34107 1997501 1775481 2264092 2687081 2567634 2295554 2322996 2390893 1995281 1231888 657935
34097 657935 502980 501372 438941 419903 559861 788708 1038881 1325672 1568429 1625622
34087 1625622 1588686 1732825 2053202 2166025 1859082 1444492 1311976 1390081 1361706 1204315
34077 1204315 1140481 1175920 1099654 933811 992167 1402123 1881921 2108590 2051725 1843431
34067 1843431 1579254 1376549 1380579 1548294 1633475 1542272 1498834 1693451 1975019 2085349
34057 2085349 2005357 1865738 1712481 1594169 1682008 2018451 2315585 2316720 2209593 2328812
34047 2328812 2578016 2571616 2293063 2135836 2236482 2251305 1976976 1755287 1956862 2379545
$$ packed form
34116A870194j80243k00147j48289J00981N98354Q81761M10346n00658q34798
34107A997501k22020M88611M22989j19447k72080K7442O7897l95612p63393n73953
34097F57935j54955j608o2431j9038J39958K28847K50173K86791K42757N7193
34087A625622l6936J44139L20377J12823l06943m14590j32516P8105k8375j57391
34077A204315o3834L5439p6266j65843N8356M09956M79798K26669n6865k08294
34067A843431k64177k02705M030J67715Q5181r1203m3438J94617K81568J10330
34057B085349p9992j39619j53257j18312Q7839L36443K97134J135j07127J19219
34047B328812K49204o400k78553j57227J00646J4823k74329k21689K01575M22683
$$ plain form
34037 2379545 2519269 2264740 1984669 1982219 2134581 2105420 1763562 1346849 1237035 1543428
34027 1543428 1944383 2065222 1970931 2063267 2482445 2897478 2982155 2804398 2584796 2358079
34017 2358079 2103033 1956655 2020024 2141675 2175404 2289568 2721772 3352738 3826011 3996183
34007 3996183 3961776 3740817 3249118 2587512 2044481 1777456 1726395 1840649 2135205 2494245
33997 2494245 2660892 2494639 2091051 1649500 1372380 1430021 1808840 2232414 2445389 2521256
33987 2521256 2666941 2826026 2790136 2637628 2680315 2952845 3132521 3047613 2908799 2914962
33977 2914962 2963851 2912506 2831673 2831210 2880690 2948005 3081205 3242242 3317499 3387166 3680564
33966 3680564 4152412 4439505 4370726 4150779 3898234 3475103 3030431 3180231 4181947
$$ packed form
34037B379545J39724k54529k80071k450J52362k9161l41858m16713j09814L06393
34027A543428M00955J20839r4291R2336M19178M15033Q4677j77757k19602k26717
34017B358079k55046j46378O3369J21651L3729J14164M32204O30966M73273J70172
34007C996183l4407k20959m91699o61606n43031k67025n1061J14254K94556L59040
33997B494245J66647j66253m03588m41551k77120N7641L78819M23574K12975P5867
33987B521256J45685J59085l5890j52508M2687K72530J79676q4908j38814O163
33977B914962M8889n1345q0833m63M9480O7315J33200J61037P5257O9667K93398
33966C680564M71848K87093o8779k19947k52545m23131m44672J49800J001716
$$ plain form
33957 4181947 5343480 5802958 5600848 5416405 5498193 5510736 5306188 5137004 5050282 4714554
33947 4714554 4029363 3394299 3174400 3323383 3685109 4203155 4627217 4495919 3753562
33938 3753562 3025421 2916955 3295641 3595357 3600007 3567677 3732795 4040379 4320022 4448921
33928 4448921 4368143 4142045 3969535 3986015 4119799 4265701 4475372 4818953 5193745 5457911
33918 5457911 5635024 5802016 5913913 5951227 6079791 6381665 6565464 6307563 5825650 5706427
33908 5706427 6108178 6535877 6570192 6445580 6609035 6974694 7022037 6569791 6080727 6096354
33898 6096354 6612689 7176860 7466828 7587518 7806581 8153391 8378527 8276544 7957189
33889 7957189 7747236 7847272 8134400 8316193 8248000 8062741 7979734 8018179 7966512 7676510
$$ packed form
33957D181947J161533M59478k02110j84443Q1788J2543k04548j69184q6722l35728
33947D714554o85191o35064k19899J48983L61726N18046M24062j31298p42357
33938C753562p28141j08466L78686K99716M650l2330J65118L07584K79643J28899
33928D448921q0778k26098j72510J6480J33784J45902K09671L43581L74792K64166
33918E457911J77113J66992J11897L7314J28564L01874J83799k57901m81913j19223
33908E706427M01751M27699L4315j24612J63455L65659M7343m52246m89064J5627
33898F096354N16335N64171K89968J20690K19063L46810K25136j01983l19355
33889G957189k09953J00036K87128J81793o8193j85259q3007L8445n1667k90002
$$ plain form
33879 7676510 7328457 7288280 7684741 8246949 8629982 8793123 8941733 9190668 9466288 9707846
33869 9707846 9945491 10121990 10053681 9725465 9472694 9651462 10187494 10675550 10928201 11186504
33859 11186504 11698489 12318592 12719548 12840255 12850837 12737409 12260722 11440818 10801175
33850 10801175 10874023 11576596 12314347 12657671 12691026 12698624 12769666 12835508 12901448 13045841
33840 13045841 13269162 13516598 13821477 14264145 14770774 15107513 15163301 15144106 15365973 15880024
33830 15880024 16416167 16719431 16832993 16975817 17235310 17519238 17767816 18024639 18259097
33821 18259097 18322404 18215565 18232515 18624765 19224538 19650658 19847872 20134719 20673994 21204424
33811 21204424 21464566 21628449 22050765 22714490 23230154 23376625 23386999 23616542 24109794
$$ packed form
33879G676510l48053m0177L96461N62208L83033J63141J48610K48935K75620K41558
33869I707846K37645J76499o8309l28216k52771J78768N36032M88056K52651K58303
33859A1186504N11985O20103M00956J20707J0582j13428m76687q19904o39643
33850A0801175P2848P02573P37751L43324L3355P598P1042O5842O5940J44393
33840A3045841K23321K47436L04879M42668N06629L36739N5788j9195K21867N14051
33830A5880024N36143L03264J13562J42824K59493K83928K48578K56823K34458
33821A8259097O3307j06839J6950L92250N99773M26120J97214K86847N39275N30430
33811B1204424K60142J63883M22316O63725N15664J46471J0374K29543M93252
$$ plain form
33802 24109794 24629847 25022976 25402856 25956993 26671369 27338940 27830838 28249182 28737746
33793 28737746 29244583 29643528 30052577 30785309 31891868 32968249 33617992 33971645 34521746
33784 34521746 35493598 36598924 37431898 37929684 38376250 39066094 40036766 41087632 42029573
33775 42029573 42917964 43995699 45384694 46927990 48403090 49777167 51140950 52510580
33767 52510580 53855359 55222990 56653812 58060879 59406335 60909913 62817398 65002841
33759 65002841 67080869 68900788 70639330 72430499 74286972 76428585 79206751 82478819
33751 82478819 85500436 87811567 89906101 92601230 95991307 99504599 102825806 106196843
33743 106196843 109806077 113450313 116998097 120743295 124999684 129624981 134238802 138742635
$$ packed form
33802B4109794N20053L93129L79880N54137P14376O67571M91898M18344M88564
33793B8737746N06837L98945M09049P32732J106559J076381O49743L53653N50101
33784C4521746R71852J105326Q32974M97786M46566O89844R70672J050866R41941
33775D2029573Q88391J077735J388995J543296J475100J374077J363783J369630
33767E2510580J344779J367631J430822J407067J345456J503578J907485K185443
33759F5002841K078028J819919J738542J791169J856473K141613K778166L272068
33751H2478819L021617K311131K094534K695129L390077L513292L321207L371037
33743A06196843L609234L644236L547784L745198M256389M625297M613821M503833
$$ plain form
33735 138742635 143375537 148364824 153726770 159331203 164982001 170483741 175785364 181060446
33727 181060446 186581845 192547273 199023013 205916934 212944687 219770893 226287438 232646964
33719 232646964 238971367 245195488 251263005 257236094 263064942 268505623 273492183 278330669
33711 278330669 283192101 287624879 291006383 293378384 295357812 297214760 298541845 298967838
33703 298967838 298707668 298128139 297157969 295473203 292983973 289790719 285896501 281340621
33695 281340621 276438419 271492123 266384583 260855589 255074779 249473487 244021069 238172681
33687 238172681 231662774 224895703 218333286 211901065 205312406 198666206 192344999 186493410
33679 186493410 180939264 175530046 170247512 165058356 159929855 154957508 150238600 145665950
$$ packed form
33735A38742635M632902M989287N361946N604433N650798N501740N301623N275082
33727A81060446N521399N965428O475740O893921P027753O826206O516545O359526
33719B32646964O324403O224121O067517N973089N828848N440681M986560M838486
33711B78330669M861432M432778L381504K372001J979428J856948J327085M25993
33703B98967838k60170n79529r70170j684766k489230l193254l894218m555880
33695B81340621m902202m946296n107540n528994n780810n601292n452418n848388
33687B38172681o509907o767071o562417o432221o588659o646200o321207n851589
33679A86493410n554146n409218n282534n189156n128501m972347m718908m572650
$$ plain form
33671 145665950 141081423 136568331 132316111 128246703 124111590 119974224 116216727 112938380
33663 112938380 109708894 106165718 102572996 99455375 96842537 94245762 91354823 88413753
33655 88413753 85809143 83546123 81307987 78894492 76420987 74128686 72140489 70408818
33647 70408818 68792632 67141301 65375512 63553212 61826337 60272455 58791116 57240804
33639 57240804 55660376 54232962 52997473 51746153 50322612 48888407 47704375 46731060
33631 46731060 45696118 44551703 43573259 42890847 42187820 41096704 39743734 38643535
33623 38643535 38095152 37890321 37613782 37049062 36260853 35436836 34725022 34148858 33624829
33614 33624829 33070024 32458646 31746689 30841198 29749134 28677261 27853873 27314874 26989516
$$ packed form
33671A45665950m584527m513092m252220m069408m135113m137366l757497l278347
33663A12938380l229486l543176l592722l117621k612838k596775k890939k941070
33655H8413753k604610k263020k238136k413495k473505k292301j988197j731671
33647G0408818j616186j651331j765789j822300j726875j553882j481339j550312
33639E7240804j580428j427414j235489j251320j423541j434205j184032r73315
33631D6731060j034942j144415r78444o82412p03027j091116j352970j100199
33623C8643535n48383k04831k76539n64720p88209q24017p11814n76164n24029
33614C3624829n54805o11378p11957r05491j092064j071873q23388n38999l25358
$$ plain form
33605 26989516 26881208 26950437 26911127 26446524 25642522 24920263 24488440 24163412 23815742 23627660
33595 23627660 23682181 23620715 23053230 22112435 21253840 20640760 20084486 19502637 19039278 18725166
33585 18725166 18395408 18018769 17775269 17704131 17587605 17312306 17039876 16857208 16565566
33576 16565566 16042814 15538520 15327635 15290865 15142122 14886607 14713378 14574645 14258837
33567 14258837 13826100 13578236 13567313 13501735 13231401 12987742 12993100 13131778 13215040 13330256
33557 13330256 13664985 14116015 14316000 14011841 13269670 12363774 11597973 11176574 11098166
33548 11098166 11169680 11199865 11159651 11111830 11053387 10905572 10622146 10259533 9976755 9965414
33538 9965414 10283926 10743152 11067654 11188154 11244073 11300314 11269342 11156661 11119083 11145581
$$ packed form
33605B6989516j08308O9229l9310m64603q04002p22259m31823l25028l47670j88082
33595B3627660N4521o1466n67485r40795q58595o13080n56274n81849m63359l14112
33585A8725166l29758l76639k43500p1138j16526k75299k72430j82668k91642
33576A6565566n22752n04294k10885l6770j48743k55515j73229j38733l15808
33567A4258837m32737k47864j0923o5578k70334k43659N358J38678Q3262J15216
33557A3330256L34729M51030J99985l04159p42171r05896p65801m21399p8408
33548A1098166P1514L0185m0214m7821n8443j47815k83426l62613k82778j1341
33538I965414L18512M59226L24502J20500N5919N6241l0972j12681l7578K6498
$$ plain form
33528 11145581 10944826 10371263 9746201 9484541 9561361 9632794 9560189 9507724 9597072 9766126
33518 9766126 9924223 9969808 9725505 9178283 8722970 8775860 9136473 9151908 8598558 7967349
33508 7967349 7708235 7639547 7408035 7144861 7221700 7572397 7721691 7437830 6966203 6584165
33498 6584165 6262319 5891007 5600663 5656739 6092967 6578243 6709159 6448548 6211516 6399030
33488 6399030 6869463 7068273 6729325 6203658 5944943 5914397 5763913 5448904 5325056 5654916
33478 5654916 6290312 6876037 7156525 7050507 6626191 6079613 5606779 5241985 4900921
33469 4900921 4562645 4287473 4078743 3877142 3696780 3627752 3687213 3786597 3859332 3925204
33459 3925204 4039026 4258247 4604028 4948513 5040567 4819111 4620925 4858186 5521964 6206815
$$ packed form
33528A1145581k00755n73563o25062k61660P6820P1433p2605n2465Q9348J69054
33518I766126J58097M5585k44303n47222m55313N2890L60613J5435n53350o31209
33508G967349k59114o8688k31512k63174P6839L50697J49294k83861m71627l82038
33498F584165l21846l71312k90344N6076M36228M85276J30916k60611k37032J87514
33488F399030M70433J98810l38948n25667k58715l0546j50484l15009j23848L29860
33478E654916O35396N85725K80488j06018m24316n46578m72834l64794l41064
33469D900921l38276k75172k08730k01601j80362o9028N9461R9384P2735O5872
33459C925204J13822K19221L45781L44485R2054k21456j98186K37261O63778O84851
$$ plain form
33449 6206815 6577113 6582585 6289552 5821866 5458295 5418593 5479657 5178868 4533186 4155520
33439 4155520 4409697 4825670 4730869 4196132 3908488 4229200 4813502 5149307 5082311 4754620
33429 4754620 4377387 4189925 4358525 4746343 4977503 4873130 4663686 4649418 4825753 5001405
33419 5001405 5125828 5279621 5422196 5383956 5124628 4819446 4635279 4556376 4500131 4488186
33409 4488186 4590699 4761597 4859301 4848486 4889726 5164902 5631802 5993049 5934099 5424538
33399 5424538 4813429 4600685 5040821 5930059 6792283 7273350 7346879 7205561 7066704 7073572
33389 7073572 7233561 7382021 7323326 7092310 6969980 7152763 7530777 7902349 8242081 8562225
33379 8562225 8664803 8342094 7793763 7540115 7861384 8560733 9325542 10053863 10728918
$$ packed form
33449F206815L70298N472k93033m67686l63571l9702O1064l00789o45682l77666
33439D155520K54177M15973r4801n34737k87644L20712N84302L35805o6996l27691
33429D754620l77233j87462J68600L87818K31160j04373k09444j4268J76335J75652
33419E001405J24423J53793J42575l8240k59328l05182j84167p8903n6245j1945
33409D488186J02513J70898R7704j0815M1240K75176M66900L61247n8950n09561
33399E424538o11109k12744M40136Q89238Q62224M81067P3529j41318j38857O868
33389G073572J59989J48460n8695k31016j22330J82783L78014L71572L39732L20144
33379H562225J02578l22709n48331k53648L21269O99349P64809P28321O75055
$$ plain form
33370 10728918 11246088 11550753 11776961 12106829 12640747 13481565 14706215 16119169 17309863
33361 17309863 18180345 19174164 20714342 22647718 24581527 26552894 28901302 31563198
33353 31563198 34016658 36038689 38085908 40712336 43928840 47369654 50827196 54338821
33345 54338821 57908513 61422549 64760928 67749340 70042152 71292582 71472931 70846110
33337 70846110 69570839 67505225 64511113 60833313 57010409 53423685 50075484 46842239
33329 46842239 43782207 41048913 38595139 36176579 33671135 31216641 28982001 26985131
33321 26985131 25222274 23773690 22621465 21532542 20318753 19074545 17955273 16885690
33313 16885690 15771514 14856835 14475683 14458409 14186143 13339996 12255557 11396063 10811187
$$ packed form
33370A0728918N17170L04665K26208L29868N33918Q40818J224650J412954J190694
33361A7309863Q70482R93819J540178J933376J933809J971367K348408K661896
33353C1563198K453460K022031K047219K626428L216504L440814L457542L511625
33345E4338821L569692L514036L338379K988412K292812J250430J80349o26821
33337G0846110j275271k065614k994112l677800l822904l586724l348201l233245
33329D6842239l060032k733294k453774k418560k505444k454494k234640j996870
33321B6985131j762857j448584j152225j088923j213789j244208j119272j069583
33313A6885690j114176r14679l81152j7274k72266q46147j084439q59494n84876
$$ plain form
33304 10811187 10326767 9948738 9744487 9512698 8942050 8077220 7353078 7116096 7260872
33295 7260872 7353115 7016382 6240392 5412212 4986867 5027981 5156181 5053286 4873707 4963046
33285 4963046 5292369 5466287 5295280 5069718 5141022 5430342 5529817 5209197 4677263 4349066
33275 4349066 4428058 4715437 4796300 4424133 3745686 3154657 2946291 3126474 3488792 3783182
33265 3783182 3835486 3638741 3390273 3352298 3585423 3855179 3885399 3688655 3540926 3587951
33255 3587951 3585374 3173005 2396487 1787702 1820839 2385604 2927135 3037451 2753412 2330918
33245 2330918 1968228 1809140 1979221 2432985 2881418 3048791 2954826 2815741 2730824 2624158
33235 2624158 2463337 2350571 2348513 2359900 2278428 2176866 2221508 2401649 2454483 2139996
$$ packed form
33304A0811187m84420l78029k04251k31789n70648q64830p24142k36982J44776
33295G260872R2243l36733p75990q28180m25345M1114J28200j02895j79579Q9339
33285D963046L29323J73918j71007k25562P1304K89320R9475l20620n31934l28197
33275D349066P8992K87379Q0863l72167o78447n91029k08366J80183L62318K94390
33265C783182N2304j96745k48468l7975K33125K69756L0220j96744j47729M7025
33255C587951k577m12369p76518o08785L3137N64765N41531J10316k84039m22494
33245B330918l62690j59088J70081M53764M48433J67373r3965j39085q4917j06666
33235B624158j60821j12766k058J1387q1472j01562M4642J80141N2834l14487
$$ plain form
33225 2139996 1551366 1048572 869190 919620 1010862 1158531 1491744 1955728 2313626 2425194
33215 2425194 2333721 2096582 1757125 1491081 1507905 1731714 1845975 1758243 1733464 1917033
33205 1917033 2048436 1902535 1722209 1861236 2200210 2301159 2024262 1624002 1322818
33196 1322818 1170279 1263802 1677849 2136799 2170477 1716606 1229355 1060519 1053224 908627
33186 908627 657074 551382 703627 1016252 1312202 1400625 1186047 827173 614323 616439
33176 616439 672873 787085 1186025 1824364 2202686 1991566 1554637 1483582 1817211 2120235
33166 2120235 2197241 2274775 2474705 2529047 2157410 1453670 763262 365164 369170 748399
33156 748399 1338135 1875030 2117448 1945382 1434358 907072 758772 1028440 1245718 957052
$$ packed form
33225B139996n88630n02794j79382N0430R1242J47669L33213M63984L57898J11568
33215B425194r1473k37139l39457k66044J6824K23809J14261q7732k4779J83569
33205A917033J31403j45901j80326J39027L38974J00949k76897m00260l01184
33196A322818j52539R3523M14047M58950L3678m53871m87251j68836p295j44597
33186I08627k51553j05692J52245L12625K95950Q8423k14578l58874k12850K116
33176F16439N6434J14212L98940O38339L78322k11120m36929p1055L33629L03024
33166B120235P7006P7534J99930N4342l71637p03740o90408l98098M006L79229
33156G48399N89736N36895K42418j72066n11024n27286j48300K69668K17278k88666
$$ plain form
33146 957052 346944 48344 340979 850130 1101266 1056428 965685 981851 1134176 1451983
33136 1451983 1856902 2081502 1950534 1655914 1521160 1557046 1489216 1203331 916968 864749
33126 864749 1026065 1259066 1531343 1872701 2197157 2333440 2232321 2044524 1965066 2045856
33116 2045856 2178196 2226485 2148523 1981592 1735631 1358531 862026 454666 435516 877847
33106 877847 1475949 1813572 1781598 1632924 1617953 1701330 1711478 1632742 1585613 1579702 1478854
33095 1478854 1228362 946411 734587 553983 380189 337817 535136 843474 991482 868404
33085 868404 639893 568681 769412 1106442 1305231 1241139 1144363 1373945 1903864 2220878
33075 2220878 1927889 1300306 961608 1069808 1157721 838906 352707 222014 589141 1130344
$$ packed form
33146I57052o10108k98600K92635N09151K51136m4838r0743J6166J52325L17807
33136A451983M04919K24600j30968k94620j34754L5886o7830k85885k86363n2219
33126H64749J61316K33001K72277L41358L24456J36283j01119j87797p9458Q0790
33116B045856J32340M8289p7962j66931k45961l77100m96505m07360j9150M42331
33106H77847N98102L37623l1974j48674j4971Q3377J0148p8736m7129n911j00848
33095A478854k50492k81951k11824j80604j73794m2372J97319L08338J48008j23078
33085H68404k28511p1212K00731L37030J98789o4092r6776K29582N29919L17014
33075B220878k92989o27583l38698J08200Q7913l18815m86199j30693L67127N41203
$$ plain form
33065 1130344 1518455 1729224 1894921 2046842 2080586 1899696 1544044 1198024 1061015 1152028
33055 1152028 1230832 977927 325841 -382833 -640187 -253091 436744 894956 951814 903434
33045 903434 1044725 1286972 1359100 1220918 1072643 1052992 1146503 1319185 1498155 1458227
33035 1458227 1027621 450508 256703 656852 1299025 1733972 1879206 1883794 1795669 1593220
33025 1593220 1361154 1193050 1045704 894813 886906 1099232 1294660 1216398 1038647 1183365
33015 1183365 1684582 2063663 1924789 1402285 896516 609400 510172 561430 747293 964282
33005 964282 1090072 1144589 1228913 1304756 1184782 795797 337321 76740 35773 -7599
32995 -7599 -208082 -475967 -676641 -867210 -1156694 -1395757 -1256925 -694537 -111789 74209
$$ packed form
33065A130344L88111K10769J65697J51921L3744j80890l55652l46020j37009R1013
33055A152028P8804k52905o52086p08674k57354L87096O89835M58212N6858m8380
33045I03434J41291K42247P2128j38182j48275j9651R3511J72682J78970l9928
33035A458227m30606n77113j93805M00149O42173M34947J45234M588q8125k02449
33025A593220k32066j68104j47346j50891p907K12326J95428p8262j77751J44718
33015A183365N01217L79081j38874n22504n05769k87116r9228N1258J85863K16989
33005I64282J25790N4517Q4324P5843j19974l88985m58476k60581m0967m3372
32995g599k00483k67885k00674j90569k89484k39063J38832N62388N82748J85998
$$ plain form
32985 74209 -117392 -367439 -496289 -556405 -576741 -467906 -207714 63178 198926 211904
32975 211904 255764 497046 959769 1421630 1539794 1197194 662621 295280 178755 181479
32965 181479 254396 450536 721657 930566 1038454 1076635 987583 728679 477780 461930
32955 461930 615148 695151 699151 820766 1021654 1068742 1029366 1231946 1593323 1524893 805488
32944 805488 58043 -49449 334792 646367 790630 1063163 1458068 1688815 1761551 1900336
32934 1900336 1958193 1548410 807885 386436 517700 696562 507285 196562 107914 93893
32924 93893 -71180 -145737 184930 679103 840651 655910 517684 543291 484525 275164
32914 275164 164746 247901 301125 207698 174405 376939 696837 960914 1171940 1346508
$$ packed form
32985G4209j91601k50047j28850o0116k0336J08835K60192K70892J35748J2978
32975B11904M3860K41282M62723M61861J18164l42600n34573l67341j16525K724
32965A81479P2917J96140K71121K08909J07888L8181q9052k58904k50899j5850
32955D61930J53218Q0003M000J21615K00888M7088l9376K02580L61377o8430p19405
32944H05488p47445j07492L84241L11575J44263K72533L94905K30747P2736J38785
32934A900336N7857m09783p40525m21449J31264J78862j89277l10723q8648j4021
32924I3893j65073p4557L30667M94173J61548j84741j38226K5607n8766k09361
32914B75164j10418Q3155N3224r3427l3293K02534L19898K64077K11026J74568
$$ plain form
32904 1346508 1366918 1166040 869760 617790 433248 387215 645135 1145909 1444515 1147462
32894 1147462 413173 -196983 -294918 78839 653215 1131868 1266096 1014558 687098 707241
32884 707241 1125650 1512210 1429687 911417 372633 122529 84011 3825 -151093 -113472
32874 -113472 318489 917071 1200703 1017222 762292 859241 1167046 1151045 592172 -143912
32864 -143912 -589178 -676417 -645062 -652847 -667123 -630243 -549790 -455388 -379165 -336750 -238736
32853 -238736 92888 668353 1135088 1032841 310402 -528599 -886617 -635828 -165709 90052
32843 90052 85544 98657 322700 656352 928920 1169732 1469171 1650411 1369371 638777
32833 638777 -2918 -69213 279178 471140 264919 -52517 -201079 -293340 -524922 -756988
$$ packed form
32904A346508K0410k00878k96280k51970j84542m6033K57920N00774K98606k97053
32894A147462p34289o10156r7935L73757N74376M78653J34228k51538l27460K0143
32884G07241M18409L86560q2523n18270n38784k50104l8518q0186j54918L7621
32874a13472M31961N98582K83632j83481k54930R6949L07805j6001n58873p36084
32864a43912m45266q7239L1355p785j4276L6880Q0453R4402P6223M2415R8014
32853b38736L31624N75465M66735j02247p22439q39001l58018K50789M70119K55761
32843I0052m508J3113K24043L33652K72568K40812K99439J81240k81040p30594
32833F38777o41695o6295L48391J91962k06221l17436j48562r2261k31582k32066
$$ plain form
32823 -756988 -695018 -363807 -101057 -65558 -26554 225797 468932 298750 -254434 -629374
32813 -629374 -376001 281553 723532 688296 500144 539698 770630 935523 984189 1057159
32803 1057159 1177467 1243021 1290202 1497498 1888000 2234732 2304469 2030061 1458677 769151
32793 769151 351281 553301 1221709 1761633 1815538 1621639 1512337 1370053 917901 322219
32783 322219 71367 325178 782899 1187427 1561098 1882351 1941551 1701893 1469736 1465122
32773 1465122 1481685 1244414 910118 905181 1351779 1911836 2158990 1912406 1285268 633214
32763 633214 389501 682038 1118452 1204352 977856 938012 1297526 1661537 1633364 1412551
32753 1412551 1462417 1783336 1904664 1539298 875392 191312 -451931 -1006257 -1264054 -1140830
$$ packed form
32823g56988O1970L31211K62750L5499L9004K52351K43135j70182n53184l74940
32813f29374K53373O57554M41979l5236j88152L9554K30932J64893M8666P2970
32803A057159J20308O5554M7181K07296L90502L46732O9737k74408n71384o89526
32793G69151m17870K02020O68408N39924N3905j93899j09302j42284m52152n95682
32783C22219k50852K53811M57721M04528L73671L21253N9200k39658k32157m614
32773A465122J6563k37271l34296m937M46598N60057K47154k46584o27138o52054
32763F33214k43713K92537M36414Q5900k26496l9844L59514L64011k8173k20813
32753A412551M9866L20919J21328l65366o63906o84080o43243n54326k57797J23224
$$ plain form
32743 -1140830 -909336 -871933 -928067 -740384 -256067 214398 421459 414136 329706 213236
32733 213236 133576 228635 469317 556193 252424 -265656 -564727 -435573 -96499 77778
32723 77778 -49789 -265273 -265890 -34996 117776 -16518 -199893 -82834 170049 2000
32713 2000 -640136 -968691 -302720 930326 1635363 1380144 777815 528720 607438 590192
32703 590192 332493 -20468 -405620 -842034 -1192082 -1258352 -1093487 -969600 -1042202 -1223974
32693 -1223974 -1361742 -1352068 -1107229 -627786 -152100 -29284 -323561 -670326 -659238 -294841
32683 -294841 56014 148683 133580 278823 552583 647936 394529 -41123 -421269 -722150
32673 -722150 -1026674 -1293569 -1439294 -1552223 -1781137 -2035720 -2035811 -1677987 -1139867 -607855
$$ packed form
32743a140830K31494L7403n6134J87683M84317M70465K07061p323q4430j16470
32733B13236p9660R5059K40682Q6876l03769n18080k99071J29154L39074J74277
32723G7778j27567k15484o17K30894J52772j34294j83375J17059K52883j68049
32713B000o42136l28555O65971J233046P05037k55219o02329k49095P8718j7246
32703E90192k57699l52961l85152m36414l50048o6270J64865J23887p2602j81772
32693a223974j37768R674K44839M79443M75686J22816k94277l46765J1088L64397
32683b94841L50855R2669j5103J45243K73760R5353k53407m35652l80146l00881
32673g22150l04524k66895j45725j12929k28914k54583r1L57824N38120N32012
$$ plain form
32663 -607855 -145023 140778 105697 -117400 -96656 387205 998553 1231651 987528 568521
32653 568521 253073 111597 131648 270139 413709 475269 498192 534866 516981 393606
32643 393606 261751 163391 -94231 -640387 -1172912 -1222968 -774367 -304110 -163125 -208276
32633 -208276 -145919 10030 -21598 -422547 -1042352 -1454682 -1263608 -505143 272063 512174
32623 512174 245665 1992 146764 522446 747899 626868 217314 -263924 -540465 -498246
32613 -498246 -357915 -410383 -576643 -522705 -236015 -107652 -317636 -538064 -476299 -339580
32603 -339580 -433905 -606402 -485293 -82816 238184 297126 240526 210528 182530 110668 -15594
32592 -15594 -217255 -418191 -401865 -120024 101493 -22355 -256995 -170334 170811 289338
$$ packed form
32663f07855M62832K85801l5081k23097K0744M83861O11348K33098k44123m19007
32653E68521l15448j41476K0051J38491J43570O1560K2923L6674j7885j23375
32643C93606j31855r8360k57622n46156n32525n0056M48601M70257J40985m5151
32633b08276O2357J55949l1628m00949o19805m12330J91074P58465P77206K40111
32623E12174k66509k43673J44772L75682K25453j21031m09554m81238k76541M2219
32613d98246J40331n2468j66260N3938K86690J28363k09984k20428O1765J36719
32603c39580r4325j72497J21109M02477L21000N8942n6600k9998k7998p1862j26262
32592a5594k01661k00936J6326K81841K21517j23848k34640Q6661L41145J18527
$$ plain form
32582 289338 62936 -109899 -2231 101594 -18261 -76436 233155 674923 804810 620957
32572 620957 453864 355986 54550 -489512 -879394 -773365 -325382 10140 -31107 -336879
32562 -336879 -622298 -710600 -626303 -467992 -249082 65363 388753 535953 480555 423810
32552 423810 476507 433800 73781 -434502 -681833 -541346 -280640 -139208 -60850 80024
32542 80024 251752 416968 679413 1048486 1213649 849325 125247 -351993 -188856 380215
32532 380215 819357 879055 722220 580196 490833 390845 298294 302723 439353 643435 787563
32521 787563 721158 349698 -228293 -706206 -812464 -582073 -300463 -177438 -179246 -187383
32511 -187383 -176937 -170312 -149119 -123076 -175078 -296740 -274365 66437 533363 693664 370808
$$ packed form
32582B89338k26402j72835J07668J03825j19855n8175L09591M41768J29887j83853
32572F20957j67093r7878l01436n44062l89882J06029M47983L35522m1247l05772
32562c36879k85419q8302Q4297J58311K18910L14445L23390J47200n5398n6745
32552D23810N2697m2707l60019n08283k47331J40487K60706J41432P8358J40874
32542H0024J71728J65216K62445L69073J65163l64324p24078m77240J63137N69071
32532C80215M39142N9698j56835j42024q9363r9988r2551M429J36630K04082J44128
32521G87563o6405l71460n77991m77913j06258K30391K81610J23025j808q137
32511a87383J0446O625K1193K6043n2002j21662K2375L40802M66926J60301l22856
$$ plain form
32500 370808 -154889 -500509 -567249 -486014 -359316 -231108 -194642 -309468 -429681 -303689
32490 -303689 119936 619825 959900 1092553 1082955 986997 874164 826792 808295 653138
32480 653138 323063 72304 181152 569750 859175 820561 591593 406738 278999 52084
32470 52084 -330035 -707699 -824054 -529615 59426 585764 737156 549161 321312 220779
32460 220779 149419 60089 137656 456035 690830 520897 193643 265618 757117 1012617
32450 1012617 597457 -49572 -190843 237755 628459 560577 241048 59690 84094 148536
32440 148536 154907 62635 -227395 -715851 -1110396 -1035819 -463925 231683 683203 849666
32430 849666 887954 864141 731248 517296 362641 330182 288812 70882 -296430 -596880
$$ packed form
32500C70808n25697l45620o6740Q1235J26698J28208L6466j14826j20213J25992
32490c03689M23625M99889L40075J32653r598r5958j12833m7372j8497j55157
32480F53138l30075k50759J08848L88598K89425l8614k28968j84855j27739k26915
32470E2084l82119l77664j16355K94439N89041N26338J51392j87995k27849j00533
32460B20779p1360q9330P7567L18379K34795j69933l27254P1975M91499K55500
32450A012617m15160o47029j41271M28598L90704o7882l19529j81358K4404O4442
32440A48536O371r2272k90030m88456l94545P4577N71894O95608M51520J66463
32430H49666L8288k3813j32893k13952j54655l2459m1370k17930l67312l00450
$$ plain form
32420 -596880 -656234 -498572 -263952 -56447 67869 40306 -159897 -378844 -361666 -43193
32410 -43193 326433 473822 463137 588926 903483 1077642 866800 520207 465985 670249
32400 670249 630061 68467 -660775 -1039557 -1019287 -928707 -908607 -776865 -439403 -109042
32390 -109042 -4090 -57489 -64900 36700 168683 264294 302128 286693 290084 395729 504106
32379 504106 348180 -137614 -595981 -609673 -220141 137520 201949 162673 315025 626524
32369 626524 773772 538005 72559 -224589 -102738 273470 508670 453689 364713 491804
32359 491804 693367 683638 510952 450552 481222 281595 -184461 -511145 -476001 -410124 -619397
32348 -619397 -794286 -458701 221235 613208 524905 389036 501525 631166 576359 579869
$$ packed form
32420e96880n9354J57662K34620K07505J24316k7563k00203k18947J7178L18473
32410d3193L69626J47389j0685J25789L14557J74159k10842l46593n4222K04264
32400F70249m0188n61594p29242l78782K0270R0580K0100J31742L37462L30361
32390a09042J04952n3399p411J01600J31983R5611L7834j5435L391J05645J08377
32379E04106j55926m85794m58367j3692L89532L57661O4429l9276J52352L11499
32369F26524J47248k35767m65446k97148J21851L76208K35200n4981q8976J27091
32359D91804K01563r729j72686o0400L0670j99627m66056l26684L5144O5877k09273
32348f19397j74889L35585O79936L91973q8303j35869J12489J29641n4807L510
$$ plain form
32338 579869 833279 994233 681348 182329 125569 546429 823102 591144 213585 153307
32328 153307 316785 335974 180485 90668 78004 -77956 -356840 -424981 -154190 106746
32318 106746 -3188 -323807 -365554 43711 547708 714370 505430 222664 132568 259075
32308 259075 464345 600617 589230 446216 258751 99975 -25612 -116528 -98320 92818
32298 92818 356420 468493 318034 20338 -246139 -425896 -557075 -665407 -784066 -980495
32288 -980495 -1223434 -1287653 -962664 -357560 142000 241283 -35782 -456887 -781062 -875308
32278 -875308 -812021 -857441 -1174840 -1527618 -1508929 -1110910 -784895 -820411 -970394 -898492
32268 -898492 -690644 -603445 -563159 -343191 -91468 -195631 -633378 -922688 -805849 -562150
$$ packed form
32338E79869K53410J60954l12885m99019n6760M20860K76673k31958l77559o0278
32328A53307J63478J9189j55489q9817j2664j55960k78884o8141K70791K60936
32318A06746j09934l20619m1747M09265N03997J66662k08940k82766r0096J26507
32308B59075K05270J36272j1387j43014j87465j58776j25587r0916J8208J91138
32298I2818K63602J12073j50459k97696k66477j79757j31179j08332j18659j96429
32288i80495k42939o4219L24989O05104M99560R9283k77065m21105l24175r4246
32278h75308O3287m5420l17399l52778J8689L98019L26015l5516j49983P1902
32268h98492K07848Q7199M0286K19968K51723j04163m37747k89310J16839K43699
$$ plain form
32258 -562150 -503582 -566905 -608892 -717060 -933037 -983671 -635111 -94441 274232 452470
32248 452470 654836 881324 956616 908360 911940 897214 608054 95389 -213185 -45617
32238 -45617 395373 744228 854069 787291 684154 735605 1032272 1335225 1256115 785972
32228 785972 372094 319508 407669 305252 61123 -112321 -273435 -574702 -824769 -676980
32218 -676980 -220208 42586 -129834 -426216 -474588 -292144 -88849 70547 180450 111469
32208 111469 -205495 -547253 -613419 -404503 -161557 11664 225325 514143 714877 691413
32198 691413 488121 185632 -212578 -637394 -859260 -703423 -276587 169334 533495 860920
32188 860920 1075014 915674 221337 -831592 -1829521 -2396491 -2372930 -1867713 -1209357 -729155
$$ packed form
32258e62150N8568o3323m1987j08168k15977n0634L48560N40670L68673J78238
32248D52470K02366K26488P5292m8256L580j4726k89160n12665l08574J67568
32238d5617M40990L48855J09841o6778j03137N1451K96667L02953p9110m70143
32228G85972m13878n2586Q8161j02417k44129j73444j61114l01267k50067J47789
32218f76980M56772K62794j72420k96382m8372J82444K03295J59396J09903o8981
32208A11469l16964l41758o6166K08916K42946J73221K13661K88818K00734k3464
32198F91413k03292l02489l98210m24816k21866J55837M26836M45921L64161L27425
32188H60920K14094j59340o94337j052929r97929n66970K3561N05217O58356M80202
$$ plain form
32178 -729155 -484819 -267199 54723 327863 384059 370907 572707 953880 1158911 1012104
32168 1012104 754128 674214 765633 927030 1252924 1817407 2319453 2319241 1823765 1295901
32158 1295901 1015225 766150 311456 -150825 -280195 -118708 6123 -20367 -38564 2044
32148 2044 -41260 -167769 -166117 -9021 6120 -292587 -640497 -724922 -631585 -576424 -399938
32137 -399938 228311 1160588 1793453 1829824 1605842 1486832 1336974 895874 370130 222048
32127 222048 492338 737210 639042 335712 82776 -96391 -280136 -413869 -411018 -359227
32117 -359227 -439011 -685243 -957756 -1115194 -1116292 -979588 -749747 -511927 -359599 -314209
32107 -314209 -312823 -300973 -315561 -438778 -664380 -857810 -906848 -888015 -984280 -1211988 -1340173
$$ packed form
32178g29155K44336K17620L21922K73140N6196j3152K01800L81173K05031j46807
32168A012104k57976p9914R1419J61397L25894N64483N02046k12m95476n27864
32158A295901k80676k49075m54694m62281j29370J61487J24831k6490j8197M0608
32148B044m3304j26509J652J57096J5141k98707l47910q4425R3337N5161J76486
32137c99938O28249R32277O32865L6371k23982j19010j49858m41100n25744j48082
32127B22048K70290K44872r8168l03330k52936j79167j83745j33733K851N1791
32117c59227p9784k46232k72513j57438j098J36704K29841K37820J52328M5390
32107c14209J386J1850j4588j23217k25602j93430m9038J8833r6265k27708j28185
$$ plain form
32096 -1340173 -1157917 -732182 -307740 -45346 16731 -152125 -514523 -813420 -716047 -195529
32086 -195529 381184 635283 544014 370652 342764 478434 640141 674883 548981 384613
32076 384613 305994 246149 19581 -378046 -675319 -618842 -272222 67839 195157 165038
32066 165038 193977 443641 861771 1210159 1303023 1217893 1184900 1275637 1334679 1241590 1084703
32055 1084703 1005058 1003777 993510 934655 842751 752282 720691 762048 757263 581015 332305
32044 332305 228709 234120 71545 -283440 -443080 -158024 273763 451436 459147 620607
32034 620607 867480 832814 510207 330215 512793 776021 831125 788668 866499 999823
32024 999823 989922 830336 650919 482976 284304 93696 -9305 -21385 29150 153544
$$ packed form
32096a340173J82256M25735M24442K62394O2077j68856l62398k98897R7373N20518
32086a95529N76713K54099r1269j73362k7888J35670J61707L4742j25902j64368
32076C84613p8619n9845k26568l97627k97273N6477L46620L40061J27318l0119
32066A65038K8939K49664M18130L48388R2864q5130l2993R0737N9042r3089j56887
32055A084703p9645j281j0267n8855r1904r0469l1591M1357m785j76248k48710
32044C32305j03596N411j62575l54985j59640K85056M31787J77673P711J61460
32034F20607K46873l4666l22607j79992J82578K63228N5104m2457P7831J33324
32024I99823r901j59586j79417j67943j98672j90608j03001j2080N0535J24394
$$ plain form
32014 153544 328442 461278 531321 635857 773119 723187 333314 -159915 -301363 72446
32004 72446 621177 830261 496415 -106866 -498073 -428731 -78601 192378 232878 155014
31994 155014 71070 -24312 -93237 -12452 195685 294807 154804 -39758 -94095 -144514 -429717
31983 -429717 -826308 -924439 -569376 -49814 307678 479686 592873 680652 755047 916425
31973 916425 1169586 1263014 960110 406692 -30603 -280660 -626874 -1160531 -1478938 -1172701
31963 -1172701 -421542 197870 405095 396819 366214 219102 -123690 -489980 -732651 -959441
31953 -959441 -1234011 -1312986 -1019374 -669605 -706412 -1010782 -1036062 -619576 -178763 6983
31943 6983 215482 709632 1156227 1043586 475240 108898 315616 736396 768232 279569
$$ packed form
32014A53544J74898J32836P0043J04536J37262m9932l89873m93229j41448L73809
32004G2446N48731K09084l33846o03281l91207O9342L50130K70979M0500p7864
31994A55014q3944r5382o8925Q0785K08137R9122j40003j94562n4337n0419k85203
31983d29717l96591r8131L55063N19562L57492J72008J13187Q7779P4395J61378
31973I16425K53161R3428l02904n53418m37295k50057l46214n33657l18407L06237
31963a172701P51159O19412K07225q276l0605j47112l42792l66290k42671k26790
31953i59441k74570p8975K93612L49769l6807l04370k5280M16486M40813J85746
31943F983K08499M94150M46595j12641n68346l66342K06718M20780L1836m88663
$$ plain form
31933 279569 -293960 -490052 -336977 -275935 -594306 -1073244 -1310593 -1254276 -1166553 -1128497
31923 -1128497 -927968 -495716 -83729 163770 476429 1027453 1515229 1511778 1052607 547253
31913 547253 220963 -30307 -304915 -540029 -680525 -736626 -677385 -495106 -346242 -390301
31903 -390301 -518317 -492408 -334863 -306283 -481409 -617236 -496848 -164916 228348 565794
31893 565794 670302 343251 -337873 -945572 -1106326 -881299 -620495 -530569 -516884 -409139
31883 -409139 -226276 -174290 -381025 -663423 -664733 -291419 100740 90718 -326204 -792524
31873 -792524 -1023121 -979896 -697668 -215550 301971 620129 672259 576551 420837 233460
31863 233460 137564 245814 360484 88647 -614710 -1279871 -1455162 -1181461 -773957 -369397
$$ packed form
31933B79569n73529j96092J53075O1042l18371m78938k37349N6317Q7723L8056
31923a128497K00529M32252M11987K47499L12659N51024M87776l451m59171n05354
31913E47253l26290k51270k74608k35114j40496n6101N9241J82279J48864m4059
31903c90301j28016K5909J57545K8580j75126j35827J20388L31932L93264L37446
31893E65794J04508l27051o81124o07699j60754K25027K60804Q9926J3685J07745
31883d09139J82863N1986k06735k82398j310L73314L92159j0022m16922m66320
31873g92524k30597M3225K82228M82118N17521L18158N2130r5708j55714j87377
31863B33460r5896J08250J14670k71837p03357o65161j75291K73701M07504M04560
$$ plain form
31853 -369397 64042 430636 524229 337212 141697 195219 452467 619776 488906 197859
31843 197859 92224 278950 437964 234643 -182101 -337298 -43745 423382 769028 962754
31833 962754 992755 689758 19159 -701712 -1121032 -1216365 -1142386 -902159 -418866 183838
31823 183838 615114 691068 438397 20959 -303601 -291165 39175 354872 371231 170776
31813 170776 19007 -7706 -17823 -37436 17577 126283 108832 -189050 -748347 -1374414
31803 -1374414 -1762392 -1653783 -1064031 -330619 144543 191038 -60917 -283929 -154670 333528
31793 333528 732362 558505 -93325 -637967 -769139 -780249 -972524 -1169622 -1110150 -927659
31783 -927659 -844329 -711679 -308269 162872 350434 313391 309932 237566 -140177 -553842
$$ packed form
31853c69397M33439L66594R3593j87017j95515N3522K57248J67309j30870k91047
31843A97859j05635J86726J59014k03321m16744j55197K93553M67127L45646J93726
31833I62754L0001l02997o70599p20871m19320r5333P3979K40227M83293O02704
31823A83838M31276P5954k52671m17438l24560J2436L30340L15697J6359k00455
31813A70776j51769k6713j0117j9613N5013J08706j7451k97882n59297o26067
31803a374414l87978J08609N89752P33412M75162M6495k51955k23012J29259M88198
31793C33528L98834j73857o51830n44642j31172j1110j92275j97098N9472J82491
31783i27659Q3330J32650M03410M71141J87562l7043l459p2366l77743m13665
$$ plain form
31773 -553842 -475611 -3574 152790 -315431 -911973 -1111715 -983404 -812341 -625480 -386088
31763 -386088 -218984 -143961 23998 245576 157693 -287617 -536588 -204404 256934 156856
31753 156856 -459212 -956733 -1024746 -893536 -757190 -556602 -373535 -513511 -1011308 -1422767
31743 -1422767 -1320395 -765709 -140114 292081 506619 573729 566374 557843 597629 681527 757238
31732 757238 747701 607403 394841 230631 135872 1225 -215324 -381195 -392657 -360510
31722 -360510 -434745 -552988 -560537 -502566 -562501 -723010 -721926 -405557 51685 364414 449437
31711 449437 441622 487628 612767 756315 860800 891504 781750 437572 -104546 -557071
31701 -557071 -587327 -206178 195740 289690 143301 8762 -46724 -113335 -180120 -145186 -28663
$$ packed form
31773e53842P8231M72037J56364m68221n96542j99742J28311J71063J86861K39392
31763c86088J67104P5023J67959K21578q7883m45310k48971L32184M61338j00078
31753A56856o16068m97521o8013J31210J36346K00588J83067j39976m97797m11459
31743a422767J02372N54686O25595M32195K14538O7110p355q531L9786Q3898P5711
31732G57238r537j40298k12562j64210r4759j34647k16549j65871j1462L2147
31722c60510p4235j18243p549N7971n9935j60509J084L16369M57242L12729Q5023
31711D49437p815M6006J25139J43548J04485L0704j09754l44178n42118m52525
31701e57071l0256L81149M01918R3950j46389j34539n5486o6611o6785L4934J16523
$$ plain form
31690 -28663 46105 68446 143979 287910 394844 416307 395103 317796 113711 -170066 -363455
31679 -363455 -394613 -375141 -418255 -501653 -550500 -523485 -374154 -73904 252164 349518 110919
31668 110919 -251810 -422721 -325833 -163936 -141298 -245043 -327097 -334528 -378758 -559725 -786668
31657 -786668 -852471 -673855 -376441 -140342 -55164 -128554 -294731 -362738 -119112 389093
31647 389093 782993 709355 223331 -271169 -391092 -25870 633459 1184063 1257940 852777
31637 852777 356419 134846 200769 375353 564692 681417 513693 -12233 -561174 -701826
31627 -701826 -425143 -64449 201125 412818 480820 206598 -296174 -615150 -593342 -513788
31617 -513788 -608185 -745120 -773404 -810337 -948278 -990030 -763928 -461898 -380299 -516532
$$ packed form
31690b8663P4768K2341P5533J43931J06934K1463k1204p7307k04085k83777j93389
31679c63455l1158J9472m3114q3398m8847K7015J49331L00250L26068R7354k38599
31668A10919l62729j70911R6888J61897K2638j03745q2054p431m4230j80967k26943
31657g86668o5803J78616K97414K36099Q5178p3390j66177o8007K43626N08205
31647C89093L93900p3638m86024m94500j19923L65222O59329N50604P3877m05163
31637H52777m96358k21573O5923J74584J89339J16725j67724n25926n48941j40652
31627g01826K76683L60694K65574K11693O8002k74222n02772l18976K1808P9554
31617e13788r4397j36935k8284l6933j37941m1752K26102L02030Q1599j36233
$$ plain form
31607 -516532 -685597 -851567 -1062000 -1206017 -1129369 -887803 -630052 -344555 -6786 116331
31597 116331 -345740 -1334450 -2271996 -2588313 -2205402 -1499606 -941566 -777409 -898785 -967154
31587 -967154 -744068 -315146 45353 167346 78449 -96891 -221797 -209550 -111990 -71718
31577 -71718 -96612 2708 329607 683520 787338 629323 409021 237124 71527 -124419
31567 -124419 -343128 -592413 -829581 -907399 -754028 -536789 -489974 -667353 -1006909 -1479663
31557 -1479663 -1957709 -2110527 -1746749 -1155191 -782097 -649907 -443857 -102470 102113
31548 102113 82323 86711 234858 330690 299751 384974 661125 757718 418803 21597 109388
31537 109388 601343 913508 788461 563379 565363 641981 489517 186914 131132 506507
$$ packed form
31607e16532j69065j65970k10433j44017P6648K41566K57751K85497L37769J23117
31597A16331m62071r88710r37546l16317L82911P05796N58040J64157j21376o8369
31587i67154K23086M28922L60499J21993q8897j75340j24906J2247R7560M0272
31577g1718k4894R9320L26899L53913J03818j58015k20302j71897j65597j95946
31567a24419k18709k49285k37168p7818J53371K17239M6815j77379l39556m72754
31557a479663m78046j52818L63778N91558L73094J32190K06050L41387K04583
31548A02113j9790M388J48147R5832l0939Q5223K76151R6593l38915l97206Q7791
31537A09388M91955L12165j25047k25082J984P6618j52464l02603n5782L75375
$$ plain form
31527 506507 1031524 1291426 1210176 1082538 1168128 1401875 1573543 1633338 1632002 1467413
31517 1467413 984857 349780 18069 196021 557990 666364 483882 293612 289221 461497
31507 461497 753153 1074716 1225550 1028662 555578 77805 -189069 -194654 9795 289396
31497 289396 428476 271868 -133767 -611004 -998733 -1158425 -972689 -500720 -48215 86664
31487 86664 -105151 -417698 -674067 -769071 -630537 -349964 -220511 -393999 -599070 -472290
31477 -472290 -90152 134806 47736 -90149 -51563 81629 164958 207048 236445 228637 266935
31466 266935 488696 743743 613008 -29225 -730609 -972670 -757147 -442232 -192922 108185
31456 108185 517960 904995 1155716 1292889 1376143 1414995 1352497 1048767 389099 -462140
$$ packed form
31527E06507N25017K59902q1250j27638Q5590K33747J71668N9795j336j64589
31517A467413m82556o35077l31711J77952L61969J08374j82482j90270m391J72276
31507D61497K91656L21563J50834j96888m73084m77773k66874n585K04449K79601
31497B89396J39080j56608m05635m77237l87729j59692J85736M71969M52505J34879
31487H6664j91815l12547k56369r5004J38534K80573J29453j73488k05071J26780
31477d72290L82138K24958q7070j37885L8586J33192Q3329M2090K9397p808L8298
31466B66935K21761K55047j30735o42233p01384k42061K15523L14915K49310L01107
31456A08185M09775L87035K50721J37173Q3254L8852o2498l03730o59668q51239
$$ plain form
31446 -462140 -1047572 -1042904 -603746 -115339 277405 656643 954689 908387 430579 -202157
31436 -202157 -601722 -573437 -182533 307504 566181 455570 189206 87703 192584 293030
31426 293030 289352 276505 253275 39785 -401230 -802794 -914573 -809591 -712975 -672943 -577213
31415 -577213 -399868 -259336 -255667 -352106 -404034 -278007 -7445 164506 16499 -356513
31405 -356513 -629829 -664419 -650222 -765604 -908893 -904631 -782068 -673164 -599899 -556260 -646870
31394 -646870 -914385 -1146300 -1100660 -849306 -656010 -569347 -388782 -15330 413092 752663
31384 752663 993133 1131974 1118118 974698 803279 627699 402973 201854 194784 386743
31374 386743 553552 509541 287201 5219 -276576 -518879 -680856 -781745 -833317 -718182
$$ packed form
31446d62140n85432M668M39158M88407L92744L79238K98046m6302m77808o32736
31436b02157l99565K8285L90904M90037K58677j10611k66364j01503J04881J00446
31426B93030l678j2847k3230k13490m41015m01564j11779J04982R6616M0032R5730
31415e77213J77345J40532L669r6439n1928J26027K70562J71951j48007l73012
31405c56513k73316l4590J4197j15382j43289M262J22563J08904P3265M3639r0610
31394f46870k67515k31915M5640K51354J93296Q6663J80565L73452M28422L39571
31384G52663K40470J38841j3856j43420j71419j75580k24726k01119p070J91959
31374C86743J66809m4011k22340k81982k81795k42303j61977j00889n1572J15135
$$ plain form
31364 -718182 -358286 -3275 -32607 -375028 -468189 -2270 597667 708567 286949 -205645
31354 -205645 -463108 -556612 -600694 -576286 -500003 -471774 -504252 -514161 -485789 -449048 -339717
31343 -339717 -115713 37860 -92203 -353232 -350986 -22628 227695 79494 -296386 -524636
31333 -524636 -473621 -253544 12941 229694 304954 262371 237174 238987 101028 -191850 -339396
31322 -339396 -96731 373447 741110 919000 971670 801762 295193 -296306 -506623 -236077
31312 -236077 132513 264518 225258 207900 216431 211037 339403 774883 1419252 1947893 2101599
31301 2101599 1832094 1254278 578972 18063 -359834 -627946 -797169 -736517 -402962 -11991
31291 -11991 187968 213025 241447 307871 307721 232551 152485 2568 -319920 -622446 -517837
$$ packed form
31364g18182L59896L55011k9332l42421r3161M65919N99937J10900m21618m92594
31354b05645k57463r3504m4082K4408P6283K8229l2478r909K8372L6741J09331
31343c39717K24004J53573j30063k61029K246L28358K50323j48201l75880k28250
31333e24636N1015K20077K66485K16753P5260m2583k5197J813j37959k92878j47546
31322c39396K42665M70178L67663J77890N2670j69908n06569n91499k10317K70546
31312b36077L68590J32005l9260j7358Q531n394J28366M35480O44369N28641J53706
31301B101599k69505n77816o75306n60909l77897k68112j69223O0652L33555L90971
31291a1991J99959K5057K8422O6424j50p5170q0066j49917l22488l02526J04609
$$ plain form
31280 -517837 8801 449501 415950 162766 167693 414069 496385 325368 248558 412596
31270 412596 463425 89147 -501277 -919740 -1131759 -1312264 -1385666 -1124480 -636218 -343237
31260 -343237 -407380 -490393 -210910 385373 927215 1110191 891167 459703 122510 81429
31250 81429 232290 285386 113299 -173633 -503677 -942624 -1423690 -1653749 -1483191 -1141939
31240 -1141939 -868765 -511981 182832 1016684 1442319 1233465 733790 378137 247592
31231 247592 207332 226579 366326 593846 793589 902189 916338 833571 697291 637832
31221 637832 729722 818965 634342 140094 -309519 -295960 169481 599926 581860 282266
31211 282266 227450 591134 941362 802651 255966 -213510 -303499 -80951 307272 789867
$$ packed form
31280e17837N26638M40700l3551k53184M927K46376Q2316j71017p6810J64038
31270D12596N0829l74278n90424m18463k12019j80505p3402K61186M88262K92981
31260c43237o4143q3013K79483N96283N41842J82976k19024m31464l37193m1081
31250H1429J50861N3096j72087k86932l30044m38947m81066k30059J70558L41252
31240a141939K73174L56784O94813Q33852M25635k08854m99675l55653j30545
31231B47592m0260J9247J39747K27520J99743J08600J4149q2767j36280n9459
31221F37832R1890Q9243j84623m94248m49613J3559M65441M30445j8066k99594
31211B82266n4816L63684L50228j38711n46685m69476q9989K22548L88223M82595
$$ plain form
31201 789867 1217609 1351595 1145699 867632 797838 897859 880722 566369 106541 -141945
31191 -141945 8865 316925 328941 -63533 -447338 -439255 -238145 -327030 -738380 -1015658
31181 -1015658 -916348 -726546 -741083 -828254 -748576 -576310 -502786 -467684 -312559 -135218
31171 -135218 -174576 -443512 -746368 -967020 -1088756 -1044314 -839738 -738899 -991637 -1396222
31161 -1396222 -1459236 -1033302 -496608 -214928 -106712 106863 438163 621370 468787 84676
31151 84676 -256797 -379012 -357844 -406674 -579130 -656605 -428171 1750 350920 546122
31141 546122 753030 1020544 1142421 962351 618366 361244 275764 291719 327063 289849
31131 289849 72662 -282074 -496764 -330590 82076 337601 229026 -50930 -224421 -269309
$$ packed form
31201G89867M27742J33986k05896k78067o9794J00021j7137l14353m59828k48486
31191a41945J50810L08060J2016l92474l83805Q083K01110q8885m11350k77278
31181a015658R9310J89802j4537q7171P9678J72266P3524L5102J55125J77341
31171a35218l9358k68936l02856k20652j21736M4442K04576J00839k52738m04585
31161a396222o3014M25934N36694K81680J08216K13575L31300J83207j52583l84111
31151H4676l41473j22215K1168m8830j72456p7475K28434M29921L49170J95202
31141E46122K06908K67514J21877j80070l43985k57122q5480J5955L5344l7214
31131B89849k17187l54736k14690J66174M12666K55525j08575k79956j73491m4888
$$ plain form
31121 -269309 -295459 -223402 122999 577240 609357 -24392 -836264 -1157634 -1020120 -1052753
31111 -1052753 -1480357 -1736190 -1316130 -568551 -212360 -368796 -563583 -520196 -421794 -423038
31101 -423038 -427317 -438733 -659963 -1054355 -1213414 -915322 -508427 -459561 -738557 -925084
31091 -925084 -781835 -463691 -225582 -137281 -101609 -49042 -73844 -324677 -694627 -757274
31081 -757274 -261648 371972 403066 -313403 -1101339 -1286950 -917097 -472501 -215835 -131818
31071 -131818 -242124 -583098 -978628 -1176498 -1189021 -1246736 -1428046 -1539869 -1362835 -867406
31061 -867406 -213687 341676 580994 473585 160250 -230901 -643710 -969833 -1075814 -1017201
31051 -1017201 -1000277 -1052197 -987166 -786902 -685643 -728590 -622072 -259520 -9300 -150330
$$ packed form
31121b69309k6150P2057L46401M54241L2117o33749q11872l21370J37514l2633
31111a052753m27604k55833M20060P47579L56191j56436j94787M3387R8402j244
31101d23038m279j1416k21230l94392j59059K98092M06895M8866k78996j86527
31091i25084J43249L18144K38109Q8301L5672N2567k4802k50833l69950o2647
31081g57274M95626O33620L1094p16469p87936j85611L69853M44596K56666Q4017
31071a31818j10306l40974l95530j97870j2523n7715j81310j11823J77034M95429
31061h67406O53719N55363K39318j07409l13335l91151m12809l26123j05981N8613
31051a017201J6924n1920O5031K00264J01259m2947J06518L62552K50220j41030
$$ plain form
31041 -150330 -383836 -309671 -64501 -22027 -133904 -86969 86471 85335 -120092 -334102
31031 -334102 -577090 -954158 -1229948 -1118031 -881043 -1013017 -1400716 -1484961 -1225165 -1142079
31021 -1142079 -1340391 -1316169 -938731 -781030 -1109186 -1333682 -963034 -404603 -231517 -262652
31011 -262652 -33495 324375 396477 300765 459951 818238 985309 974253 1105930 1294683
31001 1294683 1124276 629686 353955 528346 743767 580112 118581 -306674 -497710
30992 -497710 -428138 -209885 -97407 -247049 -460925 -450736 -306183 -358380 -625039 -784942
30982 -784942 -696488 -534278 -386629 -137629 180213 324051 243060 178299 249829 290250
30972 290250 198676 118341 136970 122532 -32624 -291259 -644181 -1071453 -1312606 -1096731
$$ packed form
31041a50330k33506P4165K45170M2474j11877M6935J73440j136k05427k14010
31031c34102k42988l77068k75790J11917K36988j31974l87699q4245K59796Q3086
31021a142079j98312K4222L77438J57701l28156k24496L70648N58431J73086l1135
31011b62652K29157L57870P2102r5712J59186L58287J67071j1056J31677J88753
31001A294683j70407m94590k75731J74391K15421j63655m61531m25255j91036
30992d97710O9572K18253J12478j49642k13876J0189J44553n2197k66659j59903
30982g84942Q8454J62210J47649K49000L17842J43838q0991o4761P1530M0421
30972B90250r1574q0335J8629j4438j55156k58635l52922m27272k41153K15875
$$ plain form
30962 -1096731 -659038 -540888 -753280 -684393 -67839 524612 521065 158045 -29677 -89614
30952 -89614 -432264 -1013305 -1353077 -1267854 -1050397 -944937 -884902 -758592 -567783 -324450
30942 -324450 -101827 -131732 -513537 -886851 -768526 -202762 281671 356539 169957 -71477
30932 -71477 -392342 -824457 -1247152 -1578998 -1837189 -1918615 -1646354 -1149073 -850968 -911688
30922 -911688 -1001814 -846785 -666781 -777290 -1025131 -1004741 -690689 -472279 -588505 -849892
30912 -849892 -949940 -796053 -488499 -190824 -73822 -193292 -362238 -319495 -85999 26816
30902 26816 -154580 -417391 -473061 -343868 -246750 -209071 -37796 352421 791812 1057736
30892 1057736 1049647 750121 219607 -313410 -579223 -596189 -659752 -859316 -859391 -416998 111255
$$ packed form
30962a096731M37693J18150k12392O8887O16554N92451l547l63020j87722n9937
30952h9614l42650n81041l39772Q5223K17457J05460O0035J26310J90809K43333
30942c24450K22623k9905l81805l73314J18325N65764M84433P4868j86582k41434
30932g1477l20865m32115m22695l31846k58191q1426K72261M97281K98105o0720
30922i11688r0126J55029J80004j10509k47841K0390L14052K18410j16226k61387
30912h49892j00048J53887L07554K97675J17002j19470j68946M2743K33496J12815
30902B6816j81396k62811n5670J29193R7118L7679J71275L90217M39391K65924
30892A057736q089k99526n30514n33017k65813j6966o3563j99564p5M42393N28253
$$ plain form
30881 111255 157349 -282152 -680261 -751482 -715019 -724239 -568423 -183097 48112 -93843
30871 -93843 -163337 300479 907688 846868 94699 -466858 -254909 290073 442973 152534
30861 152534 -122645 -170287 -153739 -167499 -103253 73149 250993 393916 556569 660415
30851 660415 511563 111688 -261634 -380503 -311218 -244966 -235953 -228471 -231195 -316666 -488912
30840 -488912 -670270 -809434 -909562 -947534 -854389 -613412 -324437 -122964 -49472 -26305
30830 -26305 41292 156637 219758 118949 -152020 -459215 -627689 -588683 -414708 -209416
30820 -209416 -12692 152006 199974 53251 -216728 -407548 -384875 -213843 -79122 -131593
30810 -131593 -411027 -820733 -1143605 -1186039 -975903 -743554 -648837 -616042 -507567 -346674
$$ packed form
30881A11255M6094m39501l98109p1221L6463r220J55816L85326K31209j41955
30871i3843o9494M63816O07209o0820p52169n61557K11949N44982J52900k90439
30861A52534k75179m7642J6548j3760O4246J76402J77844J42923J62653J03846
30851F60415j48852l99875l73322j18869O9285O6252R013P482k724q5471j72246
30840d88912j81358j39164j00128l7972R3145K40977K88975K01473P3492K3167
30830b6305O7597J15345O3121j00809k70969l07195j68474L9006J73975K05292
30820b09416J96724J64698M7968j46723k69979j90820K2673J71032J34721n2471
30810a31593k79434m09706l22872m2434K10136K32349R4717L2795J08475J60893
$$ plain form
30800 -346674 -249860 -236983 -262754 -362943 -578639 -760800 -660250 -257557 174699 416420
30790 416420 551028 759892 994027 1018501 746714 373333 130766 14969 -155087 -434993
$$ packed form
30800c46674R6814J2877k5771j00189k15696j82161J00550M02693M32256K41721
30790D16420J34608K08864K34135K4474k71787l73381k42567j15797j70056k79906
$$ [...]
##END NTUPLES=NMR SPECTRUM
##END=
