##TITLE=31Pdec_DE-174rm_3h
 D, 64 sc
13.8.2026
##JCAMPDX= 6.0         $$ Bruker NMR JCAMP-DX V2.0
##DATA TYPE= NMR SPECTRUM
##DATA CLASS= NTUPLES
##ORIGIN= UXNMR, Bruker Analytische Messtechnik GmbH
##OWNER= root
$$ XWIN-NMR		Version 3.5
$$ Wed Aug 12 14:41:10 2026 Russian Standard Time (UT+4h)  she@DPX200
##.OBSERVE FREQUENCY= 81.013821
##.OBSERVE NUCLEUS= ^31P
##.ACQUISITION MODE= SIMULTANEOUS
##.ACQUISITION SCHEME= undefined
##.AVERAGES= 64
##.DIGITISER RES= 17
##SPECTROMETER/DATA SYSTEM= spect
##.PULSE SEQUENCE= zgpg30
##.SOLVENT NAME= CDCl3
##.SHIFT REFERENCE= (INTERNAL, CDCl3, 0, 197.392)
##AUDIT TRAIL= $$ (NUMBER, WHEN, WHO, WHERE, WHAT)
$$ ##TITLE= Audit trail, XWIN-NMR		Version 3.5
$$ ##JCAMPDX= 5.01
$$ ##ORIGIN= Bruker BioSpin GmbH
$$ ##OWNER= she
$$ F:/spectra/data/she/nmr/P31/2/pdata/1/auditp.txt
$$ ##AUDIT TRAIL=  $$ (NUMBER, WHEN, WHO, WHERE, WHAT)
(   1,<2026-08-12 14:39:25.01 +0400>,<she>,<DPX200>,
      <created by zg, POWCHK disabled, PULCHK disabled
       configuration hash MD5:
       00 E9 B6 7A A2 85 ED C7 34 08 36 98 17 FE 4E 26
       data hash MD5: 32K
       65 D2 DB D2 E8 04 83 84 DC 84 47 28 23 88 C0 9E>)
(   2,<2026-08-12 14:39:38.01 +0400>,<she>,<DPX200>,
      <Start of raw data processing
       efp BC_mod = 2 LB = 1.5 FT_mod = 6 PKNL = 1 PHC0 = 1922.775 PHC1 = 196.8983 SI = 64K 
       data hash MD5: 64K
       83 58 66 D3 CA ED E5 02 6B 96 FF F2 BA 74 1E 38>)
(   3,<2026-08-12 14:39:57.12 +0400>,<she>,<DPX200>,
      <pk PHC0 = -6.296984 PHC1 = 0 
       data hash MD5: 64K
       17 A1 7C 67 35 43 42 2A D2 22 68 96 21 9D AA C3>)
(   4,<2026-08-12 14:40:26.29 +0400>,<she>,<DPX200>,
      <pk PHC0 = 118.9281 PHC1 = -334.2 
       data hash MD5: 64K
       83 CF 6F D1 86 C8 C5 6A A2 E0 FC 86 30 38 BA C1>)
$$ ##END=
$$ 
$$ hash MD5
$$ 77 19 5C 4A DD 21 CA E1 12 71 6B F6 E1 9E BA FF
##$RELAX= 
##$RELAX= 
##$RELAX= 
##$RELAX= 
##$RELAX= 
##$RELAX= 
##$RELAX= 
##$RELAX= 
$$ Bruker specific parameters
$$ --------------------------
##$DU= <F:/spectra>
##$EXPNO= 2
##$NAME= <P31>
##$PROCNO= 1
##$TYPE= <nmr>
##$USER= <she>
##$AMP= (0..31)
100 100 100 100 100 100 100 100 100 100 100 100 100 100 100 100 100 100 
100 100 100 100 100 100 100 100 100 100 100 100 100 100 
##$AQSEQ= 0
##$AQ_mod= 1
##$AUNM= <au_zg>
##$AUTOPOS= <>
##$BF1= 81.014009
##$BF2= 200.13
##$BF3= 200.13
##$BF4= 200.13
##$BF5= 200.13
##$BF6= 200.13
##$BF7= 200.13
##$BF8= 200.13
##$BYTORDA= 1
##$CFDGTYP= 0
##$CFRGTYP= 5
##$CHEMSTR= <none>
##$CNST= (0..31)
1 1 145 1 1 1 1 1 1 1 1 1 1 1 1 1 1 1 1 1 1 1 1 1 1 1 1 1 1 1 1 1 
##$CPDPRG= <waltz16>
##$CPDPRG1= <>
##$CPDPRG2= <waltz16>
##$CPDPRG3= <>
##$CPDPRG4= <mlev>
##$CPDPRG5= <mlev>
##$CPDPRG6= <mlev>
##$CPDPRG7= <mlev>
##$CPDPRG8= <mlev>
##$CPDPRGB= <>
##$CPDPRGT= <>
##$D= (0..31)
0 1 0 0 0 0 0 0 0 0.06 0 0.03 2e-05 3e-06 0 0 0.0002 0 0 0 0 0 0 0 0 0 
0 0 0 0 0 0 
##$DATE= 1786531164
##$DBL= (0..7)
120 120 120 11 120 120 24 19 
##$DBP= (0..7)
150 150 150 150 150 150 150 150 
##$DBP07= 0
##$DBPNAM0= <>
$$ [...]
##$SUBNAM3= <"">
##$SUBNAM4= <"">
##$SUBNAM5= <"">
##$SUBNAM6= <"">
##$SUBNAM7= <"">
##$SUBNAM8= <"">
##$SUBNAM9= <"">
##$SW= 400.765351723535
##$SWIBOX= (0..15)
0 1 3 0 0 0 0 0 0 0 0 0 0 0 0 0 
##$SW_h= 32467.5324675325
##$TD= 32768
##$TD0= 1
##$TE= 0
##$TE2= 300
##$TE3= 300
##$TEG= 300
##$TL= (0..7)
0 120 53 12 22 120 120 120 
##$TP= (0..7)
150 150 150 150 150 150 150 150 
##$TP07= 0
##$TPNAME0= <>
##$TPNAME1= <>
##$TPNAME2= <>
##$TPNAME3= <>
##$TPNAME4= <>
##$TPNAME5= <>
##$TPNAME6= <>
##$TPNAME7= <>
##$TPOAL= (0..7)
0.5 0.5 0.5 0.5 0.5 0.5 0.5 0.5 
##$TPOFFS= (0..7)
0 0 0 0 0 0 0 0 
##$TUNHIN= 0
##$TUNHOUT= 0
##$TUNXOUT= 0
##$USERA1= <user>
##$USERA2= <user>
##$USERA3= <user>
##$USERA4= <user>
##$USERA5= <user>
##$V9= 5
##$VALIST= <valist>
##$VCLIST= <CCCCCCCCCCCCCCC>
##$VD= 0
##$VDLIST= <DDDDDDDDDDDDDDD>
##$VPLIST= <PPPPPPPPPPPPPPP>
##$VTLIST= <TTTTTTTTTTTTTTT>
##$WBST= 1024
##$WBSW= 4
##$XGAIN= (0..3)
0 0 0 0 
##$XL= 0
##$YL= 0
##$YMAX_a= 56014
##$YMIN_a= -46261
##$ZGOPTNS= <>
##$ZL1= 120
##$ZL2= 120
##$ZL3= 120
##$ZL4= 120
##$ABSF1= 0
##$ABSF2= 0
##$ABSG= 0
##$ABSL= 0
##$ALPHA= 0
##$AQORDER= 0
##$ASSFAC= 0
##$ASSFACI= 0
##$ASSFACX= 0
##$ASSWID= 0
##$AUNMP= <proc_1d>
##$AZFE= 0.1
##$AZFW= 0.5
##$BCFW= 0
##$BC_mod= 2
##$BYTORDP= 0
##$COROFFS= 0
##$CY= -3
##$DATMOD= 1
##$DC= 0
##$DFILT= <>
##$DTYPP= 0
##$F1P= 0
##$F2P= 0
##$FCOR= 1
##$FTSIZE= 65536
##$FT_mod= 6
##$GAMMA= 0
##$GB= 0
##$INTBC= 1
##$INTSCL= 9.790993e-09
##$ISEN= 30
##$LB= 1.5
##$LEV0= 0
##$LPBIN= 0
##$MAXI= 10000
##$MC2= 0
##$MEAN= 0
##$ME_mod= 0
##$MI= 50
##$NCOEF= 0
##$NC_proc= -8
##$NLEV= 6
##$NOISF1= 182.463
##$NOISF2= 159.3651
##$NSP= 0
##$NTH_PI= 0
##$NZP= 0
##$OFFSET= 197.3918
##$PC= 4
##$PHC0= 2035.406
##$PHC1= -137.3017
##$PH_mod= 1
##$PKNL= yes
##$PPARMOD= 0
##$PSCAL= 0
##$PSIGN= 0
##$REVERSE= no
##$SF= 81.014063255964
##$SI= 65536
##$SIGF1= 159.3651
##$SIGF2= -187.1042
##$SINO= 113.3802
##$SIOLD= 16384
##$SREGLST= <1H.CDCl3>
##$SSB= 0
##$STSI= 65536
##$STSR= 0
##$SW_p= 32467.5324675325
##$SYMM= 0
##$S_DEV= 0
##$TDeff= 32768
##$TDoff= 0
##$TI= <>
##$TILT= no
##$TM1= 0
##$TM2= 0
##$TOPLEV= 0
##$USERP1= <user>
##$USERP2= <user>
##$USERP3= <user>
##$USERP4= <user>
##$USERP5= <user>
##$WDW= 1
##$XDIM= 65536
##$YMAX_p= 296147813
##$YMIN_p= -377370702
$$ End of Bruker specific parameters
$$ ---------------------------------
##NTUPLES= NMR SPECTRUM
##VAR_NAME=  FREQUENCY,     SPECTRUM/REAL,   SPECTRUM/IMAG
##SYMBOL=    X,             R,               I
##VAR_TYPE=  INDEPENDENT,   DEPENDENT,       DEPENDENT
##VAR_FORM=  AFFN,          ASDF,            ASDF
##VAR_DIM=   65536,         65536,           65536
##UNITS=     HZ,            ARBITRARY UNITS, ARBITRARY UNITS
##FACTOR=    0.49542278885378, 1,            1
##FIRST=     15991.5117654749, 0,            0
##LAST=      -16476.0207020576, 0,           0
##MIN=       -16476.0207020576, -377370702,  0
##MAX=       15991.5117654749, 296147813,    0
$$ Real data points
##PAGE= N=1
##DATA TABLE= (X++(R..R)), XYDATA
$$ [...]
45881G074625J275719L09672k016765l245800j765055R0946n98263k648419k595848
45872d119188o8027K064758K334017J963801J623346N27557p98164n08127R51136
45863C971109Q78646q65411j056711J041723J303607k685864o535397m822244
45855h770542P46934L707930J782020j312609k230286j434459j40376J677150
45847e974238L200185K519365l5348j386077l7562J745640J612184M96435M79882
45838B620466J279042R89884p52597k163336j547944P68058K603676J977541n15693
45829E259097j953791p51295R08546J75902j929704j917257O13760K190388P84985
45820C380631j421597j816662q16571J27109J154438K452508K411225j45860l385005
$$ y = [7074625, 8350344, 8660016, 6643251, 3397451, 1632396, 1723342, 1125079, -1523340, -4119188, -4187215, -2122457, 211560, 2175361, 3798707, 4326264, 3528100, 3019973, 3971109, 4849755, 3984344, 2927633, 3969356, 5272963, 2587099, -3948298, -8770542, -8023608, -4315678, -2533658, -3846267, -6076553, -7511012, -7651388, -5974238, -2774053, -254688, -290036, -1676113, -1713675, 31965, 1644149, 2140584, 2620466, 3899508, 4889392, 4136795, 1973459, 425515, 1193573, 3797249, 5774790, 5259097, 3305306, 2554011, 3462557, 3638459, 1708755, -208502, 405258, 2595646, 3380631, 1959034, 142372, -674199, -547090, 607348, 3059856, 5471081, 5325221, 1940216]
45811A940216m393632k757140n41651L60987m09622j864152k093302K24416L776283
45802e757597N490641M232677J903357K64080r41075j831692j347104J23355K19547
45793B356189j242263r63423K287515M348306J634539k722387l351012p55283
45785A592181L69407p95813q14104Q79338Q18921j602241k114988J314845M547095
45776D194641L517550J89379j291267r77471j649558l321576l429280j421926
45768d189508N85255J473087K224226L120681K636416L9820k894654l919396k852254
45759c776327j153645R2214P43757P52791J7663q39357o95245M42859R30543l41598
45749c826345j964532j739923l0381O78054k27771l75600J691249L965718M085261
$$ y = [1940216, -2453416, -5210556, -5752207, -5391220, -5800842, -7664994, -9758296, -9533880, -5757597, -266956, 3965721, 5869078, 6133158, 5192083, 3360391, 2013287, 2136642, 2356189, 1113926, 150503, 2438018, 6786324, 8420863, 5698476, 2347464, 1592181, 1961588, 1165775, 351671, 1231009, 2049930, 447689, -1667299, -352454, 4194641, 7712191, 7901570, 6610303, 5632832, 3983274, 661698, -2767582, -4189508, -3604253, -2131166, 93060, 3213741, 5850157, 5889977, 2995323, -924073, -3776327, -4929972, -4837758, -4094001, -3341210, -3323547, -4162904, -4858149, -4415290, -3484747, -3826345, -5790877, -7530800, -7561181, -6883127, -7110898, -7486498, -5795249, -1829531, 2255730]
45740B255730K745391J709522M57170k217496m770833m455255j547225J151714
45732d671282K439448L064781K536719m98430m450663n324761k170915J361247
45724g713856K122830R62493j22643r95264j726334j036057J271483K792719J842866
45715b601763K40083M23744J601247J251691q59493k552979k287522m06347J939256
45706c252083L474918L091052Q70891j659965l157948l535354k929202j055354
45698h153045J586504L393895L536741K789329J826236M05362j122551j631924
45690B630547j381800j945937l026848k261095L42711J139943j564293l899585
45682i966357j744985K885560M559980J768832k189225m315256m158433j979683
$$ y = [2255730, 5001121, 6710643, 7167813, 4950317, 179484, -4275771, -5822996, -4671282, -2231834, 832947, 3369666, 2871236, -1579427, -6904188, -9075103, -7713856, -5591026, -4628533, -4751176, -5746440, -7472774, -8508831, -7237348, -4444629, -2601763, -2361680, -1937936, -336689, 915002, 55509, -2497470, -4784992, -5191339, -3252083, 222835, 3313887, 4184778, 2524813, -633135, -4168489, -7097691, -8153045, -6566541, -3172646, 364095, 3153424, 4979660, 5385022, 4262471, 2630547, 1248747, -697190, -3724038, -5985133, -5642422, -4502479, -6066772, -9966357, -11711342, -8825782, -4265802, -2496970, -4686195, -9001451, -13159884, -15139567]
45674a5139567J447455L624490K533424n6923p29786M31909L11853j750683k784136
45665a2111964j092792J319734K375530K673985L133464K869395J343670J82271
45657F93293O59031J176175m45246l254326l989527j397720J963284K661941K57231
45648a675864k411487k677913j058709j4402j72665M35534K897271N260765N261454
45639E843984L356005J194346j096437l666473m677345k474954R41844J967428
45631A388398M53314n59560R8112M90747l55946p82634K25548J314896J389601
45622C662476J041289L98988j372548l292973k572403R48488L487324K442193
45614D742834j35781j436533k200918m103496n441239l309201J268687M123658
$$ y = [-15139567, -13692112, -10067622, -7534198, -7591121, -8320907, -7888998, -7577145, -9327828, -12111964, -13204756, -11885022, -9509492, -6835507, -3702043, -832648, 511022, 693293, 1352324, 2528499, 2083253, -1171073, -5160600, -6558320, -4595036, -1933095, -1675864, -4087351, -6765264, -7823973, -7838375, -8011040, -7575506, -4678235, 582530, 5843984, 9199989, 10394335, 9297898, 5631425, 954080, -1520874, -579030, 1388398, 1841712, 1282152, 1380264, 1871011, 1515065, 732431, 957979, 2272875, 3662476, 4703765, 5102753, 3730205, 437232, -2135171, -1186683, 2300641, 4742834, 4607053, 3170520, 969602, -3133894, -8575133, -11884334, -10615647, -6491989]
45606f491989L461500J478664N81635Q64513J579152K420082K580361P57698k708017
45597D523599n199468m547043j572785R79977J460523M54138o77537j417208j968303
45588g964107k143739j232843Q06228K674341K896737J426358m15785j322361
45580e275171q65253N00592J600426J268374k00907q92134M27183K457318K981176
45571B001604J648156j90307j641056k631175k863614k256685j679463j284834
45563h897374P84891N354965Q956790P229771J291720l206957l686369l099402
45555D728035l876242m002901j359291K068424L355471K965096K876274K931373
45547I686239K016617O67361l42883j895243m230176m997640k677440J57142L40182
$$ y = [-6491989, -3030489, -1551825, -970190, -105677, 1473475, 3893557, 6473918, 7231616, 4523599, -675869, -5222912, -6795697, -5815720, -4355197, -3901059, -4578596, -5995804, -7964107, -10107846, -11340689, -10534461, -7860120, -4963383, -3537025, -3952810, -5275171, -6140424, -5639832, -4039406, -2771032, -2971939, -3864073, -3436890, -979572, 2001604, 3649760, 3459453, 1818397, -812778, -3676392, -5933077, -7612540, -8897374, -8112483, -2757518, 6199272, 13429043, 14720763, 11513806, 7827437, 4728035, 851793, -3151108, -4510399, -2441975, 913496, 3878592, 6754866, 9686239, 11702856, 12370217, 12027334, 10132091, 5901915, 904275, -1773165, -1616023, -1275841]
45538a275841j008419o68504J292829K206230J626423J415444J744714J051125
45530F384001l45766n36002J07132p04700k616534k436888N84001L002439K097372
45521E535055p01670k821978l936354m492972l614424q37419J977284K786635
45513f105843K136268J838336J993422J335397j15682p34846K83748J588970J262162
45504C481932q65310k905434k891659r42659Q05222N93704r86899j804658o57077
45495f172838J485289K503171J227033j146268j903739J07843K615441K646892
45487A362824Q44751O41244K812823L999299K012523p05273j284897q91860j734029
45478G057405k517762j074606P35408l60773k923309k574100N93371J855862m06487
$$ y = [-1275841, -2284260, -2952764, -1659935, 546295, 2172718, 3588162, 5332876, 6384001, 6038235, 5502233, 5609365, 4904665, 2288131, -148757, 435244, 3437683, 5535055, 4833385, 2011407, -1924947, -6417919, -10032343, -10869762, -8892478, -6105843, -3969575, -2131239, -137817, 1197580, 1081898, 347052, 630800, 2219770, 3481932, 2616622, -288812, -3180471, -4123130, -3317908, -2724204, -3711103, -5515761, -6172838, -4687549, -2184378, -957345, -2103613, -4007352, -3899509, -1284068, 1362824, 2207575, 2848819, 5661642, 9660941, 11673464, 10968191, 9683294, 8791434, 7057405, 4539643, 3465037, 4200445, 3839672, 916363, -1657737, -1064366, 791496, 385009]
45469C85009k212556o66710J819065K198974J375198J412445J724124R00349m23388
45460F512510j074792j320754j242439K24236K466586K307844j340928m566174
45452A966089l345036P20767K835546J536547o16819j759050k521657l261549
45444d445162k694230j36057K886518M182209L152067J201699L69985J345970
45436E862999K569632J871393q73351l634866m714544l999348j949390O33646
45428d233829J818586J55888k399666k056331J402089L874629K915251J006655
45420B483272R13113J391864M11742p37535k72749n7754k571895n672238m998053
45411i110233o56918K832217K922530J385375L48922j33465j27977J030257K736194
$$ y = [385009, -1827547, -2494257, -675192, 1523782, 2898980, 4311425, 6035549, 6935898, 6512510, 5437718, 4116964, 2874525, 3098761, 5565347, 7873191, 6532263, 1966089, -1378947, -658180, 2177366, 3713913, 3097094, 1338044, -1183613, -4445162, -7139392, -7275449, -4388931, -206722, 2945345, 4147044, 4517029, 5862999, 8432631, 10304024, 9430673, 5795807, 1081263, -2918085, -4867475, -4233829, -2415243, -2259355, -4659021, -6715352, -5313263, -1438634, 1476617, 2483272, 3396385, 4788249, 5199991, 4462456, 4189707, 4131953, 1560058, -4112180, -9110233, -9767151, -6934934, -4012404, -2627029, -2278107, -2411572, -2539549, -1509292, 1226902]
45402A226902L084555J669721J15837o23919j190678j710441j142147O95930K436256
45393D562016K904475J909351n02013l585024n052261l070827R78142L926028
45385B069887M606104L860271J703947k059751m847717l190496J658707M131497
45377G932449J803681j436817j626835k45775n69758j866181j202505R47413J149758
45368D885430j437951l653941l013046r69358l26046j245648j368122P52556L572254
45359b803872M223666J828828j423695k682708j362504P91066J881555J236283
45351A688619p42558k787608l154454j202314J464842K604747J859520N28004
45343B58798n83906j496656j836043j252640o65235r74362r72479R54505L380365
$$ y = [1226902, 4311457, 5981178, 6097015, 5473096, 4282418, 2571977, 1429830, 2125760, 4562016, 7466491, 9375842, 8873829, 5288805, 236544, -2834283, -1856141, 2069887, 6675991, 10536262, 12240209, 10180458, 5332741, 2142245, 3800952, 7932449, 9736130, 8299313, 6672478, 6426703, 5856945, 3990764, 2788259, 3735672, 4885430, 3447479, -206462, -3219508, -4188866, -4514912, -5760560, -7128682, -6376126, -2803872, 1419794, 3248622, 1824927, -857781, -2220285, -1429219, 452336, 1688619, 946061, -1841547, -4996001, -6198315, -4733473, -2128726, -269206, 258798, -325108, -1821764, -3657807, -4910447, -5575682, -6550044, -7522523, -6568018, -3187653]
45334c187653L187038N56108q02879O93863K085434P45979j503853j487524O53006
45325I39519K444631K869941K638397K002986O26753j156927k609976l346256
45317D409068k883564q97031J160343P75820j904254l363614j524715J121576
45309c106371J460421M00982O40443J863467J699990J21387p57276n22738n92669
45300A207636q58924L09403K554866L260440J362616j298990k991719l899198
45292c53870m370374l896716k643362j757346j348081k45422J523458K234378
45284a0857335J385494R33533K304241M010614L729816J347772j396131l031772
45276a573768k844584n22751L054071N453731M761478J850520n74649j136817
$$ y = [-3187653, -615, 555493, -247386, 446477, 2531911, 3277890, 1774037, 286513, 939519, 3384150, 6254091, 8892488, 10895474, 11522227, 10365300, 7755324, 4409068, 1525504, 628473, 1788816, 2564636, 660382, -2703232, -4227947, -3106371, -1645950, -1244968, -604525, 1258942, 2958932, 3080319, 2323043, 1800305, 1207636, 348712, 658115, 3212981, 6473421, 7836037, 6537047, 3545328, -353870, -4724244, -8620960, -11264322, -13021668, -14369749, -14615171, -13091713, -10857335, -9471841, -8538308, -6234067, -2223453, 1506363, 2854135, 1458004, -1573768, -4418352, -4941103, -1887032, 3566699, 8328177, 10178697, 9604048, 8467231]
45268H467231j008941j843381l325948l481078j344635J375392K070301M76747
45260A385688j026173p27495K76956L41535J51765J315151K975787K463125n49699
45251F606640l006222k471241k20516R16612L35584k32738M06395J410729J241816
45242D987059m00942k248857k749205j486586O20604K196575K126468l4126l142995
45233a32005m224558j214032L475858M621412R23888k567111j266324K361669
45225A978797K856722L23587l15859J925754K115293k234983o300646m814703
45217d466038J89994K581483N88286j962609j584775J213853L759006L986910
45209D306110J609353j523628k607662r04484J236536J649494J147122J312616
$$ y = [8467231, 7458290, 5614909, 2288961, -1192117, -2536752, -1161360, 908941, 1385688, 359515, -367980, -91024, 250511, 402276, 1717427, 4693214, 7156339, 6606640, 3600418, 1129177, 908661, 1825273, 2160857, 1928119, 2334514, 3745243, 4987059, 4586117, 2337260, -411945, -1898531, -1277927, 918648, 3045116, 3010990, -132005, -4356563, -5570595, -2094737, 2526675, 3450563, 883452, -382872, 1978797, 4835519, 5159106, 4843247, 6769001, 8884294, 6649311, 348665, -4466038, -4276044, -1694561, -1106275, -3068884, -4653659, -3439806, 319200, 4306110, 5915463, 4391835, 1784173, 879689, 2116225, 3765719, 4912841, 6225457]
45201F225457J327247l96985k786952l330731k005022j000207q80054m2558J864806
45192a024999K939805K159597J073163J347392K436860K631054J139917j401082
45184A1301707l464720l658882k348797j765590k970297l600867j036451K904327
45176d639570L706817P29701j585976j59988K591068K981194J246520j54751q45504
45167C869511j860101k393736p84734J906792K560688L58333k103679k349905
45159g96831n35188J771724L244607L013301J290332J00174J263628L277445K661922
45150A5291114p71866k793187o32841K605283K180506j462695l584362k133484
45142H698468p5030k17975j312402j038510N3088K53507L71750K440681N478388
$$ y = [6225457, 7552704, 7155719, 4368767, 1038036, -966986, -1967193, -2847247, -2889805, -1024999, 1914806, 4074403, 5147566, 6494958, 8931818, 11562872, 12702789, 11301707, 7836987, 4178105, 1829308, 63718, -2906579, -6507446, -7543897, -4639570, -932753, -203052, -1789028, -1949016, 642052, 3623246, 4869766, 4715015, 3869511, 2009410, -384326, -1169060, 737732, 3298420, 3656753, 1553074, -796831, -1332019, 439705, 3684312, 6697613, 7987945, 8088119, 9351747, 12629192, 15291114, 14519248, 11726061, 11093220, 13698503, 15879009, 14416314, 10831952, 8698468, 8623438, 8405463, 7093061, 6054551, 6107639, 6361146, 6732896, 9173577, 14651965]
45133A4651965N834550K274587j947174l243308j911413p34609q49243q31118
45125A3244237O75932L009276M315512L522445J339694m27254o55031M4348M46621
45116B5515780N41322J178782K105972K026513R36686M66201J064805R81502m87544
45107C4330019r34446J638979N024471N573756L697626L193483N362273P338725
45099F5224886O844311N240813M583744M596049M306673M171443M532515M119809
45091A03620243K360659J358137K977786N318529M957440K019652N4017P61361
45083A23427824J612647l20125m228327o742906o186857m237052l526298m563470
45075I5235436n498219m725535l036229k542908l851324n459696o045785n958122
$$ y = [14651965, 20486515, 22761102, 20813928, 17570620, 15659207, 14924598, 14075355, 13244237, 13920169, 16929445, 21244957, 24767402, 26107096, 25679842, 25024811, 25069159, 25515780, 26057102, 27235884, 29341856, 31368369, 32305055, 32771256, 33836061, 34817563, 34330019, 33395573, 35034552, 40059023, 45632779, 49330405, 52523888, 57886161, 65224886, 72069197, 77310010, 81893754, 86489803, 90796476, 94967919, 99500434, 103620243, 105980902, 107339039, 110316825, 115635354, 120592794, 122612446, 122666463, 123427824, 125040471, 124720346, 120492019, 113749113, 107562256, 103325204, 99798906, 95235436, 89737217, 85011682, 81975453, 79432545, 75581221, 70121525, 64075740, 58117618]
45067E8117618n937709n824626n372706m889664m050371j749234J435992K505017
45059C4234317n4675l229589l174590q07046l50210k740504m262452k359642Q11845
45050A8067454K120988J654084J171603R60243O03421Q55728K115671K479721
45042C0028913O8735l525983m762644k838737n30366l17552j739447k859137k521688
45033A1002094p04149J815094L545919L251136J338372o00978j753936k470932
45025A5422620k708240j752397r1158J12549k262909n136563n267060k044279
45017c727437K001064M208228M011665K238800j50718j873174j372957J244430
45009F579901L023911J050394l238439m907594j858034J941991J804078j023038
$$ y = [58117618, 52179909, 46355283, 40982577, 36092913, 32042542, 30293308, 31729300, 34234317, 34179642, 30950053, 27775463, 26968417, 26618207, 23877703, 19615251, 17255609, 18067454, 20188442, 21842526, 23014129, 23974372, 24577793, 25433521, 27549192, 30028913, 30097648, 26571665, 21809021, 18970284, 18439918, 18122366, 16382919, 13523782, 11002094, 10297945, 12113039, 15658958, 18910094, 20248466, 19647488, 17893552, 15422620, 12714380, 10961983, 10870825, 10983374, 8720465, 3583902, -1683158, -3727437, -1726373, 2481855, 6493520, 8732320, 8581602, 6708428, 5335471, 6579901, 9603812, 10654206, 7415767, 2508173, 650139, 2592130, 4396208, 3373170]
45001C373170j589370P90105J532027j278075k939437O36150N698544N501251
44993A1724365J94562l510168k043335R84049J300658m09653j473942j621047
44985E145489j512045j64230K807324M786253L514997J154526J364979L430268
44977B0527561L158271n14092l595421k686696M30689J467137r89476m293653
44969A3504320m932594j920259K269495L718798Q97192l261145m190391r11908
44961E173508K781826K865604l95725l290978l119645p16022J226674J434972
44953E960214J145436J940882L177826K705872J89804k015488k294979k217880
44945H591687l589520m695636k505232K111829M843463L863580J881524J345749
$$ y = [3373170, 1783800, 2573905, 4105932, 2827857, -111580, 524570, 6223114, 11724365, 11918927, 8408759, 6365424, 7349473, 8650131, 8240478, 6766536, 5145489, 3633444, 3469214, 6276538, 11062791, 14577788, 15732314, 17097293, 20527561, 23685832, 23171740, 19576319, 16889623, 17320312, 18787449, 17797973, 13504320, 8571726, 6651467, 8920962, 12639760, 13536952, 10275807, 6085416, 5173508, 7955334, 10820938, 10425213, 7134235, 4014590, 3298568, 4525242, 5960214, 7105650, 9046532, 12224358, 14930230, 15120034, 13104546, 10809567, 8591687, 5002167, 306531, -2198701, -86872, 4756591, 8620171, 10501695, 11847444]
44937A1847444J041759p12970k548527k331037p92648j48180o10335q27769n22217
44928D395520j74327Q03839K932514M510573L314756O5616k296078k514932j786463
44919I251018r16492N60415K214903K327803M53446j622904k182095j211865N10842
44910I385071K165015K518531Q73459j231012j352563L14507R27692p34678k214138
44901A0651884p21243L270449O831784P375412L969063k099100p083206p216996
44893A4978047k754616K052516L879649L211790J652167o10649k975479l202353
44885A6231072p03242J428777O21280j158245p99748O61544O3621k122000k489604
44876A1733455n86308L18582j369815l402738l617810k444328o91130J619486
$$ y = [11847444, 12889203, 12176233, 9627706, 7296669, 6504021, 6355841, 5745506, 4917737, 4395520, 4221193, 5025032, 7957546, 12468119, 15782875, 15848491, 13552413, 11037481, 9251018, 8334526, 8894941, 11109844, 13437647, 13891093, 12268189, 10086094, 8874229, 9385071, 11550086, 14068617, 14942076, 13711064, 12358501, 12673008, 13600700, 12866022, 10651884, 9930641, 13201090, 20032874, 27408286, 31377349, 29278249, 22195043, 14978047, 12223431, 14275947, 18155596, 21367386, 23019553, 22408904, 19433425, 16231072, 15527830, 16956607, 17577887, 16419642, 15619894, 16281438, 16345059, 14223059, 11733455, 11147147, 11465729, 10095914, 6693176, 3075366, 631038, -60092, 1559394]
44868A559394L184462J795364j678980l025544k83065L388868M365996L070472
44860A2376967J608049N3575j860305k090429Q28406L987084L267113m58249k199395
44851A5512816O9764K894536K678172K65429j353354j389934j211707j441821
44843A6023901j340527p28755o83206j730968k412445p88269K663368M835705
44835A5838804L543904M29230j175229p44179p12089j990053k186418K49177K734412
44826A5987559J963947j159715k993737k529241k054366k661046k425468L7511
44818D165444K896330L529971J954755L45144J16748P02371P89894J4938n46324
44809A3969271L65058K201811K592137K25282l006754m148156k811644r58919
$$ y = [1559394, 4743856, 6539220, 4860240, 1834696, 1551631, 4940499, 9306495, 12376967, 13985016, 14038591, 12178286, 10087857, 10916263, 14903347, 18170460, 17712211, 15512816, 15582580, 18477116, 21155288, 21420717, 20067363, 18677429, 17465722, 16023901, 14683374, 13954619, 13271413, 11540445, 9128000, 8339731, 11003099, 15838804, 19382708, 19811938, 18636709, 17892530, 17180441, 15190388, 13003970, 13253147, 15987559, 17951506, 16791791, 13798054, 11268813, 9214447, 6553401, 4127933, 4165444, 7061774, 10591745, 12546500, 12891644, 13008392, 13710763, 14500657, 14515595, 13969271, 14334329, 16536140, 19128277, 19353559, 16346805, 12198649, 9387005, 8428086]
44801H428086L04237J382095J854521L70014k348916l089921l32677L172156L836986
44792A3576581J762237o8332j3633Q62298J165519R19138O69652K76834o85202
44783A8465092j922377k491202j968332j215091j431638k384239k455656j007980
44775C588577M23565M47553J48654J239793K814613K473980L53280q42094j29426
44766A0518495L63175p98228j979853j349897K94563J173858R17780j46423j942308
44757G051162l374885k440969O06747K516023J401610n23818o82053R1908J19461
44748D765186L75799J987630K820557P22791j853451j087166J839808K593806
44740A2164960R71249Q87666L216867M355052K790709J438207J666829N63045
$$ y = [8428086, 8732323, 10114418, 11968939, 12338953, 9990037, 6900116, 6567439, 9739595, 13576581, 15338818, 15270486, 15256853, 16119151, 17284670, 18203808, 18873460, 19150294, 18465092, 16542715, 14051513, 12083181, 10868090, 9436452, 7052213, 4596557, 3588577, 4012142, 4459695, 4608349, 5848142, 8662755, 11136735, 11490015, 10647921, 10518495, 10881670, 10083442, 8103589, 6753692, 7048255, 8222113, 9139893, 8993470, 7051162, 3676277, 1235308, 1842055, 4358078, 5759688, 5235870, 4553817, 4645725, 4765186, 5140985, 7128615, 9949172, 10671963, 8818512, 7731346, 9571154, 12164960, 13136209, 14023875, 17240742, 21595794, 24386503, 25824710, 27491539, 28054584]
44732B8054584l071470n179022k786780M40625l09953l198509k700671J479547
44724A2728351L901581J559745k210962k988819p96345J189426J013758o13365
44716A3783370j880767j633330k56849N62412m44069k304632k408679M39199L889616
44707I746271L930920l80480m668240l525843K418782O114830K747628l586457
44699A2797411n406507k258355m22569k485325l474375M57328N350300N492714
44691A0050622J692596j250148j926456k081714j675316K74004J596155o25080
44683F054663m317496m476596p13324K446477K806596K624463K957152J627579
44675I009514j525500k797792n97941J422261K35109j705119r03343J414672J794002
$$ y = [28054584, 24983114, 19804092, 17017312, 17457937, 17147984, 13949475, 11248804, 12728351, 16629932, 18189677, 15978715, 12989896, 12193551, 13382977, 14396735, 13783370, 11902603, 10269273, 10012424, 10574836, 10130767, 7826135, 5417456, 5856655, 9746271, 13677191, 13296711, 8628471, 5102628, 7521410, 13636240, 16383868, 12797411, 7390904, 5132549, 4709980, 2224655, -1249720, -792392, 4557908, 10050622, 11743218, 10493070, 8566614, 6484900, 4809584, 5083588, 6679743, 6054663, 1737167, -2739429, -3452753, -1006276, 1800320, 4424783, 7381935, 9009514, 7484014, 4686222, 4088281, 5510542, 5745651, 4040532, 3137189, 4551861, 6345863]
44666F345863Q9904j302935j701760j929761j465808N30209K375511J549091j227073
44657C263241k655106j465321L27119P98343L14119J1927J03662L18026O86445
44648A702455J266570J701315J350587p9362j638836j334518J383776L710375
44640H062362K400399j263631k507000K3942K015208J53447k727064k419472M4278
44631C782469Q08947k88336n22946k6371j424222m162685m350461q30994L041003
44622c973596M461455L936397K329350m85176k919218k086769J328331K780956
44614E371730M91664j700019n31707J710597J527400k51895j013913j217731k437808
44605A948318l097115p98802K745162L738455K271725J788999L069698L221505
$$ y = [6345863, 6435767, 5132832, 3431072, 1501311, 35503, 565712, 2941223, 4490314, 3263241, 608135, -857186, -530067, 268276, 582395, 594322, 697984, 1016010, 1702455, 2969025, 4670340, 6020927, 5941565, 4302729, 2968211, 4351987, 8062362, 10462761, 9199130, 6692130, 6716072, 8731280, 8884727, 6157663, 3738191, 3782469, 4591416, 4303080, 3780134, 3753763, 2329541, -1833144, -6183605, -7014599, -3973596, 487859, 4424256, 6753606, 6268430, 3349212, 1262443, 2590774, 5371730, 5863394, 4163375, 3631668, 5342265, 6869665, 6617770, 5603857, 4386126, 1948318, -1148797, -1947599, 797563, 4536018, 6807743, 8596742, 11666440, 14887945]
44597A4887945R01718j652375k627460k972285l611434l589026k356696j151103
44589b170716p19929m4102J453867K611439K521000J767985Q56652l53393r29724
44580D993079P04102L529221L996703Q99753k559871l305533k100713p05384J391838
44571F843195M398886N484618K652274r45441j058028R46308L49180k946812m284689
44562A1439491k195177n92605j581655j862252P81966K645780Q9886l630384k743062
44553B351988K284256N719753N057178L191667K222517L75385l449763o397902
44545A1355079n430604j680147J241254J536591J19503j294749j510687m48805
44537C887435M81804k63189j970202k154139j22852J838712J858736R98389R31134
$$ y = [14887945, 15789663, 14137288, 11509828, 8537543, 4926109, 1337083, -1019613, -2170716, -2890645, -2934747, -1480880, 1130559, 3651559, 5419544, 6276196, 5922803, 4993079, 5697181, 9226402, 13223105, 14122858, 11562987, 8257454, 6156741, 5451357, 6843195, 11242081, 16726699, 19378973, 18433532, 17375504, 18321812, 18670992, 15724180, 11439491, 9244314, 8651709, 7070054, 5207802, 5989768, 8635548, 8725434, 5095050, 2351988, 4636244, 10355997, 15413175, 18604842, 20827359, 21202744, 17752981, 11355079, 5924475, 4244328, 5485582, 7022173, 7141676, 5846927, 4336240, 3887435, 4369239, 4106050, 2135848, -18291, -141143, 1697569, 3556305, 4554694, 5485828]
44528E485828J106970J58331j515129k653601l223487l477745k377401N33641
44520e962593K925215K338995L24451O89007L753259N686160M098069J056164
44512A4908727o36446j130052j645355j493923M24741K711923K775048N28680
44504A6443343j434648j387266m44085o50729k298075l666356k920976m1326K946410
44495F546292L849873K624995J335799J422191J681818j14347l833504o320108
44487G193009m726583n5558L501046L083859K97231j112965j70054N57875o38839
44478G929021j837127p20296J542493K283262J653346J617153J578986q27451
44470A3219387m402964m413485L39476M543416L218342j647901m468553l514029
$$ y = [5485828, 6592798, 6751129, 5236000, 2582399, -641088, -4118833, -6496234, -5962593, -3037378, -698383, -373932, 315075, 4068334, 9754494, 13852563, 14908727, 14272281, 13142229, 11496874, 10002951, 10427692, 13139615, 15914663, 16443343, 15008695, 13621429, 13177344, 12526615, 10228540, 6562184, 3641208, 3599882, 6546292, 10396165, 13021160, 14356959, 15779150, 17460968, 17346621, 13513117, 7193009, 2466426, 2410868, 5911914, 8995773, 9293004, 8180039, 8009985, 8567860, 7929021, 6091894, 5371598, 6914091, 9197353, 10850699, 12467852, 14046838, 13219387, 8816423, 4402938, 4742414, 9285830, 12504172, 10856271, 6387718, 2873689]
44462B873689j464509l28118M00665J253488J726217J545092P22067r90829k710384
44453C027378j977261J616232M023929J529289l309287m625039j488388J386033
44445A82886J246766O87583K205442M037574L675037J746278j01038j978524l867677
44436G834327l916236j473155O39229j95688k447908k927908j323561N13769J971449
44427a325682L332368L591140J858190j38587j13441J039521O74345j105782j628462
44418F183610p7465J477724J646195J304741J160621N12344p85755j504769j034096
44409H883150k48173J80407M42084K34504j122837k780982k814743j189198P897
44400A592109K083M95980K305895L438213K269831L99013J33303Q75869M67728
$$ y = [2873689, 1409180, 1081062, 1481727, 2735215, 4461432, 6006524, 6728591, 5737762, 3027378, 1050117, 2666349, 6690278, 8219567, 4910280, 285241, -1203147, 182886, 1429652, 2117235, 4322677, 8360251, 12035288, 13781566, 13680528, 11702004, 7834327, 3918091, 2444936, 3084165, 2888477, 440569, -2487339, -3810900, -3297131, -1325682, 2006686, 5597826, 7456016, 7317429, 7203988, 8243509, 8917854, 7812072, 6183610, 6106145, 7583869, 9230064, 10534805, 11695426, 12207770, 11422015, 9917246, 8883150, 8634977, 8815384, 9257468, 9491972, 8369135, 5588153, 2773410, 1584212, 1592109, 1594192, 2090172, 4396067, 7834280, 10104111, 10503124, 10636427, 11512296, 11980024]
44391A1980024j036904j536178l99808N73026J5800r75619l85295K062275M294320
44382A4591641L710160j77001m610961n755898k681477J434878K905771J595490
44374A1012603J98888J50216J63398r13625j775039o20936J645558K215267N00125
44365A2576455n29991J515924M388749L669288r30801m568984l696587q41356
44357A1582697o37648l070796l983246j473643J799113K924588J988583J93468
44349I323116j988735l331549j703165K310954M318372J596308k323487j961138
44341F240676K324991M571021J355769l660336m629481n91978M147461N490388
44333A5248511L515354J018874m53989j906917m233192n694026l699249J133324
$$ y = [11980024, 10943120, 9406942, 9007134, 9580160, 9595960, 8620341, 8235046, 10297321, 14591641, 18301801, 18124800, 13513839, 7757941, 5076464, 6511342, 9417113, 11012603, 11211491, 11361707, 11525105, 10611480, 8836441, 8215505, 9861063, 12076330, 12576455, 12046464, 13562388, 17951137, 21620425, 20689624, 16120640, 12424053, 11582697, 10945049, 7874253, 3891007, 2417364, 4216477, 7141065, 9129648, 9323116, 7334381, 4002832, 2299667, 4610621, 8928993, 10525301, 8201814, 6240676, 8565667, 13136688, 14492457, 10832121, 6202640, 5610662, 9758123, 15248511, 18763865, 19782739, 19328750, 17421833, 13188641, 7494615, 3795366, 4928690]
44325D928690M674985L832571n4299l212682l426927j135638J828935L285803
44317A0721438J974374p37748j754022k17385J106305M2957j512429q15223J033035
44308I841302R83678p09459j055267L44010O28837j209816k460512j178429Q13327
44299E997671J131251L35708L62205J540818K872532L557808K896693M35735k484676
44290A6645745l166796j003061J162182N79816j956799l511087k425675P26216
44282G050541L969783M710835J702740k554437l657635j033184Q07255j195794
44274I800104l814786k452439J645736L379848J541670j96699K11957N64015o62923
44265A0016483j256466M98429K038315J82430l550257m668186j908243J379089
$$ y = [4928690, 9603675, 13436246, 13381947, 10169265, 6742338, 5606700, 7435635, 10721438, 12695812, 11958064, 10204042, 9986657, 11092962, 11135919, 9623490, 8808267, 9841302, 10824980, 10115521, 9060254, 9404264, 10033101, 8823285, 6362773, 5184344, 5997671, 7128922, 7464630, 7826835, 9367653, 12240185, 15797993, 18694686, 19130421, 16645745, 13478949, 12475888, 13638070, 14217886, 12261087, 8750000, 6324325, 7050541, 11020324, 15731159, 17433899, 14879462, 11221827, 10188643, 10995898, 9800104, 5985318, 3532879, 5178615, 8558463, 10100133, 9903434, 10115391, 10679406, 10016483, 8760017, 9258446, 11296761, 11479191, 7928934, 3260748, 1352505, 2731594]
44257B731594K204965J629718K250389L762045L122351r23366n245250n484262
44249D048184j161714L829802N865451N058340L411483J415069j537872m414585
44241A6514158m878558k638625k58534K93455J72632J417158L464284L730882
44233A7816852J357769j334984j703345m749J234118O54424l83362j26705P72099
44224A8282117J17546k392796m127222k635108J137315L711125K829135l25584
44216A6596528k559376j969283J86312J081217o1786q65095O00629K270108O91194
44207A5970448l086041l730741R04365N899604N577291J134605j612147n64280
44199B0493104O93056r11367l671431m171845j849441R83574K015862P96005j181650
$$ y = [2731594, 4936559, 6566277, 8816666, 12578711, 15701062, 14777696, 9532446, 4048184, 2886470, 6716272, 12581723, 17640063, 21051546, 22466615, 20928743, 16514158, 11635600, 8996975, 8738441, 9031896, 9204528, 10621686, 14085970, 17816852, 19174621, 17839637, 16136292, 16131543, 17365661, 18020085, 17636723, 17510018, 18282117, 18399663, 16006867, 11879645, 9244537, 10381852, 14092977, 16922112, 16596528, 14037152, 12067869, 12254181, 13335398, 13273612, 12408517, 13009146, 15279254, 15970448, 12884407, 9153666, 10058031, 15957635, 21534926, 22669531, 21057384, 20493104, 21186160, 20274793, 16603362, 12431517, 10582076, 11565650, 13581512, 14377517, 13195867]
44190A3195867j814231p20269J01844p79535j564984K44625L416191M162100J690754
44181A7932362q17098j361353j595555k715968k583986L85689L369458K581594
44173A5195143j089230l206528j737914J076625K460256J952884L60949j689519
44165A3322666l348046l370044j335082J707467M181741N014305L884252J432360
44157B1489619p05973j078974k7406N48789n36059k148883k038152M14588L143350
44148A9060899L512090J272561j277178k123816j497211n68460M35253J640315
44140B0454453K293325J827925J223071J377917J094410r08613k839924j827363
44132B2695201J259963K578351J245585O30110K598021M455102L621324J654251
$$ y = [13195867, 11381636, 10661367, 10763211, 9983676, 8418692, 8663317, 12079508, 16241608, 17932362, 17115264, 15753911, 14158356, 11442388, 8858402, 9244091, 12613549, 15195143, 14105913, 10899385, 9161471, 10238096, 12698352, 14651236, 15012185, 13322666, 9974620, 6604576, 5269494, 6976961, 11158702, 16173007, 20057259, 21489619, 20783646, 19704672, 19677266, 20226055, 19689996, 17541113, 15502961, 15917549, 19060899, 22572989, 23845550, 22568372, 20444556, 18947345, 18378885, 18814138, 20454453, 22747778, 24575703, 25798774, 27176691, 28271101, 27362488, 24522564, 22695201, 23955164, 26533515, 27779100, 28409210, 31007231, 35462333, 39083657, 40737908]
44124D0737908R86222J006441N09081R75096L674338N968070M639397J199078
44116E9695631k39803Q88475J689960J082153O66811P57303j07745j467281q75111
44107F2090393J784704L625314L156359J793004K47759k646410o176945o829657
44099E7044521l399687L26764O61382j005947j228898j33008n30802k739916l886403
44090D5108006k402663m04482p32922l237897m926447l293426Q48204L882079
44082C4840452L087800k26765k158952q99158J279303J318083o18599j627494
44074C4994670M9121K752476L144849o5888m210768m971243j207104L230216L763232
44065C7479561N72289k020843j429212K87469K3041k071538l319492k186271K38582
$$ y = [40737908, 41724130, 42730571, 43239652, 44214748, 47889086, 53857156, 58496553, 59695631, 59455828, 60344303, 62034263, 63116416, 63783227, 64540530, 64432785, 62965504, 62090393, 63875097, 67500411, 70656770, 72449774, 72697533, 70051123, 63874178, 57044521, 53644834, 53971598, 54632980, 53627033, 52398135, 52265127, 51734325, 48994409, 45108006, 42705343, 42300861, 41567939, 38330042, 33403595, 30110169, 30958373, 34840452, 37928252, 37701487, 35542535, 34643377, 35922680, 37240763, 36622164, 34994670, 35043791, 37796267, 40941116, 40875228, 36664460, 31693217, 30486113, 33716329, 37479561, 38051850, 36031007, 34601795, 34889264, 34912305, 32840767, 29521275, 27335004, 27573586]
44056B7573586J816114J503363K43443o5916J071751J896280R25522m96909j33207
44047C4334027J323618J122142q55884j518492M28961K120432Q81929j846525
44039C5990208l103918k599785j917316j417878m96317L99822L72862k41556o80487
44030B6305635j177396j924970k025691j263814j244731k634340l118320q71123
44022A2045250J639256P99225k238027k731270N89098L521304K429189j035854
44014A5018171k913248k085045l55599R88786K378806M050436M709980K898842
44006B4691129p04998l214402k529077o4458Q87352l86360j212321K2492J154452
43997A8643809j4108j593058l63020K814370L990513K027702j32348l18321K00171
$$ y = [27573586, 29389700, 30893063, 31136506, 31070590, 32142341, 34038621, 34964143, 34467234, 34334027, 35657645, 36779787, 35923903, 34405411, 34834372, 36954804, 37836733, 35990208, 32886290, 30286505, 28369189, 26951311, 26454994, 26854816, 27227678, 26986122, 26305635, 25128239, 23203269, 21177578, 19913764, 18669033, 16034693, 12916373, 12045250, 13684506, 14483731, 12245704, 9514434, 10103532, 13624836, 16054025, 15018171, 12104923, 10019878, 9664279, 10653065, 13031871, 17082307, 21792287, 24691129, 23986131, 20771729, 18242652, 18178194, 19065546, 18679186, 17466865, 17489357, 18643809, 18629701, 17036643, 16673623, 19487993, 23478506, 25506208, 25373860, 25055539, 25255710]
43988B5255710k84046j297183j755276j600761p52621J130678K709692J401141
43980B4807334k640971n393266l849997r3148J728390Q90030P3896Q44300J768373
43971A8134941J071514q30725k025754j320184N72359J621300L99942k215971
43963A5407422l636026k198660J185613M183013N124974L803137J198293j106179
43955B3961587k069684k128591k226645j999439l59301J987200K624810Q69685
43947B0659622r07060p78234j20520r73983k238319j265171J594268L058436J659295
43938B0688334l61828p17196j73952n25799j426320j348704o02227r76402k421120
43929A2134786k358236O52799M086940L987980n7164m020964l910696j39013L223237
$$ y = [25255710, 24971664, 23674481, 21919205, 20318444, 19565823, 20696501, 23406193, 24807334, 22166363, 16773097, 12923100, 12829952, 14558342, 15448372, 15522268, 16366568, 18134941, 19206455, 18375730, 16349976, 15029792, 15602151, 17223451, 17623393, 15407422, 11771396, 9572736, 10758349, 14941362, 20066336, 23869473, 25067766, 23961587, 21891903, 19763312, 17536667, 15537228, 15177927, 17165127, 19789937, 20659622, 19752562, 18974328, 18853808, 17879825, 15641506, 14376335, 15970603, 19029039, 20688334, 20326506, 19609310, 19435358, 18909559, 17483239, 16134535, 15532308, 14555906, 12134786, 9776550, 10429349, 14516289, 18504269, 18447105, 14426141, 10515445, 10376432, 13599669]
43920A3599669K979810j04332k555262j996303M27883J448586m23898k863405
43912A0512748k425871R57725L613885K732057r8094j094452R43560L449768L328003
43903B1919329L39596k648033k401797J216976M528033L987011Q74962j61576
43895B7654501K132062L468404O85155k727577j559881K981365M934689K444889
43887D0013607k70256k54222Q3k454620o019158p132617m955751j197515K377426
43878B0106977M352934L765939J529179j67204r13545k113437l273084j828652
43870B1459107J822915L156596m4628l843041l887813j428875R5684R42217K872639
43861B1144801M025669J483686k798837m198831k608229j932153k819426j617327
$$ y = [13599669, 16579479, 16475147, 13919885, 11923582, 12351465, 13800051, 13376153, 10512748, 8086877, 9044602, 12658487, 15390544, 15292450, 14197998, 15141558, 18591326, 21919329, 22258925, 19610892, 17209095, 18426071, 22954104, 26941115, 27816077, 27654501, 29786563, 33254967, 33940122, 31212545, 29652664, 32634029, 37568718, 40013607, 39743351, 39489129, 39489212, 37034592, 31015434, 23882817, 18927066, 17729551, 20106977, 24459911, 28225850, 29755029, 29587825, 28674280, 26560843, 23287759, 21459107, 23282022, 26438618, 26393990, 22550949, 18663136, 17234261, 17329945, 18272162, 21144801, 25170470, 26654156, 23855319, 19656488, 17048259, 15116106, 12296680, 10679353]
43853A0679353K748420O172102N189147J095009l120023n907433o019899k587474
43845H249202J896913K840034n4184j634537J020361L893194K328480j641455
43837A6898008k582418K08856K441433J499531q51121k155848k046510r90812
43829A2421119P70298K290128K116209L02388j161084n44306J811563M013010
43821B2019325M298695K413855p1641j134806l93641P39117J108079Q27089L6135
43812B9842207j512770k944571k562080r30588j200121m328444o470729m076669
43804E816235M88351K134736M51894m27144J113375K045714M87129j019386j43669
43795A0947235J221632N75691o10472M77769K819772K926890N09549j009027K59144
$$ y = [10679353, 13427773, 19599875, 24789022, 25884031, 22764008, 16856575, 10836676, 8249202, 10146115, 12986149, 12931965, 11297428, 12317789, 16210983, 18539463, 16898008, 14315590, 14524446, 16965879, 18465410, 17614289, 15458441, 13411931, 12421119, 13191417, 15481545, 17597754, 17900142, 16739058, 16194752, 18006315, 22019325, 26318020, 28731875, 28660234, 27525428, 27131787, 27870904, 28978983, 29806072, 29842207, 28329437, 25384866, 22822786, 21892198, 20692077, 16363633, 9892904, 5816235, 6304586, 8439322, 8891216, 8464072, 9577447, 11623161, 12110290, 11090904, 10947235, 12168867, 12744558, 12134086, 12611855, 15431627, 18358517, 18868066, 17859039, 18118183]
43786A8118183K282273K759348K197628J904268J282407q31316l502797m369531
43778A9840463k475098Q67368L526330L871006J534366j771551l020049j160528
43770B1212307R65102L0558k865882l382713l53394K148539Q15770j749309r07250
43761A5913728K900371M755848K540408l45624m77481Q57341M93215j566463k644134
43752B2427209j584874K07395J463168K410204L276070L356388K198061M36793
43744C4190414j125265k346934l176804l078406j662317N00424K150519K349578
43736B7801209J213102j69194p35431o80820j297587l024158m153198k548679
43728A6405244J436952M877314N323470K992125k24004k630124l076508r50538
$$ y = [18118183, 20400456, 23159804, 25357432, 27261700, 28544107, 27712791, 24209994, 19840463, 17365365, 18232733, 21759063, 25630069, 27164435, 25392884, 22372835, 21212307, 22177409, 22207967, 19342085, 15959372, 15605978, 17754517, 18570287, 16820978, 15913728, 18814099, 23569947, 26110355, 25764731, 25287250, 26144591, 26637806, 25071343, 22427209, 20842335, 21049730, 22512898, 24923102, 28199172, 31555560, 33753621, 34190414, 33065149, 30718215, 27541411, 24463005, 22800688, 23301112, 25451631, 27801209, 29014311, 28845117, 28109686, 27428866, 26131279, 23107121, 18953923, 16405244, 17842196, 22719510, 28042980, 31035105, 30811101, 28180977, 25104469, 24153931]
43720B4153931K729164N035148L668509k44151l189556l191502j519412m03606
43712B7038525m79438j020329j337279j003396K49457J764230J946549K21026
43704B7379345j688666j727954k07438Q39673N09633l16681q24372j015176p17837
43695B2230527K92853J110956N94536l77296K06847J924217J908934n62973k356064
43686B4972537j181124P35969L66079j038392j5037L307171N160022L560069N10920
43677C6378214j386008j693323j152383m39138l60660j184955j581478k77624
43669B8302645J380287R47480j157252j993153n51301J083781J411570J245922
43661C0669979J117707K19868j024423o33849J349872K222765J069365L64501
$$ y = [24153931, 26883095, 31918243, 35586752, 35342601, 32153045, 28961543, 27442131, 27038525, 26559087, 25538758, 24201479, 23198083, 23447540, 25211770, 27158319, 27379345, 25690679, 23962725, 23755287, 24594960, 25104593, 24787912, 23963540, 22948364, 22230527, 22523380, 23634336, 24228872, 23851576, 24058423, 25982640, 27891574, 27328601, 24972537, 23791413, 24527382, 24893461, 23855069, 23840032, 27147203, 32307225, 35867294, 36378214, 34992206, 33298883, 32146500, 31707362, 31346702, 30161747, 28580269, 28302645, 29682932, 30630412, 29473160, 27480007, 26928706, 28012487, 29424057, 30669979, 31787686, 32007554, 30983131, 30349282, 31699154, 33921919, 34991284, 35355785]
43653C5355785J237854R39587k208602m937901l693111k52181J166509j3241j463721
43644B6130978k449042l202532j877482K805254P191421O460282K258130Q27292
43636C8144301L174480L304236j848401o715188n078971P88502L739846J728690
43628C7237495q08793m50340J045851O91010j195284k119461j151829K60392N54429
43619C4063470k45174j178944j733658j856604j087625J055416L586551M399211
43611C7002643L021088J606701J729806J632450j049216m830215n670130k728101
43603C0715026K03446j02410k269958k855981q52236J967678L705493L736394
43595C4247452K438257Q88360K12116L38646O5573j019948j578426k22563K539812
$$ y = [35355785, 36593639, 37533226, 35324624, 30386723, 26693612, 26441431, 27607940, 27594699, 26130978, 23681936, 20479404, 18601922, 21407176, 28598597, 35058879, 37317009, 38144301, 41318781, 44623017, 42774616, 36059428, 30980457, 31768959, 35508805, 37237495, 36428702, 35978362, 37024213, 37715223, 36519939, 34400478, 33248649, 33509041, 34063470, 33818296, 32639352, 30905694, 29049090, 27961465, 29016881, 32603432, 37002643, 40023731, 41630432, 43360238, 44992688, 43943472, 39113257, 33443127, 30715026, 30918472, 30816062, 28546104, 25690123, 24837887, 26805565, 30511058, 34247452, 36685709, 37574069, 37786185, 38124831, 38190404, 37170456, 35592030, 35369467, 37909279]
43586C7909279M733476M813226K878336N41315m59700j32748j91042j203796r85328
43577D7903018K073775N108476L553447k060176n751466l835605L44273J554971
43569D8890713l84743j721472p82186M90451K63483q44131j317434p42272O8615
43560D3921024j7103j286379k464200j939420j05218Q44898L2430r09681o07934
43551C7468417Q7050J24398R0439M56142K30313p59078o57126J028216J488883
43542C9557654q03027k199145J181511O465703P049178K001119k720864k924112
43534D7608017j070471j080821k764931l711057l104052j196277J985256M966436
43526D1632100M737614J054926j759707l44798K651924K477409o42847k342390
$$ y = [37909279, 42642755, 47455981, 50334317, 50875632, 50415932, 50283184, 50092142, 48888346, 47903018, 49976793, 55085269, 58638716, 56578540, 50827074, 46991469, 47335742, 48890713, 48505970, 46784498, 46002312, 46492763, 46756246, 45912115, 44594681, 43852409, 43921024, 43903921, 42617542, 40153342, 38213922, 38108704, 38953602, 38986032, 38076351, 37468417, 37555467, 37679865, 37770304, 38226446, 38456759, 37697681, 37040555, 38068771, 39557654, 38754627, 36555482, 37736993, 44202696, 51251874, 53252993, 50532129, 47608017, 46537546, 45456725, 42691794, 38980737, 35876685, 34680408, 36665664, 41632100, 46369714, 47424640, 45664933, 45320135, 47972059, 50449468, 49806621, 47464231]
43518D7464231j032696M02854O1447p9033J752316L614823K957670R27104O40495
43509E6709211K249588K672050L27585k389371k405474q44J983053K034957J318219
43500F2498974J228126J301933L35678j481596k652668k258225r59616k16550
43492E7796056r53924k744869l916216k891481L6143K680903L246706K133315
43484E5386633R21959L47809K04547M74794J215705J782431J547406J068863J177507
43475F4127654J340245N99427k66776L46440J868999J951728L21544m52330Q68765
43466G0705696K038097J227057M59524K298319N051153M882172J844320k6430
43458H8479908J146638K576792J672523k490J32395J286690J139222L65607J636679
$$ y = [47464231, 46431535, 46834389, 46895836, 46816803, 48569119, 52183942, 55141612, 56068716, 56709211, 58958799, 61630849, 61958434, 59569063, 57163589, 57162745, 59145798, 61180755, 62498974, 63727100, 65029033, 65364711, 63883115, 61230447, 58972222, 58012606, 57796056, 56842132, 54097263, 50181047, 47289566, 47325709, 50006612, 53253318, 55386633, 56308592, 56656401, 56860948, 57335742, 58551447, 60333878, 61881284, 62950147, 64127654, 65467899, 66067326, 65800550, 66146990, 68015989, 69967717, 70289261, 69836931, 70705696, 72743793, 73970850, 74430374, 76728693, 81779846, 86662018, 88506338, 88479908, 89626546, 92203338, 93875861, 93873371, 94005766, 95292456, 96431678, 96797285, 98433964]
43449I8433964M434342M649454N56752l869817l881482k42357K120241Q16715
43441A03017812j553336j760452J5460J682426K620659L604801M461888L975640
43433A16064898K132712Q14049J582850L573594M261059K263458q79664k034113
43425A27778843J26613L440556M846438M309276M501782O348414P248155N210679
43417A63810756K500236K442694M082398L603690Q00100J46520M117270Q895494
43409A90399158R326108N885348L609957N098082P707784P924429N853542M132895
43401B39937303M051890M502891M311049L943628M281993M734934L932673K203676
43393B71900037J760366L496194M940309L211417n71456k043813Q41243M939246
$$ y = [98433964, 102868306, 107517760, 108074512, 104204695, 100323213, 100080856, 102201097, 103017812, 101464476, 99704024, 99719484, 101401910, 104022569, 107627370, 112089258, 116064898, 118197610, 119011659, 120594509, 124168103, 128429162, 130692620, 129812956, 127778843, 127905456, 131346012, 136192450, 140501726, 145003508, 151351922, 158600077, 163810756, 166310992, 168753686, 172836084, 176439774, 177239874, 177386394, 181503664, 190399158, 199725266, 205610614, 209220571, 214318653, 222026437, 229950866, 235804408, 239937303, 243989193, 248492084, 252803133, 256746761, 261028754, 265763688, 269696361, 271900037, 273660403, 277156597, 282096906, 285308323, 284736867, 282693054, 283534297, 288473543]
43385B88473543N630270K044000k615471n031542m786702l784556l729486m475590
43377B71724466m753467m316858m469733n719586o126970l927416j029078j099072
43369B40282286m096584n938700m569984k947005m041472o237674o741899o643052
43361A99065916q432969j0461322q816980m171115j669102l271368n001598l629489
43353A53611973j673582k767953n605122o382250m947720m229160m686903l791867
43345A19527416j192749j60161k364440m661759l551272m16746O91008q90430
43337A06980867j994352j066111n86162k743860n398747m731625n47812L468304
43329I3380502M259430K040769j255550l896058m507564k671436k26001n986k192979
$$ y = [288473543, 294103813, 296147813, 293532342, 288500800, 283714098, 279929542, 276200056, 271724466, 266970999, 262654141, 258184408, 252464822, 246337852, 242410436, 241381358, 240282286, 236185702, 230247002, 225677018, 222730013, 218688541, 212450867, 205708968, 199065916, 190632947, 180171625, 171354645, 167183530, 165514428, 162243060, 157241462, 153611973, 151938391, 149170438, 143565316, 137183066, 132235346, 128006186, 123319283, 119527416, 118334667, 118174506, 115810066, 111148307, 107597035, 107180289, 107871297, 106980867, 104986515, 103920404, 103334242, 100590382, 95191635, 90460010, 89912198, 93380502, 97639932, 99680701, 98425151, 94529093, 90021529, 87350093, 87124092, 87118106, 84925127]
43320H4925127l717288k514726m63037l61385j802655k398686j747898j365224
43312G0554228j366232k75256J777265K606319J474590M38202R71430J534731
43304G7715277K53068j723451j708669N14864K269052J524467p37714k108235
43296G5998659j534961K15566K175461M032781N140337L990815K12894l425116
43288H6806436l323799L520J814963l72291k804632j006345K948298L198735p33347
43279H6531538k952201l27288K811486J841243j073268j257680P22831P98563
43271H7095224j197533j469362Q32891J968013k02051k896398k997163j221538
43263G9912083L86472J935631M004746M919127K848363n94276j765203K40544
$$ y = [84925127, 81207839, 78693113, 78230076, 77868691, 76066036, 73667350, 71919452, 70554228, 69187996, 68912740, 70690005, 73296324, 74770914, 75209116, 76180546, 77715277, 77968345, 76244894, 74536225, 75051089, 77320141, 78844608, 78106894, 75998659, 74463698, 74679264, 76854725, 80887506, 86027843, 90018658, 90231552, 86806436, 83482637, 83486157, 85301120, 84928829, 82124197, 81117852, 84066150, 87264885, 86531538, 83579337, 83252049, 86063535, 87904778, 86831510, 85573830, 86296661, 87095224, 85897691, 84428329, 85261220, 87229233, 87027182, 84130784, 81133621, 79912083, 80298555, 82234186, 86238932, 91158059, 94006422, 93412146, 91646943, 91887487]
43255I1887487K505582K232975J02883r52017N64211K990455L551134J860527
43247A04743237N77700J814346L812508L116898j58016j826998O70925M541116
43239A17291716N422739K995284N19307J60664J359381L063467M806755N571654
43231A41190967M111708J037036j258688j339509M1259J683403L237762M311346
43223A53015284L940435J823046r14562k608185j948312J567600O470066R082790
43215A70428162O915106K435082P17442K780854M439157K949483J047630J797370
43207A93510286K952819N56361m052140n507032j963650K904526N408828N400420
43199A99210418M035726J928054M05268R97536K540925K163207J70775J28400
$$ y = [91887487, 94393069, 96626044, 96728927, 95776910, 96341121, 99331576, 102882710, 104743237, 105320937, 107135283, 110947791, 114064689, 113906673, 112079675, 112750600, 117291716, 122714455, 125709739, 126229046, 126389710, 127749091, 130812558, 135619313, 141190967, 145302675, 146339711, 145081023, 143741514, 143782773, 145466176, 148703938, 153015284, 156955719, 158778765, 157864203, 155256018, 153307706, 154875306, 161345372, 170428162, 177343268, 179778350, 180495792, 183276646, 187715803, 190665286, 191712916, 193510286, 196463105, 197019466, 192967326, 187460294, 185496644, 188401170, 193809998, 199210418, 203246144, 205174198, 205579466, 206577002, 209117927, 211281134, 211451909, 211580309]
43191B11580309K641365L496148O32403j452107J648237O735597P266452K934687
43183B35483091m53500K24993K099263J969233L09637j405447k964777l496740
43175B31765753j273004K604957L870671Q07810k711239k470660M08840J835903
43167B34839031N88424j352054k758035m154868n546317o089912n942123o057856
43159B03526290o158048m998088k782132j409615j944772l292095l748189k828534
43151A76364817j400569p73846j543235k817456l202794k998529m021841o258456
43143A53348091o636320l197830J240057K444157M95780j267201k163437m673949
43135A39589348q691423r950542o194808j077632Q21477j26209o65690k1028K65609
$$ y = [211580309, 214221674, 217717822, 218350225, 216898118, 218546355, 225281952, 232548404, 235483091, 235029591, 235254584, 237353847, 239323080, 239632717, 238227270, 235262493, 231765753, 230492749, 233097706, 236968377, 237776187, 235064948, 232594288, 233003128, 234839031, 235427455, 234075401, 231317366, 227162498, 221616181, 215526269, 209584146, 203526290, 197368242, 192370154, 189588022, 188178407, 186233635, 182941540, 179193351, 176364817, 174964248, 174190402, 172647167, 169829711, 166626917, 163628388, 159606547, 153348091, 146711771, 143513941, 144753998, 147198155, 147693935, 146426734, 144263297, 139589348, 130897925, 120947383, 114752575, 113674943, 114496420, 114370211, 113704521, 113683493, 113949102]
43126A13949102O3569O40399J882208K623665K872965K842840J063472l058019
43118A22880201o095930m493613r78943j780713o851532q715599l369777L266631
43110I3860725L762377n85524l047550j581213L27396R84476K196808L853591
43102I9771086K900271j030464m075186l966709k915532k784764j922591N75143
43094H6551254J788937k55865k375453r98675J698503J169362j920160k646110
43086H3011793K73453K553538R51507k422277l766487k365626k55011N25104p62935
43077G7743059l051168l687179j173998K058996K012318j474087m397754m177608
43069F3852579k499866j631949j156044p3628P79992N95731M66959J241326J624541
$$ y = [113949102, 114012671, 114653070, 116535278, 119158943, 122031908, 124874748, 125938220, 122880201, 116784271, 112290658, 111311715, 109531002, 102679470, 93963871, 90594094, 93860725, 97623102, 97037578, 93990028, 92408815, 92736211, 93720687, 95917495, 99771086, 102671357, 101640893, 97565707, 93598998, 90683466, 87898702, 85976111, 86551254, 88340191, 88084326, 85708873, 84710198, 86408701, 87578063, 85657903, 83011793, 83285246, 85838784, 86790291, 84368014, 80601527, 78235901, 77980890, 78505994, 77743059, 74691891, 71004712, 69830714, 71889710, 73902028, 72427941, 68030187, 63852579, 61352713, 59720764, 58564720, 58491092, 59271084, 59866815, 60333774, 61575100, 63199641]
43060F3199641M94263j012651j750363k509715l407272k103194K127632N039194
43052F0077535K306131l763128o789457m785226j606904k55148M48383J713140
43044D7345326K002646L91433j028620m89093N93169M25805k1998Q16392J952293
43035E1987353J564024K82754L4296P00893O12528k95288m58738K91295J38296
43026E4857413j746635l523116k938091k53825J929269J496062q90162k413719
43018D6517196j274003R76813J220371r97413k591154j221836J141078P80623
43010D4551675k554634n155744l988024J5119L541277M231124K060407j126315
43002D1574885k766465j393547J839105M023649L382549Q15900j572730k700577
$$ y = [63199641, 63693904, 62681253, 60930890, 58421175, 55013903, 52910709, 55038341, 60077535, 62383666, 58620538, 51831081, 47045855, 45438951, 45183803, 45632186, 47345326, 49347972, 49739405, 48710785, 48221692, 48814861, 49240666, 49218668, 50035060, 51987353, 53551377, 53834131, 53868427, 54569320, 55181848, 54886560, 54427822, 54719117, 54857413, 53110778, 49587662, 46649571, 46395746, 48325015, 49821077, 48930915, 46517196, 45243193, 46220006, 47440377, 46442964, 43851810, 42629974, 43771052, 44551675, 41997041, 36841297, 32853273, 32868392, 36409669, 40640793, 42701200, 41574885, 38808420, 37414873, 39253978, 43277627, 46660176, 47476076, 45903346, 43202769]
42994D3202769k935469l068375l321180k953284q61235K681474N110786L909059
42986D1764545K09473j748183J10517K685367J847249j749676l674882k067402
42978C7377008J60920K00703o29514K58855K157809K307088O08484j42119J136866
42969D3436100J979724L11346k151641k284252J37838K487106K849340J661330
42961D8426891J39681j084435j616969j215606n83891r56025k193513k429155
42953C8486978n98007J565601J462989p33068j971804l52842K178012K489462
42945D2527321P02111j44710J030124J342503j552095m985329m277854M59439
42937C5101510L890491K495667j025044j982915K97707L017698M378932M611019
$$ y = [43202769, 40267300, 37198925, 33877745, 30924461, 30063226, 32744700, 37855486, 41764545, 41974018, 40225835, 40336352, 43021719, 44868968, 43119292, 39444410, 37377008, 37537928, 37738631, 37109117, 37367972, 39525781, 41832869, 42441353, 42299234, 43436100, 45415824, 45727170, 43575529, 41291277, 41429115, 43916221, 46765561, 48426891, 48566572, 47482137, 45865168, 44649562, 44065671, 43109646, 40916133, 38486978, 37888971, 39454572, 40917561, 40184493, 38212689, 37859847, 40037859, 42527321, 43229432, 43084722, 44114846, 45457349, 43905254, 38919925, 34642071, 35101510, 38992001, 41487668, 40462624, 38479709, 38777416, 41795114, 46174046, 50785065]
42929E0785065L739398J458929j028403j813833j128205j067536k226970k866847
42921D5851598j899744n65773l86156j200095j864073j341307J157344N167070
42913D4918864P791896N944329O37531l308595l047842q87972k27710p94779k23680
42904E0802042J591920K584389J951715Q76249K38513j38357j77785N21386J478676
42895E9728748J708274J232803Q17667M90686k06604q59739o71606j7029J20275
42886F2343475k0197N59386J558349J701944J046911Q77978J128143J80545k111615
42877F7264919l494022k624299j311070j699441k722843j550748K050553M959384
42869F0872433M565470J806892l62850n05715L13149O67914O85203J238056K006367
$$ y = [50785065, 54524463, 55983392, 54954989, 53141156, 52012951, 50945415, 48718445, 45851598, 43951854, 43386081, 42999925, 41799830, 39935757, 38594450, 39751794, 44918864, 52710760, 58655089, 59292620, 55984025, 52936183, 52048211, 51820501, 51025722, 50802042, 52393962, 54978351, 56930066, 57806315, 58044828, 57906471, 57728686, 58250072, 59728748, 61437022, 62669825, 63487492, 63978178, 63771574, 62911835, 62240229, 62223200, 62343475, 62323278, 62882664, 64441013, 66142957, 67189868, 68067846, 69195989, 69376534, 67264919, 63770897, 61146598, 59835528, 58136087, 55413244, 53862496, 55913049, 60872433, 65437903, 67244795, 66881945, 66376230, 66689379, 67357293, 68042496, 69280552, 71286919]
42860G1286919J641884L968j104395k89209J368477J818350Q59200m0275k34556
42851G5310363m08540o67855j09991J198216J686309O91637j74041O73484K388882
42842H0588464L032280K328861J517820J125065O06120o1186j47576L30821M52262
42833H9772931J26435N26944K080761L350203K995499J823240J512260J955973
42825A04144246J499240k80518j686646j292892J33027R15431O47694J21101j20022
42816A04080661q0703K67291Q38931J170826J221298J728510K620532K072160
42808A13919506r18737l725113k580008J887359M480613K037682k290698l271129
42800A09539475j43695L429412M684750M294755L835192L246133J721696k19127
$$ y = [71286919, 72928803, 72932771, 71828376, 71539167, 72907644, 74725994, 75585194, 75544919, 75310363, 74901823, 74233968, 74123977, 75322193, 77008502, 77700139, 77526098, 78199582, 80588464, 83620744, 85949605, 87467425, 88592490, 89198610, 89137424, 88989848, 89320669, 89772931, 89899366, 90426310, 92507071, 95857274, 98852773, 100676013, 102188273, 104144246, 105643486, 105362968, 103676322, 102383430, 102516457, 103431888, 104079582, 104200683, 104080661, 103999958, 104267249, 105106180, 106277006, 107498304, 109226814, 111847346, 113919506, 113000769, 109275656, 106695648, 108583007, 113063620, 115101302, 112810604, 109539475, 109395780, 112825192, 117509942, 121804697, 125639889, 128886022, 130607718, 130388591]
42792A30388591p29239J243355M204127N228027L482913J739807K736295M888603
42784A53182479M469638J799444J228898L919426N388561L004780J102037L946816
42776A78042079P708382N875906J04947j860632J677581M308477K620308J235446
42768A99712494L587905N252765J827273k495725j046096M364193N824076J174230
42760B18201115l210814j808126L323906O545753N408291J838850p97031n56371
42752B28945573J542524K444320P27804j358561j241098q0849q37956l432454
42744B26709303n184377n405284n754129o122349m368709r69559K54130k185240
42736A96973786m752858m233396k487346k923511m918650n307605l693588k522590
$$ y = [130388591, 129659352, 130902707, 135106834, 140334861, 143817774, 145557581, 148293876, 153182479, 157652117, 159451561, 160680459, 164599885, 169988446, 172993226, 174095263, 178042079, 185750461, 191626367, 191731314, 189870682, 191548263, 195856740, 198477048, 199712494, 203300399, 208553164, 210380437, 207884712, 206838616, 211202809, 217026885, 218201115, 214990301, 213182175, 216506081, 223051834, 228460125, 230298975, 229501944, 228945573, 230488097, 232932417, 233660221, 232301660, 231060562, 230979713, 230141757, 226709303, 221524926, 216119642, 210365513, 204243164, 199874455, 198904896, 199159026, 196973786, 192220928, 187987532, 185500186, 182576675, 177658025, 172350420, 168656832, 166134242]
42728A66134242k640642k405448j302859j126542k683391m058480l563106k371264
42720A45982510k565033l927143m396970l004132q77230L28005j22643j803237
42712A29614127l245565k693311l8444K248129J672752p72763j514117O58450
42704A25929258K619131J248826k086049l494476j744862R78862K746821L489820
42696A29687331L071126Q28918k194345l362605k108078j100524k263487l925848
42688A18632488l793329k546243k103368k195919j556910j180144l083214o253884
42680I5919477p055624m100044r5121J838923J434999L0925j800925l958150n546684
42671G6667776n494718l981463k258771j182282m66265N99791J934896K411648
$$ y = [166134242, 163493600, 161088152, 159785293, 158658751, 155975360, 151916880, 148353774, 145982510, 143417477, 139490334, 135093364, 132089232, 131212002, 131540007, 131417364, 129614127, 126368562, 123675251, 123636807, 125884936, 127557688, 126784925, 125270808, 125929258, 128548389, 129797215, 127711166, 124216690, 122471828, 123450690, 126197511, 129687331, 132758457, 133587375, 131393030, 128030425, 125922347, 124821823, 122558336, 118632488, 114839159, 112292916, 110189548, 107993629, 106436719, 105256575, 102173361, 95919477, 88863853, 84763809, 84668688, 86507611, 87942610, 87973535, 86172610, 82214460, 76667776, 71173058, 67191595, 64932824, 63750542, 63284277, 63884068, 65818964, 68230612]
42663F8230612J142777j123434k609866k518677j492659j76553J103286J116783
42655F3672269j414511m770983m783107m83082L261048J656586l351236n688571
42647D8098413l145729Q49642K746881K412371J205087R4616J74116J924221L433667
42638E7793285K222098p78703j989401k77600J779937K120884J402453M53436
42630F2726389r43110j903045p73498J285103R14106j848184k764759j62287J926668
42621E8457383K59347k254138j533730J005864J401097j4597K12789K267135K865004
42612F2666154Q72032j327061k045597k044847j953563j439764j160894k182580
42604E1383880l078767r59280L741068O528876M311078o31108l526825k431171
$$ y = [68230612, 69373389, 68249955, 65640089, 63121412, 61628753, 61452200, 62555486, 63672269, 62257758, 57486775, 52703668, 52220586, 55481634, 57138220, 53786984, 48098413, 44952684, 45802326, 48549207, 50961578, 52166665, 52261281, 52435397, 54359618, 57793285, 60015383, 59236680, 57247279, 56969679, 58749616, 60870500, 62272953, 62726389, 61783279, 59880234, 59106736, 60391839, 61305945, 59457761, 56693002, 56530715, 58457383, 58716730, 56462592, 54928862, 55934726, 57335823, 57321226, 57534015, 59801150, 62666154, 63538186, 62211125, 60165528, 58120681, 56167118, 54727354, 53566460, 51383880, 48305113, 47345833, 51086901, 57615777, 61926855, 61295747, 57768922, 55337751]
42596E5337751M90097J906612O21502j607329k226010r29645J55826k86360q32108
42587E2630336J71718J781387K078326J309918J096726J414341Q05915q77820
42579F0410847k163699k041480n42737K026378M471218M335527N78874m047827
42571F3027101n632677l458159K94337L815030N999151N196212J341844j707687
42563F8875152j15021M039094M937567J073668l084752l659079j146645K803374
42555G3723358P394142J0105439P301634J31188m471501j964729L889376O379356
42547A02488263M168467J053225n1462O08536J710836K116569J062938o52820
42539A12504552q19662J138209K819788K181188L31638p02616q86061r36088l97235
$$ y = [55337751, 55827848, 57734460, 58355962, 56748633, 54522623, 53592978, 53748804, 53462444, 52630336, 52802054, 54583441, 56661767, 57971685, 59068411, 60482752, 61288667, 60410847, 58247148, 56205668, 55662931, 57689309, 62160527, 66496054, 67074928, 63027101, 57394424, 53936265, 54230602, 58045632, 64044783, 69240995, 70582839, 68875152, 68760131, 72799225, 77736792, 78810460, 75725708, 72066629, 70919984, 73723358, 81117500, 91222939, 98524573, 98655761, 94184260, 92219531, 96108907, 102488263, 106656730, 107709955, 107658493, 108267029, 109977865, 112094434, 113157372, 112504552, 111684890, 112823099, 115642887, 117824075, 118155713, 117453097, 116567036, 115630948, 115233713]
42530A15233713Q83384J449316N58202l15746l66915j316274l953469n565710
42522A06606501l871407j032010m08417j630285k385575k693286l369005k598352
42514H8618164J106234M254155K090183l768350o753937m358780n09304J476082
42506H2154447K901840N245321O698742N588423L440396K220334J553328P56760
42498A10559591P94824K132859L142063K609153J676029J640665J981688K049348
42490A26586220K467749L328733L207421J512314l14130j302609k327489l584895
42482A29573314l363414j148254O70594L35255n23119k1435N45876q07097l050975
42473A22210745m047426m297352n338064n830538l106316J888593M866954L699300
$$ y = [115233713, 116117097, 117566413, 118124615, 117808869, 117441954, 116125680, 112172211, 106606501, 102735094, 101703084, 101294667, 99664382, 97278807, 94585521, 91216516, 88618164, 89724398, 93978553, 96068736, 92300386, 85546449, 81187669, 80678365, 82154447, 85056287, 90301608, 97000350, 102588773, 106029169, 108249503, 109802831, 110559591, 111354415, 113487274, 116629337, 119238490, 120914519, 122555184, 124536872, 126586220, 129053969, 132382702, 135590123, 137102437, 136788307, 135485698, 133158209, 129573314, 126209900, 125061646, 125732240, 126067495, 125544376, 125522941, 126068817, 125261720, 122210745, 118163319, 113865967, 108527903, 102697365, 99591049, 101479642, 106346596, 110045896]
42465A10045896O66795j162615j150024k02935Q19696J057612Q4710q55226J27390
42456A09431299K620680L740162J722972j814158l988919l615017j287708J944395
42448A08753706M725453N338050L134869j85633j934457j283211n9719l71416
42440A18117642j912480k335327m10610K042696K350666O81523N166K024625M770758
42431A25334659N268690L246136P84829o41280j059000o26725O91645K152723
42423A35151677K571876J866332J077480P73759M93078k44442j367750k558168
42415A37763842l159129k181509L64608K531238K294952J49794j615413j937267
42407A34211116j591922j079945k0657J187034J293376L09394l76775n50741j523059
$$ y = [110045896, 110712691, 109550076, 108400052, 108197117, 109016813, 110074425, 110159135, 109303909, 109431299, 112051979, 115792141, 117515113, 115700955, 111712036, 108097019, 106809311, 108753706, 113479159, 118817209, 121952078, 121766445, 119831988, 118548777, 118489058, 118117642, 116205162, 113869835, 113459225, 115501921, 117852587, 118534110, 118539276, 120563901, 125334659, 130603349, 133849485, 134634314, 133993034, 132934034, 132307309, 132998954, 135151677, 137723553, 139589885, 140667365, 141441124, 141934202, 141689760, 140322010, 137763842, 134604713, 132423204, 132787812, 135319050, 137614002, 137763796, 136148383, 134211116, 132619194, 131539249, 131518592, 132705626, 133999002, 134308396, 133931621, 133380880, 131857821]
42398A31857821l077700k749563J57816K335889P67829k563266l164388j12905
42390A23451533L334068M585873M020915K479641j60454k906301l184408l82032
42382A31238835K298564J736888q39168j839437n81970J37043j301542k784154
42374A28065059j606218J747589M503197N153143M491407L655328K825994J990448
42366A50825947J539575J461178Q84668p97359k888333m115499m012346l039268
42358A39858563j759069n35496K90253N96749N71697J420j957393n244185p653660
42349A24168879o814832l533711j308487j791419k684742j650377l94960k070609
42341A03919742n491471n628613q67636L580037K174790l139334n196683j177148
$$ y = [131857821, 128780121, 126030558, 126188374, 128524263, 129292092, 126728826, 123564438, 123451533, 126785601, 131371474, 135392389, 137872030, 137711576, 134805275, 131620867, 131238835, 133537399, 135274287, 134435119, 132595682, 132013712, 132150755, 130849213, 128065059, 126458841, 128206430, 132709627, 137862770, 142354177, 146009505, 148835499, 150825947, 152365522, 153826700, 154711368, 153914009, 151025676, 146910177, 142897831, 139858563, 138099494, 137563998, 137854251, 138451000, 139022697, 139024117, 137066724, 131822539, 124168879, 117354047, 113820336, 112511849, 110720430, 108035688, 106385311, 105990351, 103919742, 98428271, 92799658, 91932022, 95512059, 97686849, 94547515, 89350832, 88173684]
42333H8173684L867785M180474O72950j476941m73560M37008j412826m340112
42325H9628462n342038m267246k959381j918299k65324J588704J738363k41306
42317G7961935j962639j024041J774229L154688J096589k921667n517486m810854
42309F7750754j962206N54215J652834K000948J976874O93649k034022l922291
42301F6710755k326754J958631M928353M116386J508870M37593Q88322p335l115941
42292G5098880n325919l578377O73132K996178J647905l62499K80775K439336
42284G3869411K238132j123797l940182l203393q47282p00605k750679l365811
42276F0175794r46708J707715J591715n61428k198431k737490l187176l416477
$$ y = [88173684, 92041469, 96221943, 96894893, 95417952, 94944392, 95381400, 93968574, 89628462, 84286424, 80019178, 77059797, 75141498, 74876174, 76464878, 78203241, 77961935, 75999296, 74975255, 76749484, 79904172, 81000761, 78079094, 72561608, 67750754, 65788548, 66342763, 67995597, 69996545, 71973419, 72667068, 70633046, 66710755, 64384001, 66342632, 71270985, 75387371, 76896241, 77333834, 78222156, 78214821, 75098880, 69772961, 66194584, 66867716, 69863894, 71511799, 71149300, 71430075, 73869411, 76107543, 74983746, 71043564, 67840171, 66992889, 66292284, 63541605, 60175794, 59229086, 60936801, 62528516, 61967088, 59768657, 57031167, 53843991, 50427514]
42268E0427514k529618j383026j861701l366990k803547P79067L946622L265236
42260D6473557K37677p35816J355652K771451N48198l148492m009802j411864
42252D2080561J160522J254108N34280J676171M007389M332542J582178j526212
42244E5101539k098052o91398j0957q85692j270165O36883L702937N124775L717374
42235F3327244J031659p12840j029767j095383j652793j757170j27235K512006
42227F0495721L379449O48294l838603n884653l408291J005297K696750j21830
42219E4972134m632600o557527m314538J20916L562373M024226J477873k365608
42211D6287249m820797m063210j038941J177590P19427j007239j434054k56677
$$ y = [50427514, 47897896, 46514870, 44653169, 41286179, 38482632, 39261699, 43208321, 46473557, 46711234, 45975418, 47331070, 50102521, 50650719, 47502227, 43492425, 42080561, 43241083, 44495191, 45029471, 46705642, 50713031, 55045573, 56627751, 55101539, 53003487, 52312089, 52301132, 51415440, 50145275, 50782158, 54485095, 59609870, 63327244, 64358903, 63646063, 62616296, 61520913, 59868120, 58110950, 57983715, 60495721, 63875170, 64523464, 60684861, 54800208, 51391917, 52397214, 55093964, 54972134, 50339534, 43782007, 39467469, 39588385, 43150758, 47174984, 48652857, 46287249, 41466452, 37403242, 36364301, 37541891, 38261318, 37254079, 35820025, 35563348]
42203C5563348N91214j4642j039400j202989p01174l85970m55234o79459q95233
42194C0780461o05637Q24885K845543L756716K921196J658828R59760o1631j901232
42185D1178889k657950p43896J744566J478206r44142j811422l43280K0614k422491
42176C5499094m265273k058616K279726M274819L057052J474485J442173K387732
42168D4091192L418430L940021K823231R6179j184239J649453N817022N527437
42160F6178726O8929m748687m670980k266733j650449j977214p6458L277421M344033
42151E8478588K398805M27624J44907J62748n86217j070397o09754j85147k86727
42142E8874430P4870J179977J660396Q30603q1728j29630r7574n51552l75137
$$ y = [35563348, 36154562, 36139920, 35100520, 33897531, 33196357, 32810387, 32355153, 31675694, 30780461, 30174824, 30999709, 33845252, 37601968, 40523164, 42181992, 43141752, 43080121, 41178889, 38520939, 37777043, 39521609, 40999815, 40055673, 38244251, 37900971, 37921585, 35499094, 31233821, 29175205, 31454931, 35729750, 38786802, 40261287, 41703460, 44091192, 47509622, 51449643, 54272874, 54369053, 53184814, 54834267, 60651289, 66178726, 66247655, 61498968, 56827988, 54561255, 52910806, 50933592, 50857134, 54134555, 58478588, 60877393, 61305017, 61449924, 61612672, 61026455, 59956058, 59346304, 59161157, 58874430, 58949300, 60129277, 61789673, 62620276, 62538548, 62408918, 62311344, 61759792, 61384655]
42133F1384655J221547K820781K559710O41937j248963j990679j410583O2119
42125F4040524R89462l44019l389354n020112l416395p83279k20376j328016j493005
42116D9035430n34712r21000l293723m776504k891727Q33354K595476P05484k715307
42107C8036771m037651j796014J679541K551663k28349l679717m548148l049432
42099B4928664j455399l69324J135410K458366J637714j143776l067395k592733
42091B1531527j390537j212258j215436j13173R94192J80485j968183k705037
42083A4101580n97005K777197M580623L350944R5127k632565k945051j206456
42075A7524394P90621J884151K009415J238632n7401m41846J099006K904290K345522
$$ y = [61384655, 62606202, 65426983, 67986693, 68628630, 67379667, 65388988, 63978405, 64040524, 65029986, 64685967, 61296613, 56276501, 52860106, 52076827, 51856451, 50528435, 49035430, 48500718, 47579718, 44285995, 39509491, 36617764, 37451118, 40046594, 40752078, 38036771, 33999120, 32203106, 33882647, 36434310, 36205961, 32526244, 27978096, 24928664, 23473265, 23103941, 24239351, 26697717, 28335431, 27191655, 24124260, 21531527, 20140990, 18928732, 17713296, 17600123, 18594315, 18774800, 16806617, 14101580, 13504575, 16281772, 20862395, 24213339, 24308466, 21675901, 18730850, 17524394, 18315015, 20199166, 22208581, 23447213, 23389812, 22947966, 24046972, 26951262, 29296784]
42066B9296784Q8644l62324J675086K366920n73544l545496k133982K079831L860568
42057C2752487J856328n74017j325732j766717k704653k591244j114041p05330
42049B3827081k355628l072395j64555M180168N427904K509364j433549l340861
42041B5577529k972338j682110n61799o6098l0453K69391J135740J551817L48818
42032B3570497j675215k089449J05398K727794K780067K08695j833590p81985
42024B3012212K201003L690649K101226p84818k342545j882401l71523J437161
42016B7060964L394215M921178M792014K292855j684584m789578m754397j554873
42008B9677794J954258K619087M98807j314898o83923J242693K215866J610244
$$ y = [29296784, 29385428, 29023104, 30698190, 33065110, 32491566, 28946070, 26812088, 28891919, 32752487, 34608815, 34034798, 32709066, 30942349, 28237696, 25646452, 24532411, 23827081, 21471453, 18399058, 18234503, 22414671, 27842575, 30351939, 28918390, 25577529, 22605191, 20923081, 20361282, 20295184, 20264731, 20534122, 21669862, 23221679, 23570497, 21895282, 19805833, 19911231, 22639025, 25419092, 25627787, 23794197, 23012212, 25213215, 28903864, 31005090, 30220272, 27877727, 25995326, 25623803, 27060964, 30455179, 35376357, 40168371, 42461226, 40776642, 35987064, 31232667, 29677794, 31632052, 34251139, 34749946, 33435048, 32751125, 33993818, 36209684, 37819928]
42000C7819928l471k079826l515309k816766n82678K18258j484575k560968l12608
41991B4681985K946635L471184K091090K158827L062271J193346l023099m798846
41983C1783393k425039M50317J351506K223214M010652L646881j82686l301868
41975C7556370k208064L03032J41109j354821p53842P49102l25809l024295l451936
41966B7630846j505112l54360k14466J415638L647636K574000j520659l336868
41958B8336655p19373J811964K72550k771905k697146L14648K474228K031179
41950B9052800M80627m04692k41122L15192O6718j465836k568865j010053K176819
41941B6401588L195820Q56405j523260j184752K45813K73713k54985M14812R64603
$$ y = [37819928, 37816457, 35736631, 32221322, 29404556, 28821878, 29040136, 27555561, 24994593, 24681985, 27628620, 31099804, 33190894, 35349721, 38411992, 39605338, 36582239, 31783393, 29358354, 29808671, 31160177, 33383391, 37394043, 41040924, 40858238, 37556370, 35348306, 35651338, 35792447, 34437626, 33683784, 34432886, 34107077, 31082782, 27630846, 26125734, 25771374, 25556908, 26972546, 30620182, 33194182, 31673523, 28336655, 27617282, 29429246, 29701796, 26929891, 24232745, 24547393, 27021621, 29052800, 29533427, 29128735, 28887613, 29202805, 29269523, 27803687, 25234822, 24224769, 26401588, 29597408, 30453813, 28930553, 27745801, 27991614, 28265327, 28010342, 28425154, 29389757]
41932B9389757p07285l007550k596833P8465J324351J43718m30621J258418K531396
41923B7983816O96635k514254l391097j512609J15247k28472o16251J290874M258815
41914B6082704M579771J044046k977821l492578p06948J786300J885518P68011
41906B8969003j12749j092815k404462k724227j329799K25846N00200N32883J716101
41897B4279981K894753K250384R35133J666695L954740L958722p0899m791279
41889C5078230n635419k047675K496830M576435L586049J056849j361675k901395
41881C4848229l351893k587936q65359Q28556J624787J918481K551438K829599
41873C7795902J096512k057972l224805m52314L513435M381675J660717j322322
$$ y = [29389757, 28682472, 25674922, 23078089, 23156554, 24480905, 24624623, 24194002, 25452420, 27983816, 28680451, 26166197, 22775100, 21262491, 21377738, 21149266, 20533015, 21823889, 26082704, 30662475, 31706521, 28728700, 25236122, 24529174, 26315474, 28200992, 28969003, 28856254, 27763439, 25358977, 22634750, 21304951, 21530797, 22030997, 22563880, 24279981, 27174734, 29425118, 30360251, 32026946, 35981686, 39940408, 39869509, 35078230, 29442811, 27395136, 29891966, 34468401, 38054450, 39111299, 37749624, 34848229, 31496336, 28908400, 28043041, 28871597, 30496384, 32414865, 34966303, 37795902, 38892414, 36834442, 33609637, 33157323, 36670758, 41052433, 42713150, 41390828]
41865D1390828j972456p00179R00878J744729J088046j143199l505985m237387
41857C3565275l502097k902220k837998k171723n66536P43711Q29715P9356q55058
41848B2382425j586183j507975m52759L38214k39194r48394J82400K281954K392682
41839B2843170J077k086302k026840j250540j555962k616799l434490l646212
41831F227102k447653Q55986M192990M039911Q79624m65353J882248L394996K40508
41822A8800359m202989m495644j548615l70173j508080q52601K627891M918993
41814A3369141L411137J98132k126663l277260k711250Q50138N415382N938440
41806B1067197J251977l374120l659771k209653l083160m329749j407908M216402
$$ y = [41390828, 39418372, 38718193, 39619071, 41363800, 42451846, 41308647, 37802662, 33565275, 30063178, 27160958, 24322960, 22151237, 21584701, 22328412, 23158127, 23237483, 22382425, 20796242, 19288267, 18835508, 19173722, 18934528, 17986134, 18168534, 20450488, 22843170, 22844247, 20757945, 18731105, 17480565, 15924603, 13307804, 9873314, 6227102, 3779449, 4635435, 8828425, 12868336, 13747960, 13282607, 15164855, 18559851, 18800359, 14597370, 10101726, 8553111, 8182938, 6674858, 5822257, 8450148, 13369141, 16780278, 16978410, 14851747, 11574487, 8863237, 9713375, 15128757, 21067197, 22319174, 18945054, 15285283, 13075630, 9992470, 5662721, 4254813, 8471215]
41798H471215O115635K448455j227916k17903K909037K854259p94654l811993
41790A6746135l470658j257089P5670m21341k051529l702988m099203k185767
41782c66770J505633M399954L981278N86244k615564k860291n74293J558471J885994
41773G500656J268636J282849K008366K291857J583448N16742l01476j162034
41765A4989044k410319l233932k143190J061741M322089M999930K592723p15648
41757A9462438k374297j850422m61738N31624R96089J353164J627604J247260
41749B0531722k87843k431650l564096k699485j080571p16536j100690O02939
41741I253790M904464P699177N096902q81321m506276l613116j315268m09402
$$ y = [8471215, 14586850, 17035305, 15807389, 15589486, 18498523, 21352782, 20558128, 16746135, 13275477, 12018388, 12094058, 11672717, 9621188, 5918200, 1818997, -366770, 1138863, 5538817, 9520095, 10106339, 7490775, 4630484, 4056191, 5614662, 7500656, 8769292, 10052141, 12060507, 14352364, 15935812, 16452554, 16151078, 14989044, 12578725, 9344793, 7201603, 8263344, 12585433, 17585363, 20178086, 19462438, 17088141, 15237719, 14775981, 15307605, 16303694, 17656858, 19284462, 20531722, 20243879, 17812229, 14248133, 11548648, 10468077, 9751541, 8650851, 9253790, 14158254, 21857431, 26954333, 26073012, 21566736, 17953620, 16638352, 16228950]
41733A6228950J38883J816210L154236K194850L1099q49832l88262o03636k191611
41724A9530887l650172l497680j747827N72711K225036K508968K036641K012513
41716A9991077K213280J145324j001484j686287Q5340J414556m63662l653300
41708A8044844m220647k111703q90886j960362k687211q77923K044526L522878
41700A0863516L080256J706102j08000k251530l951738l978372j722668J861718
41692E499284M132185K761648r35776k223767J373256O015082O035566J388978
41684B4046456k822021l510552k242238q60629Q84315K386752J415170j815281
41676A7481972l709293k507138p91484p03437n65911J104800K199910R95199j32867
$$ y = [16228950, 16367833, 18184043, 21338279, 23533129, 23564228, 22714396, 22326134, 21722498, 19530887, 15880715, 12383035, 10635208, 11207919, 13432955, 15941923, 17978564, 19991077, 22204357, 23349681, 22348197, 20661910, 20747250, 22161806, 21698144, 18044844, 13824197, 11712494, 10821608, 8861246, 6174035, 5296112, 7340638, 10863516, 13943772, 15649874, 15541874, 13290344, 9338606, 5360234, 3637566, 5499284, 9631469, 12393117, 11457341, 9233574, 10606830, 16621912, 22657478, 24046456, 21224435, 17713883, 15471645, 14611016, 15495331, 17882083, 19297253, 17481972, 13772679, 11265541, 10474057, 9770620, 9204709, 10309509, 12509419, 13504618, 13371751]
41667A3371751J129370K473939R91734j209480m61109J716002R22317k443971
41659A6490553l639969j339771P09281K59304n48940o0139M6903j324308k103588
41650H489326o70411J220215J270996k56583k002031l494047m044418k183666
41642a670619J919708N430276N850804L607443Q41629o43385Q8344K319585L121271
41633B0865056K78268l911920m886214k213628P933j85750j18653J766264K582819
41624A4184175L61837j777504o60817J529877J166454p31132r43684J34104R7309
41615A3360619k93278J091876K398356M4405m321281n051875j125135K123534
41607H227221J249885n54490O95571L585916M074525J471519j382393k121312
$$ y = [13371751, 14501121, 16975060, 17966794, 16757314, 16296205, 18012207, 18934524, 16490553, 12850584, 11510813, 12220094, 12479398, 11930458, 11870319, 11917222, 10592914, 8489326, 7818915, 9039130, 10310126, 10053543, 8051512, 4557465, 513047, -1670619, 249089, 5679365, 11530169, 15137612, 15979241, 15335856, 15424200, 17743785, 20865056, 21143324, 17231404, 12345190, 10131562, 10139495, 9953745, 9835092, 11601356, 14184175, 14546012, 12768508, 12107691, 13637568, 14804022, 14072890, 13129206, 13263310, 13360619, 13067341, 14159217, 16557573, 16601978, 12280697, 7228822, 6103687, 8227221, 9477106, 8922616, 9618187, 13204103, 17278628, 18750147, 17367754, 15246442]
41599A5246442p28021J334219K299648J546491O93565J725923L568097K791261
41591B8477625j382809n292435n487925k879580n51929L31244K82606q80001l333013
41582I283783n157177l817833J33461K985942K166932p04252j841848K59065L200290
41573F508363L647859J379891n79444o2455J420757J197307n09699j218419k97696
41564A1486464K02319q82077j956205j296156N07509J827591K014219J128543
41556A3032207o85157k498916k802369j460756p6152M37610R66606J927629J862058
41547A0702760j32843k214726j972681J73273J453284J08037k893209m982699
41539B41196m159014q13247K190490K382781Q31361P45010K739690L908739K358366
$$ y = [15246442, 14518421, 15852640, 18152288, 19698779, 20392344, 22118267, 25686364, 28477625, 27094816, 21802381, 16314456, 13434876, 12882947, 13214191, 13496797, 12616796, 9283783, 4126606, 308773, 442234, 3428176, 5595108, 4890856, 3049008, 3308073, 6508363, 10156222, 11536113, 10956669, 10894214, 12314971, 13512278, 13002579, 11784160, 11486464, 11688783, 10806706, 8850501, 7554345, 8061854, 9889445, 11903664, 13032207, 12347050, 9848134, 7045765, 5585009, 5508857, 5946467, 6913073, 8840702, 10702760, 10569917, 8355191, 6382510, 6555783, 8009067, 8117104, 5223895, 241196, -3917818, -4731065, -2540575, -157794, 673567, 1418577, 4158267, 8067006, 10425372]
41530A0425372j35079j428152k083094l061354l146565j420935J22487l50755
41522a078075q95205J149901M083031L879806M71661k133255j899626r87135j408105
41513A182998k114338j573737k84775O57995J254937J678023J480823O42837r1609
41504B833154l70902k82381O74599K765242M326755L201908l3918k575116l150338
41495G389003k818764k133177n95568Q00168M067k185341k209506P69969K972899
41486A993750J632817p75135n75393J706787L036494K657935J962465J314968
41478A2954688J98806p75616r35444j335428k595512k479901Q28120M240600K851356
41469A2951669k597618n688923k813861K122824L322846L76159k453900k174279
$$ y = [10425372, 10290293, 8862141, 6779047, 3717693, 571128, -849807, -727320, -1078075, -1973280, -823379, 3259652, 7139458, 7611119, 5477864, 3578238, 2591103, 1182998, -931340, -2505077, -2789852, -2131857, -876920, 801103, 2281926, 2924763, 2833154, 2462252, 2179871, 2854470, 5619712, 9946467, 13148375, 13114457, 10539341, 7389003, 4570239, 2437062, 1841494, 2641662, 2645729, 460388, -1749118, -979149, 1993750, 3626567, 2851432, 2276039, 3982826, 7019320, 9677255, 11639720, 12954688, 13153494, 12377878, 11442434, 10107006, 7511494, 5031593, 5859713, 10100313, 12951669, 10354051, 4665128, 1851267, 3974091, 7296937, 7673096, 5219196, 3044917]
41461C044917K24565K059087J935392O06989q8814P20117J766233J300792j04684
41452A1464594j1086K121513L525993J812013j514696l060555k061488p94669
41444A1481619q38309j107630j58350J256024J140265r21146k976682k792462
41436E083329k42830K530485L216784J519177p29549j493400m31158R80337R03765
41427A1336940j139685l523952l671805q09052K466122K693040P6893j218314
41419F210187J353518M612670L683036r01803l644496j909545N97868m5397k104616
41410G851422j781604J82913J49857j588213r57002K621817M437307J893315j030969
41401A1778843P2293L202265L334393N6949k629193k703326j867115j347933j85335
$$ y = [3044917, 3269482, 5328569, 7263961, 7870950, 7782136, 8502253, 10268486, 11569278, 11464594, 11453508, 13575021, 17101014, 18913027, 17398331, 14337776, 12276288, 11481619, 10643310, 9535680, 9377330, 10633354, 11773619, 10852473, 7875791, 5083329, 4840499, 7370984, 10587768, 12106945, 11377396, 9883996, 9452838, 10433175, 11336940, 10197255, 6673303, 3001498, 2192446, 4658568, 7351608, 7428501, 6210187, 7563705, 12176375, 15859411, 14957608, 11313112, 9403567, 10001435, 9956038, 7851422, 6069818, 6252731, 6402588, 4814375, 3857373, 6479190, 10916497, 12809812, 11778843, 11851136, 15053401, 18387794, 18444743, 15815550, 13112224, 11245109, 9897176, 9711841]
41392I711841J773564K670279J446252o44473j998136k076158q13364J089825
41384A1159630J509536p68473l313180k754995o966R21636o05907r88159J191916
41375F345038K747898J747498Q90030K181255K938549R49131o87241J265380L694865
41366B2072403J584999l401792m970512j767995J255540J130525N03230J682356
41358A8088754K489290N74294k239690k813241j078733R06332K102326K525079
41350B0554411J936233M57493q05935j212300j483604k160633k534433k069776
41342A2681456j492034j476070j485833p84069M22878J389356J465397L35926
41334A1057007j191275j109940J273448L324992K020733j473789l075172j493091
$$ y = [9711841, 11485405, 14155684, 15601936, 14957463, 12959327, 10883169, 10069805, 11159630, 12669166, 11900693, 8587513, 5832518, 5825552, 6747188, 6141281, 5153122, 6345038, 9092936, 10840434, 11730464, 13911719, 16850268, 17799399, 17112158, 18377538, 22072403, 23657402, 20255610, 15285098, 13517103, 14772643, 15903168, 16406398, 18088754, 20578044, 21152338, 18912648, 16099407, 15020674, 15927006, 18029332, 20554411, 22490644, 22948137, 22142202, 20929902, 19446298, 17285665, 14751232, 12681456, 11189422, 9713352, 8227519, 7443450, 7866328, 9255684, 10721081, 11057007, 9865732, 8755792, 10029240, 13354232, 15374965, 13901176, 10826004, 9332913]
41326I332913P27942K024866L559379N144185L917558o43696m342694l789500
41318A5930953r78586N86375R65465J560472J182752j322820l213734j480411
41310A3230466J557528J372219j337453j739212J055859K607639M96921k192429
41302A5051538k277193p34579M44696J534576K813544K674064P13697m20615Q05346
41293B0605074J592018r58905m631943m815740j118141K351086K784013J447503
41285A7254965N75819M58010L31192j16531j089426k866275m696549m740844k107496
41276C002865J657005L790909K869828R8207j651341l61196L015571N247364M224474
41267B1893686J236250q78626j188897j025048j358071j600487j235749q65993
$$ y = [9332913, 10060855, 12085721, 15645100, 20789285, 24706843, 24063147, 19720453, 15930953, 14952367, 15538742, 16504207, 18064679, 19247431, 17924611, 14710877, 13230466, 14787994, 16160213, 14822760, 13083548, 14139407, 16747046, 17243967, 15051538, 12774345, 12039766, 12484462, 14019038, 16832582, 19506646, 20220343, 19799728, 20605074, 22197092, 21238187, 16606244, 11790504, 10672363, 13023449, 15807462, 17254965, 17830784, 18288794, 18619986, 18503455, 17414029, 14547754, 9851205, 5110361, 3002865, 4659870, 8450779, 11320607, 11418814, 9767473, 9406277, 12421848, 17669212, 21893686, 23129936, 22251310, 21062413, 20037365, 18679294, 17078807, 15843058, 14977065]
41259A4977065p99403q6831J748211L142899K354674L47416j03244J628344K848504
41250B6057635J308089j406049j928633K44688K204395J717847j68475j322878
41242B6706619j361794q11435Q72035M018383O287819M526834l59966l162332
41234C6716163o20255M133849N580117K794328l34035j197119j440517l062208
41226D2570323m670347l916479j728727j187367k799596l792741k497058p74649
41218B1203359q31029j823269j650859n91044n90879j567383j196359J202013
41210A4154550L059977K051251o79133k317276k065234j282031q11456p7493J322578
41201A3355733K723917L334510K998519J871385K14637j384397k324015k565018
$$ y = [14977065, 14177662, 14090831, 15839042, 18981941, 21336615, 21684031, 21580787, 23209131, 26057635, 27365724, 25959675, 24031042, 24275730, 26480125, 28197972, 28029497, 26706619, 25344825, 24533390, 25405425, 29423808, 35711627, 40238461, 39878495, 36716163, 36095908, 40229757, 45809874, 48604202, 48270167, 47073048, 45632531, 42570323, 37899976, 33983497, 32254770, 31067403, 28267807, 24475066, 21978008, 21203359, 20372330, 18549061, 16898202, 16307158, 15716279, 14148896, 12952537, 14154550, 17214527, 19265778, 18586645, 16269369, 14204135, 12922104, 12110648, 12033155, 13355733, 16079650, 19414160, 22412679, 24284064, 24498701, 23114304, 20790289, 18225271]
41193A8225271k389523j886019j280982j196467j657482j532735k37672P35333
41185H779724k08529j757268j029655J933353L671920K273883K26880M29697J546794
41176A5866799J67633l484354n186306k425034K047318L586524J107954k156699
41168I523835k655023r7436K877159L794999K671543J376708J137915J218093
41160A9847793J78433k101752m133847m322008k440277J79322J723164J417075
41152A0347903Q6717j048566j818981k524819k373373l26434K203284J946848
41144F492579j391882l232212J60448N585197O218150O91503n089624o023890
41136C410269l716866k257032j838679k02128K105357K439846J132886J339685
$$ y = [18225271, 15835748, 13949729, 12668747, 11472280, 9814798, 8282063, 8044391, 8779724, 8571195, 6813927, 5784272, 7717625, 11389545, 13663428, 13890308, 14320005, 15866799, 16034432, 12550078, 7363772, 4938738, 6986056, 10572580, 11680534, 9523835, 6868812, 6771376, 9648535, 13443534, 16115077, 17491785, 18629700, 19847793, 20026226, 17924474, 13790627, 9468619, 7028342, 7207664, 8930828, 10347903, 10434620, 9386054, 7567073, 5042254, 2668881, 2342447, 4545731, 6492579, 5100697, 1868485, 2028933, 7614130, 13832280, 14523783, 9434159, 3410269, -306597, -2563629, -4402308, -4604436, -2499079, -59233, 1073653, 2413338]
41128B413338L459902L943962J078602j818230j324922J024022J569462J15061
41120A0461197p10419j46497L11918M66114J548007K792196J709590j395995k841934
41111A2194177r92156J135521P21464p04438p74713q55373l143441n337264l029446
41102g85669L097085P081587N380130Q61074k025566k520527k279790j869391
41094F938933q45912N77726J842823K678607K421790N29152j458434r64732J533291
41085A3253244K461694P56271k6068K291566M218951K223490p72382J79441L444713
41076B8030920K928010j940019m955539k766841N62874Q07272l86530o3192M16719
41067B2633674j326767l507048l009231q45219k11766j054933j094509o81502
$$ y = [2413338, 5873240, 9817202, 10895804, 9077574, 7752652, 8776674, 10346136, 10461197, 9750778, 9604281, 9916199, 10382313, 11930320, 14722516, 16432106, 15036111, 12194177, 11202021, 12337542, 13059006, 12354568, 11579855, 10724482, 7581041, 2243777, -785669, 2311416, 9393003, 14773133, 15634207, 13608641, 11088114, 8808324, 6938933, 6093021, 6670747, 8513570, 11192177, 13613967, 14143119, 12684685, 11719953, 13253244, 15714938, 16471209, 16445141, 18736707, 22955658, 25179148, 24406766, 24586207, 28030920, 30958930, 29018911, 24063372, 21296531, 21859405, 22666677, 22280147, 22216955, 22633674, 21306907, 17799859, 14790628, 13945409, 13733643, 12678710, 11584201, 10902699]
41059A0902699j762884k927079p51965L694567M910711R54632l225845k860790
41051H934046j1149J0964l633011o610606n424429j275890K026249K197010K70559
41042c516257q92015J56052J710902J193828j026649j758320O65744M064190N388857
41033E986332M260544K311753P15113j15160P4722N04389p48225m049731o595133
41024B344604n581402k012078Q38982J801289K125579K206131J092802o71923
41016B143984q65085Q84515K043821R19519q30146r69474j9495P8623p42357p84631
41006A859274N85043J924246J528193p15807l250358m190849l054241j249570
40998f564069k19074O20840K669731N047227N016492K203788j40740L41963J705257
$$ y = [10902699, 9139815, 6212736, 5460771, 9155338, 14066049, 15020681, 11794836, 8934046, 8922897, 8933861, 5300850, -1309756, -6734185, -8010075, -5983826, -3786816, -3516257, -4408272, -4252220, -2541318, -1347490, -2374139, -4132459, -3466715, 597475, 5986332, 10246876, 12558629, 13273742, 13158582, 13233304, 13737693, 12989468, 8939737, 2344604, -3236798, -5248876, -4409894, -2608605, -483026, 1723105, 2815907, 2143984, 1278899, 2163414, 4207235, 5126754, 4296608, 3327134, 3307639, 3386262, 2643905, 1859274, 2444317, 4368563, 5896756, 5180949, 1930591, -2260258, -5314499, -6564069, -6783143, -6162303, -3492572, 1554655, 6571147, 8774935, 8634195, 8976158, 10681415]
40989A0681415R78487j268971k444357k262274k196919j833613L32099K889235
40981D875102K510014n21833j860142N40170L404027L286920J124157o95367k252738
40972A0410310m005709m051294j462496K94602j985405n049451l115386K761307
40964f203522N303458J775621j984368p65914K390364J906040j392557k429669
40956a400547l56052R31472j41627q37623K50275O28875j202209k465869m97134
40947e090439K500015K254518j572435n002109m662976r41393L329762N476587
40939c708470M505654J616265o91309r34339O8100O83943L62084p02461k462663
40930a263196m179495l982729j278782J318376Q35007j732830k484862o193K961662
$$ y = [10681415, 11659902, 10390931, 7946574, 5684300, 3487381, 1653768, 1985867, 4875102, 7385116, 6863283, 5003141, 5543311, 8947338, 12234258, 13358415, 12663048, 10410310, 6404601, 2353307, 890811, 1185413, -799992, -5849443, -8964829, -6203522, -900064, 875557, -1108811, -1874725, 515639, 2421679, 1029122, -1400547, -1756599, -825127, -966754, -1804377, -1554102, -925227, -2127436, -4593305, -5090439, -2590424, -335906, -1908341, -6910450, -11573426, -12514819, -9185057, -3708470, 797184, 2413449, 1722140, 787801, 855901, 1539844, 1901928, 1199467, -1263196, -5442691, -9425420, -10704202, -9385826, -8550819, -10283649, -12768511, -12774704, -9813042]
40921i813042L688199K569615J099107n41397k130047j995761O75120L676864
$$ y = [-9813042, -6124843, -3555228, -2456121, -2997518, -5127565, -7123326, -6448206, -2771342]
$$ [...]
##END NTUPLES=NMR SPECTRUM
##END=
