##TITLE=31Pdec_DE172rm_3h
 D, 64 sc
10.8.2026
##JCAMPDX= 6.0         $$ Bruker NMR JCAMP-DX V2.0
##DATA TYPE= NMR SPECTRUM
##DATA CLASS= NTUPLES
##ORIGIN= UXNMR, Bruker Analytische Messtechnik GmbH
##OWNER= root
$$ XWIN-NMR		Version 3.5
$$ Mon Aug 10 15:07:33 2026 Russian Standard Time (UT+4h)  she@DPX200
##.OBSERVE FREQUENCY= 81.013821
##.OBSERVE NUCLEUS= ^31P
##.ACQUISITION MODE= SIMULTANEOUS
##.ACQUISITION SCHEME= undefined
##.AVERAGES= 64
##.DIGITISER RES= 17
##SPECTROMETER/DATA SYSTEM= spect
##.PULSE SEQUENCE= zgpg30
##.SOLVENT NAME= CDCl3
##.SHIFT REFERENCE= (INTERNAL, CDCl3, 0, 197.392)
##AUDIT TRAIL= $$ (NUMBER, WHEN, WHO, WHERE, WHAT)
$$ ##TITLE= Audit trail, XWIN-NMR		Version 3.5
$$ ##JCAMPDX= 5.01
$$ ##ORIGIN= Bruker BioSpin GmbH
$$ ##OWNER= she
$$ F:/spectra/data/she/nmr/P31/2/pdata/1/auditp.txt
$$ ##AUDIT TRAIL=  $$ (NUMBER, WHEN, WHO, WHERE, WHAT)
(   1,<2026-08-10 15:06:21.12 +0400>,<she>,<DPX200>,
      <created by zg, POWCHK disabled, PULCHK disabled
       configuration hash MD5:
       00 E9 B6 7A A2 85 ED C7 34 08 36 98 17 FE 4E 26
       data hash MD5: 32K
       4B 63 35 98 AB A3 8D F5 6D 31 F4 B0 1D E4 49 DD>)
(   2,<2026-08-10 15:06:26.18 +0400>,<she>,<DPX200>,
      <Start of raw data processing
       efp BC_mod = 2 LB = 1.5 FT_mod = 6 PKNL = 1 PHC0 = 1927.752 PHC1 = 196.8983 SI = 64K 
       data hash MD5: 64K
       EA 2A 1A 69 44 5A C6 3E E4 6F D8 CA 63 F3 67 2E>)
(   3,<2026-08-10 15:06:40.87 +0400>,<she>,<DPX200>,
      <pk PHC0 = -8.991444 PHC1 = 0 
       data hash MD5: 64K
       48 27 E4 D7 48 34 01 A7 C7 DA 9F B1 28 7F 9E 94>)
(   4,<2026-08-10 15:06:44.85 +0400>,<she>,<DPX200>,
      <abs ABSG = 5 
       data hash MD5: 64K
       21 64 A2 DD 2B 66 9F B3 1D D3 5E 02 88 73 40 6C>)
(   5,<2026-08-10 15:07:04.21 +0400>,<she>,<DPX200>,
      <pk PHC0 = 4.014896 PHC1 = 0 
       data hash MD5: 64K
       8F 5B DF AD 6C 47 CB 42 9F 0E 8B FD 91 DC 5A 8B>)
$$ ##END=
$$ 
$$ hash MD5
$$ 91 30 7C C0 4C CA C1 62 AF 88 8C C7 FF E1 8F 4C
##$RELAX= 
##$RELAX= 
##$RELAX= 
##$RELAX= 
##$RELAX= 
##$RELAX= 
##$RELAX= 
##$RELAX= 
$$ Bruker specific parameters
$$ --------------------------
##$DU= <F:/spectra>
##$EXPNO= 2
##$NAME= <P31>
##$PROCNO= 1
##$TYPE= <nmr>
##$USER= <she>
##$AMP= (0..31)
100 100 100 100 100 100 100 100 100 100 100 100 100 100 100 100 100 100 
100 100 100 100 100 100 100 100 100 100 100 100 100 100 
##$AQSEQ= 0
##$AQ_mod= 1
##$AUNM= <au_zg>
##$AUTOPOS= <>
##$BF1= 81.014009
##$BF2= 200.13
##$BF3= 200.13
##$BF4= 200.13
##$BF5= 200.13
##$BF6= 200.13
##$BF7= 200.13
##$BF8= 200.13
##$BYTORDA= 1
##$CFDGTYP= 0
##$CFRGTYP= 5
##$CHEMSTR= <none>
##$CNST= (0..31)
1 1 145 1 1 1 1 1 1 1 1 1 1 1 1 1 1 1 1 1 1 1 1 1 1 1 1 1 1 1 1 1 
##$CPDPRG= <waltz16>
##$CPDPRG1= <>
##$CPDPRG2= <waltz16>
##$CPDPRG3= <>
##$CPDPRG4= <mlev>
##$CPDPRG5= <mlev>
##$CPDPRG6= <mlev>
##$CPDPRG7= <mlev>
##$CPDPRG8= <mlev>
##$CPDPRGB= <>
##$CPDPRGT= <>
##$D= (0..31)
0 1 0 0 0 0 0 0 0 0.06 0 0.03 2e-05 3e-06 0 0 0.0002 0 0 0 0 0 0 0 0 0 
$$ [...]
##$SUBNAM3= <"">
##$SUBNAM4= <"">
##$SUBNAM5= <"">
##$SUBNAM6= <"">
##$SUBNAM7= <"">
##$SUBNAM8= <"">
##$SUBNAM9= <"">
##$SW= 400.765351723535
##$SWIBOX= (0..15)
0 1 3 0 0 0 0 0 0 0 0 0 0 0 0 0 
##$SW_h= 32467.5324675325
##$TD= 32768
##$TD0= 1
##$TE= 0
##$TE2= 300
##$TE3= 300
##$TEG= 300
##$TL= (0..7)
0 120 53 12 22 120 120 120 
##$TP= (0..7)
150 150 150 150 150 150 150 150 
##$TP07= 0
##$TPNAME0= <>
##$TPNAME1= <>
##$TPNAME2= <>
##$TPNAME3= <>
##$TPNAME4= <>
##$TPNAME5= <>
##$TPNAME6= <>
##$TPNAME7= <>
##$TPOAL= (0..7)
0.5 0.5 0.5 0.5 0.5 0.5 0.5 0.5 
##$TPOFFS= (0..7)
0 0 0 0 0 0 0 0 
##$TUNHIN= 0
##$TUNHOUT= 0
##$TUNXOUT= 0
##$USERA1= <user>
##$USERA2= <user>
##$USERA3= <user>
##$USERA4= <user>
##$USERA5= <user>
##$V9= 5
##$VALIST= <valist>
##$VCLIST= <CCCCCCCCCCCCCCC>
##$VD= 0
##$VDLIST= <DDDDDDDDDDDDDDD>
##$VPLIST= <PPPPPPPPPPPPPPP>
##$VTLIST= <TTTTTTTTTTTTTTT>
##$WBST= 1024
##$WBSW= 4
##$XGAIN= (0..3)
0 0 0 0 
##$XL= 0
##$YL= 0
##$YMAX_a= 71379
##$YMIN_a= -57024
##$ZGOPTNS= <>
##$ZL1= 120
##$ZL2= 120
##$ZL3= 120
##$ZL4= 120
##$ABSF1= 197.3918
##$ABSF2= -203.3724
##$ABSG= 5
##$ABSL= 3
##$ALPHA= 0
##$AQORDER= 0
##$ASSFAC= 0
##$ASSFACI= 0
##$ASSFACX= 0
##$ASSWID= 0
##$AUNMP= <proc_1d>
##$AZFE= 0.1
##$AZFW= 0.5
##$BCFW= 0
##$BC_mod= 2
##$BYTORDP= 0
##$COROFFS= 0
##$CY= -3
##$DATMOD= 1
##$DC= 0
##$DFILT= <>
##$DTYPP= 0
##$F1P= 0
##$F2P= 0
##$FCOR= 1
##$FTSIZE= 65536
##$FT_mod= 6
##$GAMMA= 0
##$GB= 0
##$INTBC= 1
##$INTSCL= 9.790993e-09
##$ISEN= 30
##$LB= 1.5
##$LEV0= 0
##$LPBIN= 0
##$MAXI= 10000
##$MC2= 0
##$MEAN= 0
##$ME_mod= 0
##$MI= 50
##$NCOEF= 0
##$NC_proc= -6
##$NLEV= 6
##$NOISF1= 182.463
##$NOISF2= 159.3651
##$NSP= 0
##$NTH_PI= 0
##$NZP= 0
##$OFFSET= 197.3918
##$PC= 4
##$PHC0= 1922.775
##$PHC1= 196.8983
##$PH_mod= 1
##$PKNL= yes
##$PPARMOD= 0
##$PSCAL= 0
##$PSIGN= 0
##$REVERSE= no
##$SF= 81.014063255964
##$SI= 65536
##$SIGF1= 159.3651
##$SIGF2= -187.1042
##$SINO= 113.3802
##$SIOLD= 16384
##$SREGLST= <1H.CDCl3>
##$SSB= 0
##$STSI= 65536
##$STSR= 0
##$SW_p= 32467.5324675325
##$SYMM= 0
##$S_DEV= 0
##$TDeff= 32768
##$TDoff= 0
##$TI= <>
##$TILT= no
##$TM1= 0
##$TM2= 0
##$TOPLEV= 0
##$USERP1= <user>
##$USERP2= <user>
##$USERP3= <user>
##$USERP4= <user>
##$USERP5= <user>
##$WDW= 1
##$XDIM= 65536
##$YMAX_p= 470800096
##$YMIN_p= -52011203
$$ End of Bruker specific parameters
$$ ---------------------------------
##NTUPLES= NMR SPECTRUM
##VAR_NAME=  FREQUENCY,     SPECTRUM/REAL,   SPECTRUM/IMAG
##SYMBOL=    X,             R,               I
##VAR_TYPE=  INDEPENDENT,   DEPENDENT,       DEPENDENT
##VAR_FORM=  AFFN,          ASDF,            ASDF
##VAR_DIM=   65536,         65536,           65536
##UNITS=     HZ,            ARBITRARY UNITS, ARBITRARY UNITS
##FACTOR=    0.49542278885378, 1,            1
##FIRST=     15991.5117654749, 0,            0
##LAST=      -16476.0207020576, 0,           0
##MIN=       -16476.0207020576, -52011203,   0
##MAX=       15991.5117654749, 470800096,    0
$$ Real data points
##PAGE= N=1
##DATA TABLE= (X++(R..R)), XYDATA
$$ [...]
44293d53534m2536K5312O43529Q83769M5540j059932j200888l98398M33067Q53707
44283b70364R02754L91824o19388j144606l70643Q57313R59823j09239q41851
44274b44377m32011K92920M20063J37926p1812k93462o18780o34573j19533M29284
44264a134355N33804M14040M32345M26107J28062k17699k05161Q3668K30986O8534
44254G60331k13337l60947k59115j0014J20628L7979J0316K05599K49123k14199
44244C26364p25965n44924J20442L24087r9593k49646L08063P58759L67293l00995
44234B83885k59619M25169Q34502M96540j83679n69783l96306P7836K53318j77087
44224G84776o83809n12243J01694J43174n37941q23379p4284P88742P39491J62513
$$ y = [-453534, -496070, -470758, 172771, 1056540, 1102080, 42148, -1158740, -1557138, -1124071, -270364, 632390, 1024214, 404826, -739780, -1110423, -253110, 706713, 597474, -244377, -676388, -383468, 36595, 174521, 102709, -190753, -809533, -1444106, -1563639, -1134355, -600551, -186511, 245834, 671941, 800003, 582304, 377143, 460811, 691797, 760331, 546994, 186047, -73068, -83082, 37546, 75525, 85841, 291440, 540563, 326364, -399601, -944525, -824083, -499996, -599589, -849235, -541172, 217587, 584880, 283885, 24266, 449435, 1283937, 1780477, 1596798, 1027015, 630709, 708545, 961863, 784776, 100967, -411276, -309582, -166408, -704349, -1527728, -1602012, -813270, -73779, 88734]
44214H8734j08999l33100j115053j816406j249193L18076J321029J058962L81967
44205a453983J30743J49380Q7051K3816m6743l51988o39751l16273M10447N50549
44195a456752j17317n78721j92899L00143J05354k90675n0116N45242O18374J38937
44185i78430k24562l06110m30433m53991P6058Q54759R94698M26108J24867O12588
44175F95552J128152Q10106l0862m87471l97071l64080o79143r28726p06281j64695
44165a124519K87994M66021M15839K42339J24625K94296P52307J091496Q35649
44156C386047K891q04261r63478m51711J63920L41901Q2922k26607l76949n17369
44146F37306p36702p55659l17159K84889M71232J70186q2797M5140K37378J54072
$$ y = [88734, -20265, -353365, -1468418, -3284824, -4534017, -4215941, -2894912, -1835950, -1453983, -1323240, -1173860, -1086809, -1062993, -1109736, -1461724, -2101475, -2417748, -2007301, -1456752, -1574069, -2152790, -2345689, -2045546, -1940192, -2230867, -2280983, -1735741, -1117367, -978430, -1202992, -1509102, -1939535, -2393526, -2317468, -1462709, -468011, -41903, 82964, 695552, 1823704, 2633810, 2602948, 2115477, 1718406, 1354326, 675183, -253543, -959824, -1124519, -836525, -370504, 45335, 287674, 412299, 706595, 1458902, 2550398, 3386047, 3388938, 2584677, 1621199, 1169488, 1333408, 1675309, 1758231, 1531624, 1154675, 637306, -99396, -855055, -1172214, -887325, -416093, -245907, -328704, -283564, -46186, 107886]
44136A07886K7730J66397K61133j51597p63721q05014k54428P2537j79519l42597
44126a861193J44042P84154Q14212L76680J79211L47101L78409P8375j84493j62798
44116H93700p1060j53332l66018n61050o11982l51239K37952P70098P86777L54646
44106I28492k6961j12854j28308k85147m65087m55154k03114J84034M58799L52514
44096B47214l5764j65726K34577O36030M29266p6420j11009K62459K35122l26818
44086A328931n79282j32723K22349j97392q21824p27485j1845N59473P49196Q04404
44076A193802O19143p5013q59245r37099l20695J51541Q8940O637K90721N34356
44066F93088L31626K8565R5815K74859L5039m41404m74652L723K84235l8246m49936
$$ y = [107886, 135616, 302013, 563146, 411549, -352172, -1157186, -1411614, -1339077, -1518596, -1861193, -1717151, -932997, -118785, 257895, 437106, 784207, 1162616, 1240991, 1056498, 893700, 822640, 669308, 303290, -257760, -869742, -1220981, -983029, -212931, 573846, 928492, 901531, 788677, 660369, 375222, -89865, -545019, -748133, -564099, -105300, 247214, 211450, 45724, 280301, 916331, 1345597, 1269177, 1158168, 1420627, 1655749, 1328931, 749649, 616926, 839275, 641883, -179941, -907426, -919271, -359798, 389398, 1193802, 1812945, 1737932, 878687, -58412, -379107, -227566, -138626, -131989, 158732, 693088, 1024714, 1053279, 1149094, 1423953, 1458992, 1017588, 542936, 546659, 830894, 792648, 342712]
44055C42712l18996J71536L53019K7414m14762o57098o88130m37691J87682P98038
44045f36276P07866n6266n42170j40640M76563L31885l81630o20464o5396N13054
44035d13474M75745O3751k48260m04893n02163m87185m10071m47137m56673o4589
44025b894949O10163R25468O35597J94407q7957m29242p93936o06532K09318P47105
44015a490558L88971j89398r9849L72743M18554J28093J66212M49535L26256j50421
44005C20138k89044j5399O5681j25350j2374M22133M31657j61313m89689N742
43995A52182O63123O46315J68629M06K77402M53370J46241m71066r57664r82858
43985I6080n74194j09981J37275L76791Q31797J063442M39040p41227j387542
$$ y = [342712, 23716, 195252, 548271, 575685, 160923, -496175, -1184305, -1621996, -1434314, -636276, 71590, 15324, -526846, -667486, -190923, 140962, -240668, -861132, -926528, -413474, 62271, 126022, -122238, -527131, -1029294, -1516479, -1926550, -2373687, -2830360, -2894949, -2284786, -1359318, -723721, -529314, -617271, -1046513, -1840449, -2446981, -2237663, -1490558, -1101587, -1290985, -1390834, -1018091, -599537, -471444, -305232, 144303, 470559, 320138, 31094, 15695, 81376, -43974, -56348, 365785, 797442, 636129, 146440, 152182, 815305, 1461620, 1630249, 1630655, 1908057, 2361427, 2507668, 2036602, 1078938, 96080, -478114, -588095, -450820, -74029, 757768, 1821210, 2260250, 1519023, 131481]
43976A31481j047371l85149k872L32302Q61416J111871O60151m4598l09401j62803
43966A145027q4823k08713l42139l69250j60648M30779J029716Q10400l15568
43957A934781j233358j049215l37485j43423l94197l41235m2205j47280m94800
43948b248417k54721N39725R03766N44357L46224Q03457J127942N81765k65499
43939B078599m50228q8096q090l20908l02995L36899Q71040M92397o08507j434050
43929E66061j299729n07408J36895K70557J95589K28615K54358R8529r5892k18540
43919c70965m99055r70171j034505k57174P19966R02163M19057L23175Q92168
43910A24659J167146M69757n77764j022516p75072l14243R7168L46894K54602
$$ y = [131481, -915890, -1301039, -1303911, -971609, -110193, 1001678, 1661829, 1617231, 1307830, 1145027, 1060204, 851491, 509352, 140102, -20546, 410233, 1439949, 2250349, 1934781, 701423, -347792, -685277, -828700, -1222897, -1564132, -1606337, -1753617, -2248417, -2503138, -1963413, -1059647, -515290, -169066, 634391, 1762333, 2344098, 2078599, 1628371, 1540275, 1532185, 1211277, 908282, 1245181, 2116221, 2608618, 2000111, 566061, -733668, -1241076, -1104181, -833624, -638035, -409420, -155062, -56533, -152425, -370965, -870020, -1840191, -2874696, -3131870, -2411904, -1509741, -1090684, -767509, 124659, 1291805, 1761562, 1183798, 161282, -613790, -928033, -830865, -483971, -229369]
43901b29369j5604R3417O25288P86558J39242n64901n07566r7864j85968n49294
43891e06061l34096L28418M47745j17025l69278J54496O38322M11978M4586K69264
43881I68349O74589M19599k81387m30060J58487N10123m5977q28123p04304L57773
43871G99069J219895J005664Q8528n76548o89262o62890o57641l17386L48404
43862E57833O15083J35754k67059K69745J184976J191080K26083m74134l38042
43853C101319k21646p52925j139446n08628M96577N86142k66288r25800q34384
43844d65079n23959m16056j74107M78883J123991J224021P98533K19749k33768
43835B032208l97889k12516R0719J37200r7536k71215k21899j27537n8472J32427
$$ y = [-229369, -244973, -151556, 473732, 1260290, 1399532, 834631, 327065, 229201, 43233, -506061, -840157, -511739, -63994, -181019, -550297, -395801, 242521, 654499, 699085, 968349, 1642938, 2062537, 1781150, 1351090, 1509577, 2019700, 1973723, 1145600, 441296, 799069, 2018964, 3024628, 3113156, 2536608, 1847346, 1184456, 526815, 209429, 557833, 1172916, 1308670, 1041611, 1311356, 2496332, 3687412, 3913495, 3439361, 3101319, 2879673, 2126748, 987302, 478674, 975251, 1561393, 1295105, 369305, -465079, -989038, -1405094, -1579201, -1100318, 23673, 1247694, 2046227, 2265976, 2032208, 1634319, 1421803, 1512522, 1649722, 1552186, 1280971, 1059072, 931535, 873063, 1005490]
43825A005490L51353K54260r0220j21305L00602N04576J9642n77249m81351Q1414
43815A247212K04073k86563o00825k40992K75245K56622j50692k36539K68463
43806G36004Q72414R54733M63542o3923q2273M08476R07920R84622O71551K50126
43796F103192j44671n06906p13020n82641j59112K82315M91814L82759L3672k71520
43786D915882j80333K88653O10756L83353p0099j19225K86989O43764P36913Q84850
43776H381503J246356J463292J223935O93109J09721n88880j415121k020937k122905
43767F970073j889340j520944q14110L65036J471305J751883J221184O21743M53535
43758H630365N69766P46744J062940J497238J632935J120187J76086o79892j226892
$$ y = [1005490, 1356843, 1611103, 1520883, 1399578, 1700180, 2204756, 2224398, 1647149, 1165798, 1247212, 1451285, 1164722, 563897, 322905, 598150, 854772, 704080, 467541, 736004, 1608418, 2563151, 3026693, 2962770, 2880497, 3288973, 4196893, 5181515, 5853066, 6103192, 5958521, 5451615, 4738595, 4155954, 3996842, 4279157, 4770971, 5153730, 5187402, 4915882, 4735549, 5024202, 5634958, 6018311, 5948212, 5828987, 6115976, 6759740, 7496653, 8381503, 9627859, 11091151, 12315086, 13008195, 13117916, 12529036, 11113915, 9092978, 6970073, 5080733, 3559789, 2745679, 3110715, 4582020, 6333903, 7555087, 8176830, 8630365, 9200131, 9946875, 11009815, 12507053, 14139988, 15260175, 15436261, 14756369, 13529477]
43749A3529477j614917j943272k042514j716582j055412m34714k16800m29525
43741D075741p18040o57280j66698L82672N02450O1242n53643p79699m39075P0594
43731A778264K15988r6247n15483p42913p68293n98400j11201O05541J060514
43722H27770Q46997K04880k05666l6594M86158R50606J110870Q68530K24915o15465
43712D663001j267171j426586j095991n57992j56469j3303R8472M66806R57826
43703A668593J046714M90653k87012p33787q19006q05148o57738k10907K41202
43694f6436J62259l71207o39390k75301K59750M38562L61525L23418J92594k35818
43684A49956o03768l52902L61193P09767K61605m34315n53741N340N77079N37992
$$ y = [13529477, 11914560, 9971288, 7928774, 6212192, 5156780, 4722066, 4505266, 4075741, 3357701, 2700421, 2533723, 2916395, 3418845, 3480087, 2926444, 2146745, 1707670, 1778264, 1994252, 1898005, 1382522, 639609, -128684, -727084, -838285, -232744, 827770, 1674767, 1879647, 1673981, 1637387, 2123545, 3074151, 4185021, 5053551, 5278466, 4663001, 3395830, 1969244, 873253, 315261, 158792, 145489, 243961, 710767, 1668593, 2715307, 3205960, 2918948, 2185161, 1366155, 561007, -96731, -307638, -66436, 95823, -275384, -914774, -1190075, -930325, -491763, -130238, 193180, 385774, 149956, -453812, -806714, -445521, 264246, 525851, 91536, -462205, -456865, 120214, 658206]
43674F58206n2555n95400n96418j34727K66112K02366j95296m30689k02110K69831
43664h10680N06150L14860r460m9642K56638N82915N97328K70113j51360l32641
43654A174221q0615L99455N25402n3544q40800r11653j18731N90573M00744k75627
43644H09425m39817J07487O69362P36896M54708N3778m34692p75491n49890J23329
43634G55095M53149p6597j029526j577180j372788o29907K62882R11588J054805
43625a248479Q31147O41881N77529L39148j33712m60825m85245n67440q37321
43616a343317p34570J42292J189285J453565Q41769O6520l56815m40921k77610
43607E40198O0295K70267J25018j1989L90119J085180J194097M21744m95504p96518
$$ y = [658206, 605651, 10251, -586167, -720894, -454782, -252416, -447712, -878401, -1080511, -810680, -304530, 10330, 870, -48772, 207866, 790781, 1388109, 1658222, 1506862, 1174221, 1093606, 1493061, 2018463, 1964919, 1124119, 212466, 93735, 684308, 1085052, 809425, 369608, 477095, 1146457, 1883353, 2338061, 2391839, 1957147, 1181656, 631766, 755095, 1208244, 1131647, 102121, -1475059, -2847847, -3477754, -3214872, -2303284, -1248479, -417332, 224549, 802078, 1141226, 1007514, 546689, 61444, -505996, -1343317, -2077887, -1935595, -746310, 707255, 1549024, 1615544, 1258729, 817808, 540198, 600493, 870760, 995778, 983789, 1373908, 2459088, 3653185, 4074929, 3579425, 2782907]
43597B782907n96834m48192m54504k86452J57849N54728N99599L49597N4837j64865
43587B548670l39308m15445k17796K24297M74026J24745n65225q34530l45236
43578F54198L78523O25558L04509j50604l87407l73054k57002k45429m26199n77437
43568d54344m03704j8095K08647K91121M99145N29051k66004j499260j735386
43559b848829n60674M91009J75854m09641M20724K001520K141628N78380n73860
43550A416111r7625P05492M31265k77984k11499K75654R5616n77774o37842J48830
43540A270244R29424J073954O91750Q2187m72309n87695j91366J74660O3794k17875
43530B816768k48940k78199o37844q93696m83354K03936L50986J3124r2626J42958
$$ y = [2782907, 2186073, 1737881, 1283377, 996925, 1154774, 1709502, 2309101, 2658698, 2713535, 2548670, 2209362, 1793917, 1576121, 1800418, 2274444, 2399189, 1833964, 999434, 654198, 1032721, 1658279, 1962788, 1812184, 1424777, 1051723, 794721, 549292, 123093, -454344, -858048, -876143, -667496, -376375, 122770, 651821, 385817, -1113443, -2848829, -3409503, -2918494, -2742640, -3152281, -2731557, -730037, 1411591, 1989971, 1416111, 1318486, 2023978, 2455243, 2177259, 1965760, 2241414, 2337030, 1759256, 1121414, 1270244, 2199668, 3273622, 3965372, 4047559, 3575250, 2987555, 2796189, 2970849, 3034643, 2816768, 2567828, 2289629, 1651785, 758089, 274735, 478671, 829657, 842781, 750155, 893113]
43520H93113K17101J38336M14947Q75420O58932l31933j023523o88247P722N2853
43510A214721n01929q17544m68979K37498Q50228J138162J025467N94427J28586
43501C400637r7073n4845R6450K04924K01986J27940J22845K53869L66486K76391
43491D899610M8244j45842l68869q06015j319189j450716r65815j56765M74896
43482B09539O74288N44777L52508K43378J09891j68649l74038j54763L20865L79592
43472B137388j98704p26186n63155m7403J48422J36886M59064Q95503O31409l74501
43462B498723j126279r30274k33916J63070R1853r4412p5089K63140P50351Q63810
43452B170977K29977o70587q70471j71502N58789N88547K22132J66049N23499
$$ y = [893113, 1110214, 1248550, 1663497, 2538917, 3197849, 2865916, 1842393, 1154146, 1161868, 1214721, 712792, -104752, -573731, -336233, 513995, 1652157, 2677624, 3272051, 3400637, 3303564, 3248719, 3345169, 3550093, 3752079, 3880019, 4002864, 4256733, 4623219, 4899610, 4947854, 4802012, 4433143, 3627128, 2307939, 857223, -108592, -265357, 209539, 883827, 1428604, 1781112, 2024490, 2134381, 1965732, 1591694, 1436931, 1757796, 2137388, 1938684, 1212498, 649343, 601940, 750362, 887248, 1346312, 2241815, 2873224, 2498723, 1372444, 442170, 208254, 371324, 463177, 368765, 293676, 556816, 1307167, 2170977, 2400954, 1730367, 859896, 688394, 1247183, 1835730, 2057862, 2223911, 2747410]
43443B747410Q22258O75648R9864n39755p35794l21752J98080K20526q9673q6143
43433B990669K54483L04863n7915j91616J52482L62559Q5826j20710J71466M60372
43423D412479K34152j24625j15867l6799k89487n02933k64371l9002l34381n84467
43413B354699n3241O53583L32418p94122j173282j22312J266289J649207Q70436
43404D983675l47008j242344j307096n52072K58554L26274j01892r5939M68782
43395B390934O81051M1530p81559j005387p25930m29063k18668J193J49173J87795
43385B91069K49523K73863M0029k59261j33202L09360L45140j75627m67901q5864
43375C87129L09605Q7920k63039q568N31247N02324q4737m26434j86713J57156
$$ y = [2747410, 3569668, 4245316, 4345180, 3805425, 3069631, 2747879, 2945959, 3166485, 3076812, 2990669, 3245152, 3550015, 3492100, 3300484, 3452966, 3815525, 3901351, 3780641, 3952107, 4412479, 4646631, 4522006, 4406139, 4369340, 4079853, 3576920, 3312549, 3273547, 2939166, 2354699, 2301458, 2955041, 3287459, 2493337, 1320055, 1197743, 2464032, 4113239, 4983675, 4636667, 3394323, 2087227, 1535155, 1793709, 2119983, 2018091, 1922152, 2390934, 3071985, 3113515, 2331956, 1326569, 600639, 171576, -47092, -45899, 103274, 291069, 540592, 814455, 854484, 595223, 462021, 771381, 1116521, 940894, 472993, 387129, 696734, 784654, 521615, 513047, 1044294, 1546618, 1461881, 1035447, 848734, 1005890]
43365A005890J46206j75866n45795o73693k81670M94565R20438M75493l21211
43356A044357n27644n5508L54010K94583O1410j12631l56837n76410l78107J47597
43346a05180L07835j49439n21551j49792O09613R49920P29078M42440L68853L31350
43336B813127J63595j16519n25305j011559j174835o11489L77707R22430O11764
43327A448916l8026l64931l58828l25657k01083K14158N97032M03993j87449l71512
43317H16613Q1504M43123J97672j33336Q4187N08595M81471K70280O03061J198688
43307D551858R44517l49698j503006j613985j127793p59020l65133L51572Q85134
43298A014446O48198P9506L3639M33720M91701K4104l99747m88756m84729m33035
$$ y = [1005890, 1152096, 976230, 430435, -243258, -524928, -30363, 890075, 1365568, 1044357, 516713, 461205, 815215, 1109798, 1171208, 1058577, 701740, 125330, -252777, -105180, 202655, 53216, -468335, -618127, -8514, 941406, 1670484, 2112924, 2481777, 2813127, 2976722, 2860203, 2334898, 1323339, 148504, -462985, -85278, 837152, 1448916, 1410890, 1045959, 687131, 361474, 160391, 374549, 971581, 1375574, 1188125, 816613, 898117, 1341240, 1538912, 1405576, 1489763, 1998358, 2479829, 2750109, 3353170, 4551858, 5496375, 5146677, 3643671, 2029686, 901893, 142873, -222260, 129312, 1014446, 1662644, 1742150, 1775789, 2209509, 2701210, 2725314, 2325567, 1836811, 1352082, 919047]
43288I19047j22124J91046p4516p44922q40567J9266R13934Q22569k9795n55064
43278D98874j75393O51513J090029P75312Q1374l21257k22849o5763j80564j56785
43268A974491M84543J259389J189360K74452m23848l54200j70184m59714p42304
43259C031985m02575J82274K93379N9890J00056L90319M20574K28394L39207P28088
43249E371591P19636N9180o32211o95457j94941L47209N40156K86541k62859p47088
43239D791757q54199o37210l84398k30939j44045j58073k74723k47298J33028
43230A993900O17990P72768N72802L07403K4625l99050p39715o15280k01213q0556
43220B253674k70244j13244N97549J091081O69063k62886p61632n76789k58960
$$ y = [919047, 796923, 987969, 913453, 168531, -672036, -652770, 261164, 1083733, 1053938, 498874, 323481, 974994, 2065023, 2840335, 2921709, 2600452, 2377603, 2311840, 2131276, 1974491, 2459034, 3718423, 4907783, 5182235, 4758387, 4404187, 4234003, 3774289, 3031985, 2629410, 2811684, 3105063, 3164953, 3265009, 3655328, 4075902, 4304296, 4643503, 5371591, 6091227, 6150407, 5518196, 4822739, 4627798, 4975007, 5515163, 5801704, 5538845, 4791757, 3937558, 3300348, 2915950, 2685011, 2540966, 2382893, 2108170, 1860872, 1993900, 2611890, 3384658, 3957460, 4264863, 4289488, 3890438, 3150723, 2535443, 2334230, 2253674, 1983430, 1870186, 2467735, 3558816, 4227879, 3964993, 3203361, 2626572, 2367612]
43211B367612k36647l07957p1969M53133P58770L84998m24721p74830j35985Q37640
43201B850044J032143L55148k05831q8411J54764J7280n8307L63486O84034J88681
43191E293031n90106n67266J61458M84250P3770k35257l6003m5803p06213j212450
43181B619411p34110K44937P17346O53001P05273Q32808L48596o94403j227613
43172C465246n82489N95604J245863J111245O30159J20955l55240o15476m50805
43163E165062m7301J78289J83295K94062N25842L97007l21883j075389j131719
43154D167265m78737K88368P72782R84444Q75825L07927m13022n90899m6347N33235
43144F400841N29083K11139J51553K68965J10658k26724k39666L3282J5987l75112
$$ y = [2367612, 2130965, 1823008, 1751039, 2204172, 2962942, 3347940, 2923219, 2148389, 2012404, 2850044, 3882187, 4237335, 4031504, 3943093, 4097857, 4115137, 4056830, 4420316, 5104350, 5293031, 4702925, 4135659, 4297117, 4781367, 4855137, 4619880, 4583877, 4538074, 3831861, 2619411, 1885301, 2130238, 2847584, 3500585, 4205858, 5038666, 5387262, 4692859, 3465246, 2882757, 3478361, 4724224, 5835469, 6465628, 6586583, 6231343, 5615867, 5165062, 5117761, 5296050, 5479345, 5773407, 6299249, 6696256, 6374373, 5298984, 4167265, 3688528, 3976896, 4749678, 5734122, 6609947, 6917874, 6504852, 5913953, 5867606, 6400841, 6929924, 7141063, 7292616, 7561581, 7672239, 7445515, 7205849, 7239131, 7255118, 6880006]
43134F880006m78486R9702Q91863J282260J195080P48323j14242j155804j606151
43125G742551j040378j06110K59992M2083m6781K99214P09464Q46009P11734L25336
43115I743114k62107o52222m55107M317j2996n65261r05968o21839k03533j82249
43105E886149l48052k55867L6856K33413L58402N36794N66519K37152k08018m39872
43095F603476o03351r53522j174248p26888K11030Q33943P86696N28220M90374
43086E995730N04647L38701K27716M34879O90113N59879J31948j44439j60723
43077H578451k19164m33602n21881l03477j6670P3928J02589L48115P12348P82767
43067I103404M20409o212j11958j1457j00716l94000l79417L27456J372983J936651
$$ y = [6880006, 6401520, 6501222, 7393085, 8675345, 9870425, 10618748, 10504506, 9348702, 7742551, 6702173, 6596063, 6856055, 6898138, 6851357, 7150571, 7860035, 8706044, 9417778, 9743114, 9481007, 8828785, 8373678, 8377995, 8364999, 7799738, 6893770, 6271931, 6068398, 5886149, 5538097, 5282230, 5319086, 5552499, 5910901, 6447695, 7014214, 7251366, 7043348, 6603476, 6000125, 5046603, 3872355, 3145467, 3356497, 4190440, 4977136, 5505356, 5995730, 6500377, 6839078, 7066794, 7501673, 8191786, 8751665, 8883613, 8739174, 8578451, 8359287, 7925685, 7403804, 7100327, 7083657, 7157585, 7260174, 7608289, 8320637, 9103404, 9523813, 9517601, 9405643, 9394186, 9293470, 8899470, 8520053, 8847509, 10220492, 12157143]
43057A2157143J583530O70320j06461l87538l03341j18657P8035L26284N76033
43048A4475348O41012M11230P0558j3832K94788O79188P18549M43248L26173O43661
43038A8689923J067821J084606O53804K02298P3808K95932Q22478J565081K078702
43029B6534453J708274M21186q34954j084922m71213L6672l5025k28836r4946
43020B5950689R5964j04852n91181r42475j024789r29350o53488k98496k43107
43011B1258915n77290o93161j18506N11309J68282r74596j625444j185785n03505
43002A6260219m62739p76985p76529n50132n10374m82114j17939K56290J29021
42993A2968718k24082j96568M851k96582r15124r34799k28364K85858J62208J10455
$$ y = [12157143, 13740673, 14410993, 14304532, 13916994, 13613653, 13494996, 13573031, 13899315, 14475348, 15116360, 15527590, 15598148, 15584316, 15879104, 16558292, 17276841, 17720089, 18046262, 18689923, 19757744, 20842350, 21496154, 21698452, 21772260, 22068192, 22890670, 24455751, 26534453, 28242727, 28663913, 27828959, 26744037, 26272824, 26309496, 26274471, 26045635, 25950689, 26046653, 25941801, 25350620, 24408145, 23383356, 22454006, 21800518, 21502022, 21258915, 20681625, 19988464, 19869958, 20381267, 20549549, 19574953, 17949509, 16763724, 16260219, 15797480, 15020495, 14243966, 13693834, 13183460, 12701346, 12583407, 12839697, 12968718, 12744636, 12548068, 12552919, 12256337, 11341213, 10406414, 10178050, 10463908, 10626116, 10736571]
42983A0736571P04141J404911J511575J241393J127713J033862N80826L0450q8008
42974A8283434J41073K86120L94137P67835J174832J101962O75589N52890R42682
42965B4320554J451531J860291K301367K640787K474437J902424J575101J713369
42957D0239861J737994J183925L94424o3085j84363l56448p88748j435461k127640
42948C8600459k514848k262107j586090j210385j498795k011348k187481k027898
42940B3301507j780285j442556j020349q29176j020902j188116r77457p29460
42932A4313206r07268j233918j104240o00367l21843l55046k38981P5541J05447
42923I732531k06810k90564Q978J8824o56069j331607j171257l83974J75343K31030
$$ y = [10736571, 11440712, 12845623, 14357198, 15598591, 16726304, 17760166, 18340992, 18371442, 18283434, 18424507, 18710627, 19104764, 19872599, 21047431, 22149393, 22824982, 23377872, 24320554, 25772085, 27632376, 29933743, 32574530, 35048967, 36951391, 38526492, 40239861, 41977855, 43161780, 43556204, 43493119, 43308756, 42952308, 42163560, 40728099, 38600459, 36085611, 33823504, 32237414, 31027029, 29528234, 27516886, 25329405, 23301507, 21521222, 20078666, 19058317, 18229141, 17208239, 16020123, 15042666, 14313206, 13405938, 12172020, 11067780, 10467413, 10145570, 9790524, 9551543, 9627084, 9732531, 9525721, 9235157, 9244135, 9262959, 8606890, 7275283, 6104026, 5720052, 5895395, 6126425]
42913F126425K22796M42522P23076R18164J050303R23120J83184j002773j774935
42904G811882j419515j93724R03839J078003L53528n73544r37809m88159L22158
42895F856659P39758M43979j18180k50898J32571L72741o7695p92133q81419j07987
42885F327396P00067P21879J61639j92709r9921P416j41502l28102l52232k60742
42875F543189p422M92474Q73285O01694n1524j31259N44802R23823L06921m79606
42865I616377l78950K01950J42380m93799o56392j59827J03591j19256N6081J019692
42855I331847J818648J589996P90868K85556J38238R1443L69681J074718J494751
42846A6985746J025026K34643K4063K15746O1628k68305M7201R17895J352286
$$ y = [6126425, 6349221, 6791743, 7514819, 8432983, 9483286, 10406406, 10589590, 9586817, 7811882, 6392367, 6198643, 7102482, 8180485, 8534013, 7960469, 7022660, 6534501, 6856659, 7596417, 8040396, 7922216, 7671318, 7803889, 8176630, 8108935, 7316802, 6435383, 6327396, 7027463, 7749342, 7910981, 7718272, 7618351, 7625767, 7484265, 7156163, 6803931, 6543189, 6535767, 7028241, 7901526, 8503220, 8451696, 8320437, 8865239, 9789062, 10095983, 9616377, 9237427, 9439377, 9581757, 9087958, 8431566, 8271739, 8375330, 8256074, 8312155, 9331847, 11150495, 12740491, 13531359, 13816915, 13955153, 14046596, 14416277, 15490995, 16985746, 18010772, 18245415, 18269478, 18485224, 18546852, 18278547, 18325748, 19243643, 20595929]
42837B0595929J090496R45038J234188J141500K15550o04396l10760O26931R77467
42828B5911943M90760j2348j9401J01969r9927n21320q10250q19791o01276k85254
42818B3335105q2932j64098m63440p54682q70753p07822j90142M85532P45522
42809B1332290K14461o29835q38183j55055O00956N53174j69954p22579o71707
42800A9513568m11010m65930q00020j001616q96627o93598o04118n72848m21892
42791A3645909j08607K10601L00484O1912k75562k74642J99539O91052O83290
42782A5133976L56663L79526Q94340J264492J070525P61789Q35704R02601K93622
42773B1893238p25335j194486q40567l91711m05728n50761l16618K05232N99716
$$ y = [20595929, 21686425, 22631463, 23865651, 25007151, 25222701, 24618305, 24307545, 24934476, 25911943, 26402703, 26390355, 26370954, 26472923, 26372996, 25851676, 25041426, 24221635, 23620359, 23335105, 23252173, 23088075, 22624635, 21869953, 20999200, 20291378, 20101236, 20586768, 21332290, 21546751, 20916916, 20078733, 19923678, 20524634, 21077808, 20907854, 20185275, 19513568, 19102558, 18636628, 17836608, 16834992, 15938365, 15244767, 14640649, 14067801, 13645909, 13537302, 13747903, 14048387, 14110299, 13834737, 13560095, 13759634, 14450686, 15133976, 15490639, 15870165, 16764505, 18028997, 19099522, 19861311, 20697015, 21599616, 21893238, 21167903, 19973417, 19132850, 18741139, 18335411, 17784650, 17468032, 17673264, 18272980]
42764A8272980O96787N65345L62030L99859R14689J595078J873004J821044K054740
42755B8555556K499130K158658O99311n93438l30475J103742K169064K234828
42747C8496376J943428J737260J232261K41042o11776p47251m20088k32197l71077
42738D1267978p02507j197417j865538k495997k769839k561772k053049j637077
42730B5984782j631823j905357j945972j543622j136844j127971j213742r51960
42722A4527491o23123p35689r49315n18671K41852J25166j051942j872947j276949
42713G865873q6654K56119k96207o30397k19008L81150N75281L96686J58080J24305
42703H525228N08888J198768J522897Q87450l52447j212935j299630j139413j208662
$$ y = [18272980, 18969767, 19535112, 19897142, 20297001, 21211690, 22806768, 24679772, 26500816, 28555556, 31054686, 33213344, 33912655, 33319217, 32988742, 34092484, 36261548, 38496376, 40439804, 42177064, 43409325, 43650367, 43038591, 42291340, 41871252, 41639055, 41267978, 40565471, 39368054, 37502516, 35006519, 32236680, 29674908, 27621859, 25984782, 24352959, 22447602, 20501630, 18958008, 17821164, 16693193, 15479451, 14527491, 13904368, 13168679, 12219364, 11700693, 11942545, 12067711, 11015769, 9142822, 7865873, 7779219, 8035338, 7739131, 7108734, 6889726, 7270876, 7846157, 8242843, 8400923, 8525228, 9034116, 10232884, 11755781, 12643231, 12290784, 11077849, 9778219, 8638806, 7430144]
42694G430144j247705q53097k71834j10268m26498n91258j56650M72971N43675
42685D789480k452m15989j94368K32600K55567O4274J99854M60485J97805l75697
42675E211559k93125N23563Q98601K16466n46593m30441n6320m39620j113287
42666C970803q64819J69246O58505J57229m09323l88588j85435j86300j39387
42657B781931M9673J0624k39763j82510J22986n3423p02643p63568J44486Q38228
42647B006021K93323p55297r74939l96673q1688l84501o77962m86429J00167Q94029
42637d63949J589424J529772M28454q37157j066790l08142K68891M4317l68764
42628H16056k17168M01297Q74783Q31023L54745j41474k05409J53666L64038O4744
$$ y = [7430144, 6182439, 5329342, 5057508, 4947240, 4520742, 3929484, 3772834, 4245805, 4789480, 4787028, 4371039, 4176671, 4409271, 4664838, 4729112, 4928966, 5389451, 5587256, 5211559, 4918434, 5441997, 6340598, 6557064, 6010471, 5580030, 5523710, 5084090, 3970803, 3105984, 3275230, 3933735, 4090964, 3681641, 3293053, 3107618, 2921318, 2781931, 2831604, 2842228, 2602465, 2419955, 2542941, 2489518, 1786875, 1023307, 1167793, 2006021, 2299344, 1544047, 569108, 172435, 90747, -293754, -971716, -1458145, -1357978, -463949, 1125475, 2655247, 3083701, 2246544, 1179754, 871612, 1140503, 1184820, 816056, 598888, 1000185, 1874968, 2705991, 3060736, 2919262, 2713853, 2867519, 3231557, 3296301]
42618C296301l02914j90715J62572K70898M35297J237319K269008K592041K405553
42609A2175360K828036L714620L213385L49534l143056m694429l836003k203102
42601H404345j215923r20682q19407o86493m80879k58736k85098o78007r88978
42592B070142o78850R3532P05973R39486J000295Q50877K68916m68105p41852
42583D040414n31047m45782o67527o29689n9235M11411J61207m83546p86883o17130
42573C92193l39966p2425K98772N79952M42677Q6463P9109M38673M79658j62014
42563B223092q51615p31965J10066P34212N33595j16461n05756m99481m87751
42554D07936o35504o40709l25926o0740k60081o80913o58712k9197O24667P83784
$$ y = [3296301, 2993387, 2802672, 2965244, 3236142, 3671439, 4908758, 7177766, 9769807, 12175360, 15003396, 18718016, 21931401, 22280935, 19137879, 14443450, 10607447, 8404345, 7188422, 6267740, 5448333, 4761840, 4280961, 4022225, 3737127, 3059120, 2070142, 1391292, 1484824, 2190797, 3130283, 4130578, 4981455, 5250371, 4782266, 4040414, 3509367, 3063585, 2396058, 1766369, 1707134, 2118545, 2279752, 1796206, 1009323, 392193, 52227, -20198, 278574, 858526, 1301203, 1387666, 1466775, 1905448, 2385106, 2223092, 1371477, 639512, 749578, 1483790, 2017385, 1900924, 1395168, 895687, 407936, -227568, -868277, -1194203, -1254943, -1515024, -2195937, -2854649, -2883846, -2259179, -1475395]
42544a475395O37971O30604P08508M92733L4031j46319J53286M47707K14210m23926
42534A273410r33813j038650q32475m17924J82028P95262J153383J238851J278429
42525B698501J297375R85903J96296o78469j089389r58375o69324n18513m30757
42516H33248k03356J99984O28150Q39228O16706r143o26260p42623l12756K02467
42506A425645L76749K39981P1427j825l783J15681M13927O99939O22590J01016
42496D061347n10359p96198p08002n16599m36575m47734m56854m55742m38456
42487g05172k93455N9271M50900N45043J99205l33161o03958l43174L13714Q67329
42477A56542Q26166K62596r4948L02366R20752O36242o79714j724388j402995
$$ y = [-1475395, -837424, -206820, 501688, 994421, 1028452, 882133, 1035419, 1483126, 1697336, 1273410, 339597, -699053, -1531528, -1949452, -1767424, -972162, 181221, 1420072, 2698501, 3995876, 4981779, 5178075, 4499606, 3410217, 2451842, 1782518, 1264005, 833248, 629892, 829876, 1458026, 2297254, 2913960, 2904817, 2278557, 1535934, 1223178, 1425645, 1802394, 2042375, 2113802, 2111977, 2108194, 2223875, 2637802, 3337741, 3960331, 4061347, 3550988, 2754790, 2046788, 1530189, 1093614, 645880, 189026, -266716, -705172, -998627, -939356, -488456, 56587, 255792, -77369, -681327, -1024501, -710787, 156542, 982708, 1245304, 1150356, 1452722, 2373474, 3009716, 2330002, 605614, -797381]
42468g97381l02369K24654k6187j15152L57504P53450O78106N58382N62608J19874
42458B013489q27679j188574k81117Q60351Q58592k154l77254K0832K66297m6324
42448A296459l17925k45716k68187m56500k16658M93681Q21624M12739L3457J76110
42438A729084J73577m38162p46568J60837J421094J381258N329j054843p86879
42429A844727J314J07046m65508q53599o36762j94966j6779r0040k5973L40150
42419I610O09539K83138m58884q46706n37224l9169J64748L06098O27150O43687
42409G61987n7518p71345m68124N76951J026654L63442n08197o99010l70738k8340
42399a74238K75045N54015N15405J19768j15075J13190L75771K42592l8408q5939
$$ y = [-797381, -1099750, -875096, -901283, -1016435, -658931, 94519, 772625, 1331007, 1893615, 2013489, 1185810, -2764, -283881, 576470, 1435062, 1432908, 1055654, 1076486, 1342783, 1296459, 978534, 732818, 464631, 8131, -208527, 285154, 1106778, 1519517, 1552974, 1729084, 1902661, 1464499, 717931, 878768, 2299862, 3681120, 3686449, 2631606, 1844727, 1846041, 1953087, 1487579, 633980, -2782, -197748, -214527, -304567, -330540, 9610, 619149, 902287, 443403, -403303, -940527, -979696, -814948, -508850, 118300, 761987, 704469, -66876, -535000, 41951, 1068605, 1432047, 923850, 224840, -145898, -174238, 100807, 654822, 1170227, 1289995, 1174920, 1288110, 1663881, 1906473, 1868065, 1782126]
42389A782126l4129o5552J55404Q89476J579298J445859N95972j29598k57406
42380E961450l3740J96566L75779N16626N70241N24475L32145j36124p77136j132982
42370F397300r61753o70797p28594q97029n91067J71698P56653P74535M37308
42361D688254R6468r4947r6011J1161r262j72183m8109N98993J190774J011752
42351G176890L40845J15812M97341O39290M5874p21096j035220j080720j200965
42342D778051j078485l08028O30205P58125j18838j107647j271733n94209K03970
42333A891411N61688O16293Q35355J223989J199744M56440l98376n70558k00846
42324E615140m4306j23026L58608J511654K149610J292961m45156j703491k030090
$$ y = [1782126, 1747997, 1682445, 1837849, 2727325, 4306623, 5752482, 6348454, 6218856, 5961450, 5927710, 6124276, 6500055, 7016681, 7586922, 8111397, 8443542, 8307418, 7530282, 6397300, 5435547, 4764750, 4036156, 3139127, 2548060, 2719758, 3476411, 4250946, 4688254, 4784722, 4689775, 4593764, 4604925, 4595663, 4423480, 4375371, 4974364, 6165138, 7176890, 7517735, 7633547, 8130888, 8770178, 8816052, 8094956, 7059736, 5979016, 4778051, 3699566, 3391538, 4021743, 4779868, 4661030, 3553383, 2281650, 1687441, 1891411, 2453099, 3069392, 3904747, 5128736, 6328480, 6784920, 6386544, 5815986, 5615140, 5570834, 5447808, 5806416, 7318070, 9467680, 10760641, 10315485, 8611994, 6581904]
42315F581904j905782j597630r60891j97920J34400l1990j48784R9554M05366
42306B378227M09054J34801k43897n82455o29729k13798L44967N05787K84718
42297B387675K25684M88135O00433L67296L42265R44702J727715K182117K757554
42288A2023576M122552N526217M986666J633491k784659n450378n325689l830122
42280A0901654k748328k251256j405770j3969R64494Q13568M7074m07152m25944
42271E474371n07219p31130o37789j04579L28652K18702j84989l83922l08624
42262C163473k21962j82192K0567M30570P17073N08948j39174o90829o00098J09027
42252C115403P99590Q69033L82852r3222k35187k83816n71810r81178j076300
$$ y = [6581904, 4676122, 3078492, 2117601, 1919681, 2054081, 2022091, 1873307, 1972861, 2378227, 2787281, 2922082, 2678185, 2095730, 1466001, 1252203, 1597170, 2102957, 2387675, 2613359, 3101494, 3701927, 4069223, 4411488, 5356190, 7083905, 9266022, 12023576, 16146128, 21672345, 26659011, 28292502, 25507843, 20057465, 14731776, 10901654, 8153326, 5902070, 4496300, 4482331, 5446825, 6260393, 6307467, 5900315, 5474371, 4967152, 4236022, 3598233, 3493654, 3822306, 4041008, 3856019, 3472097, 3163473, 2941511, 2759319, 2779886, 3210456, 3927529, 4436477, 4297303, 3606474, 3006376, 3115403, 3914993, 4784026, 5166878, 5073656, 4838469, 4554653, 3982843, 3001665, 1925365]
42243A925365o85710j46672R0288n078n2331J69976L64899J48108l11215m84220
42233A013410l07417k78873n39489m67638L41300J219406J237141N14748o2651
42224B669937k05975l80800o59682m58579L13126Q06924M56113j43097k01873
42215B196094N5693r6741o24401p84785k51833N01292Q89518P64131L32196l0978
42205B950186L5290M86322P64569M54092r9046k23742J56828M80320L28188j72487
42195E160520o69176r06905p79864m21086j77426j87463j50925J30214K63295
42186B261184j43847o52580m77603K82144O94876L73654j0080J24952L84017J67131
42176C003848k86024k91074J81311M71748K07769k39605l45473q3372J68920J48758
$$ y = [1925365, 1239655, 1092983, 1183271, 1178193, 1125862, 1295838, 1660737, 1808845, 1497630, 1013410, 705993, 427120, -112369, -580007, -238707, 980699, 2217840, 2732588, 2669937, 2463962, 2083162, 1423480, 964901, 1278027, 2084951, 2541064, 2397967, 2196094, 2251787, 2155046, 1530645, 745860, 494027, 995319, 1884837, 2648968, 2981164, 2950186, 2985476, 3471798, 4236367, 4690459, 4591413, 4367671, 4524499, 5004819, 5333007, 5160520, 4491344, 3584439, 2804575, 2383489, 2206063, 2018600, 1867675, 1997889, 2261184, 2117337, 1464757, 987154, 1269298, 1964174, 2337828, 2327748, 2452700, 2836717, 3003848, 2717824, 2426750, 2608061, 3079809, 3287578, 3047973, 2702500, 2619128, 2788048, 2936806]
42166B936806n5805k32274l30149m03415l67909j04401J41213j28697q63072j200964
42156f08667n38613M83257P85079M28285M57469J132310J394989N37256n62272
42147C509093o19684K91847R92006Q02002J08930m35577n33688j65080M40885
42138D390734P53686L91530l53848q31082p93962m86608j37037J72717K68044
42129C374174J5707l53285m72540l12068o4257K37517N59741O07171K66967K2754
42119C881881K67502N11670J03621n39927m83840P2039k5785q78131j116963p3661
42109A718406R79675P22843j95178k86266M31483O68060M4254m35664j01792N06642
42099D052463P56667P98218Q91549P78798K82380j57078j09873J70112K00610
$$ y = [2936806, 2881001, 2648727, 2318578, 1915163, 1547254, 1442853, 1584066, 1455369, 592297, -608667, -1147280, -664023, 121056, 549341, 1006810, 2139120, 3534109, 4071365, 3509093, 2889409, 3181256, 4173262, 4975264, 5084194, 4648617, 4114929, 3949849, 4390734, 5144420, 5535950, 5182102, 4351020, 3557058, 3070450, 2933413, 3106130, 3374174, 3389881, 3036596, 2564056, 2251988, 2187731, 2425248, 2984989, 3592160, 3859127, 3881881, 4149383, 4661053, 4764674, 4224747, 3740907, 3812946, 3787161, 2909030, 1792067, 1718406, 2698081, 3420924, 3225746, 2939480, 3370963, 4039023, 4083277, 3647613, 3545821, 4052463, 4809130, 5607348, 6498897, 7277695, 7560075, 7402997, 7293124, 7463236, 7663846]
42090G663846j2511j83168l08968n26166o42496l05545M45139J145261J376794
42081H652186J055317L79149k83330n93812n58058n20472o64287p00052k95201
42072F471440L54900O96603M94826P1069j19550O5925M30151O69388O14316L54425
42062A0103493J35340R9475K00913L90391P03872J078983J289634J219467J026501
42053A6248069Q98313Q69834J047764J688691K729599L548678L677957L565797
42045C4274702M069828N270038O418473P134771P974706R563138J1827069J4493402
42037A01026127J7598013K0616313K1473719J7626799Q599485l046188j3516172
42030A70378096k0194171k2375360k0724889j6862522j2892856j0162816q314311
$$ y = [7663846, 7651335, 7468167, 7159199, 6633033, 5990537, 5684992, 6130131, 7275392, 8652186, 9707503, 10086652, 9803322, 9209510, 8651452, 8130980, 7466693, 6766641, 6471440, 6826340, 7522943, 8017769, 8088838, 7969288, 8035213, 8465364, 9134752, 9749068, 10103493, 10238833, 10338308, 10539221, 10929612, 11633484, 12712467, 14002101, 15221568, 16248069, 17146382, 18016216, 19063980, 20752671, 23482270, 27030948, 30708905, 34274702, 38344530, 43614568, 50033041, 57167812, 65142518, 74705656, 86532725, 101026127, 118624140, 139240453, 160714172, 178340971, 186940456, 183894268, 170378096, 150183925, 127808565, 107083676, 90221154, 77328298, 67165482, 58851171]
42023E8851171o242763l982110k768455l078984l708994l459741k789811k748354
42015C0071959k987476k259022o34150L58811P9860k57106L42714R93481M64872
42006B6173943o81938r28114j38245M64711M03859M45135Q44943O20381q26376
41997B6378299k515285l099750k484834j545960q88920n65072m73945l76555Q0984
41988A4508962P95811J086548O66254K33387M76484J010370J074670Q44976J102705
41979B1800167J834064K183849J868381J712107K473325L811946M805205N079277
41971D5568321N145455N869031P731077J0397906J3028625J5217733J7385923
41964A20344071J9720350K0865843J8424787J1139984L97017j0459981j8132060
$$ y = [58851171, 52608408, 48626298, 45857843, 42778859, 39069865, 35610124, 32820313, 30071959, 27084483, 24825461, 24191311, 24550122, 24629982, 24372876, 24715590, 25709071, 26173943, 25492005, 24563891, 24425646, 24890357, 25294216, 25739351, 26584294, 27204675, 26378299, 23863014, 20763264, 18278430, 16732470, 15843550, 15278478, 14804533, 14427978, 14508962, 15304773, 16391321, 17057575, 17290962, 17767446, 18777816, 19852486, 20697462, 21800167, 23634231, 25818080, 27686461, 29398568, 31871893, 35683839, 40489044, 45568321, 50713776, 56582807, 64313884, 74711790, 87740415, 102958148, 120344071, 140064421, 160930264, 179355051, 190495035, 190892052, 180432071, 162300011]
41957A62300011k1071066k0014024j7114216j4207353j1756062r458520p334525
41950F1344245n615874m036768k211110n63533J35578J56135O28928J832630K847721
41941E4517952L273770M032768N805908P861129R347176J0654563J2243257J2912598
41933A20649121J0728457N475503r35093o329279r559636j0256517q619435n676276
41925I5476845k776916m72497J613719L896873O444655R172762J1425816J1493453
41917A36274710P782543Q32305o704062j2350704j5328702j5853313j4267225
41910H0385552j1438071q848474p338674o392841n328902m435034m145333l877697
41902B8580526k800745j310503o02783r29424j324650j089297n78029l09574j52315
$$ y = [162300011, 141228945, 121214921, 104100705, 89893352, 78137290, 68678770, 61344245, 55728371, 51691603, 49480493, 48916960, 49052538, 49208673, 49837601, 51670231, 54517952, 57791722, 61824490, 67630398, 75491527, 84838703, 95493266, 107736523, 120649121, 131377578, 136853081, 135917988, 129588709, 120029073, 109772556, 101153121, 95476845, 92699929, 92227432, 93841151, 97738024, 104182679, 113355441, 124781257, 136274710, 144057253, 144889558, 138185496, 125834792, 110506090, 94652777, 80385552, 68947481, 60099007, 52760333, 46367492, 41038590, 36603556, 32458223, 28580526, 25779781, 24469278, 23866495, 22937071, 21612421, 20523124, 19945095, 19635521, 19483206]
41893A9483206K33762Q13872J467439K312816L210795L321794J826016r09746
41885C1759954l362317m229252l549527k356634j505484j117582r80175r68476
41877A3690507r08962m83353L01560Q01989M14929n09563r61195n20824J88760
41868A2013848M27576K04966p835K9078K32777M46024M79665K00163j92840k96195
41858A3537227j01375m9800k58513k00811M62572J225023J393897R87583M58130
41849A7453933m9602n30711n92517J26159J172217J639322J263215N59614j3772
41840B1027858l83660m53227j02300L66366M39848J14940j82825l56086o09755
41831A9861159p21436k39247M63026L30656p71267j540427r50642K93884P90900
$$ y = [19483206, 19716968, 20530840, 21998279, 24311095, 27521890, 30843684, 32669700, 31759954, 28397637, 24168385, 20618858, 18262224, 16756740, 15639158, 14658983, 13690507, 12781545, 12298192, 12599752, 13401741, 13816670, 13307107, 12345912, 11825088, 12013848, 12441424, 12646390, 12638555, 12667633, 12900410, 13346434, 13826099, 14026262, 13833422, 13537227, 13435852, 13386052, 13127539, 12926728, 13389300, 14614323, 16008220, 16995803, 17453933, 17404331, 16873620, 16281103, 16407262, 17579479, 19218801, 20482016, 21041630, 21027858, 20644198, 20190971, 20088671, 20455037, 20894885, 21009825, 20827000, 20470914, 19861159, 19139723, 18900476, 19363502, 19694158, 18922891, 17382464, 16431822, 16725706, 17516606]
41822A7516606L37376p7873J66652O46405O99354K24470l73193n74121j09894
41813A8455782O91015J048804O03252m6453q5617M96818J182455J924868L029787
41804B7300711M030600L632196J249848j980901m239902m706361l826784k378583
41796A9080824r33731k3686m760n12052o07932J26036R72269R58821J25698n85171
41786A8596316o16451l87171m61999p11940o90317l99218j50031L8985K91313
41777A5509487L04986l40330j305499j674460j216105p62293r84142j439921j327927
41768F763796o38392L8754M35624O94235Q38763Q21517Q88101J231130J421824
41759A2495352Q93031n0778m44930K138M86051K59671m20186q58915r03460q72590
$$ y = [17516606, 17853982, 17776109, 17942761, 18589166, 19288520, 19512990, 19139797, 18565676, 18455782, 19146797, 20195601, 20798853, 20752400, 20666783, 21163601, 22346056, 24270924, 27300711, 31331311, 34963507, 36213355, 34232454, 29992552, 25286191, 21459407, 19080824, 18147093, 18123407, 18118647, 17606595, 16998663, 17124699, 18096968, 19055789, 19181487, 18596316, 17979865, 17592694, 17130695, 16418755, 15728438, 15329220, 15179189, 15218174, 15509487, 15814473, 15474143, 14168644, 12494184, 11278079, 10515786, 9531644, 8091723, 6763796, 6125404, 6164158, 6599782, 7294017, 8132780, 8954297, 9842398, 11073528, 12495352, 13388383, 13337605, 12892675, 12894813, 13380864, 13640535, 13220349, 12361434, 11457974, 10585384]
41749A0585384q65377o82903l26920j17773k33441l97596j91189L66243O84209
41740H820637K40321o13992q18237J14546J269301J330804K80174o15442n81545
41731I426567k73405n22837r38560n79436M11876Q48396K01109o04336m42220
41722G527154N57637J285240J037466J37732o69996r41224o06183J91149J031892
41713I550867J299087P63519M5702N3989Q48526J492596J283889O81243N30946
41704A6550364P63220O22352O0053m3749O87401J357333J055562K11250j10394
41695B1153392J66391J41409n46578j157983r95988l41595J07376J35866p3910
41686A8588380m53576r55801j231790r27688k32589K55266J98988k03271n60535
$$ y = [10585384, 9720007, 9037104, 8710184, 8592411, 8358970, 7961374, 7770185, 8136428, 8820637, 9060958, 8446966, 7628729, 7743275, 9012576, 10343380, 10623554, 10008112, 9426567, 9153162, 8630325, 7691765, 7112329, 7524205, 8372601, 8573710, 7969374, 7527154, 8084791, 9370031, 10407497, 10545229, 9875233, 8934009, 8327826, 8518975, 9550867, 10849954, 11613473, 11659175, 11713164, 12561690, 14054286, 15338175, 16019418, 16550364, 17313584, 17935936, 17995989, 17952240, 18639641, 19996974, 21052536, 21263786, 21153392, 21319783, 21461192, 20914614, 19756631, 18760643, 18419048, 18526424, 18662290, 18588380, 18134804, 17179003, 15947213, 15019525, 14786936, 15042202, 15241190, 15037919, 14477384]
41677A4477384o53150n06007l33989l66935n37408m86043j46926q8950p35315
41668A0622661j352864o42893J337987K666535J762072l94684j329013k56319
41660A2413482J030268Q37674j08475l5839J070763J528364N93916n07397n56915
41651A6265841J4129K31664K24599O46370J175216R00112n9265n65473j53494
41642A8679699L89805L69699J07631J18890K43066J50659L0253J73155M02378
41633B0665235M68122N24521O68588N18834r5414m87426O8198J174375J752703
41624B5257736J461189R40313Q19862J245909K238778L644860M757221M891653
41616D5257521M458732M625355N786679P237211Q476247R840231J1627541J3732834
$$ y = [14477384, 13824234, 13318227, 12984238, 12617303, 12079895, 11593852, 11446926, 11357976, 10622661, 9269797, 8626904, 9964891, 12631426, 14393498, 13998814, 12669801, 12413482, 13443750, 14281424, 14172949, 14137110, 15207873, 16736237, 17330153, 16822756, 16265841, 16279970, 16511634, 16736233, 17382603, 18557819, 19457931, 19398666, 18833193, 18679699, 19069504, 19439203, 19546834, 19665724, 19908790, 20059449, 20089702, 20262857, 20665235, 21133357, 21657878, 22326466, 22845300, 22749886, 22262460, 22330658, 23505033, 25257736, 26718925, 27659238, 28479100, 29725009, 31963787, 35608647, 40365868, 45257521, 49716253, 54341608, 60128287, 67365498, 75841745, 85681976, 97309517, 111042351]
41608A11042351J6532703K0922758K6982813L3952497M1903656N0982301N7197601
41601C59516680N1656202K8409583o567789l7699904n2794199n2076550m4007996
41594B46436027l5434237k8094282k1968395j7625117j4948445j2522483r472642
41587A06370426o459210m276616k801403j780514j330665j103861j83900J579888
41579I0014145L272102M546603O381684R465243J3017598J6190658J9615988K4567452
41571A87071473L1553701M0503065N0480309N7225578N2779114L1611733j731190
41564D49493783l3639465n1930664n4603042m8076363l9289079l1347278k4863638
41557A65744254k0011151j6567897j3848987j1556433r917637q766499p454058
$$ y = [111042351, 127575054, 148497812, 175480625, 209433122, 251336778, 302319079, 359516680, 411172882, 439582465, 433014676, 395314772, 342520573, 290444023, 246436027, 211001790, 182907508, 160939113, 143313996, 128365551, 115843068, 106370426, 99911216, 95634600, 92833197, 91052683, 89722018, 88618157, 88434257, 90014145, 93286247, 97832850, 104214534, 113679777, 126697375, 142888033, 162504021, 187071473, 218625174, 259128239, 309608548, 366834126, 419613240, 451224973, 449493783, 415854318, 363923654, 309320612, 261244249, 221955170, 190607892, 165744254, 145733103, 129165206, 115316219, 103759786, 93842149, 85075650, 77621592]
41550G7621592n911772m823160m408723l989029l174663k545111k554332k625563
41542D7589239k097970j363780j180581j392031j307555r98354j146362j686784
41534C6415822j653867n85167P93124J617208J897126K076206K222697K203181
41526D4986330K210058K524673K995996L271464L408186L801971M595203N585048
41518G3378929O697641Q148569J0089303J2463628J5304375J8820348K3061567
41511A67964360K7886179L3434504L9956925M6324207M9049288M4381964L2469527
41504D41466954J8585248Q479254K268640n495562j8806091l4566603m5453958
41497C66477882m7570659m3372742l7370664l1465336k5457142j9842462j5805163
$$ y = [77621592, 71709820, 66886660, 62477937, 58488908, 55314245, 52769134, 50214802, 47589239, 45491269, 44127489, 42946908, 41554877, 40247322, 39248968, 38102606, 36415822, 34761955, 34176788, 34969912, 36587120, 38484246, 40560452, 42783149, 44986330, 47196388, 49721061, 52717057, 55988521, 59396707, 63198678, 67793881, 73378929, 80076570, 88225139, 98314442, 110778070, 126082445, 144902793, 167964360, 195850539, 229285043, 269241968, 315566175, 364615463, 408997427, 441466954, 460052202, 468531456, 470800096, 465304534, 446498443, 411931840, 366477882, 318907223, 275534481, 238163817, 206698481, 181241339, 161398877, 145593714]
41490A45593714j3249360j0951219q632278p211784o809815o085582m187366k131006
41482H6335304j391241j949398k585573k548339k118948j840460j900112k141347
41474F9859886k177484j625240o23483Q3878J1500l15525K6537J060251J691554
41465F7991874Q79078j277424l657884n073370n065184m039062k806079j951457
41457D5000492j537167j292784r66634m92736N0837N74820J048385J312049Q27267
41448D4524529r55949l614583n544529n435588l803306k311592j685216j257766
41440A9916000o41367n61119j421491k196092j773155o26233k4834j28498n7987
41431A2485224M58202P42426M27433m6811k94324l96481l67318j14234m624n08771
$$ y = [145593714, 132344354, 121393135, 112760857, 105549073, 98739258, 92653676, 88466310, 86335304, 84944063, 82994665, 80409092, 77860753, 75741805, 73901345, 72001233, 69859886, 67682402, 66057162, 65433679, 65517557, 65529057, 65213532, 65240069, 66300320, 67991874, 68870952, 67593528, 63935644, 58862274, 53797090, 49758028, 46951949, 45000492, 43463325, 42170541, 41203907, 40711171, 40762008, 41336828, 42385213, 43697262, 44524529, 43568580, 39953997, 34409468, 28973880, 25170574, 22858982, 21173766, 19916000, 19274633, 18713514, 17292023, 15095931, 13322776, 12696543, 12671709, 12543211, 12485224, 12943426, 13685852, 14113285, 14066474, 13772150, 13375669, 13008351, 12894117, 12889493, 12380722]
41421A2380722j151454q56764L99503J327415J103615L88272N8052l8446l56369
41412A3254546o35816m88842k45975k97711k44964L30775Q46948N49864j13747
41403A2955078j51211K70813J09101o19057n93048P52903K150143K127839Q39369
41394A7841930m29221q81904o26293j5483O08634P80989K59283n36982r48808
41385A6052145q85955p73187p86212o67060l36288j56310l52926n69962l42881
41376A1181364K04525N05668L22606J468j26429k50926p04760j272593j293321
41367H567602n24041M24498P25654K35153m42230o60110l09359K34676N57524
41358H809367N98423O64443R86223J269471R43876k1746q75345r43195m67769
$$ y = [12380722, 11229268, 10372504, 10772007, 12099422, 13203037, 13591309, 13649361, 13610915, 13254546, 12618730, 12129888, 11883913, 11586202, 11341238, 11672013, 12518961, 13068825, 12955078, 12803867, 13074680, 13183781, 12564724, 11971676, 12724579, 14874722, 17002561, 17841930, 17412709, 16530805, 15904512, 15889029, 16497663, 17278652, 17537935, 17000953, 16052145, 15166190, 14393003, 13606791, 12939731, 12603443, 12447133, 12094207, 11524245, 11181364, 11385889, 11891557, 12214163, 12215631, 12089202, 11838276, 11133516, 9860923, 8567602, 8043561, 8468059, 9193713, 9428866, 8986636, 8326526, 8017167, 8251843, 8809367, 9407790, 10072233, 11058456, 12327927, 13271803, 13250057, 12374712, 11431517, 10963748]
41349A0963748j88441k94128l12880K3934L93637M86187M74133O20392Q29828
41340A2996410R03943R14589R87445R86060P80042N96054O66060O89073J84409
41331A9704085o08367p73913M9422R41412O99645o17608j681916j483639m56953
41322A5772168K18550M7181m74359p54262p51958o71709n23147k68655p3822o4252
41312A2455735j8736L61664R65652J341617J232813Q36331N62555O87931J153725
41303A9579287J557728J496647J097214R86619J469423K003563J911622J376384
41295C1478487J150179J389723J488986J161211R27085J162398J315359O73624
41287D0747052m76342j099689o86037K52255R05810R36514N06784l8215l83689
$$ y = [10963748, 10775307, 10481179, 10168299, 10192233, 10585870, 11072057, 11546190, 12166582, 12996410, 13900353, 14814942, 15802387, 16788447, 17568489, 18164543, 18830603, 19519676, 19704085, 19095718, 18321805, 18371227, 19312639, 20012284, 19394676, 17712760, 16229121, 15772168, 15990718, 16037899, 15563540, 14809278, 14057320, 13385611, 12862464, 12593809, 12519987, 12455735, 12436999, 12798663, 13764315, 15105932, 16338745, 17175076, 17737631, 18425562, 19579287, 21137015, 22633662, 23730876, 24717495, 26186918, 28190481, 30102103, 31478487, 32628666, 34018389, 35507375, 36668586, 37595671, 38758069, 40073428, 40747052, 40270710, 39171021, 38484984, 38737239, 39643049, 40579563, 41086347, 41048132, 40664443]
41278D0664443m14280l19654m17524q42632j496650k209925k764331k854104k321549
41269B7023794j469080q96748r37356j391118j833146j994222j805069j315759
41261A5381296p49829m89316p57475j284962j459098r36540o5654M39230K76954
41252A0354606j43094k94713k22190l28263n95902n27590l201L36604k989m67968
41242H105300r7111J056035J827405J411100L36546l19154k05101K43023O31986
41233A2990029R12257R85430O10018j71097r18269j284875j333173j233936r65805
41224I590579n13694q4773J38198K43409L19946J65041l81623r80932j111539
41215G384612p81097m68348l69124k25358L179r2115o12642r14838m39354L94798
$$ y = [40664443, 40250163, 39930509, 39512985, 38670353, 37173703, 34963778, 32199447, 29345343, 27023794, 25554714, 24657966, 23720610, 22329492, 20496346, 18502124, 16697055, 15381296, 14631467, 14142151, 13384676, 12099714, 10640616, 9704076, 9638422, 10077652, 10354606, 10211512, 9916799, 9694609, 9366346, 8770444, 8242854, 8239653, 8576257, 8573268, 8105300, 8008189, 9064224, 10891629, 12302729, 12639275, 12320121, 12115020, 12358043, 12990029, 13902286, 14887716, 15497734, 15326637, 14408368, 13123493, 11790320, 10556384, 9590579, 9076885, 8992112, 9130310, 9373719, 9693665, 9858706, 9477083, 8496151, 7384612, 6603515, 6135167, 5766043, 5540685, 5543864, 5451749, 4839107, 3924269, 3484915, 3879713]
41205C879713P02363L23647p8601l4392J71546J0456o20937j293302j341363l92946
41195A326184J053072J796355J186765P847n04903l05725l39319q05002p85413
41186B629861O8433O64590M7334j071304j327539n93920K06811O94560J228521
41177B547347J692019J355392J91706p24396o00555N0105K52371j58151n97392
41168D008446o12762k16458L33533O52972L91902l18303p73729m29782M11526
41159C447345R67037Q83084M45332J3665l18795m92614l67401o4174p4896o34826
41149C803757j138010o84087O68250J670169J279456n1237j005262j073852q66079
41140B603105q08409m95336L05975R20157P44707K77431L05614O01097M10060
$$ y = [3879713, 4582076, 4905723, 4827122, 4792730, 4964276, 4974732, 4353795, 3060493, 1719130, 1326184, 2379256, 4175611, 5362376, 5370223, 4865320, 4559595, 4220276, 3415274, 2629861, 2698294, 3362884, 3410218, 2338914, 1011375, 417455, 624266, 1318826, 2547347, 4239366, 5594758, 5786464, 5062068, 4461513, 4511618, 4763989, 4605838, 4008446, 3395684, 3179226, 3512759, 4165731, 4557633, 4239330, 3465601, 3035819, 3447345, 4414382, 5297466, 5742798, 5756463, 5437668, 4945054, 4577653, 4513479, 4438583, 3803757, 2665747, 1981660, 2649910, 4320079, 5599535, 5548298, 4543036, 3469184, 2603105, 1794696, 1299360, 1605335, 2525492, 3270199, 3547630, 3853244, 4454341, 4864401]
41131D864401j41789k60042Q8600J74338l7058K86385J239379J670005Q89822
41122H774041k00841m83040j72610q6618j75672J00264M97457L02526l35274n46253
41112G673980j93442j16365p48119j430657j457610j037176p51238o14423k15500
41103A109450M93759J054282J112676Q42029O23911M71281N3429n70832n88354
41094D601631O31731K299118K688721J197750p95969j651616j350764r43110p78601
41085E898891l63484L66565Q07138P42985O61580Q76467J141451J203758R83341
41076A2318692K69970q64613j480364p59214M02920J88323j456414k437493j471810
41067D709997Q3642M01626j89363j69278O39268J165186J076699R70944Q65298
$$ y = [4864401, 4722612, 4462570, 4551170, 4725508, 4688450, 4974835, 6214214, 7884219, 8774041, 8573200, 8090160, 7917550, 7830932, 7655260, 7755524, 8252981, 8555507, 8220233, 7673980, 7480538, 7364173, 6616054, 5185397, 3727787, 2690611, 1939373, 1324950, 1109450, 1603209, 2657491, 3770167, 4612196, 5236107, 5707388, 5760817, 5189985, 4601631, 5233362, 7532480, 10221201, 11418951, 10622982, 8971366, 7620602, 6677492, 5898891, 5535407, 5901972, 6709110, 7452095, 8113675, 8990142, 10131593, 11335351, 12318692, 12588662, 11724049, 10243685, 9484471, 9887391, 10075714, 8619300, 6181807, 4709997, 4793639, 5195265, 5005902, 4836624, 5475892, 6641078, 7717777, 8688721, 9554019]
41058I554019J49662r46228j360971r01875n82682r24512j165564o30923K19301
41049C410227O67801P18847O29621L04318k46135n48317l36823Q811J28979J56864
41039D894193J56424j71898p75282r93853n26508Q5731M14000P16071J004898
41030D803776N78354o75094j500385r09304K47165N59263J53634J22293N14015
41021C893717N15415K20645M48799R22777M69809p90501j290248m86202K82081
41012D186292O7158k93944K0089L14222p1551k23402P72430J917619J696143N03106
41002H888162j11715J0907k51948r84253r88591L2622Q53091O82627K17572K14724
40992H563198L60138J62065j81175m07092o72919q96349o18808j3030N5926m73017
$$ y = [9554019, 9703681, 8757453, 7396482, 6494607, 5911925, 4987413, 3821849, 3190926, 3410227, 4078028, 4796875, 5426496, 5730814, 5484679, 4936362, 4599539, 4608350, 4737329, 4894193, 5050617, 4878719, 4103437, 3109584, 2583076, 2668807, 3082807, 3798878, 4803776, 5382130, 4707036, 3206651, 2297347, 2544512, 3103775, 3257409, 3379702, 3893717, 4409132, 4629777, 5078576, 6001353, 6471162, 5680661, 4390413, 3904211, 4186292, 4253450, 3959506, 3979595, 4293817, 4222266, 3998864, 4771294, 6688913, 8385056, 8888162, 8776447, 8787354, 8535406, 7551153, 6562562, 6595184, 7448275, 8130902, 8348474, 8563198, 8923336, 9085401, 8904226, 8497134, 7824215, 6927866, 6309058, 6296028, 6351954, 5878937]
40982E878937m71812N45698J404476J023146O1368l25868l40591p74129j254228
40973E746997q74740k9865R4017l67806q6355J125377J790453J019431k04827
40964H212682o57109n16483n65366p81047o69836k90144o0094k1336J0903q603
40954D653567j00544j9502K38294K48449j4291J34940R05425J295323M70061p74889
40944G036833j048665l69776J31366J83434N74004J389477J633650J021982O82351
40935A1234656J288149J755279Q63656p85493j661494j506853j348019j641047
40927H198834j723112j136651l46007J17539L00077L13728o267n67574q47634
40918D302933o62823n05504p01842q17354l98043K04255L29923k6627l32365l39256
$$ y = [5878937, 5407125, 5952823, 7357299, 8380445, 8441813, 8115945, 7775354, 7001225, 5746997, 4872257, 4842392, 4936409, 4568603, 4482248, 5607625, 7398078, 8417509, 8212682, 7555573, 7039090, 6473724, 5692677, 5022841, 4732697, 4672603, 4651267, 4662170, 4653567, 4553023, 4533521, 4771815, 5020264, 5005973, 5140913, 6046338, 7341661, 7811722, 7036833, 5988168, 5618392, 5749758, 5933192, 6507196, 7896673, 9530323, 10552305, 11234656, 12522805, 14278084, 15141740, 14356247, 12694753, 11187900, 9839881, 8198834, 6475722, 5339071, 4993064, 5110603, 5410680, 5724408, 5718141, 5150567, 4302933, 3640110, 3134606, 2432764, 1615410, 1217367, 1421622, 1751545, 1724918, 1392553, 1053297]
40908A053297k29028q9656K11180O43769R11086P62728K17350m17776o14537j7140
40898B431273R89193J478961J089160M87118L18077K52054k34862o80401k53556
40889E877017P37370J105417N40127m8169r8497j14057m16071m04053K14353N16022
40879G909459l21457j554677j795483r00872R0062N47203P13357P58624M54477
40870E900693j10515l95546k20311k4299j09026k21504j00383J00412J83768K93604
40860E296893O83930J336095J888781J791743P05712r13148j865340j365206j248
40851G558212R92515J230653J271237J395634J198497M90213k80912p99435j297267
40842A1759347j831171j868512j075368N4340Q24844J105280J067189O96706O9924
$$ y = [1053297, 824269, 734613, 945793, 1589562, 2500648, 3263376, 3480726, 3062950, 2448413, 2431273, 3420466, 4899427, 5988587, 6475705, 6793782, 7045836, 6810974, 6130573, 5877017, 6614387, 7719804, 8259931, 8211762, 8113265, 7999208, 7583137, 7179084, 7393437, 7909459, 7588002, 6033325, 4237842, 3336970, 3427032, 3974235, 4687592, 5446216, 5900693, 5790178, 5394632, 5174321, 5150022, 5040996, 4819492, 4719109, 4819521, 5003289, 5296893, 5980823, 7316918, 9205699, 10997442, 11703154, 10790006, 8924666, 7559460, 7558212, 8550727, 9781380, 11052617, 12448251, 13646748, 14136961, 13856049, 13056614, 11759347, 9928176, 8059664, 6984296, 7038636, 7863480, 8968760, 10035949, 10732655, 10802579]
40833A0802579l54536k79005p3836k53443p33884j036551r30775m79173K23613
40824F884989R57192J380948J539836J935289K599410K588386J122564j079218
40816A7929396k403842k195692j309027q30912r26936j072705q61028l35838J59646
40807H153062L21547K29338K86339O42724R06063P12047K78966j6901k78157p25107
40797A0509921r89132n04225N02032J145088J034029O44719N57866R90324K006165
40788A5896787L317363L812099K347152n57909k759868k869583j833699j439934
40780A5912408j984677k384035k061250j520681j160654o95954l4042K52953j39686
40771F184382n46210k00257O29537J028076P27076L73698N52962J110522J531023
$$ y = [10802579, 10448043, 10169038, 10095202, 9841759, 9107875, 8071324, 7140549, 6661376, 6884989, 7842181, 9223129, 10762965, 12698254, 15297664, 17886050, 19008614, 17929396, 15525554, 13329862, 12020835, 11189923, 10262987, 9190282, 8329254, 7993416, 8153062, 8474609, 8703947, 8990286, 9633010, 10539073, 11251120, 11530086, 11513185, 11235028, 10509921, 9520789, 9016564, 9518596, 10663684, 11697713, 12342432, 12900298, 13890622, 15896787, 19214150, 23026249, 25373401, 24815492, 22055624, 19186041, 17352342, 15912408, 13927731, 11543696, 9482446, 7961765, 6801111, 6105157, 6071115, 6324068, 6184382, 5638172, 5437915, 6067452, 7095528, 7822604, 8196302, 8749264, 9859786, 11390809]
40762A1390809J493942Q99841j73739j269216j721109j383992q35415n00468m4494
40753G856159P92991J269488N15651q81617j365694o32903j11534p10176j367026
40744E365339q18118K78298L79886m54228p14489J25475R05753P08928Q2473j25568
40734E733749L7995J81965L09133L85618P4520m53800l11818P64366J665834J359395
40724I746957M06282J06429O91637J367058J703879J900972J916617J463475Q50508
40715B0153814Q05665J333772J655567J454932J287636J431892J185593j27072
40707B9181799k014574l276603l312542k526857j641749j022633o45412m44362
40699A4297067n50776j111232j846738k054543j359465k90121L04950K93805K18593
$$ y = [11390809, 12884751, 13784592, 13610853, 12341637, 10620528, 9236536, 8401121, 7900653, 7856159, 8649150, 9918638, 10434289, 9552672, 8186978, 7554075, 7442541, 6732365, 5365339, 4547221, 4825519, 5205405, 4751177, 4036688, 4162163, 5067916, 5776844, 5859317, 5733749, 5771744, 5953709, 6262842, 6648460, 6722980, 6269180, 5957362, 6721728, 8387562, 9746957, 10153239, 10259668, 10951305, 12318363, 14022242, 15923214, 17839831, 19303306, 20153814, 20959479, 22293251, 23948818, 25403750, 26691386, 28123278, 29308871, 29181799, 27167225, 23890622, 20578080, 18051223, 16409474, 15386841, 14741429, 14297067, 13746291, 12635059, 10788321, 8733778, 7374313, 7084192, 7389142, 7682947, 7901540]
40690G901540L06017J82435l06469o78887n57891k60126j99462j74338J91841
40681F404660O14688L84675o28691j712736k075404j498118k62972J102700J905183
40672D233985J598728M01050o32438n73754L20757Q39438K18307r62833j526160
40663C917080j118543m88027l94602p45115r91462r16483o42642k19399K87483
40654a311710N13707J73183l69184m78421j96440j82848n98004p25234m2862R11445
40644b306368J247377Q87827M79349L91854L84464K03737j62L1764K74487M56947
40634B051276L58799L1023k32809k28147j62699m18652r02526r78271l02652O08866
40624a75792J029723R51154Q89086R80981Q58230L53687k44729o80499r19577
$$ y = [7901540, 8207557, 8389992, 8083523, 7404636, 6846745, 6586619, 6387157, 6212819, 6404660, 7019348, 7404023, 6775332, 5062596, 2987192, 1489074, 1226102, 2328802, 4233985, 5832713, 6233763, 5601325, 5027571, 5348328, 6187766, 6406073, 5443240, 3917080, 2798537, 2310510, 1915908, 1170793, 179331, -737152, -1379794, -1599193, -1311710, -798003, -624820, -994004, -1472425, -1668865, -1851713, -2449717, -3174951, -3217813, -2306368, -1058991, -171164, 308185, 700039, 1084503, 1288240, 1288078, 1319842, 1594329, 2051276, 2410075, 2441098, 2208289, 1980142, 1817443, 1398791, 496265, -482006, -784658, -175792, 853931, 1805085, 2694171, 3675152, 4533382, 4887069, 4642340, 3961841, 3042264]
40615C042264q11227j92066N16314N22276j72153n25052O3750O80117J57412j038939
40605B242696j305542k32562P38652L87349n93928p50287L8763O42406N05422
40596A672969K75659N30829Q71877O80172M2568n72045r89678j155866p99544
40587E56941N9788O52128K98248m68195m53900N12192J298464J069184L26804
40578C851654n7905q7798k53248m82976l15232J62825L74189J98867J28058M01101
40568C919535O52731N92905M45316M52297M44699J96594k13178o54843j114415
40559D721641j318363p28703O11954J724601J839175J512165J766429K332551
40551A2461450J826425r3555j800860j641428j16247P75729O3849j252013j785765
$$ y = [3042264, 2231037, 2038971, 2555285, 3077561, 2905408, 2380356, 2444106, 3124223, 3281635, 2242696, 937154, 704592, 1443244, 1830593, 1236665, 486378, 525141, 1167547, 1672969, 1948628, 2479457, 3351334, 4031506, 4074074, 3502029, 2512351, 1356485, 556941, 616729, 1268857, 1567105, 1098910, 645010, 1157202, 2455666, 3524850, 3851654, 3793749, 3705951, 3452703, 2969727, 2654495, 2817320, 3191509, 3390376, 3518434, 3919535, 4572266, 5165171, 5610487, 6062784, 6507483, 6704077, 6490899, 5836056, 4721641, 3403278, 2674575, 3286529, 5011130, 6850305, 8362470, 10128899, 12461450, 14287875, 14194320, 12393460, 10752032, 10635785, 11411514, 11475363, 10223350, 8437585]
40542H437585j387128q16149m96971k56771j8680p4968n64394j102003j168318
40533B552203p04745j50717N8767p3067j78966R158L35628M49689L53921N29888
40523C181759J333577K365828K711492J866709K54386j232114k003779k018385
40515F459473j522229q36748l07090j52680k85505m33007m72475m80806m37988
40506A530945j36862M48356Q96615P18533j4422o33666n44586J61336Q13123Q25421
40496D064793K33026m14676o79614o89364q39530j099556r45097j44160P46716
40487B32538J053307Q83091Q27744R55254Q33165N82806J002892K211205K966582
40478A1548584K098292J02664j486149j947888j737560j294993n61789L13279
$$ y = [8437585, 7050457, 6234308, 5737337, 5480566, 5461886, 5386918, 4822524, 3720521, 2552203, 1847458, 1696741, 1755508, 1682441, 1503475, 1512633, 1848261, 2297950, 2651871, 3181759, 4515336, 6881164, 9592656, 11459365, 11713751, 10481637, 8477858, 6459473, 4937244, 4100496, 3793406, 3640726, 3355221, 2922214, 2449739, 1968933, 1530945, 1394083, 1842439, 2739054, 3457587, 3443165, 2809499, 2264913, 2426249, 3239372, 4064793, 4297819, 3883143, 3203529, 2514165, 1674635, 575079, -370018, -514178, 232538, 1285845, 2168936, 2996680, 3951934, 4785099, 5367905, 6370797, 8582002, 11548584, 13646876, 13749540, 12263391, 10315503, 8577943, 7282950, 6721161, 7034440]
40470G034440Q67432J183854J872438K788925K752534J205713o59493j285391
40462A5760452p09076k76065p68625j685833k200316k029279j382615o87509l73250
40453E647884m61644m80353j84094l3697l90113o57708r2601Q17105Q28704k27151
40443D766332j164002j148328o38961k87208N8724O69328J130911R65775M38328
40434D790899N5013k24142o10639q05668m36492J46216K27385k83530q11424r12362
40424A135256n91270R471P02870J122045R53325K91225m96672j087986j183066
40415H55198n58373M69203J034620O96828Q0406O371L45122L91944O7148n9501
40405C328966J89396L29051L0960m29105o02556k53575N99061J495736J589987
$$ y = [7034440, 7901872, 9085726, 10958164, 13747089, 16499623, 17705336, 17045843, 15760452, 15051376, 14775311, 14006686, 12320853, 10120537, 8091258, 6708643, 6021134, 5647884, 5186240, 4705887, 4521793, 4488096, 4097983, 3440275, 3347674, 4164779, 4993483, 4766332, 3602330, 2454002, 1815041, 1527833, 1586557, 2255885, 3386796, 4352571, 4790899, 4845912, 4621770, 4011131, 3205463, 2768971, 2915187, 3142572, 2859042, 2047618, 1135256, 543986, 553457, 1256327, 2378372, 3331697, 3622922, 3126250, 2038264, 855198, 296825, 766028, 1800648, 2497476, 2577882, 2584253, 2929375, 3321319, 3388467, 3328966, 3518362, 3847413, 3878373, 3449268, 2846712, 2593137, 3192198, 4687934, 6277921]
40396F277921N67476o67580r98709o07806n47973r53821q89355j17623L30101
40387B392631j06550m69819J41244R76917P43466l90102j091109p86306j28732
40378A281640K99105O20015Q94050P23403o939p14653q74087o91359o19177n64074
40368C47924n5076Q99785J542327J152846P419p17359j98144J017179J603045
40359E599946J046385J55404j58544l833M564j73454j43095n206l29856j158079
40349D834232j717095j372197m04432M06203O47860N01051L28376K74939K22980
40340C721917M7210j21787j4235L38318N12406K49894j07034k7567N02728R51923
40330F053773P85216j40168j435545k188702j562325J11343J236718O55147q25713
$$ y = [6277921, 6845397, 6177817, 5179108, 4571302, 4023329, 3069508, 2180153, 2062530, 2392631, 2286081, 1816262, 1957506, 2934423, 3677889, 3287787, 2196678, 1410372, 1281640, 1580745, 2200760, 3094810, 3818213, 3811274, 3096621, 2222534, 1531175, 911998, 347924, 292848, 1192633, 2734960, 3887806, 3895225, 3177866, 2979722, 3996901, 5599946, 6646331, 6801735, 6643191, 6639358, 6643922, 6470468, 6327373, 6322167, 5992311, 4834232, 3117137, 1744940, 1340508, 1746711, 2394571, 2895622, 3223998, 3498937, 3721917, 3769127, 3647340, 3633105, 3971423, 4483829, 4733723, 4626689, 4599122, 5101850, 6053773, 6838989, 6698821, 5263276, 3074574, 1512249, 1623592, 2860310, 3515457, 2689744]
40321B689744j398342n89930K99254J31646o89848j100182p48722m463P10539
40312g00304J051579P86955K29982J29455O33907R00133K87045o22827q90014
40303A805911n96981n02086o78209m95112J43405N47742L69580P9074J1577k43156
40293D41745r91388j609877j238749J4568J166005J527465J291155R66044O96693
40284B263661L15966j99404n82469n70432k26626J00024J47511K0321K3776K46122
40274A538450M29542K95583j18686n36592p57997p54528m94164R1230Q15803J101828
40264A610469M83816o82110j348134q69836K39371R37320Q40071L97640N3510
40255A662117k14354m81447n75104l99151j24438J46851M94510P91852O95518
$$ y = [2689744, 1291402, 701472, 1000726, 1132372, 442524, -657658, -1406380, -1410843, -700304, 351275, 1138230, 1368212, 1497667, 2131574, 3031707, 3318752, 2695925, 1805911, 1208930, 706844, 28635, -466477, -323072, 224670, 594250, 673324, 684901, 441745, -549643, -2159520, -3398269, -3383701, -2217696, -690231, 600924, 1566968, 2263661, 2579627, 2380223, 1797754, 1227322, 1000696, 1100720, 1248231, 1268552, 1292328, 1538450, 1967992, 2263575, 2144889, 1608297, 850300, 95772, -398392, -307162, 508641, 1610469, 2094285, 1412175, 64041, -805795, -566424, 370896, 1210967, 1608607, 1662117, 1447763, 966316, 391212, -7939, -132377, 14474, 508984, 1300836, 1996354]
40246A996354K37272j20743k66080n92860j020356p14290N25832J448549R47773
40237B441451j85660l74845L33087M68808l63310q41448j41027P36420N92455
40228B665931k44567p22647o10568l02594R7535N27187M98815j18474m57915J63810
40218A496513R62758P25317k91962p57691l31807L058k88227n25057j53153L18129
40208A157878K77941j8644q3835o9923l32887o45902n03853R7631O95719R40783
40198A514908P78078L10878j88926l75082k00421L4743J54824K64126K82153j40972
40188B434309r12177j238536n99207M31479Q96558O67104L33852J64696q8533
40179B089545m22604m05311N2153L95804K36086m3968Q6670M38674L95919p5488
$$ y = [1996354, 2233626, 2112883, 1846803, 1253943, 233587, -480703, 45129, 1493678, 2441451, 2255791, 1880946, 2214033, 2682841, 2319531, 1478083, 1337056, 2073476, 2665931, 2421364, 1698717, 1088149, 785555, 883090, 1410277, 1909092, 1790618, 1332703, 1496513, 2459271, 3184588, 2892626, 2134935, 1803128, 1806186, 1517959, 992902, 839749, 1157878, 1435819, 1417175, 1333340, 1263417, 930530, 284628, -219225, -121594, 574125, 1514908, 2292986, 2603864, 2414938, 2039856, 1839435, 1874178, 2029002, 2293128, 2575281, 2434309, 1522132, 283596, -315611, 115868, 1012426, 1679530, 2013382, 2178078, 2089545, 1666941, 1261630, 1313783, 1709587, 1945673, 1901705, 1988375, 2427049, 2822968, 2747480]
40169B747480l00265J08131O43148O56419L41233M00349Q72277R98173M37280
40160F904225j01044O3855M66614K13543n62904q92938m87138o6186n3082M0765
40150E525710N34007Q40546M61913o1432L1021N50959Q54120J026717J641485
40141A1405046K616688L287810L521926L812067M164600L760074K022858n70653
40133C4020416k982327m429930m639437l885074k947693k475358k225491j503016
40125H932090m34087r688n55191j028921m86598M71329N88677j81524p19870m89328
40115F086889j81109m17413p67968n91792j56710j71568n69699n76884L6898N32786
40105C223430K89282k90514m31584j55122j75382p35521j165262p78266K14010
$$ y = [2747480, 2447215, 2555346, 3198494, 3854913, 4196146, 4596495, 5468772, 6466945, 6904225, 6803181, 6867036, 7333650, 7547193, 6984289, 6091351, 5604213, 5538027, 5484945, 5525710, 6059717, 6900263, 7362176, 7300744, 7331765, 7882724, 8736844, 9763561, 11405046, 14021734, 17309544, 20831470, 24643537, 28808137, 32568211, 34591069, 34020416, 31038089, 26608159, 21968722, 18083648, 15135955, 12660597, 10435106, 8932090, 8498003, 8488315, 7933124, 6904203, 6417605, 6888934, 7477611, 7296087, 6576217, 6086889, 5905780, 5488367, 4720399, 4128607, 3971897, 3800329, 3230630, 2653746, 2690644, 3223430, 3512712, 3222198, 2790614, 2635492, 2460110, 1724589, 559327, -218939, -4929]
40096d929R52189Q64216J54449m88648n54756j94593k5764k94484m28701J43066
40086A22045R21982Q41382j10007o85097j60947O13350N99253J10812L8635K78515
40076B569923J28812k47797j18419K96592L8044q03236r77880j09945N59117Q9604
40066A424815p25567o87907N8121N48807M90391K69294P8936n6271J11303N66310
40056B078232O24807j38779j017407j093096n70832k48274j24567L28226Q46642
40047F84952O38531j09922l27724J70961L30946l11706p08317N7652J244555J522979
40037C192907Q53888K87407L19174M48983K27702j47561l56163l82396k73641
40028D170300n227K50785J67392k45999n65595n39614l90312l21791j20708L88217
$$ y = [-4929, 947260, 1811476, 1965925, 1477277, 922521, 727928, 702164, 407680, -21021, 122045, 1044027, 1885409, 1775402, 1090305, 929358, 1542708, 2141961, 2252773, 2291408, 2569923, 2698735, 2450938, 2332519, 2629111, 2667155, 1863919, 886039, 776094, 1335211, 1424815, 699248, 11341, 69462, 618269, 1108660, 1377954, 1456890, 1400619, 1511922, 2078232, 2703039, 2564260, 1546853, 453757, -117075, -365349, -489916, -161690, 684952, 1323483, 1213561, 885837, 1056798, 1387744, 1076038, 367721, 425373, 1669928, 3192907, 4046795, 4334202, 4653376, 5102359, 5330061, 5182500, 4826337, 4443941, 4170300, 4165073, 4415858, 4583250, 4337251, 3771656, 3232042, 2841730, 2519939, 2399231, 2787448]
40018B787448Q15323O79297K76609M25933J199682J549258O34965r31444j774952
40009E662119j429730o68287k88688l26305n40892q78793j112999p32748K80642
40000c5681J097073J028224M54136J72532K17675M2420l81792m59999L7199N93982
39990B765769P05411M58862J77447p8011m37510r19881j326344j305085o32551
39981e91893L51294Q27721L99339l22493m86617j02032K04618K49416L15899K84402
39971A129654k64965r72907p91966M03622J245923O06783q09076j408732p40106
39962a601770L02125R86566J461526J887096J763873O59948q13809j350074l43738
39953B951743J324027K090068J270441l22703j347868j304009p68714m97163o48811
$$ y = [2787448, 3602771, 4282068, 4558677, 4984610, 6184292, 7733550, 8368515, 7437071, 5662119, 4232389, 3564102, 3275414, 2949109, 2408217, 1529424, 416425, -316323, -35681, 1061392, 2089616, 2543752, 2716284, 2933959, 2976379, 2594587, 2134588, 2171787, 2765769, 3471180, 3930042, 4107489, 4029478, 3591968, 2672087, 1345743, 40658, -591893, -240599, 587122, 986461, 663968, 177351, 75319, 279937, 529353, 845252, 1129654, 864689, -108218, -900184, -496562, 749361, 1356144, 547068, -861664, -1601770, -1299645, -313079, 1148447, 3035543, 4799416, 5459364, 4645555, 3295481, 2951743, 4275770, 6365838, 7636279, 7313576, 5965708, 4661699, 3892985, 3395822, 2747011]
39944B747011q64082p57191k65256K81374M68315L67900O02482J478342K288185
39935F347080K041858P81396m70531j035024j128040j057300p41668k95915k28685
39926D213171n91923o95919k19711J31015k49298p73895n55004J52977L86329
39917A797742J9244j50178K48412P09267Q23637P90063P43935M03462k71107p57252
39907D357225p25564n42920n60600l97810M82549J793323K647182K686480K449403
39898A2189268K554940L010057L509965L949624M181413L542953J342043j968322
39890C2311941m650191n242635m069809k736552k266140k276929j969474j256603
39882G843608o24464l52630k71917o5897M41349J095220J367605Q00581l42809
$$ y = [2747011, 1882929, 1125738, 860482, 1141856, 1610171, 1978071, 2580553, 4058895, 6347080, 8388938, 9170334, 8699803, 7664779, 6536739, 5479439, 4737771, 4441856, 4213171, 3621248, 2925329, 2705618, 2836633, 2587335, 1813440, 1258436, 1411413, 1797742, 1816986, 1666808, 1915220, 2624487, 3448124, 4238187, 4982122, 5385584, 5114477, 4357225, 3631661, 3088741, 2528141, 2130331, 2612880, 4406203, 7053385, 9739865, 12189268, 14744208, 17754265, 21264230, 25213854, 29395267, 32938220, 34280263, 32311941, 27661750, 22419115, 18349306, 15612754, 13346614, 11069685, 9100211, 7843608, 7219144, 6866514, 6594597, 6528700, 6970049, 8065269, 9432874, 10233455, 9890646]
39873I890646j195174j237688q07069m82988l82366l29236l24271m75032p10899
39864C945923q43868p08421j52395P31828J312226R50487J6168l38896K51253
39855E164305Q02550M70981k38749m78877m50207p80431j149066p50891J86360
39846B775975N74959J17766l09625m4851N27261P13796L29717l68893r30412q62128
39836B523565j59673M11345K34336j78199L3150N82859M54987l02365n33441P6002
39826C142566L75482l95529j346885j278048l07551O18311J025131R29210K92924
39817C055611o61707j129620n64295M81974J017586P94605K90385j07766l32588
39808B844185l84296l57445m24819m35005L1012Q39585J130910M66626m40996
$$ y = [9890646, 8695472, 7457784, 6650715, 6167727, 5785361, 5456125, 5131854, 4656822, 3945923, 3102055, 2393634, 2241239, 2973067, 4285293, 5235780, 5251948, 4913052, 5164305, 5966855, 6437836, 6199087, 5720210, 5270003, 4489572, 3340506, 2589615, 2775975, 3350934, 3468700, 3159075, 3114224, 3641485, 4355281, 4684998, 4316105, 3385693, 2523565, 2363892, 2775237, 3009573, 2831374, 2864524, 3447383, 3902370, 3600005, 3066564, 3142566, 3518048, 3122519, 1775634, 497586, 190035, 808346, 1833477, 2762687, 3055611, 2393904, 1264284, 699989, 1181963, 2199549, 2994154, 3284539, 3176773, 2844185, 2459889, 2102444, 1677625, 1242620, 1273632, 2113217, 3244127, 3710753, 3269757]
39799C269757p22491m72860k33723j402M19559O33577J95469m48328n31310j84650
39789A923598r5293j96515J87759R53244J141113M76818o0810L57654J256084
39780E943652J604187J120887L26540k80602o28681q71592j104962j206025r11290
39771C992114k23708L56738L39754j12130m46027m99759n04251m15880O3002P30091
39761C279944Q79674L10840l04656m08272l22202n90889j063343j179184q18345
39752b16433l05064J99601P37108J101716R45127M07736J39903M57599Q32813
39743D300106N66014k07989n91074p2926P33193Q12807M9450o36571n25827n634
39733D421549J10816j88055j60650M68299R70660N83586l92623q91734l53087
$$ y = [3269757, 2547266, 2074406, 1840683, 1839281, 2258840, 2892417, 3087886, 2639558, 2108248, 1923598, 1828305, 1631790, 1819549, 2772793, 3913906, 4390724, 4329914, 4687568, 5943652, 7547839, 8668726, 8995266, 8714664, 8085983, 7214391, 6109429, 4903404, 3992114, 3768406, 4125144, 4464898, 4352768, 3906741, 3406982, 2902731, 2486851, 2549853, 3279944, 4159618, 4470458, 4165802, 3757530, 3435328, 2844439, 1781096, 601912, -216433, -521497, -321896, 415212, 1516928, 2462055, 2869791, 3009694, 3467293, 4300106, 4866120, 4658131, 4067057, 3994131, 4727324, 5540131, 5589581, 4953010, 4427183, 4421549, 4532365, 4344310, 4183660, 4651959, 5622619, 6206205, 5813582, 4921848, 4568761]
39724D568761O63585J176808Q35640J13184m09184o72009r55450j301137j427554
39715B592644j196573q37970n94337m12625j54429J28016L27715M82167O21470
39706I56078O17203M05896J59795L890j99424n06819o07177k57436K27478L73318
39696A172802K54229K78072L80633P4095o17920r15407k96317P04620J143141
39687B177948Q55059N43157P25479J026004P29852j76150q89998q07229k99800
39678C884322j29174l04405j18713O32390J159786P74257j00089n55167m22715
39669D820492k31106k29897j71697M2572J87614K07856K91870L87103J87700k88767
39659E203740o13750n76398m67117n89813q53859r67160p44759k07862L37892
$$ y = [4568761, 5232346, 6409154, 7244794, 7357978, 6948794, 6276785, 5321335, 4020198, 2592644, 1396071, 558101, -36236, -448861, -603290, -475274, -147559, 334608, 956078, 1573281, 1979177, 2138972, 2142862, 1943438, 1436619, 829442, 572006, 799484, 1172802, 1427031, 1705103, 2085736, 2159831, 1541911, 626504, 330187, 1034807, 2177948, 3033007, 3576164, 4301643, 5327647, 6057499, 5881349, 4991351, 4184122, 3884322, 3755148, 3450743, 3332030, 3964420, 5124206, 5898463, 5798374, 5243207, 4820492, 4589386, 4359489, 4187792, 4230364, 4417978, 4625834, 4917704, 5304807, 5492507, 5203740, 4589990, 4013592, 3546475, 2956662, 2102803, 1135643, 390884, 183022, 520914]
39650E20914M26295Q337k75383P3704N06350J01951r00379j171150j51335J031951
39640A71255J041657M8621o97393n73176j16493J1774o9006J91520Q39272J168198
39630B016229N58689n52065r64766k26151O29814M16576n22661q27577j28445
39621C99643N32220M12420O3268J35808K51610j45699o23894m20150K25868L71946
39611A203040k13895p99175p85783l42013P9995K45060Q9553k94749n13197j34993
39601a466157P26625J389706J306413O23785l7459k49150j48285j52797l48808
39592A643873l40782J25352O24445N41096l3163m16917l24680j32514j00704j9451
39582A566555J80316J80763m7411l6161L11216L67674j76868o29692l21001K99066
$$ y = [520914, 947209, 955546, 680163, 753867, 1260217, 1362168, 461789, -709361, -860696, 171255, 1212912, 1261533, 564140, -9036, -125529, -113755, -182761, 8759, 848031, 2016229, 2574918, 2022853, 1058087, 831936, 1461750, 1878326, 1355665, 528088, 399643, 931863, 1344283, 1407551, 1543359, 1794969, 1649270, 1025376, 605226, 831094, 1203040, 989145, 189970, -595813, -937826, -857831, -612771, -523218, -817967, -1331164, -1466157, -739532, 650174, 1956587, 2580372, 2542913, 2293763, 2145478, 1992681, 1643873, 1303091, 1428443, 2052888, 2593984, 2560821, 2143904, 1819224, 1686710, 1586006, 1566555, 1746871, 1927634, 1880223, 1844062, 2155278, 2522952, 2346084, 1716392, 1395391, 1694457]
39572A694457L61901j03770l68136j66298J07113J14007k06835q64444j580541
39563a012546j617981n74257Q68061J650163J541422R93619K06025p79794j371957
39554i7245q99077K26377Q04603M42370q914K10071P81454R37085M49227k81842
39544B564109p13572o12835l27584m80081j040650j096578j32327R65263J072213
39535A97958N21705M46999P76579L91727p23138j167624m06782K43129k64202
39526A6351j004655o26051N12861J045567O99364L72345N14711O59367M40068
39517B629928N3004l12001o77832q64965n62309P9596M59371K49736k36800m39679
39507C78049o8202O92522J287063J240146O48811J8497m12398p45488p98682j70538
$$ y = [1694457, 2056358, 1952588, 1584452, 1418154, 1525267, 1639274, 1432439, 567995, -1012546, -2630527, -3204784, -2336723, -686560, 854862, 1848481, 2054506, 1274712, -97245, -996322, -769945, 34658, 477028, 468114, 678185, 1459639, 2396724, 2845951, 2564109, 1850537, 1237702, 910118, 430037, -610613, -1707191, -1839518, -874255, 197958, 719663, 1166662, 1943241, 2334968, 1611830, 444206, 37424, 280553, 16351, -988304, -1614355, -1101494, -55927, 643437, 1015782, 1530493, 2189860, 2629928, 2682932, 2370931, 1693099, 828134, 265825, 345421, 804792, 1054528, 817728, 378049, 309847, 1002369, 2289432, 3529578, 4178389, 4196886, 3784488, 3039000, 2240318, 2069780]
39497B069780P73385Q67804k50134j305502j039044k4297K63399l05699n21742
39488E27950P7333N30651J12727n88243p73715n80222m41527j54191N81781J276766
39478E69310J214190N98229K91488N19671O38570K51595k03727k58785j51789
39469C468752k93839m73970k20358K91928L93776k6927l31161j80239p7003m23415
39459B127544o81387j64653Q01267J367870J518769J915891K436052K007758K62595
39450A1591706j644990k439026k146150j509397p64950J63940Q52837P54954J49412
39441E008336j43138J09996M01530L41494O306m60756r44908j125091p63643j80138
39431B249988J29056K26150M75958P25094N03988j5993j18065L10859N54296J93901
$$ y = [2069780, 2843165, 3710969, 3460835, 2155333, 1116289, 1091992, 1355391, 1049692, 527950, 605283, 1135934, 1248661, 660418, -113297, -693519, -1135046, -1289237, -707456, 569310, 1783500, 2381729, 2673217, 3192888, 3831458, 4083053, 3879326, 3620541, 3468752, 3174913, 2700943, 2480585, 2772513, 3166289, 3139362, 2808201, 2627962, 2550959, 2127544, 1446157, 1281504, 2082771, 3450641, 4969410, 6885301, 9321353, 11329111, 11591706, 9946716, 7507690, 5361540, 3852143, 3087193, 3251133, 4103970, 4858924, 5008336, 4865198, 4975194, 5376724, 5718218, 5724524, 5263768, 4318860, 3193769, 2430126, 2249988, 2379044, 2605194, 3081152, 3806246, 4310234, 4294241, 4176176, 4487035, 5041331, 5235232]
39421E235232l27486n45792n90460n78762j76702O80367J288409J061417M22383
39412F468606J33673J58130n9295m79313n08316r9972L7330m44674r08678o17994
39402C679497K43899R15780J103124J136287J199642R91115L31121l41124m60895
39393H798446j03556J57749Q4767L4522L33988Q28162J250033J664971K236361
39384A5285443K814212L090230K975195K511783J597666J61341j474916k721695
39376B4239259l178528k811466j899082j035466q62091j383419j793476j424820
39368I850911o25652k01606k71973l29810k20189k70291n10223n87874n11605
39359F321688o39166q01607l62676N58238Q96511K07201m90511j99672M86266
$$ y = [5235232, 4907746, 4361954, 3771494, 3192732, 3016030, 3696397, 4984806, 6046223, 6468606, 6602279, 6760409, 6701114, 6221801, 5713485, 5613513, 5650843, 5206169, 4297491, 3679497, 3923396, 4839176, 5942300, 7078587, 8278229, 9269344, 9600465, 9259341, 8798446, 8694890, 8852639, 8937406, 8971928, 9305916, 10134078, 11384111, 13049082, 15285443, 18099655, 21189885, 24165080, 26676863, 28274529, 28435870, 26960954, 24239259, 21060731, 18249265, 16350183, 15314717, 14452626, 13069207, 11275731, 9850911, 9225259, 9023653, 8751680, 8421870, 8201681, 7931390, 7421167, 6833293, 6321688, 5682522, 4880915, 4518239, 5076477, 5972988, 6180189, 5689678, 5490006, 5976272]
39350E976272K90008p64516j387700r25843j79463j06226n38322o47786j91859
39341A524565K38429R8603l66565m29193J58588P58248O19001j09594n71800m01359
39331A518923j51597l27615n98622m15490R3205M15836M69733M97976M54213J73961
39321B130523m1151K53272Q08001R00867M28157N1525J20749J75594j92595o43185
39311C991757o83962m55096m05116n18696l78976J66778Q30320J283447J382626
39302E213082J049939K83655o38012j205317j091078m85773M6636J01530j46105
39293C128557j33816L76906Q97611P41365j09883r57915j216592r59201n60865
39284A206167j74099K02551M32688L58621P9835j53645k34074j66433J15959O15978
$$ y = [5976272, 6266280, 5501764, 4114064, 3188221, 3008758, 2902532, 2364210, 1716424, 1524565, 1762994, 1861597, 1495032, 1065839, 1224427, 1982675, 2601676, 2492082, 1920282, 1518923, 1367326, 1039711, 441089, 25599, 118804, 534640, 1004373, 1502349, 1956562, 2130523, 2089372, 2342644, 3150645, 4051512, 4479669, 4531194, 4651943, 4827537, 4634942, 3991757, 3307795, 2852699, 2447583, 1928887, 1549911, 1716689, 2547009, 3830456, 5213082, 6263021, 6546676, 5908664, 4703347, 3612269, 3126496, 3173132, 3274662, 3128557, 2994741, 3371647, 4269258, 5010623, 4900740, 3942825, 2726233, 1767032, 1206167, 1032068, 1234619, 1667307, 2025928, 2105763, 1952118, 1718044, 1551611, 1667570, 2283548]
39274B283548J031788R90560N67382K79275M43085P67759P46063K79515k81071
39265G107904n98233o14595m07352o6297J96314R3434l40788n89274k25931M17780
39255D972962N72003Q5854k98767k670N00601L57100l80509q07664m91773m1348
39245D465789j07554m41405m35951j77413k87617q22048r74791j18689J234732
39236B335053J858143J131953k65134j071778p78793p3120J52568k2307J96558
39227C463143R43392J282687N56890n03165p66533l78546m26957j031410r99068
39218B140433J90400J220972O93808p60426j326438n57410K42547J81811m9382
39209A976315L40779P90714L39983p04172j116256m66358M49293Q08977N78390
$$ y = [2283548, 3315336, 4305896, 4873278, 5152553, 5595638, 6363397, 7109460, 7388975, 7107904, 6509671, 5895076, 5487724, 5421427, 5617741, 5711175, 5370387, 4781113, 4555182, 4972962, 5544965, 5630819, 5332052, 5329382, 5829983, 6187083, 5806574, 4998910, 4507137, 4465789, 4358235, 3916830, 3480879, 3303466, 3015849, 2193801, 1219010, 1100321, 2335053, 4193196, 5325149, 5060015, 3988237, 3209444, 3136324, 3288892, 3266585, 3463143, 4406535, 5689222, 6246112, 5742947, 4976414, 4597868, 4170911, 3139501, 2140433, 2330833, 3551805, 4245613, 3485187, 2158749, 1601339, 1843886, 2025697, 1976315, 2317094, 3107808, 3447791, 2743619, 1627363, 1161005, 1610298, 2419275, 2997665]
39200B997665P4564n27759j028083j118787p64490k91780O6743L55854N31869
39191B95796L73953n7541l20032j83215P7925K08267L36801N20239M10010j80623
39181A481580p77972q35436n17091l59632m07513k68767J50342N82146R51006
39172a337J342674J477344R29541m3651o04890m64665k36814m11410o74024o34428
39162F78340n28828o30470n89494q3756L87787K26027j29995K02591R82880J005884
39152A520966k3049q96705o48595J10851L07984K4506O2860M65258N60552K54115
39142A738743J78346N04025O05484J79431j87453n229L05544J46988k79243l53117
39132B833519l999L06355L02308N6543l34696p20046p53025l12629J28732Q6444
$$ y = [2997665, 3072229, 2544470, 1516387, 397600, -366890, -658670, -591927, -236073, 295796, 669749, 612208, 292176, 108961, 186886, 395153, 731954, 1252193, 1662203, 1481580, 703608, -131828, -648919, -1008551, -1416064, -1684831, -1534489, -952343, -1337, 1341337, 2818681, 3748222, 3704571, 3099681, 2635016, 2398202, 1986792, 1312768, 678340, 149512, -480958, -1070452, -1154208, -766421, -540394, -670389, -467798, 515082, 1520966, 1497917, 601212, -47383, 63468, 371452, 395958, 458818, 924076, 1484628, 1738743, 1917089, 2421114, 3026598, 3206029, 3018576, 3013347, 3318891, 3465879, 3186636, 2833519, 2829520, 3135875, 3438183, 3494726, 3160030, 2439984, 1686959, 1374330, 1503062, 1589506]
39122A589506k04926k26826q6366k37276m78985j77428M97704O02895l6795l71276
39112H70227K37728R01505N54150l70096o60312k26662r3962o39732r98420m65724
39102h91298M23111O83301J70774l78892k94484L73693R78532R06557K10640m00955
39092A780979l82280M461J81255J52166L38557O46237M66543k46826o75667l12606
39082A952819J96380n3066r21744j437627j075211k50519L67130N27835L68177
39073c25826J27602J8883J28536L37059M46984L91875K43817R9075M4792J02745
39063A615542J07893j50642n14961m54069K41499R87175J010942L11761l92317
39054B762823o18247n64268n34344m02112M7984N57546N96492Q1628m53573n14922
$$ y = [1589506, 1384580, 1157754, 1071388, 834112, 355127, 177699, 675403, 1278298, 1241503, 870227, 1107955, 2009460, 2563610, 2193514, 1533202, 1306540, 1212578, 572846, -425574, -891298, -468187, 215114, 385888, 6996, -287488, 86205, 1064737, 1971294, 2181934, 1780979, 1398699, 1403160, 1584415, 1736581, 2075138, 2721375, 3187918, 2941092, 2265425, 1952819, 2149199, 2096133, 1174389, -263238, -1338449, -1588968, -1221838, -694003, -325826, -198224, -179341, -50805, 286254, 733238, 1125113, 1368930, 1468005, 1512797, 1615542, 1723435, 1572793, 1057832, 603763, 845262, 1832437, 2843379, 3155140, 2762823, 2144576, 1580308, 1045964, 643852, 691836, 1249382, 1845874, 1927502, 1473929, 959007]
39044I59007k28691n9103j04883l3087K45387K67720k79290q80838p88076j69015
39034a070869M3874m12814o26386J24064J184836J425365Q23142K77451J36188
39025A904851p7214m96454n53836q9958J55248k94104q02979o30005j11455q184
39015a004090j64581K00658J080491J554994J157252N05589L27542N44676O47613
39006D850144M44008J08997j15541n9306J65668L2600p65376j476877q96684Q65489
38996C153122K109759J660875M10394j44209j03542o06478j550446j521810j45145
38987C262520J071859Q73006n7065m22596k71698m82662j033571j083703m74173
38978A381917O1245J54763K23435N22576P25651O64639O31420O45014K47499n07272
$$ y = [959007, 730316, 671213, 566330, 533243, 778630, 1046350, 767060, -113778, -901854, -1070869, -1026995, -1439809, -2066195, -1942131, -757295, 668070, 1491212, 1768663, 1904851, 1827637, 1331183, 777347, 687389, 842637, 548533, -254446, -884451, -995906, -1004090, -1168671, -968013, 112478, 1667472, 2824724, 3330313, 3657855, 4202531, 4850144, 5294152, 5403149, 5287608, 5228302, 5393970, 5426570, 4661194, 3184317, 2287633, 3153122, 5262881, 6923756, 7334150, 7189941, 7086399, 6479921, 4929475, 3407665, 3262520, 4334379, 5207385, 5150320, 4727724, 4456026, 3973364, 2939793, 1856090, 1381917, 1443162, 1597925, 1821360, 2343936, 3069587, 3734226, 4365646, 5010660, 5258159, 4750887]
38968D750887n77763Q99059L343728N145431N082318L056621p9589k919564m157857
38959A4543271l577869k309511j615812j550463j278107m90191K03913K96472
38951D221703N7211o7102j35931l99051p21897p88718o23249m64080k93786M0085
38941H25185L12310N3454o83128j146618p67093R1648N87304M21390O2579M0766
38931b02203L61771O30885M83930j12079p45725q08053j73914M45920K94935l23321
38921a47854l70810L76577R20565N97590J73515N79977J303123J206399N15169
38912E154251N33558J379964J540721K01437j332284j440549l79931L93620L16654
38903F367441m7865l48394p42407j048343q07068k44787j18853m61358m83451
$$ y = [4750887, 4173124, 5072183, 8415911, 13561342, 18643660, 21700281, 21620692, 18701128, 14543271, 10965402, 8655891, 7040079, 5489616, 4211509, 3721318, 3925231, 4221703, 4278914, 4211812, 4075881, 3676830, 2954933, 2166215, 1542966, 1078886, 785100, 825185, 1137495, 1190949, 507821, -638797, -1405890, -1314242, -726938, -305548, -242969, -202203, 159568, 790453, 1274383, 1162304, 416579, -391474, -565388, -119468, 175467, -147854, -518664, -142087, 778478, 1376068, 1549583, 2129560, 3432683, 4639082, 5154251, 5687809, 7067773, 8608494, 8809931, 7477647, 6037098, 5657167, 6050787, 6367441, 6319576, 5971182, 5228775, 4180432, 3373364, 3128577, 3009724, 2548366, 2064915]
38894B064915L4637K90632j62036n51878q9159P45102R58548N71553M44394Q25548
38884E132256J037933P29111O17181J523308L046113L697980K408735k87569k667203
38875A5237845l417340k742262j811896j321743r85446m12939J25798J84323o9628
38866D786712j25847J2831j52640p63307j313136j326645q79301l03632K02493
38857A37528M88193L82977P2k18573n9323J44625N7036j08111J6564K80942K85198
38846A407128J48896L50507P80028O76092k14351j061753j020803l69345K8582
$$ y = [2064915, 2099552, 2390184, 2228148, 1676270, 1587111, 2332213, 3290761, 3862314, 4306708, 5132256, 6170189, 6899300, 7516481, 9039789, 12085902, 15783882, 18192617, 17905048, 15237845, 11820505, 9078243, 7266347, 5944604, 4959158, 4546219, 4672017, 4856340, 4786712, 4660865, 4673696, 4521056, 3757749, 2444613, 1117968, 238667, -64965, 137528, 625721, 1008698, 1008770, 790197, 730874, 875499, 932535, 824424, 840988, 1121930, 1407128, 1556024, 1906531, 2686559, 3362651, 3148300, 2086547, 1065744, 696399, 724981]
$$ [...]
##END NTUPLES=NMR SPECTRUM
##END=
