##TITLE=31Pdec_DE-172_TEST_PH-Cly
 D2O, 64 sc
17.8.2026
##JCAMPDX= 6.0         $$ Bruker NMR JCAMP-DX V2.0
##DATA TYPE= NMR SPECTRUM
##DATA CLASS= NTUPLES
##ORIGIN= UXNMR, Bruker Analytische Messtechnik GmbH
##OWNER= root
$$ XWIN-NMR		Version 3.5
$$ Mon Aug 17 14:56:28 2026 Russian Standard Time (UT+4h)  she@DPX200
##.OBSERVE FREQUENCY= 81.013821
##.OBSERVE NUCLEUS= ^31P
##.ACQUISITION MODE= SIMULTANEOUS
##.ACQUISITION SCHEME= undefined
##.AVERAGES= 64
##.DIGITISER RES= 17
##SPECTROMETER/DATA SYSTEM= spect
##.PULSE SEQUENCE= zgpg30
##.SOLVENT NAME= CDCl3
##.SHIFT REFERENCE= (INTERNAL, CDCl3, 0, 197.392)
##AUDIT TRAIL= $$ (NUMBER, WHEN, WHO, WHERE, WHAT)
$$ ##TITLE= Audit trail, XWIN-NMR		Version 3.5
$$ ##JCAMPDX= 5.01
$$ ##ORIGIN= Bruker BioSpin GmbH
$$ ##OWNER= she
$$ F:/spectra/data/she/nmr/P31/2/pdata/1/auditp.txt
$$ ##AUDIT TRAIL=  $$ (NUMBER, WHEN, WHO, WHERE, WHAT)
(   1,<2026-08-17 14:43:21.64 +0400>,<she>,<DPX200>,
      <created by zg, POWCHK disabled, PULCHK disabled
       configuration hash MD5:
       00 E9 B6 7A A2 85 ED C7 34 08 36 98 17 FE 4E 26
       data hash MD5: 32K
       2C A6 B2 28 31 B9 D3 4E FB BB 61 0F 54 F1 F7 73>)
(   2,<2026-08-17 14:55:07.90 +0400>,<she>,<DPX200>,
      <Start of raw data processing
       efp BC_mod = 2 LB = 1.5 FT_mod = 6 PKNL = 1 PHC0 = 1926.62 PHC1 = 155.2984 SI = 64K 
       data hash MD5: 64K
       31 6B 45 6A EE 9B 2A F0 26 69 DB 5A A7 AB AD 01>)
(   3,<2026-08-17 14:55:37.17 +0400>,<she>,<DPX200>,
      <pk PHC0 = 66.45155 PHC1 = -177 
       data hash MD5: 64K
       3D D5 8F 89 A9 0B 7B E1 30 5B 08 EB 25 8D 48 C4>)
$$ ##END=
$$ 
$$ hash MD5
$$ C7 22 53 B2 26 97 8E E0 7A FB 7C 4A 45 F4 06 5A
##$RELAX= 
##$RELAX= 
##$RELAX= 
##$RELAX= 
##$RELAX= 
##$RELAX= 
##$RELAX= 
##$RELAX= 
$$ Bruker specific parameters
$$ --------------------------
##$DU= <F:/spectra>
##$EXPNO= 2
##$NAME= <P31>
##$PROCNO= 1
##$TYPE= <nmr>
##$USER= <she>
##$AMP= (0..31)
100 100 100 100 100 100 100 100 100 100 100 100 100 100 100 100 100 100 
100 100 100 100 100 100 100 100 100 100 100 100 100 100 
##$AQSEQ= 0
##$AQ_mod= 1
##$AUNM= <au_zg>
##$AUTOPOS= <>
##$BF1= 81.014009
##$BF2= 200.13
##$BF3= 200.13
##$BF4= 200.13
##$BF5= 200.13
##$BF6= 200.13
##$BF7= 200.13
##$BF8= 200.13
##$BYTORDA= 1
##$CFDGTYP= 0
##$CFRGTYP= 5
##$CHEMSTR= <none>
##$CNST= (0..31)
1 1 145 1 1 1 1 1 1 1 1 1 1 1 1 1 1 1 1 1 1 1 1 1 1 1 1 1 1 1 1 1 
##$CPDPRG= <waltz16>
##$CPDPRG1= <>
##$CPDPRG2= <waltz16>
##$CPDPRG3= <>
##$CPDPRG4= <mlev>
##$CPDPRG5= <mlev>
##$CPDPRG6= <mlev>
##$CPDPRG7= <mlev>
##$CPDPRG8= <mlev>
##$CPDPRGB= <>
##$CPDPRGT= <>
##$D= (0..31)
0 1 0 0 0 0 0 0 0 0.06 0 0.03 2e-05 3e-06 0 0 0.0002 0 0 0 0 0 0 0 0 0 
0 0 0 0 0 0 
##$DATE= 1786963401
##$DBL= (0..7)
120 120 120 11 120 120 24 19 
##$DBP= (0..7)
150 150 150 150 150 150 150 150 
##$DBP07= 0
##$DBPNAM0= <>
##$DBPNAM1= <>
##$DBPNAM2= <>
##$DBPNAM3= <>
##$DBPNAM4= <>
##$DBPNAM5= <>
##$DBPNAM6= <>
##$DBPNAM7= <>
##$DBPOAL= (0..7)
0.5 0.5 0.5 0.5 0.5 0.5 0.5 0.5 
##$DBPOFFS= (0..7)
$$ [...]
##$SUBNAM2= <"">
##$SUBNAM3= <"">
##$SUBNAM4= <"">
##$SUBNAM5= <"">
##$SUBNAM6= <"">
##$SUBNAM7= <"">
##$SUBNAM8= <"">
##$SUBNAM9= <"">
##$SW= 400.765351723535
##$SWIBOX= (0..15)
0 1 3 0 0 0 0 0 0 0 0 0 0 0 0 0 
##$SW_h= 32467.5324675325
##$TD= 32768
##$TD0= 1
##$TE= 0
##$TE2= 300
##$TE3= 300
##$TEG= 300
##$TL= (0..7)
0 120 53 12 22 120 120 120 
##$TP= (0..7)
150 150 150 150 150 150 150 150 
##$TP07= 0
##$TPNAME0= <>
##$TPNAME1= <>
##$TPNAME2= <>
##$TPNAME3= <>
##$TPNAME4= <>
##$TPNAME5= <>
##$TPNAME6= <>
##$TPNAME7= <>
##$TPOAL= (0..7)
0.5 0.5 0.5 0.5 0.5 0.5 0.5 0.5 
##$TPOFFS= (0..7)
0 0 0 0 0 0 0 0 
##$TUNHIN= 0
##$TUNHOUT= 0
##$TUNXOUT= 0
##$USERA1= <user>
##$USERA2= <user>
##$USERA3= <user>
##$USERA4= <user>
##$USERA5= <user>
##$V9= 5
##$VALIST= <valist>
##$VCLIST= <CCCCCCCCCCCCCCC>
##$VD= 0
##$VDLIST= <DDDDDDDDDDDDDDD>
##$VPLIST= <PPPPPPPPPPPPPPP>
##$VTLIST= <TTTTTTTTTTTTTTT>
##$WBST= 1024
##$WBSW= 4
##$XGAIN= (0..3)
0 0 0 0 
##$XL= 0
##$YL= 0
##$YMAX_a= 28697
##$YMIN_a= -26865
##$ZGOPTNS= <>
##$ZL1= 120
##$ZL2= 120
##$ZL3= 120
##$ZL4= 120
##$ABSF1= 0
##$ABSF2= 0
##$ABSG= 0
##$ABSL= 0
##$ALPHA= 0
##$AQORDER= 0
##$ASSFAC= 0
##$ASSFACI= 0
##$ASSFACX= 0
##$ASSWID= 0
##$AUNMP= <proc_1d>
##$AZFE= 0.1
##$AZFW= 0.5
##$BCFW= 0
##$BC_mod= 2
##$BYTORDP= 0
##$COROFFS= 0
##$CY= -3
##$DATMOD= 1
##$DC= 0
##$DFILT= <>
##$DTYPP= 0
##$F1P= 0
##$F2P= 0
##$FCOR= 1
##$FTSIZE= 65536
##$FT_mod= 6
##$GAMMA= 0
##$GB= 0
##$INTBC= 1
##$INTSCL= 9.790993e-09
##$ISEN= 30
##$LB= 1.5
##$LEV0= 0
##$LPBIN= 0
##$MAXI= 10000
##$MC2= 0
##$MEAN= 0
##$ME_mod= 0
##$MI= 50
##$NCOEF= 0
##$NC_proc= -5
##$NLEV= 6
##$NOISF1= 182.463
##$NOISF2= 159.3651
##$NSP= 0
##$NTH_PI= 0
##$NZP= 0
##$OFFSET= 197.3918
##$PC= 4
##$PHC0= 1993.072
##$PHC1= -21.7016
##$PH_mod= 1
##$PKNL= yes
##$PPARMOD= 0
##$PSCAL= 0
##$PSIGN= 0
##$REVERSE= no
##$SF= 81.014063255964
##$SI= 65536
##$SIGF1= 159.3651
##$SIGF2= -187.1042
##$SINO= 113.3802
##$SIOLD= 16384
##$SREGLST= <1H.CDCl3>
##$SSB= 0
##$STSI= 65536
##$STSR= 0
##$SW_p= 32467.5324675325
##$SYMM= 0
##$S_DEV= 0
##$TDeff= 32768
##$TDoff= 0
##$TI= <>
##$TILT= no
##$TM1= 0
##$TM2= 0
##$TOPLEV= 0
##$USERP1= <user>
##$USERP2= <user>
##$USERP3= <user>
##$USERP4= <user>
##$USERP5= <user>
##$WDW= 1
##$XDIM= 65536
##$YMAX_p= 341059549
##$YMIN_p= -55857616
$$ End of Bruker specific parameters
$$ ---------------------------------
##NTUPLES= NMR SPECTRUM
##VAR_NAME=  FREQUENCY,     SPECTRUM/REAL,   SPECTRUM/IMAG
##SYMBOL=    X,             R,               I
##VAR_TYPE=  INDEPENDENT,   DEPENDENT,       DEPENDENT
##VAR_FORM=  AFFN,          ASDF,            ASDF
##VAR_DIM=   65536,         65536,           65536
##UNITS=     HZ,            ARBITRARY UNITS, ARBITRARY UNITS
##FACTOR=    0.49542278885378, 1,            1
##FIRST=     15991.5117654749, 0,            0
##LAST=      -16476.0207020576, 0,           0
##MIN=       -16476.0207020576, -55857616,   0
##MAX=       15991.5117654749, 341059549,    0
$$ Real data points
##PAGE= N=1
##DATA TABLE= (X++(R..R)), XYDATA
$$ [...]
41850a082841k84116l0006L23364L97327J08162k30793k60262N4833M30617N65049
41840h666L83695L9861k49062l58271l01806j67434k9063P0826R5073L9464j7810
41829e03193J4969R9906R8283j1635p7493k6768k5246k08686l84547k53520J23268
41818a154662L56847K53980M2484Q50J11336J93409J63186L6556j24750j57670
41808b78434Q4757M28904M54458O1408l04033k40685M9104J09716r3773k46038
41798B5384k46800k45433k07977M3567L55280L26883j8879j67614P7058K19712
41788A61181j43097n99245m73943J57765N57591L48101n8127j29826J06491K56662
41778A83553J38198p4290j45651j5349K22982M31053M98310L79874J06448k26637
$$ plain form
41850 -1082841 -1366957 -1396963 -1073599 -676272 -568110 -798903 -1059165 -1004332 -573715 -8666
41840 -8666 375029 414890 165828 -192443 -494249 -661683 -690746 -619920 -524847 -485383 -503193
41829 -503193 -488224 -388318 -290035 -301670 -379163 -405931 -431177 -639863 -1024410 -1277930 -1154662
41818 -1154662 -797815 -543835 -501351 -500501 -389165 -195756 -32570 3986 -120764 -278434
41808 -278434 -193677 235227 689685 751093 447060 206375 255479 365195 271422 25384
41798 25384 -221416 -466849 -674826 -631259 -275979 50904 32025 -135589 -58531 161181
41788 161181 18084 -581161 -1055104 -897339 -339748 8353 -49774 -179600 -73109 183553
41778 183553 321751 247461 101810 86461 309443 740496 1238806 1618680 1725128 1498491
41768A498491m76792n14586l42130j39175j05818k36345l20912k10972j2388O9402
41758g91225L8955J22696L99708N57685K36486l90555o61199k27182M09464M66077
41748A60910j25627o59607n93209j49999J43426J42466M9294m320k185J28092
41738i10759L78535M80855K19611j52268j77791J47840L58258J89154j00401j83606
41728B49428r5664l7705m4375n6958j03894k00845k44084j79906j16117j13229
41718i43349n3292J20887K46234K11249J63812K15942J83868o6264k40823j184
41708a62920M18299M52096L7143k83141j67873Q5863J02610k2286l9491m8832
41698C71468k71651n33002m24163N2294L91917K35267j77183l49884j54964P6941
$$ plain form
41768 1498491 1021699 507113 164983 25808 -80010 -316355 -637267 -848239 -860627 -791225
41758 -791225 -752270 -629574 -229866 327819 564305 173750 -487449 -714631 -305167 160910
41748 160910 35283 -624324 -1217533 -1367532 -1224106 -1081640 -1032346 -1036666 -1038851 -910759
41738 -910759 -532224 -51369 168242 15974 -161817 -13977 344281 533435 433034 249428
41728 249428 153764 116059 71684 14726 -89168 -290013 -534097 -714003 -830120 -943349
41718 -943349 -996641 -875754 -629520 -418271 -254459 -38517 145351 79087 -161736 -162920
41708 -162920 255379 707475 744618 461477 293604 379467 482077 459791 420300 371468
41698 371468 99817 -433185 -857348 -805054 -413137 -177870 -355053 -704937 -859901 -782960
41688g82960L5042j77023k04935P7874M05427M73661L09840J52083Q5759K2540
41678C97308k7688M7792J80864J36649j03881k71712k44233k36151l69925l90075
41668h81052r6734K31967K28564K2193K571J50818R7964j85715k70302N8215M41401
41657b00110M63639J87204m6381r0781m7584l1225q4401k04911l09404k78071
41647f42025j34432n1782r4278j02033O2252K97500M16200L94642L48051L32072
41637H26167K71977O6197k66395n26561m93390k21781n3831j74880l17528j62588
41627a052613J30876J66844l8765j26040o5218j94654m99739m72436N8509N37362
41617a555874M88073J91855J16679J54334k1891k36889r3990K82066M27483L03186
$$ plain form
41688 -782960 -747918 -924941 -1129876 -1052002 -646575 -172914 136926 289009 374768 397308
41678 397308 369620 417412 598276 734925 631044 359332 115099 -121052 -490977 -881052
41668 -881052 -977786 -745819 -517255 -495062 -492491 -341673 -243709 -429424 -699726 -641511 -200110
41657 -200110 263529 450733 404352 313571 265987 234762 150361 -54550 -363954 -642025
41647 -642025 -776457 -828239 -922517 -1024550 -962298 -664798 -248598 146044 494095 826167
41637 826167 1098144 1164341 897946 371385 -122005 -343786 -397617 -572497 -890025 -1052613
41627 -1052613 -921737 -754893 -793658 -919698 -984916 -1179570 -1679309 -2151745 -2093236 -1555874
41617 -1555874 -1067801 -875946 -759267 -604933 -626824 -863713 -957703 -675637 -248154 55032
41607E5032K45256K60412L6189l47600l83137N7444M60154M15924J33717j8768
41597I14623m4416j13437j86535j37110j6795L5453j2843j23977k56479l21751
41587b63267k61957j96261k58524k95282k9699M50983P14177N55379K21134m444
41577F32239q1649k1146J83219L16358P1074m18801o12788l35002m8591r5158
41567d10245j58732J12682M06292K08833l25320n52109k58104J14425J43565r3105
41557h11818k50361j16846K38654N06496L71748r4349l95210j85898K56584M03940
41547g7060J67066r2880j20981K23J04171J07836k4229j97522j43934K34163N53448
41536E10301L31484l45620q75275q62612m70976l9117L01982N41652O20000M96155
$$ plain form
41607 55032 300288 560700 596889 249289 -133848 -76404 383750 799674 933391 914623
41597 914623 870207 756770 570235 433125 416330 451783 438940 314963 58484 -263267
41587 -263267 -525224 -721485 -980009 -1275291 -1304990 -854007 -139830 415549 636683 632239
41577 632239 550590 529444 712663 1029021 1100095 681294 68506 -266496 -315087 -410245
41567 -410245 -568977 -456295 -50003 158830 -166490 -718599 -976703 -862278 -718713 -811818
41557 -811818 -1062179 -1179025 -940371 -433875 -62127 -156476 -551686 -737584 -481000 -77060
41547 -77060 90006 -2874 -123855 -123632 -19461 88375 64146 -133376 -277310 -43147 510301
41536 510301 841785 496165 -379110 -1241722 -1712698 -1751815 -1449833 -908181 -288181 207974
41526B07974K23869j01627l44688l27786l6660K26385J48437j66039l40093k65232
41516g75460j89304k60131l18426k20945o2237M3131J39812K66172L27638K61394
41506g88356J56136J07762R3746M9762m9124j89090k79241j80059O5084J53606
41496h59774p2623k99095j67690J04587J7202l55020l79934J40084N85449M07074
41486h79740j13068l64512k53991j06651l3974J11919L16323L78574K57193J00453
41476e87474k5434j61083k62801k47146j79959j82803j95320o1232J76894K91156
41466a435202J87869L6877M6408K15503L36346K12904r4517k67186q5935K42772
41456f04161L23715J25288J446J06589J54214o4614k84496j76177J33426K78909
$$ plain form
41526 207974 431843 330216 -14472 -342258 -378918 -152533 -4096 -170135 -510228 -775460
41516 -775460 -964764 -1224895 -1543321 -1764266 -1826503 -1783372 -1643560 -1377388 -1049750 -788356
41506 -788356 -632220 -524458 -430712 -380950 -430074 -619164 -898405 -1078464 -1013380 -859774
41496 -859774 -932397 -1231492 -1399182 -1294595 -1277393 -1632413 -2012347 -1872263 -1286814 -879740
41486 -879740 -992808 -1357320 -1611311 -1717962 -1751936 -1640017 -1323694 -945120 -687927 -587474
41476 -587474 -612908 -773991 -1036792 -1283938 -1463897 -1646700 -1842020 -1903252 -1726358 -1435202
41466 -1435202 -1247333 -1210456 -1164048 -948545 -612199 -399295 -493812 -760998 -846933 -604161
41456 -604161 -280446 -155158 -153712 -47123 107091 42477 -242019 -418196 -284770 -5861
41446e861J71211k9560k53817m89926n75796l72401k8349K26906L99011N38763
41436d19819M61581N8363l19572k79834n1534j70112n65470n99306r1081L45857
41426a630927K45682j9429J03474M56034M56813L0057k94506j73023J12847J25319
41416e87659j29017k75564j12162J48225K04623P0427q221L9803L0754j04511
41406g23302j59584k5863N8997r0813k23310l6052K60123K32480m6087r6441J65718
41395f84134L03291J21263k5638J00619J97051j3364k62762j90215N7543J10897
41385b85449j5842m1286N5561N1703q8578j76225j34486p1993p0971j37104k68096
41374a182766l64696k25388J34689L43531J36117k21913k97807j02469L8938P0400
$$ plain form
41446 -5861 165350 135790 -118027 -607953 -1183749 -1556150 -1584499 -1357593 -958582 -419819
41436 -419819 41762 100125 -219447 -499281 -550815 -720927 -1286397 -1885703 -1976784 -1630927
41426 -1630927 -1385245 -1404674 -1301200 -845166 -388353 -358296 -652802 -825825 -712978 -587659
41416 -587659 -716676 -992240 -1104402 -956177 -751554 -681127 -689348 -649545 -618791 -723302
41406 -723302 -882886 -908749 -849752 -940565 -1163875 -1199927 -939804 -707324 -753411 -849852 -684134
41395 -684134 -380843 -259580 -285218 -184599 12452 -912 -263674 -453889 -396346 -285449
41385 -285449 -301291 -342577 -287016 -235313 -323891 -500116 -634602 -706595 -777566 -914670 -1182766
41374 -1182766 -1547462 -1772850 -1638161 -1294630 -1158513 -1380426 -1678233 -1780702 -1741764 -1671364
41364a671364K02811L97925L49634L7859j50227K520K17228J54150j21508l02019
41354h82991k41339k3253K00115K93736K04391M6979L189P4729P9332p0874k57774
41343e73760l61931l86900l27689j25606J54643K93529J77538n0605j87298j80675
41333a568754r4864j6257m2510j92769k83142r0276K98217N12767L70401R8771
41323a008416q563O9529K10786L62145M42804K81500j04482l64967k28351Q6620
41313b61395J53591p6500k72681k37732j02103l76J26237L08294L88716K42718
41303B68769k337j14682l4513J05947J66956J09688l1839j99410l38956m22152
41293d92529m30383l13222j9239L88077O87658O52919K74981j91483m29012l06211
$$ plain form
41364 -1671364 -1468553 -1070628 -720994 -683135 -833362 -830842 -613614 -459464 -580972 -882991
41354 -882991 -1124330 -1147583 -947468 -653732 -449341 -402362 -399173 -324444 -245112 -315986 -573760
41343 -573760 -935691 -1322591 -1650280 -1775886 -1621243 -1327714 -1150176 -1200781 -1388079 -1568754
41333 -1568754 -1663618 -1679875 -1722385 -1915154 -2198296 -2288572 -1990355 -1477588 -1107187 -1008416
41323 -1008416 -1016979 -947450 -736664 -374519 68285 349785 245303 -119664 -348015 -261395
41313 -261395 -107804 -184304 -456985 -694717 -796820 -797196 -670959 -362665 26051 268769
41303 268769 266432 151750 117237 223184 390140 499828 467989 268579 -70377 -492529
41293 -492529 -922912 -1236134 -1255373 -867296 -179638 473281 748262 556779 127767 -178444
41283a78444N1142L71160L92620K5060m96911o76596k16534N22948P90069L26059
41273I10573k83601l95046j55184j44916m02817m19610p5374J23837m6964p9008
41263i68110L83042P94511M77560k76213n94684k97835k9073j62872l32718j85837
41253a192229O8830J46088J63931K90776L55416J84895j5171P116J19684P5234
41243B04570l9699j1903N1120r4930l34880l21634n3972R2511o0767k73266l13814
41232a156664k54517k00542m9296K64380N14858M31278Q3225j87806j69205M5204
41222f79085K35443K71749J62383R24j10157j35580j13838q0381l3138O204j7476
41211d92952q3540p0743N9800J43967K3204j82274k00933j4348Q4549p4205k54132
$$ plain form
41283 -178444 -127302 243858 636478 661538 164627 -511969 -728503 -205555 584514 910573
41273 910573 626972 231926 76742 -68174 -470991 -890601 -965975 -842138 -889102 -968110
41263 -968110 -585068 209443 687003 410790 -183894 -481729 -510802 -673674 -1006392 -1192229
41253 -1192229 -1123399 -977311 -813380 -522604 -167188 17707 2536 9652 129336 204570
41243 204570 164871 152968 204088 109158 -225722 -547356 -601328 -508817 -569584 -842850 -1156664
41232 -1156664 -1411181 -1611723 -1661019 -1396639 -881781 -450503 -367278 -555084 -724289 -679085
41222 -679085 -443642 -171893 -9510 -8586 -118743 -254323 -368161 -448542 -481680 -475476 -492952
41211 -492952 -576492 -647235 -587435 -443468 -420264 -602538 -803471 -817819 -733270 -807475 -1061607
41200a061607j41974J89562L86437L07458J50292Q1282J6237j31839k27950j13058
41190e45160J32575L05013L46202L29409K70484J36161j9161j02363j39150k31371
41180D82639l78949m74878m51246l21918j35786M710k7356j98800k74476j24251
41170a900311O8666J13770J48445L60394N43523L61110k6354j05973J70053K53119
41160a3558j32651n15861l98245j194J44782K7266O2375L50826N27080L43215
41150C94035L475j59833p9220N1735J8373j95913l46803j68926K37682M37029
41140A91634K17386r7736j16771O9690J01783q4452k62645l46724m24514m31137
41130a183486j85229K39783N24878N21895L72360J99660k3556k70282l92933l13505
$$ plain form
41200 -1061607 -1203581 -1014019 -627582 -320124 -169832 -88550 -72313 -204152 -432102 -545160
41190 -545160 -412585 -107572 238630 568039 838523 974684 955523 853160 714010 482639
41180 482639 103690 -371188 -822434 -1144352 -1280138 -1275428 -1302784 -1501584 -1776060 -1900311
41170 -1900311 -1831645 -1717875 -1569430 -1209036 -665513 -304403 -330757 -436730 -266677 -13558
41160 -13558 -146209 -662070 -1060315 -1061509 -916727 -889461 -827086 -476260 50820 394035
41150 394035 397510 237677 158457 210192 228565 32652 -314151 -483077 -245395 191634
41140 191634 409020 311284 194513 264203 365986 281534 18889 -327835 -752349 -1183486
41130 -1183486 -1368715 -1128932 -604054 -82159 290201 489861 466305 196023 -196910 -510415
41120e10415q8095J89436L59193J97784k64266n59529k87509K83329N14611K37522
41110G2061j32889k73644k58817j81758N790J86196J05980j54925k09497J8353
41100h23150J81700J32531J20715K21533J58313q3211r7036J86591K54081q6275
41090A65792k59965P0169K75047k16011p98522n61255J76866L06416k88245n55790
41080a685498N041N78891L88227j33394j53234K54256L56552m7550l99306k49900
41070a085915K00776N07406N33105M33856L01049M1194l71457o70201n13020N0938
41060e72269N42087O02725L76580J55968p9310m38548o68799m11775J56850M39534
41050A03043K25205n6250o978K11512K09715q3555m05663m81576k33509J47806
$$ plain form
41120 -510415 -598510 -409074 -49881 147903 -116363 -675892 -963401 -680072 -165461 72061
41110 72061 -60828 -334472 -593289 -775047 -769257 -583061 -477081 -632006 -841503 -823150
41100 -823150 -641450 -508919 -388204 -166671 -8358 -91569 -188605 -2014 252067 165792
41090 165792 -94173 -24004 251043 35032 -763490 -1324745 -1147879 -841463 -1129708 -1685498
41080 -1685498 -1680457 -1101566 -713339 -846733 -999967 -745711 -389159 -436709 -836015 -1085915
41070 -1085915 -885139 -377733 155372 589228 890277 931471 560014 -110187 -623207 -572269
41060 -572269 -30182 572543 949123 1105091 1025781 587233 -81566 -493341 -336491 103043
41050 103043 328248 271998 265020 476532 686247 602692 197029 -284547 -518056 -370250
41040c70250K86349j3209m58635n67641k72610M7246J22765N1474n669o827J31222
41029a055785M74119P75079O55780J88314j30576j06431p5240k37879k97380m9976
41019A40025J70235L7211k00759j47344R7241J84891J25975J61799K49588J64527
41009I83389k7143n9148N9006P4835o2586j74372k14834k98885m01885l69045
40999d90668k02431m4695P3013J79624J47271j40335m63694m66648j61205J10061
40989a459707K10594L41247N78657O47505L21825j93366m68881l23385K6424K29457
40979h9630J59085N686k7066o1047l59257p79325p74343j56421M95609N54875
40969a031834J86831K1789K08236L33827J91067M2315P2397J05455J3897l5974
$$ plain form
41040 -370250 -83901 -97110 -555745 -1123386 -1395996 -1348750 -1225985 -1174511 -1180180 -1187007 -1055785
41029 -1055785 -581666 193413 849193 1037507 906931 800500 725260 487381 190001 140025
41019 140025 310260 347471 146712 -632 96609 281500 407475 569274 818862 983389
41009 983389 956246 897098 956104 1030939 968353 793981 579147 280262 -121623 -490668
40999 -490668 -693099 -737794 -664781 -485157 -337886 -478221 -941915 -1408563 -1569768 -1459707
40989 -1459707 -1249113 -907866 -329209 318296 640121 446755 -22126 -345511 -319087 -89630
40979 -89630 69455 75141 48075 -12972 -372229 -1151554 -1925897 -2082318 -1586709 -1031834
40969 -1031834 -845003 -823214 -614978 -281151 -90084 -47769 24628 130083 143980 108006
40959A08006O3694J33672L5180p4521j3966J29975J51993j0770k77179n08368
40949b62284n38765l14312l0028P8858P6796K04188M31976M63169K13495m6229
40939B76864j06514n8363k5370K4411Q4291K7374j52523k79488k69290k11311
40929f89919j41168l8408n9353l69794o94550n13676J45562O08368M74737J55676
40919a122525J81412M42875N19513L54982J47608r7337m06498m87722p8545M87959
40909e8278N72104N7629n15441o46139l57978J2142K00225J50397r563q4190j0970
40898f90062J00068J77620K67719L25049J91845p4080j63787m878O8420j22189
40888G5725k79883k08708k35465n68389p03275j48511O08730O65793M8057l54654
$$ plain form
40959 108006 171700 305372 340552 266031 252065 382040 534033 523263 246084 -262284
40949 -262284 -801049 -1115361 -1145389 -1066531 -989735 -785547 -353571 109598 323093 276864
40939 276864 170350 111987 86617 111028 195319 222693 70170 -209318 -478608 -689919
40929 -689919 -831087 -869495 -928848 -1298642 -1993192 -2506868 -2361306 -1752938 -1278201 -1122525
40919 -1122525 -941113 -498238 21275 376257 523865 426528 20030 -467692 -546237 -58278
40909 -58278 513826 571455 56014 -590125 -948103 -935961 -735736 -585339 -594902 -679092 -690062
40898 -690062 -589994 -412374 -144655 180394 372239 298159 134372 129494 197914 75725
40888 75725 -204158 -412866 -648331 -1216720 -1919995 -2068506 -1459776 -793983 -745926 -1100580
40878a100580j44665J61052J55429J04593K19563J92175j15181k29783J48877
40869f08520N09517K69274k91791m58797j30697J72985J55750R849p0433j18105
40859e60968j45541r4191l5066o3176l0907K38607N10015L41542k14040n44148
40849e97873k72135K45374M41983K66896R8438J32409J95612J16542k6375r5339
40839E05532j06449j21146p1383J32932L77392M01018J10542k90296n32282n34076
40829a28216l80545j83086n1551p5271j97759k09611j2203J97795J66016p2231
40819i46662k49171k01990J5307K77449M54352M17364K00268P3865K17140M04839
40809F62761L09068J1546j50272j74752l72072p28046q07818m49379o3486L560
$$ plain form
40878 -1100580 -1245245 -1084193 -928764 -824171 -604608 -412433 -527614 -757397 -608520
40869 -608520 -99003 170271 -121520 -580317 -711014 -538029 -382279 -372430 -442863 -560968
40859 -560968 -706509 -800700 -835766 -898942 -929849 -691242 -181227 160315 -53725 -597873
40849 -597873 -870008 -624634 -182651 84245 182683 315092 510704 627246 600871 505532
40839 505532 399083 277937 206554 339486 716878 1117896 1228438 938142 405860 -128216
40829 -128216 -508761 -691847 -743398 -818669 -1016428 -1226039 -1238242 -1040447 -874431 -946662
40819 -946662 -1195833 -1397823 -1382516 -1105067 -650715 -233351 -33083 40782 257922 662761
40809 662761 971829 983375 833103 658351 286279 -441767 -1249585 -1698964 -1762450 -1758890
40799a758890m3380R4372K86487K92059K38180L38769M27698K52974J5117R6496
40789B39882L82995L75939n0259m81107n79923m35884k31620J6585K54250K85282
40779b23860O1278j72560j73889L2845K66430L72545K51896p6112l81446m12661
40769d55534k31220j34260k01568j85787N5941K95352K57595j557k13060k23871
40759a037969n5098K19864M89489N93272M39644J00270k54508m44673l38850j663
40749b90222K24915L7546l73940m67464o7901L47191K88195r3481k88846j56271
40739h40278N281k886o7004r8233j93231l32455k56660J19191M08757J90961l46341
40728a412898n32735n3000O11094P57383L07692j79040k76831j70181k57258n31226
$$ plain form
40799 -1758890 -1802270 -1707898 -1421411 -1129352 -891172 -552403 -124705 128269 143386 239882
40789 239882 622877 998816 948557 467450 -112473 -548357 -779977 -763392 -509142 -223860
40779 -223860 -162582 -335142 -509031 -476186 -209756 162789 414685 338573 -42873 -455534
40769 -455534 -686754 -821014 -1022582 -1208369 -1152428 -857076 -599481 -601038 -814098 -1037969
40759 -1037969 -1093067 -873203 -383714 209558 649202 749472 494964 50291 -288559 -290222
40749 -290222 -65307 -27761 -401701 -869165 -937066 -589875 -301680 -395161 -684007 -840278
40739 -840278 -834997 -837883 -904887 -1003120 -1196351 -1528806 -1785466 -1666275 -1257518 -1066557 -1412898
40728 -1412898 -1945633 -1998633 -1387539 -630156 -322464 -501504 -778335 -948516 -1205774 -1737000
40718a737000o02828k41534L45126P71563Q30009N64528J53543k13376m30084
40709e60053m87110l66478o624N05821Q05621N49898j22947o39985n80618q5231
40699i87706L63150M24540J31179k20055l39881k03516m1984j151P3862L17551
40689d84011M64446J67894l56292m86502q9147K50756J19078j16167L6582L71975
40679a21388L49921l7990l51416m55514n72203o63488m20350O5859K50688l7490
40669a993371k62922L1831N57512P42965N05895J83077k8170j62731k12803j41513
40659g80230o0475p4501n7523J16293K55618J26945o4263Q9716M90577N51931
40649E94088O7314m03535l10476R8292J82274j33545l21177j29218L6288j98290
$$ plain form
40718 -1737000 -2339828 -2581362 -2236236 -1464673 -634664 -70136 83407 -129969 -560053
40709 -560053 -1047163 -1413641 -1420265 -914444 -108823 441075 318128 -321857 -902475 -987706
40699 -987706 -624556 -200016 -68837 -288892 -628773 -832289 -874273 -875424 -801562 -484011
40689 -484011 -19565 148329 -207963 -694465 -783612 -532856 -413778 -529945 -493363 -121388
40679 -121388 228533 190543 -160873 -616387 -1188590 -1852078 -2272428 -2206569 -1955881 -1993371
40669 -1993371 -2256293 -2224462 -1666950 -923985 -418090 -235013 -263183 -425914 -638717 -780230
40659 -780230 -840705 -915206 -972729 -856436 -600818 -473873 -538136 -448420 42157 594088
40649 594088 661402 257867 -52609 45683 227957 94412 -226765 -355983 -319695 -517985
40639e17985n41432m66207j8257K55002J14949q0830k26J58134K8366l37302n56390
40628a962178m30199q8138K54689M05650K01595k42786m03664R5649Q21006R25990
40618d22386L03866k14102m8632L22267J95250k38860k82469P4780J50746k84273
40608d43813o41536m70222r1067M9125O9408K58907M48962L08393k9174j56314
40598f97331l0466O3074N6146J16757J95310N6355k19970k51274M4976L03910
40588c62513K86543J70654J15206j9610k80222l72370j30968J19869M4145j74938
40578f04204j84567p2048j56966l70412l56783j02528M6962j7368m5282O9328
40568a793868J45773J54164L06731N75528O05571L09016O6854P6515j2269m37857
$$ plain form
40639 -517985 -1059417 -1525624 -1543881 -1288879 -1173930 -1254760 -1254986 -1096852 -1068486 -1405788 -1962178
40628 -1962178 -2392377 -2480515 -2225826 -1820176 -1618581 -1861367 -2265031 -2169382 -1348376 -422386
40618 -422386 -118520 -332622 -381254 -58987 136263 -102597 -385066 -310286 -159540 -443813
40608 -443813 -1085349 -1555571 -1646638 -1597513 -1528105 -1269198 -820236 -511843 -541017 -697331
40598 -697331 -727797 -664723 -608577 -491820 -296510 -240155 -460125 -711399 -666423 -362513
40588 -362513 -75970 94684 209890 190280 -89942 -462312 -593280 -473411 -429266 -604204
40578 -604204 -788771 -860819 -1017785 -1388197 -1744980 -1847508 -1800546 -1817914 -1863196 -1793868
40568 -1793868 -1648095 -1493931 -1187200 -611672 -6101 302915 369769 446284 434015 -3842
40558c842p59346m63327J75959M09415L0685m36985m95441j45625L44427O84862
40548f59218N83651j7793o62576p42921k41758K49763L22314J62541P8112M4374
40538h83511n5876j07423L1773K42815L17551K37326R0040r8020k67016k58430
40528g50771l7096J92459K56191K21230J98393J53941P9267J05364K50855K99355
40518I69188J44928r05L321p0324l93508o39898m17078N4434K00127n7773k27467
40507d34955l8371K03234J64772o1029k38685l30629l30613j07946K93760M76083
40497d04379J41741m21742o31802l22636J06080K48611J50607J15589K30491K71996
40487e15444P5634j80126k06095l6958O604j70256k48867J542L11457L08917J12444
$$ plain form
40558 -3842 -763188 -1226515 -1050556 -641141 -610456 -1047441 -1542882 -1688507 -1344080 -659218
40548 -659218 -75567 -93360 -755936 -1498857 -1740615 -1490852 -1168538 -1005997 -927885 -883511
40538 -883511 -939387 -1046810 -1015037 -772222 -454671 -217345 -127305 -225325 -492341 -750771
40528 -750771 -787867 -595408 -339217 -117987 80406 234347 313614 418978 669833 969188
40518 969188 1114116 1113211 1116532 1046208 652700 12802 -404276 -349842 -149715 -207488 -434955
40507 -434955 -473326 -270092 -105320 -166349 -405034 -735663 -1066276 -1174222 -880462 -404379
40497 -404379 -262638 -684380 -1316182 -1638818 -1532738 -1284127 -1133520 -1017931 -787440 -515444
40487 -515444 -439810 -619936 -826031 -862989 -856385 -1026641 -1275508 -1273966 -962509 -653592 -541148
40476e41148J12276K86136K31248j15369l16980j48723K4609j43193m11589l58227
40466a380960m3270J34946N0668p7359j09784j10001q7487M5276K39981L13944
40456a024046K36438J94589L04294M17339K97075r5032n26241o71019l88513J29892
40446a125224N19096N67033L42440M1820j60469j54446K265L5996k28874n10847
40436f71210l70567R3385K98882P0551o4290K24815M53979J31063l32079k41072
40426d06543J99603J92436l10382n01440m2911M13625L31552Q3615J62165L03537
40416D25257M6741l45240k61133K28322M21197J048n82635p86964n55861j51817
40406a561085J88267K99713J13438j93810k76364m222L39754L58603j2689m21496
$$ plain form
40476 -541148 -428872 -142736 88512 -26857 -343837 -492560 -467951 -611144 -1022733 -1380960
40466 -1380960 -1424230 -1289284 -1238616 -1315975 -1425759 -1535760 -1623247 -1577971 -1337990 -1024046
40456 -1024046 -787608 -593019 -288725 128614 425689 330657 -195584 -866603 -1255116 -1125224
40446 -1125224 -606128 -39095 303345 345165 184696 30250 32515 68511 -160363 -671210
40436 -671210 -1041777 -948392 -649510 -578959 -643249 -418434 35545 166608 -165471 -406543
40426 -406543 -206940 -14504 -324886 -826326 -869237 -455612 -124060 -40445 121720 425257
40416 425257 471998 126758 -134375 93947 515144 516192 -66443 -853407 -1409268 -1561085
40406 -1561085 -1372818 -1073105 -959667 -1153477 -1429841 -1434063 -1094309 -735706 -748395 -1169891
40396a169891m52866o4113L63051M56857K78747J64527K05337J64678n2746j91543
40386b97962o6796J26931J66757J62882K64184K80590r113l81005m39732k37333
40376d30597j54972k35613j33137K43601N31454M89541L33264K97234K54316K1159
40366A216250k75890m18183m29828m23476l24004l9655K44008K45848k102j86281
40356c93313j31619J9395N2596n8290j68212j41233K094Q6267l0687k59556l64570
40345a387128k56980n8986J48023M19288O94472P04178L39168q3347j83661j8619
40335C16408N0728j09569k96404l36523k65395j45076R398R4705j1961j96689
40325h90378j88388M4423K52910L30062M41499O03993N12896N3198l61570l38854
$$ plain form
40396 -1169891 -1622757 -1686870 -1323819 -866962 -588215 -423688 -218351 -53673 -106419 -297962
40386 -297962 -364758 -237827 -71070 91812 355996 636586 627473 246468 -193264 -430597
40376 -430597 -585569 -821182 -954319 -710718 -179264 310277 643541 940775 1195091 1216250
40366 1216250 940360 522177 92349 -331127 -655131 -694786 -450778 -204930 -207032 -393313
40356 -393313 -524932 -505537 -452941 -511231 -679443 -820676 -818582 -732315 -763002 -1022558 -1387128
40345 -1387128 -1644108 -1703094 -1555071 -1135783 -441311 262867 602035 518688 335027 316408
40335 316408 367136 257567 -38837 -375360 -640755 -785831 -776433 -681728 -693689 -890378
40325 -890378 -1078766 -1034343 -781433 -451371 -9872 594121 1107017 1160215 798645 459791
40315D59791j30501k45334o09050o54493k28090J62733J46898K318R4192K64776
40305g36760J90000j878L9542K40589K05671j01386k80911j46744J5992j9310
40295e95195n7042J23015L48736L31164J16179l9617p5836j16302j64137j02238
40285b31273M9131J34714J14237Q8810P9494p655j69005k47310j45709M2391J62421
40274a29754J45036M859j84897k91826k16312j9818J33450J82063K14620K91088
40264A28509L23901J89312j04992l98730m96733l25361k3552J49374N9460j72032
40254f70844l23131k88567r5450J75098L72938L19457L6760j68281n4477K00103
40244d96394K25573j9718k21359j80890l0729N5141Q6639J15757J17719J07446
$$ plain form
40315 459791 329290 83956 -525094 -1179587 -1407677 -1244944 -1098046 -1095728 -1001536 -736760
40305 -736760 -546760 -548638 -509096 -268507 -62836 -164222 -445133 -591877 -575885 -595195
40295 -595195 -652237 -529222 -180486 150678 266857 227240 151404 35102 -129035 -231273
40285 -231273 -182142 -47428 66809 155619 235113 227458 58453 -188857 -334566 -292175 -129754
40274 -129754 15282 20141 -164756 -456582 -672894 -692712 -559262 -377199 -162579 128509
40264 128509 452410 641722 536730 138000 -358733 -684094 -707646 -558272 -498812 -670844
40254 -670844 -993975 -1282542 -1377992 -1202894 -829956 -510499 -473739 -642020 -696497 -496394
40244 -496394 -270821 -290539 -511898 -692788 -723517 -668376 -581737 -465980 -348261 -240815
40234b40815J55536K10974J35124j9108k3622J40287K07843P3645q422J36908
40224G68350K88609K17042Q7594J30366J64397j14116n27427n83380k19194Q6455
40214B98696K3409j49113q1523J44579K32898J60284J36602J86446P9034k75154
40204G56158n70067m06060J94033P15794O88707K21363j45045j06658Q6283O4751
40194A499259j40737k29920j11536L4924R7129J25243J02010o5791k64637j94315
40184H51629J83555M83126L86708R1213J1101J78654K38549K730k89365l44805
40174A793095k08904j15995j04520r166J98164K93293J15572j69243k79849j97685
40164A314762j41613j93476j70804N5683L02102K68932r6619n47645p75729o25559
$$ plain form
40234 -240815 -85279 125695 260819 241711 218089 358376 566219 639864 631442 768350
40224 768350 1056959 1274001 1361595 1491961 1656358 1542242 1014815 431435 212241 298696
40214 298696 322105 172992 91469 236048 468946 629230 765832 952278 1031312 756158
40204 756158 186091 -219969 -25936 689858 1378565 1599928 1454883 1348225 1434508 1499259
40194 1499259 1358522 1128602 1017066 1051990 1149119 1274362 1376372 1310581 1045944 851629
40184 851629 1035184 1518310 1905018 1996231 2007332 2185986 2424535 2427265 2137900 1793095
40174 1793095 1584191 1468196 1363676 1354510 1552674 1845967 1961539 1792296 1512447 1314762
40164 1314762 1173149 979673 808869 864552 1166654 1435586 1338967 791322 15593 -609966
40154f09966j79690K60233L77330J62148m0617N9776L21282L57366M9927l13949
40144D43840m24496k94459j52772j09204l9098J97009M91109N46245K48192j31908
40134G74458k64379k06741k66918m50915m12199n7537J96359K7092k85142l07285
40124a253207j17495q6741k16026j86773M2861J91312J60238J07264L4385j84032
40114a508214l41252m0556N64922P51955K17749m16515m46382J947L14971K98746
40104f02629K49213L14261K82752k245l78621n65135m22463k2225L87448N24368
40094b35276L18742j1385j97758j60426Q845J47583Q1638k13181m70346l91077
40084a122641p7154Q8961L3768P5289L15204M09942J66205r7813r0467J738l5899
$$ plain form
40154 -609966 -789656 -529423 -152093 10055 -30562 29214 350496 707862 757789 443840
40144 443840 19344 -275115 -427887 -537091 -576189 -379180 111929 658174 906366 774458
40134 774458 510079 303338 36420 -414495 -826694 -884231 -687872 -660780 -945922 -1253207
40124 -1253207 -1370702 -1457443 -1673469 -1860242 -1817381 -1626069 -1465831 -1358567 -1324182 -1508214
40114 -1508214 -1849466 -1890022 -1325100 -573145 -355396 -771911 -1218293 -1216346 -901375 -602629
40104 -602629 -353416 -39155 243597 241352 -137269 -702404 -1124867 -1147092 -759644 -235276
40094 -235276 83466 72081 -125677 -286103 -277258 -129675 -48037 -261218 -731564 -1122641
40084 -1122641 -1199795 -1110834 -1077066 -1001777 -686573 -276631 -110426 -208239 -298706 -296968 -332867
40073c32867l800K45091L43924j072l42804r7670M57575N46596R3610k34685j59576
40062E14322j35965m22359n90353k86873J51371K48055P3218j1477Q3045K23900
40052a53116L58474M30235K55322j97313o04821o45535l94647j52381m4292J5928
40042a132146J17180K63445L67894K61139j13086m78562m65620j20892J32298
40033a168350J14002R7096K64599L67503J69526j16243j31748J39069M36803N48374
40023G20631L69130p9166m95984m81683r2118J20408j35365m62506m02849r1934
40013a031436R7854J83999L62685M84751K82470q7934k47132j74895j07526l3338
40003b70502J79805L10752L7701m03595m32281k7151J74039j90824o96955p48311
$$ plain form
40073 -332867 -336667 -91576 252348 251276 -91528 -189198 268377 814973 908583 673898 514322
40062 514322 378357 -44002 -634355 -921228 -769857 -521802 -448584 -460061 -377016 -153116
40052 -153116 205358 635593 890915 693602 88781 -556754 -951401 -1103782 -1148074 -1132146
40042 -1132146 -1014966 -751521 -383627 -122488 -235574 -714136 -1179756 -1300648 -1168350
40033 -1168350 -1054348 -957252 -692653 -325150 -155624 -271867 -403615 -264546 172257 720631
40023 720631 1089761 1010595 514611 32928 -59190 61218 -74147 -536653 -939502 -1031436
40013 -1031436 -933582 -749583 -386898 97853 380323 292389 45257 -129638 -237164 -270502
40003 -270502 -90697 220055 257756 -145839 -578120 -605271 -431232 -622056 -1319011 -2067322
39993b067322k91088K68810N32347L67224j1917j74151L9786K26791j4423l73820
39983a497763k39384K70924M05922j5945l02032n1954J89296o6313l43875j3335
39973a664459N63844N53097l949k45384J73689O18034M85677J1610k14361n0029
39963B27769J86455K01241k9786l05502l34664o544L76755L51901j12070m97796
39953E7759l76030M2987K15724n729k28271j16871J17431J4836m55882p77454
39943a511500n20858J10062N61358O05166M64234L53322K47877J23032N0070l9089
39933D43674l07953o00427m96968j2076K36679p2580l68623l6862N28103M56392
39923b30641k13336n26711m5453N31859M69737K1429j05643J89404M04623K18779
$$ plain form
39993 -2067322 -2358410 -2089600 -1557253 -1190029 -1201946 -1376097 -1336311 -1109520 -1123943 -1497763
39983 -1497763 -1737147 -1466223 -1060301 -1076246 -1378278 -1430232 -1240936 -1307249 -1651124 -1664459
39973 -1664459 -1100615 -547518 -551467 -796851 -623162 -5128 480549 492159 277798 227769
39963 227769 414224 615465 585679 280177 -54487 -61031 315724 667625 555555 57759
39953 57759 -318271 -275284 -59560 -65289 -293560 -410431 -293000 -278164 -734046 -1511500
39943 -1511500 -2032358 -1922296 -1360938 -755772 -291538 61784 309661 432693 482763 443674
39933 443674 135721 -464706 -961674 -973750 -737071 -809651 -1178274 -1215136 -687033 -230641
39923 -230641 -443977 -970688 -1016141 -484282 -14545 6884 -98759 90645 495268 714047
39913G14047j94767m94733m71154j37756K25233K75052N0818k4350J94322K51041
39903C87753j96804o73885m55655L23184P57288L94372k24432m16666k12554n2263
39893c69662o4388o4446r935k6433r7187j02734j20124l29833o09727n66855r1247
39882b452571M02527M77262K27194J09162L23775O01797O04107L25538J7986j43330
39872D93447j79567j55780o6809P6975J54291M0192j94877k96191r9239K60057
39862C2499M87327M50072K61552O7032j06995k47115k60201j19632N446o1433
39852E08552k38079k76077r9509J11323J68123M7930j69138l55211l38379o8620
39842g09085K08443J93204j8297k3931K63967M39502K21823j08425j70806n5399
$$ plain form
39913 714047 519280 24547 -446607 -584363 -359130 -84078 -33260 -57610 136712 387753
39903 387753 190949 -482936 -938591 -615407 141881 536253 311821 -104845 -317399 -369662
39893 -369662 -434050 -498496 -508431 -534864 -632051 -734785 -854909 -1184742 -1794469 -2361324 -2452571
39882 -2452571 -2050044 -1572782 -1345588 -1236426 -912651 -310854 293253 618791 636777 493447
39872 493447 313880 158100 91291 168266 322557 362749 167872 -128319 -227558 32499
39862 32499 519826 969898 1231450 1298482 1191487 944372 684171 564539 569985 508552
39852 508552 270473 -5604 -105113 6210 174333 222263 53125 -302086 -640465 -709085
39842 -709085 -500642 -307438 -325735 -349666 -85699 353803 575626 467201 296395 240996
39832B40996p2696k12993k74743l04531m40290m92332j95828K37087L63969K33376
39822i17985K61751M19373K30275l17202n95551l29401m9240j64697k58297J52518
39812a568456P10385P25187J95812l05930m71861l83982r5112K90247L67504p3135
39802f09341n05353l06086K43032L49656k2277j47299J85092L26392o6052m11112
39792i63348j77651K74164L52971J30804R292j9287j78221l28612j66675K21696
39782h44867M81623M83093L15611J9253l09809l97396j54341Q7010N7250k3432
39772b86005J20179L11223K99179K58135L53714K16237m36863r87678o12187L65102
39762c98964P61469K14533l80533l03518O5199J30073J7777P0304J19386p7736
$$ plain form
39832 240996 168300 -44693 -319436 -623967 -1064257 -1556589 -1752417 -1515330 -1151361 -917985
39822 -917985 -656234 -236861 -6586 -323788 -919339 -1248740 -1297980 -1462677 -1720974 -1568456
39812 -1568456 -858071 -132884 62928 -243002 -714863 -1098845 -1193957 -903710 -536206 -609341
39802 -609341 -1114694 -1420780 -1177748 -828092 -850369 -997668 -812576 -486184 -552236 -963348
39792 -963348 -1140999 -866835 -513864 -383060 -373768 -393055 -571276 -899888 -1066563 -844867
39782 -844867 -363244 119849 435460 454713 144904 -252492 -406833 -319823 -262573 -286005
39772 -286005 -165826 145397 444576 702711 1056425 1272662 835799 -151879 -764066 -398964
39762 -398964 362505 577038 196505 -107013 -41814 88259 106036 176340 295726 217990
39752B17990k32852l3833J83179l7959m15874l23348J84954M53751K37447m5560
39742A87895o6653K0649J5819l6894j00485k33785l36236k22147o120K3462m7483
39731h01978J44144M99067M19224k29129p06935l98199K52621L54664j76044n78166
39721a220731l50660J65593L73211J48368j64831k10311O9786M23533N24640L21525
39711H0123J13097J52193K93191K45517M0143o9617p4862j76131k95402r7504
39701B10748L70274N36694R1602m84921n69400k67877j65376l85526m52082r9781
39691a215645K99417L10118L6535j26808q2066m4185r3954l3048K73111O10430
39681f6095N99556J33361m37580o14058k65048K25989L92733J81302r8709k12762
$$ plain form
39752 217990 -14862 -48695 134484 96525 -319349 -642697 -457743 -3992 233455 187895
39742 187895 121242 141891 157710 120816 20331 -213454 -549690 -771837 -777957 -754495 -801978
39731 -801978 -657834 -158767 260457 31328 -675607 -1073806 -821185 -466521 -642565 -1220731
39721 -1220731 -1571391 -1405798 -1032587 -884219 -1049050 -1259361 -1189575 -766042 -241402 80123
39711 80123 193220 345413 638604 884121 924264 854647 779785 603654 308252 210748
39701 210748 581022 1117716 1209318 724397 154997 -112880 -278256 -663782 -1115864 -1215645
39691 -1215645 -916228 -606110 -569575 -696383 -778449 -822634 -916588 -949636 -676525 -66095
39681 -66095 533461 666822 229242 -384816 -649864 -423875 -31142 150160 51451 -161311
39671a61311j78191n7108J44411L24602L05541J06550m2888o2585j20484k46890
39661A1647j88605J19689K83849N005l83572l80003r4505l6804k47425k52414
39651a163138Q4259K92960Q2923j77815j00562Q6241k6175l09512l16106m013
39641a550938K46685K49573J87543J76767P5293j73024l31451j72151K01958M66344
39631f23401M12721J32340o9361K9510K73960K37825k28713o83220n66088P5338
39621a009089O15786O04177K14280j00440j36010j3686O6948J8586p5465l7991
39611A47096J57333K45404k3391m47852n29640j35264K85582K90560j2864k20290
39601b43326j92901r6619k9259R6016L30468N76344O93607N80046J97267l31077
$$ plain form
39671 -161311 -339502 -396610 -252199 72403 377944 484494 441606 379021 258537 11647
39661 11647 -176958 -57269 226580 231585 -151987 -531990 -626495 -663299 -910724 -1163138
39651 -1163138 -1078879 -785919 -702996 -880811 -981373 -895132 -921307 -1230819 -1546925 -1550938
39641 -1550938 -1304253 -1054680 -867137 -690370 -615077 -788101 -1119552 -1291703 -1089745 -623401
39631 -623401 -210680 -78340 -147701 -118191 155769 393594 164881 -518339 -1084427 -1009089
39621 -1009089 -393303 210874 425154 324714 188704 175018 241966 260552 185087 147096
39611 147096 304429 549833 526442 78590 -451050 -586314 -300732 -10172 -23036 -243326
39601 -243326 -436227 -532846 -562105 -466089 -135621 440723 1134330 1714376 1911643 1580566
39591A580566p06055p11090m54889k10789o3503J06468L16511L79487J76152j24945
39581B87913k36315r2590O1671m0313l23133l87426j3186M36803L89759j20115
39571c6932l70154Q4867P10254O73133J728m78513l12427P5860J74753J01833
39561F24402J84656K87649N8988l95490n95896l75193m6622J23711K18311L56460
39551D40976M20221K61044m0440k80492l56257k76243q3783J24693K18275J64535
39541E92529O1495j2481p3196j19813r7311l0957l3266q6053J800K78221M72556
39530I53524L43604N3735p1492o1205k41446o40074p99764l63822L90304Q38292
39520D01656P05952K64191r5389k47108k86245l05824l12917k60215q4298K18630
$$ plain form
39591 1580566 874511 163421 -291468 -502257 -565760 -459292 -142781 236706 412858 287913
39581 287913 51598 -40992 20679 -19634 -342767 -730193 -743379 -306576 83183 -36932
39571 -36932 -407086 -322219 388035 1061168 1062896 584383 271956 347816 522569 624402
39561 624402 809058 1096707 1155695 760205 164309 -210884 -257506 -133795 84516 440976
39551 440976 861197 1122241 1081801 801309 445052 168809 85026 209719 427994 592529
39541 592529 654024 641543 568347 448534 351223 320266 287000 200947 202747 480968 953524
39530 953524 1297128 1350863 1279371 1218166 976720 336646 -463118 -826940 -436636 401656
39520 401656 1107608 1371799 1276410 1029302 743057 437233 124316 -135899 -220197 -1567
39510a567N05041N54697L09504j3082j39513n0377K5934o5191k01758j76561j2195
39499G34932N1724r8618k54463j44971J61004K73514m0207n14727o55485l13908
39489h01205J48727L04974J36484l3343J2166J61440J93902O1846j14331k18165
39479a47505k07475r1351N3931J01817K8352L512J78132L94269L02392j63991
39469D52083o06554n92257j52415K93645M28120K84012O6321p1196n5834J03436
39459A49361K58339J97696j10441m26446m75078k23289J36844M09096N05905L99321
39449H21308R9825k80213n31797m98744k22813Q6889K30230J55639m8644k50534
39439d38854l50274l24361k51275k47815l00306k08772J67951O34164Q07419N77569
$$ plain form
39510 -1567 503474 1058171 1367675 1354593 1215080 1164703 1190637 1125446 923688 747127 734932
39499 734932 786656 688038 433575 288604 449608 723122 682915 168188 -487297 -801205
39489 -801205 -652478 -347504 -211020 -244363 -232197 -70757 123145 184991 70660 -147505
39479 -147505 -354980 -446331 -392400 -290583 -262231 -258719 -80587 313682 616074 452083
39469 452083 -154471 -746728 -899143 -605498 -177378 106634 172955 101759 45925 149361
39459 149361 407700 605396 494955 68509 -406569 -629858 -493014 -83918 421987 821308
39449 821308 921133 640920 109123 -389621 -612434 -525545 -295315 -139676 -188320 -438854
39439 -438854 -789128 -1113489 -1364764 -1612579 -1912885 -2121657 -1953706 -1319542 -512123 65446
39429F5446K09231p8663l60139o58788o70498j85881M13314N32304J77561o3308
39419f19421J17735L80061L51414J46932L2724j9477j26818j79468p6576j779
39409E327j07746j76225K7175K92175K81627J04767R4069J73042J293l23267l18744
39398E3493O2142K70216L301l42506l49562k10809k98438m92756m01832j4156
39388a720907L05474L48771K29408J03405M3380J23179L34029M67460L51105J47889
39378G33193J45922K94538K53864q2218m19634n01995m40095m54407n03011l80051
39368a353894q5588J20834O4882q6494j8989L12950N83739M78077Q9837j95358
39358i0004j80325l7201J6122M008L9684P5376J468j19564j27609k0370N7395
$$ plain form
39429 65446 274677 196014 -164125 -822913 -1493411 -1679292 -1265978 -733674 -556113 -619421
39419 -619421 -501686 -121625 229789 376721 409445 389968 263150 83682 7106 5327
39409 5327 -102419 -278644 -251469 40706 322333 427100 521169 694211 695504 372237 53493
39398 53493 115635 385851 389152 46646 -302916 -513725 -812163 -1304919 -1706751 -1720907
39388 -1720907 -1415433 -1066662 -837254 -733849 -690469 -567290 -233261 234199 585304 733193
39378 733193 879115 1173653 1427517 1345299 925665 423670 -16425 -470832 -973843 -1353894
39368 -1353894 -1439482 -1318648 -1253766 -1340260 -1359249 -1046299 -462560 15517 105354 -90004
39358 -90004 -270329 -307530 -291408 -287400 -247716 -172340 -170872 -290436 -418045 -438415 -381020
39347c81020N8627Q1352J50096J21254j07502l91299m50408j90047J56826K71632
39337f80489J30978L2414J63659K96668J19945k33525l16069k1133K65914K77905
39327C6267K30409L54404M45662K29984j14057k12304q5908o6493k35237l45526
39317B37201k41852m107K54722M07047K54542j67632l89060q3020K93029L0916
39307E91786p08172r99612m74170J91337L39138J67237J16949J11617l9936n9000
39297g62826L07476O35834L96372j26446k32744P6574J70925j04972k21091N9398
39287A98500K83868J25814j12632j38315j61244l40110l25162J17041N07141K99562
39277D54463k19378l35583J2726K42832J18243J9726J55945J87219j16136m13633
$$ plain form
39347 -381020 -322393 -241041 -90945 30309 -77193 -468492 -918900 -1108947 -952121 -680489
39337 -680489 -549511 -517097 -353438 -56770 63175 -170350 -486419 -507552 -241638 36267
39327 36267 266676 621080 1066742 1296726 1182669 970365 884457 817964 582727 237201
39317 237201 -4651 -8758 245964 653011 907553 739921 350861 267841 560870 591786
39307 591786 -116386 -1115998 -1590168 -1398831 -1059693 -892456 -775507 -663890 -703826 -762826
39297 -762826 -455350 180484 576856 450410 217666 294240 465165 360193 139102 198500
39287 198500 482368 608182 495550 357235 195991 -144119 -469281 -352240 154901 454463
39277 454463 235085 -100498 -87772 155060 273303 293029 448974 636193 520057 106424
39267A06424l49744j26571j15088k26703j12256K25930M44783L58042N8724l27073
39257f3532o31533n28099J04675P48925P01257M0027l78567p2417M29089M01739
39247G51564r3549m85337n65078n35571m26885q1120L39146M15177J19607j08095
39237f70141n3860q605j74611k82329r8191J16194N2733p1477J29249M89613M56428
39226a14997p0138n44387n14007j51856J12110J61490J60560J78812J35944M1869
39216f04600M1262J87282L29338K91997Q3465j28492j96782j04624N4851J37444
39206I1141K1532k65851m84748l76007J0854L10891K78450J00269J02640K64081
39196E3252K73692K6590k27877k60024j06862J05963K97762L10002r579m38818
$$ plain form
39267 106424 -243320 -369891 -484979 -711682 -823938 -598008 -153225 204817 263541 -63532
39257 -63532 -695065 -1223164 -1118489 -369564 331693 371720 -6847 -79264 349825 751564
39247 751564 658015 172678 -392400 -927971 -1354856 -1435976 -1096830 -681653 -562046 -670141
39237 -670141 -724001 -732606 -907217 -1189546 -1287737 -1171543 -1118810 -1190287 -1061038 -571425 -114997
39226 -114997 -185135 -729522 -1243529 -1395385 -1283275 -1121785 -961225 -782413 -646469 -604600
39216 -604600 -563338 -376056 -46718 245279 328744 200252 3470 -101154 -46303 91141
39206 91141 112673 -153178 -637926 -1013933 -1003079 -692188 -413738 -313469 -210829 53252
39196 53252 326944 353534 125657 -134367 -241229 -135266 162496 472498 462919 24101
39186B4101m52502P0671N30155L48525k17553m35729j01601K91556L38181J90043
39176E85847J45347J77708P5441k02253m81579n41271k60986K32914N59804M37447
39166G28419N3224j58039j08333j21685l57450n27232l46615M1141L02886L30918
39156a62766K18175M5453r9760j01533j0490m1763j85543r7892L49133P01728
39146F14742M95145l6488k80727j32642m3835k27696l73693k58592j07707j06426
39136d57919j2114M00488Q52224R10954N97337K54763n499l10832n82010n37702
39126A109690j79534J25744J53708O4406L415j76175n42781p43338m07490K45597
39116c46758N85176L47504q7510k53796j32055J0098N2265O7807Q6432O2457L7041
$$ plain form
39186 24101 -428401 -357730 172425 520950 303397 -132332 -233933 57623 395804 585847
39176 585847 731194 908902 984343 782090 300511 -240760 -501746 -268832 290972 728419
39166 728419 781643 623604 515271 393586 36136 -491096 -837711 -796570 -493684 -162766
39156 -162766 55409 100862 1102 -100431 -110921 -152684 -338227 -436119 -86986 614742
39146 614742 1109887 1073399 792672 660030 616195 388499 14806 -243786 -351493 -457919
39136 -457919 -470033 -69545 782679 1693633 2290970 2545733 2540234 2229402 1647392 1109690
39126 1109690 930156 1055900 1209608 1274014 1277429 1101254 558473 -184865 -592355 -346758
39116 -346758 238418 585922 498412 244616 112561 122659 174924 242731 329163 391620 428661
39105D28661J12048K42242K36014K4369k12201k66495j47924j8983J7940k9243
39095C86428j22517j94169j20591J46934M30852M68623K41400L667p6773j22922
39085A040932k57246k93449K2890N46701Q06592N87539J82105l5816n0680o6902
39075B482666j38342j56014q6341l480O4328J44330K03187J53658m8612l80480
39065B234900p24230q17043m49668J40501L55416q846l65523r3471N42623P56432
39055A571091L84435K5709L4102Q5977n0739l5231L52331O50091L98066p5943
39045C339889j48603J61583L53459K76190J81017J30115j2034j16816M4299K48526
39035D457625Q9081k38374j26888M05230O23732K18554k13800j56751O9072o53
$$ plain form
39105 428661 540709 782951 1018965 1043334 831133 564638 416714 397731 415671 386428
39095 386428 263911 69742 -50849 96085 526937 995560 1236960 1240627 1163854 1040932
39085 1040932 783686 490237 513127 1059828 1866420 2453959 2636064 2600248 2549568 2482666
39075 2482666 2344324 2188310 2101969 2098489 2162817 2307147 2510334 2663992 2615380 2234900
39065 2234900 1510670 693627 243959 384460 739876 731030 365507 272036 814659 1571091
39055 1571091 1955526 1981235 2015337 2101314 2050575 2015344 2367675 3017766 3415832 3339889
39045 3339889 3191286 3352869 3706328 3982518 4163535 4293650 4281616 4164800 4209099 4457625
39035 4457625 4546706 4308332 4181444 4586674 5210406 5428960 5215160 5058409 5127481 5126828
39025E126828j62668k4536K22876J96694J03617L79246P76776O16043q8255n19436
39015F627185k40333J94760J24107k68372l26551R5749N11325N27472K70445N6635
39005G572422k9092q4732j22747n6989Q8355J47137O4018M6024L02415O85189
38995H612000P94943M91037J02414J9369K44304N03056O47538P22501P24906N73195
38985A3435263L35319K39988L63239M94998M55735L89022N31101P74053P47881
38976A7766599M10976K60574O82581J288278J341099Q44020O66473J328889K172046
38967B6761535K258629J736646J581887K116313K612611K520036K271878K465557
38959D4325092K922254L150336L243412L640864M308089M830967N149470N561729
$$ plain form
39025 5126828 4964160 4939624 5162500 5359194 5462811 5842057 6618833 7234876 7146621 6627185
39015 6627185 6386852 6581612 6705719 6437347 6110796 6206545 6717870 7245342 7515787 7572422
39005 7572422 7543330 7458598 7335851 7278862 7367217 7514354 7578372 7624396 7926811 8612000
38995 8612000 9406943 9897980 10000394 10019763 10264067 10767123 11414661 12137162 12862068 13435263
38985 13435263 13770582 14010570 14373809 14868807 15324542 15713564 16244665 17018718 17766599
38976 17766599 18177575 18438149 19120730 20409008 21750107 22594127 23260600 24589489 26761535
38967 26761535 29020164 30756810 32338697 34455010 37067621 39587657 41859535 44325092
38959 44325092 47247346 50397682 53641094 57281958 61590047 66421014 71570484 77132213
38951G7132213O109682O592769P140428Q110529R366472J0310997J0802970J1426892
38943A46992952J2596895J3958815J5025511J5898275J6903577J7886610J8358333
38936B57620968J8111749J7235270J5677761J3261868J0077798O465997K608138
38929C41059549j513253n711557r483963j2422277j4511377j5920915j6710242
38922B64785965j6882906j6583793j6057829j5436670j4678060j3728089j2674354
38915A58744264j1690738j0840884r999347r031776q023179p216030o699118o286561
38907H8956631n785169n255702m860894m540542m055510l380444k846568k760869
38899E5470933l000634l146158k961921k575177k191626j853234j565871j446693
$$ plain form
38951 77132213 83241895 89834664 96975092 105085621 114452093 124763090 135566060 146992952
38943 146992952 159589847 173548662 188574173 204472448 221376025 239262635 257620968
38936 257620968 275732717 292967987 308645748 321907616 331985414 338451411 341059549
38929 341059549 339546296 333834739 324350776 311928499 297417122 281496207 264785965
38922 264785965 247903059 231319266 215261437 199824767 185146707 171418618 158744264
38915 158744264 147053526 136212642 126213295 117181519 109158340 101942310 95243192 88956631
38907 88956631 83171462 77915760 73054866 68514324 64458814 61078370 58231802 55470933
38899 55470933 52470299 49324141 46362220 43787043 41595417 39742183 38176312 36729619
38891C6729619j531022j573729j324692r49268q58904j096117j232867j005213
38883B7157807p00615o84502q61462r34042r28636j038386j117996q38603l22146
38874A9731419j28225m97640j012371j158624q84496m49847p3008P0123j73899
38865A5423432o79856j008671q95913n80789m11391l48426j63793O3934M0555
38856A1439082k27663l83586k24180M3493J34171L2942j00615j93353k77002l39211
38846I904078k97626j32579K4452M042j69591k33178M938L46184L98338J22375
38836I971433q0487L7326J74148n6233n01095o88429n33711l83015l72969k39734
38826G327234J00197K57385l8767m29004m17816j35549j29171m88820o91298l92013
$$ plain form
38891 36729619 35198597 33624868 32300176 31350908 30492004 29395887 28163020 27157807
38883 27157807 26457192 25772690 24911228 23977186 23048550 22010164 20892168 20053565 19731419
38874 19731419 19603194 19105554 18093183 16934559 16050063 15600216 15527208 15597331 15423432
38865 15423432 14743576 13734905 12838992 12258203 11846812 11498386 11334593 11398527 11439082
38856 11439082 11211419 10827833 10603653 10647146 10781317 10814259 10713644 10520291 10243289 9904078
38846 9904078 9606452 9473873 9498325 9502367 9332776 9099598 9104536 9450720 9849058 9971433
38836 9971433 9890946 9928272 10102420 10046187 9545092 8856663 8322952 7939937 7566968 7327234
38826 7327234 7427431 7684816 7646049 7217045 6799229 6663680 6534509 6045689 5354391 4962378
38816D962378Q4569K58345J31409J2465k4943j33111k81080k52779m9105N8116
38806D766264n2273j73481j33855o8945j49968k51318j26208J86710L52183J36314
38796D485423l03393n47061l20551J82289M26791J16836m00559n25393j72626
38787B941756J57818J13913r6731j72742j64617j77423m6768K89177M59327J90812
38777C494522j31745L118L89385M22198P9598j32251j25643l09860o59574n75467
38767B454281M8661M45001J14557l64323k45840K64873M73591L06729K10411K43342
38757C951283M8502l75113n82113m00644j60089j12227j19114l0249O3031R4504
38747B377771J79758L41157L67628J25586j94389l00008j49526K2259k0943k45632
$$ plain form
38816 4962378 5046947 5305292 5436701 5449166 5424223 5291112 5010032 4757253 4708148 4766264
38806 4766264 4713991 4540510 4406655 4337710 4187742 3936424 3810216 3996926 4349109 4485423
38796 4485423 4182030 3634969 3314418 3496707 3923498 4040334 3639775 3114382 2941756
38787 2941756 3099574 3213487 3116756 2944014 2779397 2601974 2555206 2844383 3303710 3494522
38777 3494522 3362777 3365895 3755280 4177478 4257076 4124825 3999182 3689322 3029748 2454281
38767 2454281 2502942 2947943 3062500 2698177 2452337 2717210 3190801 3497530 3707941 3951283
38757 3951283 3999785 3624672 3042559 2641915 2481826 2369599 2250485 2220236 2283267 2377771
38747 2377771 2557529 2898686 3266314 3391900 3197511 2897503 2747977 2770236 2749293 2503661
38737B503661l52153j30388J93481J79471j87155l85972q7147L39895L65615N6594
38727B495902j27907o8442j9067m6804K2331J27513j5582l56666m66896j97983
38717A346399O5412M684j86850j95355o8612j6376m020J29428L10953L01173P2301
38706A759137j16188m1515K12207L41183J40868k68782n54105n24020l12511j55042
38696D81232r6932m3513J5427J3241k6761p995R0406K07914K81056K35137L6273
38685A185485j42003k0607L50717N25912K66805q0135j20322Q396J1579M8885
38675B034712L90280P26520N18701r5125m68297m67290n48466p78644o38907k7053
38665F46431L84051J79789j46408n3695K02588J46787q3128j15569q1633k80203
$$ plain form
38737 2503661 2151508 2021120 2214601 2394072 2206917 1820945 1733798 2073693 2439308 2495902
38727 2495902 2367995 2299553 2280486 2233682 2256013 2383526 2367944 2011278 1544382 1346399
38717 1346399 1411811 1416495 1229645 1034290 965678 949302 945282 1074710 1385663 1686836 1759137
38706 1759137 1642949 1601434 1813641 2154824 2295692 2026910 1472805 948785 636274 481232
38696 481232 384300 340787 356214 369455 342694 334699 425105 633019 914075 1149212 1185485
38685 1185485 1043482 1022875 1373592 1899504 2166309 2086174 1965852 1974248 1985827 2034712
38675 2034712 2424992 3151512 3670213 3575088 3106791 2639501 2091035 1312391 673484 646431
38665 646431 1030482 1210271 1063863 1010168 1212756 1359543 1276415 1160846 1079213 799010
38655G99010m64542j86998L56947N31198K26025q129J90856N51079O38397L39916
38645B973759j93094p14995r29704o86097k12760Q0028P3103J7818J53402M41207
38635A002667O61770O07555K27321k67094n21444m20665k36066k35372l08913
38626E09759j94946Q2062K57255K06106M2706q3439r4268K0604J51346J35195
38616A032380J2373K4552K04657K33856n1737k88766o4178M35569O29494K91519
38606B459719k33390n00300l91001j29927n6854k78947m46364j11192N77517R15479
38596A804740N93281J45388J08678K37614O5758k30884k06388r641j05223l77052
38586B026271l30608n2886j11585n09078o05740k06837J09349j7644j85431J065
$$ plain form
38655 799010 334468 147470 504417 1035615 1261640 1253511 1444367 1995446 2633843 2973759
38645 2973759 2780665 2065670 1135966 449869 237109 317137 390240 408058 561460 1002667
38635 1002667 1664437 2271992 2499313 2232219 1710775 1290110 1054044 818672 509759
38626 509759 314813 396875 654130 860236 902942 819503 725235 745839 897185 1032380
38616 1032380 1044753 1069305 1273962 1507818 1456081 1167315 1103137 1538706 2168200 2459719
38606 2459719 2226329 1726029 1335028 1205101 1148247 869300 422936 311744 889261 1804740
38596 1804740 2398021 2543409 2652087 2889701 2955459 2724575 2518187 2508546 2403323 2026271
38586 2026271 1695663 1642777 1531192 1022114 416374 209537 318886 301242 115811 116876
38576A16876L00906L59109K70046K32471J54401l1028j27538q8304j85252m34538
38566E67149l78983J47566N59816L36957j46672j93373J48818K20949k12542o53122
38556C96563n79342l4381N23765O73626L54593o2912j24240J55936K92222L0340
38546A626170k67575j96738P0512J09940q7987k04274j45579p9578n1280K4353
38536G97964Q0886m764j10673k4011J67813J85939M346j46070j65610j56285j55371
38525D74164j15308j00697j92288k46875p2216K12176L22047K63976K82841L86623
38515A214443L23431O2220j04996l6657N0713j1588n8757J03537L62925M51971
38505B357242K59293j32034n41329p34310n63928j69830J30216K11394K14057
$$ plain form
38576 116876 417782 776891 1046937 1279408 1433809 1402781 1275243 1186939 1001687 567149
38566 567149 188166 335732 895548 1232505 1085833 892460 1041278 1262227 1049685 396563
38556 396563 -182779 -217160 306605 980231 1334824 1271912 1147672 1303608 1595830 1626170
38546 1626170 1358595 1161857 1232369 1342309 1254322 1050048 904469 824891 773611 797964
38536 797964 878850 874086 763413 739402 907215 1093154 1097500 951430 785820 629535 474164
38525 474164 358856 258159 65871 -181004 -253220 -41044 281003 544979 827820 1214443
38515 1214443 1537874 1600094 1495098 1458441 1509154 1497566 1438809 1542346 1905271 2357242
38505 2357242 2616535 2484501 1943172 1208862 644934 475104 605320 816714 1030771
38496A030771K14259J03422r5941j08178J75464M05350K00722k83931n34342l52246
38486G55350m8655M6538l0088q0713q0418j09902j13974K5903K21453K21416k1765
38475G85145k31849j69593M7684J39121M1155r0661j51838j37008m752K29709
38465D57113L14444O275m76598o03166k30366K00520L13055K50140K45140J55959
38455F32516j78439m50332k63979J76507K87464m4063l32787k45571k7J04927
38445c13784J23695K17857L05188K07119n0181k78771l40656k00499Q4304L28213
38435H2485L25282Q9421j42697k07074j61299r9460j4673P5183O2701o8694j58233
38424b17058p7968J04892K68748L89766M47765L42311N8382j98307k02190o24
$$ plain form
38496 1030771 1245030 1348452 1252511 1144333 1319797 1725147 1925869 1641938 1107596 755350
38486 755350 706695 753233 723145 642432 562014 452112 338138 364041 585494 806910 785145
38475 785145 553296 383703 431387 570508 611663 521002 369164 232156 227404 457113
38465 457113 771557 777832 301234 -301932 -532298 -331778 -18723 231417 476557 632516
38455 632516 454077 3745 -260234 -83727 203737 159674 -173113 -418684 -418711 -313784
38445 -313784 -190089 27768 332956 540075 489894 211123 -129533 -330032 -245728 82485
38435 82485 407767 497188 354491 147417 -13882 -113342 -128015 -52832 9869 -58825 -217058
38424 -217058 -295026 -190134 78614 468380 916145 1258456 1316838 1118531 916341 915717
38414I15717J20985m2344l94867o16600m42336P1023N38079N92971K72467l7497
38404I77598n6932J05273J68637M9396r4226j13095m8615n2093j69629k52512
38394E13802j36114R6540J56349o4095k84326j87803J26912K80304J50958J3364
38384F65891J02111K88453K93424L8791l17322n50362m96958j62501K07459K92688
38374C61674L3670k82227l26563m6227L32698N08517L21774q5296l29645j67142
38364C21233J96019L50857K18110R0080J37280J80973N6137r5484p3230P1466
38354A453441J64807J70076J32557K1773j83788l67534l86672k28309L0293K82353
38344A088997L50138R0849l43220n69122m41005k32164j96603k09654o1741J55137
$$ plain form
38414 915717 1036702 994358 599491 -17109 -459445 -388422 149657 742628 1015095 977598
38404 977598 920666 1025939 1194576 1243972 1149746 1036651 988036 935943 766314 513802
38394 513802 377688 474228 630577 566482 282156 94353 221265 501569 652527 665891
38384 665891 768002 1056455 1349879 1388670 1071348 520986 24028 -138473 68986 361674
38374 361674 395344 113117 -213446 -259673 73025 581542 903316 818020 488375 321233
38364 321233 517252 868109 1086219 1176299 1313579 1494552 1550689 1455205 1381975 1453441
38354 1453441 1618248 1788324 1920881 1942654 1758866 1391332 1004660 776351 806644 1088997
38344 1088997 1439135 1529984 1186764 617642 176637 -55527 -252130 -461784 -523525 -368388
38334c68388K47499K85594M33017N82277N18034L16553K10139J47074j11151m90912
38324A769736o25825m16897j77135j24442j09452M875N4525j09122l04651k86972
38314c25360j19544j8254J8700J53103L70400M61769L24421P6911j29455k52622
38304E60069l03748k84466j99675m2746K09481M84078N50715K52522k00371l79605
38294F46254j66042O8510l3125k95540k58222J31625L98272J89961k39361l96318
38284D6014j79942J10182K46671K42501J18721j39660l61821k79346L6270J52492
38274g918j03197l04683j7740M95636N62573J7850n55928n76900j42912J88356
38264d44863R6385k02637k76988K3694M02389M40124R2870k23751j33237K30574
$$ plain form
38334 -368388 -120889 164705 597722 1179999 1698033 2014586 2224725 2371799 2260648 1769736
38324 1769736 1143911 727014 549879 425437 315985 320860 375385 266263 -38388 -325360
38314 -325360 -444904 -463158 -444458 -291355 79045 540814 865235 942146 812691 560069
38304 560069 256321 -28145 -227820 -270566 -61085 422993 973708 1226230 1025859 646254
38294 646254 480212 548722 515597 220057 -38165 93460 491732 681693 442332 46014
38284 46014 -133928 -23746 222925 465426 584147 444487 82666 -196680 -160410 -7918
38274 -7918 -111115 -415798 -433538 62098 624671 642521 86593 -490307 -633219 -444863
38264 -444863 -348478 -551115 -828103 -804409 -402020 38104 130974 -92777 -226014 4560
38254D560M27984L04123J16765P8473P4049m4810j48173l6159J95446K40833j5590
38243A197501l74504n71965m95629j85160J96960L90752K36908q1048j70252Q5013
38233B28576L31642K06950j46933k73190m9665J55721N3203j48525j12860N6454
38223C01373l8957m35961o61100l52950K30655N22064L10276r9075l09828k20016
38213g53519K0581K55662M15549M30832J94491k92708p63963q19973l39152L09379
38203a342821O05898M20240Q0044q1509o2618l6373n3683l8552L0006P6898M8694
38192c53776r301J267J16205K27549J77205m462n8495J59616M11220L83099J73630
38181A223757J40377K81480J81465l06420p32152o54977k58149n2360j92114l92487
$$ plain form
38254 4560 432544 736667 853432 931905 1005954 961144 812971 776812 972258 1213091 1197501
38243 1197501 822997 251032 -244597 -429757 -232797 157955 394863 313815 143563 228576
38233 228576 560218 767168 620235 347045 297380 453101 506304 357779 244919 301373
38223 301373 262416 -173545 -834645 -1187595 -956940 -434876 -124600 -223675 -533503 -753519
38213 -753519 -732938 -477276 -61727 369105 563596 270888 -493075 -1313048 -1652200 -1342821
38203 -1342821 -736923 -316683 -236639 -318148 -380766 -417139 -470822 -509374 -479368 -402470 -353776
38192 -353776 -363077 -361810 -245605 -18056 159149 154687 96192 255808 667028 1050127 1223757
38181 1223757 1364134 1645614 1827079 1520659 788507 133530 -124619 -176979 -369093 -761580
38171g61580l70045r7769K58178M43747K93633l3101j80535r3076r1182k72742
38161i04472k52411J72242N37488L97040R6755K18015N46613L89539k08803m40732
38151E51274j2766M01309K59173o7467l3108K04077J75248j07740l04639l58944
38141G06417m50634n73023n94660n47736m85463k69103J46974M55045L88701J37717
38131a085765r91r4759k55707j78842L92373R65121P79618o1383o59665n75002
38121g75002k88352k40683j67972K14212N29443L27820j00838j38261K11269M04129
38111b4235K42771O4843P4435P1988n2762q5114O9651J56702K9669n6115R9162
38100E90995K43115R8866r9846M6857L98435M09061n8687n25216n78720l52802
$$ plain form
38171 -761580 -1131625 -1229394 -971216 -527469 -233836 -266937 -447472 -540548 -631730 -904472
38161 -904472 -1156883 -984641 -447153 -50113 46642 264657 811270 1200809 992006 551274
38151 551274 538508 939817 1198990 1131523 1098415 1302492 1477740 1370000 1065361 706417
38141 706417 255783 -317240 -911900 -1459636 -1945099 -2214202 -2067228 -1612183 -1223482 -1085765
38131 -1085765 -1086756 -1181515 -1437222 -1616064 -1223691 -258570 521048 459665 -200000 -775002
38121 -775002 -1063354 -1304037 -1472009 -1257797 -728354 -400534 -501372 -639633 -428364 -24235
38111 -24235 218536 283379 357814 429802 377040 291926 361577 518279 547948 491833 590995
38100 590995 834110 932976 833130 879987 1278422 1687483 1628796 1103580 524860 172058
38090A72058j75968j22083j20528j87360k83042k04924Q8535K67942O9299k34465
38080g30536j61750K74326N67613M15597O1035j28297j13145q6739j49931k28971
38070b80798j93293K4925L29191M64497K65868r1589k58366j47718k6296j17795
38060c1374k91845k44605J15711N36838O34938K62383k72384m46485j10634K90856
38050D43399K77714m7794k35688j94084k23290l73163k83514J73760N55428M40457
38040E33225K3153k08916j40303m2451r4120k03995k24119q6115K14739N69151
38030C40249P44645N92139K12487j82837m70501n84470m58128j52813J00944J56494
38020B98209J24986J55897J90342R9123o9305j61320j35462m6804Q7585K57153
$$ plain form
38090 172058 -3910 -125993 -246521 -433881 -716923 -921847 -833312 -565370 -496071 -730536
38080 -730536 -892286 -617960 -50347 365250 426285 297988 184843 98104 -51827 -280798
38070 -280798 -474091 -449166 -119975 344522 610390 518801 260435 112717 86421 -31374
38060 -31374 -323219 -567824 -452113 84725 719663 982046 709662 263177 152543 443399
38050 443399 721113 673319 437631 243547 20257 -352906 -636420 -462660 92768 533225
38040 533225 556378 347462 207159 164708 70588 -133407 -357526 -443641 -228902 340249
38030 340249 1084894 1677033 1889520 1706683 1236182 651712 193584 40771 141715 298209
38020 298209 423195 579092 769434 868557 799252 637932 502470 455666 543251 800404
38010H00404L76974L66866K46600R2160q02Q9698L55250M88933J71453m06338
38000B581198o57955l76092q390M8708J468J64255L18746N7387m90257p88438
37990H50630o25655k66269K9297K06732K11291N876k15815k04002l6338k736j38769
37979a85758j99314o7668J24876K55130K81335J13946k68664o16111o21959l04610
37969a488797Q6347M28141O92468P21198M15894K0657j73539k58936m32654m97842
37959d87063j79768K36608K30025q7022j24141J75775K49738o2362k19199M5764
37949b21645K37854j3098k94431j46629J48712R8735j64129j85622K7076J22311
37939c90866N5765P4819K14858K87236K52747K16823J71776O6207j9910m7007
$$ plain form
38010 800404 1177378 1544244 1790844 1883004 1882202 1971900 2327150 2816083 2987536 2581198
38000 2581198 1923243 1547151 1538761 1587469 1588937 1753192 2071938 2129325 1639068 850630
37990 850630 224975 -41294 -11997 194735 406026 411902 196087 -7915 -44253 -46989 -185758
37979 -185758 -385072 -452740 -327864 -72734 208601 322547 53883 -562228 -1184187 -1488797
37969 -1488797 -1402450 -974309 -281841 439357 855251 875908 702369 443433 10779 -487063
37959 -487063 -666831 -430223 -200198 -287220 -411361 -235586 14152 -48210 -267409 -221645
37949 -221645 16209 3111 -291320 -437949 -289237 -190502 -354631 -540253 -513177 -390866
37939 -390866 -335101 -260282 -45424 241812 494559 711382 883158 949365 929455 882448
37929H82448j56303l74004m47035k65417j19711j88379j47531K48406N74170L20601
37919C27245k10675k90619J08004K93446k8774l35984j58332K38041L26874M3086
37909C12312k71203l46820j67575J24601L24490L01232J21304q2801l12869n60465
37899e57794n66966r0027N98831Q86353N83638J53908L5104R4694j6894k77516
37889H43331l76478k26620p9322j38827k86013k71012q4427q071k29691m91593
37879a348723l37795K31937O20255L56610k55023n24168k63465Q3631J47218N1293
37869a238230N7231J50999J65642Q4106L9060J18680K65309L09507J23387j76521
37859a00830k79976q1238J22723N3307j05971n843K84892M01275K86685K02387
$$ plain form
37929 882448 726145 352141 -94894 -360311 -480022 -668401 -815932 -567526 6644 327245
37919 327245 116570 -174049 -66045 227401 198627 -137357 -295689 -57648 269226 312312
37909 312312 41109 -305711 -473286 -348685 -24195 277037 398341 315540 2671 -557794
37899 -557794 -1124760 -1214787 -615956 270397 854035 1007943 1043047 1137741 1120847 843331
37889 843331 466853 240233 160911 22084 -263929 -534941 -619368 -627439 -857130 -1348723
37879 -1348723 -1686518 -1454581 -834326 -477716 -732739 -1256907 -1520372 -1436741 -1289523 -1238230
37869 -1238230 -1180999 -1030000 -864358 -780252 -741192 -622512 -357203 -47696 75691 -100830
37859 -100830 -380806 -462044 -339321 -286014 -391985 -397828 -112936 288339 575024 777411
37849G77411J72087m6934l82025m06271n6037J66486k0210k09575R608L69513
37839C74053L73821N7404j92744k76429l24618k45861J03425M36060L15987r8386
37829E22712j75306K34609N16353J80099m41147p00237m80758j54815N9072K65038
37819a74380M95281N51402L23375j0599k26250l00381k94382j75672N7326K01789
37809D47509N1238k59461l62081j55816M2451l9582k50137k81301j19419J5581
37799i11018L4765P690p0252k29407k99890o7091L37852N23159L52474O7565j40124
37788c94277l20903m45637l03814P6577K84264Q4271j87124j06955K16542L65727
37778g31329K43110Q9042R090j08128k48176k23412N175K58961M17627M94721
$$ plain form
37849 777411 949498 902564 520539 114268 58231 224717 204507 -5068 4540 374053
37839 374053 747874 805278 612534 336105 11487 -234374 -130949 305111 621098 522712
37829 522712 347406 582015 1098368 1278467 837320 137083 -343675 -498490 -439418 -174380
37819 -174380 320901 872303 1195678 1185079 958829 658448 364066 188394 245720 447509
37809 447509 498747 239286 -122795 -278611 -236160 -275742 -525879 -807180 -926599 -911018
37799 -911018 -876253 -868563 -938815 -1168222 -1468112 -1535203 -1197351 -674192 -321718 -254153 -394277
37788 -394277 -715180 -1160817 -1464631 -1388054 -1103790 -1019519 -1206643 -1313598 -1097056 -731329
37778 -731329 -488219 -399177 -390087 -498215 -746391 -969803 -964628 -705667 -288040 206681
37768B06681M29692R8725m01021p30862o66935k97185J65215N45653O52446L36933
37758C39342k42372o17196m59888N3843M57031M92794L03867J82018K31354K90212
37748A031005J62729r9511k32207j22707j832j13176l11667k54156M9232J95556
37738C03266j9501k81703k21420M8049J26368p9063k52314j42441J22934K65501
37728a30324K10852J01098N3193K5894p6957k34706k88539j22399J52037K77792
37718c2059J62593O991K4433J35178J18876J3528R3303L82169M77981Q6254m70162
37707I99085n92055j79421K69289L49854J91044P7860j2149k28861m62604m83741
37697g1699l35374k40572j82437O4375M70303O79939N15045K41981J67105K09428
$$ plain form
37768 206681 636373 735098 334077 -396785 -1063720 -1360905 -1195690 -650037 2409 339342
37758 339342 96970 -520226 -980114 -926271 -469240 23554 327421 509439 740793 1031005
37748 1031005 1193734 1094223 862016 739309 737477 624301 312634 58478 107710 303266
37738 303266 283765 2062 -219358 -171309 -44941 -124004 -376318 -518759 -395825 -130324
37728 -130324 80528 181626 234819 260713 183756 -50950 -339489 -461888 -309851 -32059
37718 -32059 130534 137525 161958 297136 416012 429540 522843 905012 1382993 1469247 999085
37707 999085 407030 227609 496898 846752 1037796 1115656 1103507 874646 412042 -71699
37697 -71699 -407073 -647645 -830082 -765707 -295404 384535 899580 1141561 1308666 1518094
37687A518094Q5474k45446n32594n48172k96760K8555J92075Q8005j39626k13490
37677f3885k6399K40219L38352K00961n6309k58491k64384o4612J83516L30745
37667E59713M06789M51722K91301j86450n93120l71907L19298N94078L410p77073
37657F97761q61501l32914N3715K7840k3387R6002R8478j39673k79162j03596
37647g66437R5543J2933j73240j10101J93619M29147M04142J72290r8352k04282
37637d4738j0798L45672M95841K41085j94932m45520m02742k16237l6021Q2093
37627a86297J16436Q3851N3678N3102J5480r7434j89621j26073J09181L87970
37617B20273N27299M19199J54246k6758k5760n6158l21790o09928n19030r5905
$$ plain form
37687 1518094 1603568 1358122 825528 277356 -19404 9151 201226 289231 149605 -63885
37677 -63885 -90284 149935 488287 689248 632939 374448 110064 45452 228968 559713
37667 559713 966502 1418224 1709525 1523075 929955 558048 877346 1471424 1474834 697761
37657 697761 -163740 -496654 -442939 -415099 -438486 -342484 -244006 -383679 -662841 -766437
37647 -766437 -670894 -657961 -831201 -941302 -747683 -318536 85606 257896 159544 -44738
37637 -44738 -55536 290136 785977 1027062 832130 386610 -16132 -232369 -268390 -186297
37627 -186297 -69861 13990 67668 120770 136250 38816 -150805 -276878 -167697 220273
37617 220273 747572 1166771 1321017 1294259 1268499 1212341 890551 280623 -238407 -334312
37607c34312J35694q5018l61466k35477J40830K78407Q2173r3681l6609P0226
37597d39233J8998j23608j94306j68196q8876N2695K26989K84173J19365j45477
37587d57476k81856k27379j13829l8425L6838J12856O0255j49008k59200l2485
37577a349709L26064L64400M2727j70285j1829J68803K3661j70005O179K98752
37567d71242J14625m34361n56878J5700N52240L74919j94528l93757q2890K65807
37557h10365L45676K60138J44230R308q9663r6224j16877k50779l38380j70289
37547a113225J42565L01031K38060J20645J8292j29107k75589k91935j77377j806
37537a168446K60698N66394O20185K31008k53668k93791R3677L63130K30975j9908
$$ plain form
37607 -334312 -198618 -283636 -645102 -880579 -739749 -461342 -379169 -472850 -509459 -439233
37597 -439233 -420235 -543843 -738149 -906345 -995221 -942526 -715537 -431364 -311999 -457476
37587 -457476 -739332 -966711 -1080540 -1118965 -1082127 -969271 -909016 -1058024 -1317224 -1349709
37577 -1349709 -1023645 -659245 -616518 -786803 -798632 -629829 -606168 -776173 -769994 -471242
37567 -471242 -356617 -790978 -1347856 -1332156 -779916 -404997 -599525 -993282 -1076172 -810365
37557 -810365 -464689 -204551 -60321 -51013 -140676 -236900 -353777 -604556 -942936 -1113225
37547 -1113225 -970660 -669629 -431569 -310924 -292632 -421739 -697328 -989263 -1166640 -1168446
37537 -1168446 -907748 -341354 278831 509839 256171 -37620 56057 419187 650162 630254
37527F30254j09611j59813l22803m30222l06784j32226j74597l57006l78625j49367
37517a890800J40442L17493L92963M49860M96679M54270K59450j3045j87202k10242
37507B09868k32776l31964l16484n4877J71829L4695k28295o8806M77408P28966
37497C89564L74632l4252M2064L00155J52695k90531m37474j83117M493q1250
37487B36979j04067J50051L78814K71194k531q5752N9990K01155J88736N4001
37477A348570j08611j86246j00548N5099O7038r7620k05441j06423J3050p9938
37467E98930k78124k89888r9931L33j45916l35762l10372r8926P4527J18055J55023
37456f12051L01284M76948M89632K68515l5302k04341j87861j27263j46460k03015
$$ plain form
37527 630254 520643 360830 38027 -392195 -698979 -831205 -1005802 -1362808 -1741433 -1890800
37517 -1890800 -1750358 -1432865 -1039902 -590042 -93363 360907 620357 607312 420110 209868
37507 209868 -22908 -354872 -671356 -726233 -554404 -519709 -748004 -816810 -339402 389564
37497 389564 764196 729944 772008 1072163 1224858 934327 496853 313736 318229 236979
37487 236979 132912 282963 661777 932971 930440 844688 904678 1105833 1294569 1348570
37477 1348570 1239959 1053713 953165 1008264 1075302 977682 772241 665818 678868 598930
37467 598930 320806 30918 -69013 -68680 -214596 -550358 -860730 -959656 -885129 -767074 -612051
37456 -612051 -310767 166181 655813 924328 889026 684685 496824 369561 223101 20086
37446B0086k03759j74003j87381j87964n9647J25880J34492p7992k32980j01199
37436i44467J46148J65548p2807k60811j84970M9482K47140L51456L76771L03401
37426A76891J35716p4784l17496n74566o60980l60384J79170M57493K25626j53761
37416i67075j89574R6809L02516K47306R7347k4477j72154l06578k40733M7624
37406a108989L10892L42665J92777N247j55209k45126k05376o5072O8403J63268
37396f96520K54994K90721J87023M4591O4398K19506K57352P1098j80635l52412
37386A60116m23556l06996Q8384N12290M93397q955m50405m22933j48322K0396
37376d86584J69232M85520P10859M64408q9412m23262l95182l23202l69081l45611
$$ plain form
37446 20086 -183673 -357676 -545057 -733021 -792668 -666788 -532296 -610288 -843268 -944467
37436 -944467 -798319 -632771 -705578 -966389 -1151359 -1101877 -854737 -503281 -126510 176891
37426 176891 312607 237823 -79673 -654239 -1315219 -1675603 -1496433 -1038940 -813314 -967075
37416 -967075 -1156649 -1059840 -757324 -510018 -412671 -437148 -609302 -915880 -1156613 -1108989
37406 -1108989 -798097 -455432 -262655 -257408 -412617 -657743 -863119 -928191 -859788 -696520
37396 -696520 -441526 -150805 36218 80809 145207 364713 622065 693163 512528 160116
37386 160116 -263440 -570436 -482052 30238 523635 514680 64275 -358658 -506980 -486584
37376 -486584 -317352 168168 879027 1343435 1254023 830761 435579 112377 -256704 -602315
37366f02315j64188p767L8966J29861L08547L74845K31574M8635n0669j69617
37356A37872l61886m54008l11023n0631J60467L19367M59322N07333M12572K55600
37346A074985J17648q342j08526j32061j38259k43703l68913k98942p4125j1650
37336a91888k00177l04404r1495J64500J00892j77265l08665k36781j68511j12237
37326a526031J09107M14778M60977J57459j63287k16145j02302l1589J1159J08484
37316g77390J45015k0729k37627k05088Q0558K85946K06395L1067l39M312k01507
37305f89387m97319m52285K8851M48297L47296m4491j40903J45479L05938K8059
37295e20465l42947l39596l4787J38914L4742p5847N0130L33779N44084N48950
$$ plain form
37366 -602315 -766503 -774270 -735304 -605443 -296896 77949 309523 358158 307489 137872
37356 137872 -224014 -678022 -989045 -1039676 -879209 -559842 -100520 406813 819385 1074985
37346 1074985 1192633 1184291 1075765 943704 805445 561742 192829 -106113 -180238 -191888
37336 -191888 -392065 -696469 -787964 -623464 -522572 -699837 -1008502 -1245283 -1413794 -1526031
37326 -1526031 -1416924 -1002146 -541169 -383710 -546997 -763142 -865444 -897033 -885874 -777390
37316 -777390 -632375 -653104 -890731 -1095819 -1015261 -729315 -522920 -491853 -492192 -487880 -689387
37305 -689387 -1186706 -1638991 -1610140 -1161843 -814547 -859038 -999941 -854462 -548524 -520465
37295 -520465 -863412 -1203008 -1237795 -1098881 -1064139 -1139986 -1089856 -756077 -211993 336957
37285C36957L51124L2118k63938l71591k04671J63039N04468N70283L10744l9864
37275A388669k13250k21767k60848l28748k14640Q0060K27859M5725k15007k67240
37265B0813j91694j68500q8867K01653M98110M91293K68906J29655K7491l11113
37255H77747p73900q87098m99029K6012L53772M60173L26408r8384n02735l67780
37245a084814K42474O12286M02100J52055L32287N06347R2755n28706n09239J07460
37235C25005L91265r1600o97239p04560k38631J11212Q8678j57687m28412n62143
37225a964112m19357n1771K80693M24506M67627M59399K81638m1864k03631m589
37215g71461L44940N18015M40311J92967j72658m95726m77421r6316K02128O8902
$$ plain form
37285 336957 688081 720199 456261 84670 -120001 43038 547506 1117789 1428533 1388669
37275 1388669 1175419 953652 692804 364056 149416 229476 457335 503060 288053 20813
37265 20813 -170881 -339381 -428248 -226595 271515 762808 1031714 1161369 1188860 877747
37255 877747 103847 -783251 -1282280 -1256268 -902496 -442323 -115915 -214299 -717034 -1084814
37245 -1084814 -842340 -230054 172046 324101 656388 1162735 1255490 726784 217545 325005
37235 325005 716270 624670 -72569 -777129 -1015760 -904548 -815870 -973557 -1401969 -1964112
37225 -1964112 -2383469 -2435240 -2154547 -1730041 -1262414 -803015 -521377 -563241 -766872 -771461
37215 -771461 -426521 91494 531805 724772 552114 56388 -421033 -517349 -315221 -246319
37205b46319k29241k35291k7560m4952l17109m05497j23885J96922K80400K73008
37195h79524L46747L51632J45052o1432j2026J66382J77609L9302J7866J61316
37185D52924K28223R4191o2588p4811o2808k40628n58941p13035n16506j54170
37175a608149K6203m9818q1172J88540N55948N64591J26457l01025k81107N8915
37165h00617K60624J78142R8976K20651L06952M1117m48992o67346l54943J72022
37155i93414L90688J73253j24938j55984J0677N6783j26427l18371k99803j43190
37145a530726q4398j82626k28289k2472L12869M07621R0030l14179k94145K10940
37135a635375O78775O21504J65168j68668j18275J16681K29802R1813k68223o71771
$$ plain form
37205 -246319 -475560 -710851 -738411 -783363 -1100472 -1505969 -1629854 -1432932 -1152532 -879524
37195 -879524 -532777 -181145 -36093 -97525 -109551 56831 234440 273742 291608 452924
37185 452924 681147 775338 712750 637939 575131 334503 -224438 -937473 -1453979 -1608149
37175 -1608149 -1581946 -1631764 -1712936 -1524396 -968448 -403857 -277400 -578425 -859532 -800617
37165 -800617 -539993 -361851 -262875 -42224 264728 305845 -143147 -810493 -1165436 -993414
37155 -993414 -602726 -429473 -554411 -710395 -699718 -642935 -769362 -1087733 -1387536 -1530726
37145 -1530726 -1615124 -1797750 -2026039 -2048511 -1735642 -1328021 -1237991 -1552170 -1846315 -1635375
37135 -1635375 -956600 -335096 -169928 -338596 -456871 -340190 -110388 -18575 -286798 -958569
37125i58569p88985m32110J20527L95111L42065L30059M68096L91181p3386m78797
37115f84808l57133R3805L28111K03081n792j36215k31395k32076l9645J68846
37105h93221J26864m2837L0171L37303M64419K65434R4617J91561K64955k0738
37095H18528m54244n18074q4479M08261M64395P2781k85998j75867K48696L78830
37085H72829m6584n12430m09935O8173K05175j59621m32106k30895P0453L4737
37075e40204j62804j46475J2258J5644j08584j22190q808J07613K54469M33657
37065b65424L86539l4120m56114m11969k3175K03586J40301R6415J77848J21934
37055f4179j72933m28983m19778k32613J359K72412M80306M18053J15187j11009
$$ plain form
37125 -958569 -1747554 -2179664 -2059137 -1664026 -1321961 -991902 -523806 -132625 -206011 -684808
37115 -684808 -1041941 -948136 -620025 -416944 -422736 -558951 -790346 -1022422 -1062067 -893221
37105 -893221 -766357 -809194 -779023 -441720 22699 288133 382750 574311 839266 818528
37095 818528 364284 -153790 -238269 169992 634387 707168 421170 245303 493999 872829
37085 872829 826245 313815 -96120 -27947 177228 17607 -414499 -645394 -574941 -540204
37075 -540204 -703008 -849483 -837225 -821581 -930165 -1052355 -1061163 -953550 -699081 -265424
37065 -265424 121115 86995 -369119 -781088 -804263 -600677 -460376 -363961 -186113 -64179
37055 -64179 -237112 -666095 -1085873 -1318486 -1317127 -1044715 -564409 -146356 -31169 -142178
37045a42178r1477j9290j01447k62557l26338k51934p6208J46189K53134P8840
37035g93266k48086l59983j14636K27329L72454K88764O5577k10300l37940j08812
37025a218899L06092M13910N0134l52533l71808j31550N3250K15208N18143P66041
37015B47988N96120M8643m57266o50286n71447l12825L2458K25986R0266j45401
37005h95764q7041K18406L19567O9875j25573N6733L72380M26009K56165J57998
36995G68755J40291l5515l48140m52583k03356Q4654P9871r4692q9508J01716
36985d8507J28018j29679k88587q273M24306M17338p2904m17362j69833L18646
36975A53163M21370J02630j34060m5190N8351j11016l47179k91572J3460K01659
$$ plain form
37045 -142178 -233655 -252945 -354392 -616949 -943287 -1195221 -1271429 -1125240 -872106 -793266
37035 -793266 -1041352 -1401335 -1515971 -1288642 -916188 -627424 -561847 -772147 -1110087 -1218899
37025 -1218899 -912807 -498897 -448763 -801296 -1173104 -1304654 -1251404 -1036196 -518053 247988
37015 247988 844108 892751 435485 -214801 -786248 -1099073 -1066615 -840629 -750363 -895764
37005 -895764 -982805 -764399 -444832 -374957 -500530 -443797 -71417 354592 610757 768755
36995 768755 909046 873531 525391 72808 -130548 -45894 33977 -60715 -150223 -48507
36985 -48507 79511 -50168 -338755 -347028 77278 494616 421712 4350 -165483 153163
36975 153163 574533 677163 543103 497913 556264 445248 98069 -193503 -180043 21616
36965B1616R4064j35131k66991k66547j79247l1065P4828l1425l11307m12635
36955a443840p7976M25154N69945K68461j7899L5591J78242P7085q7759N7991
36945a5005L79279L79661J6937j86643K2055K11182m3221m91484o12986l55913
36935f96138o5802Q1793J49275J08485j09752l17851k44718J3162J02231j8606
36925i97921p862K88481N57558M51910L1985l58415m53618k14565J80021M12096
36915a10330K89172L35p5484J40856L34965K36659o8470l17716l38628q8201L27020
36904C30178N93846M10425j25439n64414o31776m74988l15868j54089M1381J41762
36894g48982O6676n2238j05439j68258k45020j24883K56009N61585M65840J16683
$$ plain form
36965 21616 115680 -19451 -286442 -552989 -732236 -763301 -688473 -719898 -1031205 -1443840
36955 -1443840 -1521816 -1096662 -526717 -258256 -276155 -240564 -62322 14763 -72996 -15005
36945 -15005 364274 743935 760872 574229 596284 807466 764245 272761 -340225 -696138
36935 -696138 -761940 -680147 -530872 -422387 -532139 -849990 -1094708 -1081546 -979315 -997921
36925 -997921 -1005783 -717302 -159744 292166 324151 -34264 -487882 -702447 -522426 -110330
36915 -110330 178842 179177 103693 244549 579514 816173 747703 429987 91359 3158 330178
36904 330178 924024 1334449 1209010 644596 12820 -462168 -778036 -932125 -890744 -748982
36894 -748982 -682306 -734544 -839983 -1008241 -1253261 -1378144 -1122135 -560550 -94710 21973
36884B1973j08875j26484j05567q7900m381O0141r709p2356N5618J87379k467
36873a92628l73137m21543n0580K43380J13162j47776j10522J58541K95979K11980
36863b73144J21372J54326K40243K98364K97035J86489j4289j26327j4219J65814
36853A035664J25186j69742m54254n01167l26983o2034K03469L96893M36887L12879
36843I96798J16767m8102j35884j36341o7315k31q926p1687r7653o8640p8583
36832D00203k01640l80187m70013l55716k9451L69596N91256M53271M1731l27927
36822I1123m05496k30874m0678L337l9486J6463K54712N01123M41107j6908n31644
36811D2779o37045k76229J47672L01046K73994K78649K55265N4014j80326j83384
$$ plain form
36884 21973 -86902 -213386 -318953 -406853 -411234 -351093 -360802 -433158 -377540 -190161 -192628
36873 -192628 -565765 -987308 -1037888 -794508 -681346 -829122 -939644 -781103 -485124 -273144
36863 -273144 -151772 2554 242797 541161 838196 1024685 1010396 884069 869850 1035664
36853 1035664 1160850 991108 536854 35687 -291296 -353330 -149861 247032 683919 996798
36843 996798 1113565 1065463 929579 793238 725923 725692 716766 645079 547426 478786 400203
36832 400203 198563 -181624 -651637 -1007353 -1036804 -667208 -75952 377319 419050 91123
36822 91123 -314373 -545247 -585925 -582588 -622074 -605611 -350899 150224 591331 574423 42779
36811 42779 -594266 -870495 -722823 -421777 -147783 130866 386131 440145 259819 76435
36801G6435n9390j71600m93137n07465L6029O42763O75326J83992k25943k04963
36791d7953L3155J51498P4469j01958k80777l54521k44457l2963J02637J24489
36781e76381J44597J97242J90605J00794J8503j6925l2075L1377K39681M20049
36771G17467K75976j71235n27999n15337k47847N4216L01378L54481J1286n55760
36761c03374p21147j56814O12280Q34681N05787K35796K85129K91251j3005l44176
36751A226408l30716m8527J42874N7069k04227m02806l14109P7409M39454L60688
36741A003517j47826o33827p57961o03078l43240M3303N06915P01701L89317j19023
36731C9798k94291p4061J28949O0082r4095j05436n4000j23437k78548l36065
$$ plain form
36801 76435 17045 -154555 -647692 -1155157 -1119128 -476365 198961 382953 157010 -47953
36791 -47953 -14798 136700 211169 109211 -171566 -526087 -770544 -803507 -700870 -576381
36781 -576381 -431784 -234542 -43937 56857 75360 58435 26360 57737 297418 717467
36771 717467 993443 822208 294209 -221128 -468975 -414759 -113381 241100 252386 -303374
36761 -303374 -1024521 -1181335 -569055 265626 771413 1007209 1292338 1583589 1570584 1226408
36751 1226408 895692 847165 990039 1047108 842881 440075 125966 203375 642829 1003517
36741 1003517 855691 221864 -536097 -1139175 -1482415 -1439112 -932197 -230496 158821 39798
36731 39798 -254493 -328554 -199605 -139523 -233618 -339054 -393054 -516491 -795039 -1131104
36721a131104k31281n8652Q0075J53342J82402K29794L39090M15370K67450j12826
36711A33660m10879l13537N8292K45212J2461l80738n58330m70740l05229j39618
36701b129446O6004K37264K35123J24275J22404K54466L14896K12841P8709k6991
36691e10455j86609l08867j22975L15365N15121K48572l8351P6945K74334L1101
36681B94181m28340m42936l7467P0930l35966n82747j86531L68635L93772j2440
36671h98909k45551q0850K21450M13311M08344J64590j74259k39531P7612L37771
36661a6022J43527k38349k90063l0247J19992M8028l6080j30666l59544m52299
36651a241723q777O80395Q02040J96707l18157j14830L80269M30576P4758r5875
$$ plain form
36721 -1131104 -1362385 -1421037 -1340962 -1187620 -1005218 -775424 -436334 -20964 246486 133660
36711 133660 -277219 -590756 -532464 -287252 -274791 -655529 -1213859 -1684599 -1989828 -2129446
36701 -2129446 -2063442 -1826178 -1591055 -1466780 -1344376 -1089910 -775014 -562173 -483464 -510455
36691 -510455 -697064 -1005931 -1128906 -813541 -298420 -49848 -88199 -11254 263080 294181
36681 294181 -134159 -577095 -614562 -543632 -879598 -1462345 -1648876 -1280241 -886469 -898909
36671 -898909 -1144460 -1225310 -1003860 -590549 -182205 -17615 -191874 -431405 -353793 -16022
36661 -16022 127505 -110844 -400907 -431154 -311162 -263134 -299214 -429880 -789424 -1241723
36651 -1241723 -1250500 -570105 231935 428642 110485 -4345 375924 806500 881258 785383
36641G85383R1890K40722P3063k30750l87184l39146j96176q7926q5315j10502
36631b45941R612K63186L67570J45950j74977k78890k09721k15275k74856j48966
36621g62308J35642K35166J1967k10173q2963K90474N07478L73373P7996j01444
36611D75208j29282j84117l54933m74784l42987m5562J26889R4422R0329K46623
36601d98194L33037J24842j92217k88800k00742k02388k65517q1833L42736N59120
36591c69956L06583q9995j78247N5521L10294L95597K73353p1966m82509n54625
36581d05950j05049M13916L85169j20023l92217n3752M46255M89437P4700l30177
36571D02309m52071l89176k72590r7433J19586K71165K87632J84352n977k17906
$$ plain form
36641 785383 877273 1117995 1191058 960308 573124 233978 37802 -50124 -135439 -245941
36631 -245941 -236329 26857 394427 540377 365400 86510 -123211 -338486 -613342 -762308
36621 -762308 -626666 -391500 -379533 -589706 -672669 -382195 125283 498656 576652 475208
36611 475208 345926 161809 -193124 -667908 -1010895 -1056457 -929568 -835146 -744817 -498194
36601 -498194 -165157 -40315 -232532 -521332 -722074 -924462 -1189979 -1271812 -929076 -369956
36591 -369956 -63373 -153368 -331615 -276094 34200 429797 703150 631184 148675 -405950
36581 -405950 -510999 -97083 288086 168063 -224154 -277906 168349 657786 732486 402309
36571 402309 -49762 -438938 -711528 -808961 -689375 -418210 -130578 53774 47797 -170109
36561a70109l27073k90910k39541k53804j68121J53209M55876L76835N8159L7696
36551c67783M19417O14100J74661n02810o94077k87991K00324L67095K40914j2262
36541A51588k57915l03863o5127J69056K2295l96374n99597m19829j63590k1697
36531a885053J66102M17051M18265R7155j32260l6990J7418k48520m17152l7053
36521a641037N00262M69464l9017k62022J4431J83299j21470m63024l94263j51241
36511a904618j37271k27936o5991L10992N94213O92295O78006M63258m8422o14815
36501b60289q38963o31297k05457K60733O54537P57770M28348p5895k85872n8905
36491b55290L08577M74734L21568j00006n97647q33719n99946j27777J35045P8451
$$ plain form
36561 -170109 -497182 -788092 -1027633 -1281437 -1449558 -1296349 -840473 -463638 -405479 -367783
36551 -367783 51634 665734 840395 337585 -356492 -644483 -444159 -77064 163850 151588
36541 151588 -106327 -410190 -475317 -306261 -283966 -680340 -1279937 -1699766 -1863356 -1885053
36531 -1885053 -1718951 -1301900 -883635 -786480 -918740 -955730 -938312 -1186832 -1603984 -1641037
36521 -1641037 -1140775 -671311 -710328 -972350 -957919 -774620 -896090 -1359114 -1753377 -1904618
36511 -1904618 -2041889 -2269825 -2335816 -2024824 -1430611 -738316 -60310 402948 354526 -260289
36501 -260289 -1099252 -1730549 -1936006 -1675273 -1020736 -262966 165382 89487 -196385 -255290
36491 -255290 53287 528021 849589 749583 151936 -681783 -1281729 -1409506 -1274461 -1196010
36481a196010K303J19253K78659K65573J12628q576j7910N1322J19973J05712
36471a67073K0284o316M6976m4405l90688o18638k82622L83689O30255K12828
36461b15710k64324k55344j3866n7221l21648l46434l5625K57661K73767O6316
36451i12428k05486l46905j33553L79886P04520M69026k1622k13451j24264j95752
36441f00029m31605l45795J54891M94137K71263j67959l05533j27634Q9645K36841
36431g31778K61266L235m53734o16811k08932L26284M00592J14624K3498K61157
36421f20599M34532L01169L0434j95122l47583l01606R0132N75129O26053J57298
36411G49837k90540k76224Q043J51739J10368O9977K1476j57975l60456l40160
$$ plain form
36481 -1196010 -1193707 -1074454 -795795 -530222 -417594 -426170 -444080 -392758 -272785 -167073
36471 -167073 -146789 -153105 -106129 -150534 -541222 -1159860 -1442482 -1058793 -428538 -215710
36461 -215710 -480034 -735378 -749244 -806465 -1128113 -1474547 -1510172 -1252511 -978744 -912428
36451 -912428 -1117914 -1464819 -1598372 -1218486 -513966 -44940 -66562 -280013 -404277 -600029
36441 -600029 -1031634 -1377429 -1222538 -728401 -457138 -625097 -930630 -1058264 -968619 -731778
36431 -731778 -470512 -467277 -921011 -1537822 -1746754 -1420470 -1019878 -905254 -881756 -620599
36421 -620599 -186067 115102 145536 -49586 -397169 -698775 -608643 -33514 592539 749837
36411 749837 459297 183073 191116 342855 453223 523200 544676 386701 26245 -313915
36401c13915j00922Q9212O5221o9936j55294j62845j38800q4693L7442K21649
36391f12881L67263L33930R9886j52189k11075j04825o2806j84597l03571k41966
36381a072831l7578J79947L78695N58138O27233N00465K27620q6015l83001n76159
36371C16514n28315k75794j19576k67187m89837l92126L3287L90182M10007K22182
36361g00663M7903r0376k17067k04083N1131L74097M66510K80592O2588J6121
36351H6753P7628P8464N907m814J04245K00914J06393j93691n19943o72966o13838
36340a344948m65101l39126j90223J09951N22972P53683N46165O1331k22171o7570
36330f35037K33371K81644J03303J1456O3660J2377j99379k76211n2727J85567
$$ plain form
36401 -313915 -414837 -325625 -260404 -330340 -485634 -648479 -787279 -871972 -834530 -612881
36391 -612881 -245618 88312 188198 36009 -175066 -279891 -342697 -527294 -830865 -1072831
36381 -1072831 -1110409 -930462 -551767 6371 633604 1134069 1361689 1275674 892673 316514
36371 316514 -211801 -487595 -607171 -874358 -1364195 -1756321 -1723034 -1332852 -922845 -700663
36361 -700663 -652760 -743136 -960203 -1164286 -1113155 -739058 -272548 8044 70632 86753
36351 86753 164381 242845 248752 243938 348183 549097 655490 461799 -58144 -731110 -1344948
36340 -1344948 -1810049 -2149175 -2339398 -2229447 -1706475 -952792 -406627 -345296 -567467 -635037
36330 -635037 -401666 -120022 -16719 -5263 58397 70774 -128605 -404816 -457543 -271976
36320b71976J01660k07429l88980l26302j76179m2241R1622J67685R3777k6115
36310i84478K2840K07665K29219m5060l46832l45847p6673J27727N6125j65715
36300a321029k73220j75790j6611N3389P6687J90788L79440M66167L73571K29387
36290a7221J54730J17491Q4390J17910J79988N7770k97826n57174m10307k0113
36280e90362K25224K60908K88005K99212J08908j86928k63712j22376r8291k15460
36270b94872o9225M28017P28744M41825l8484j67070j00518l20145o89416n97422
36260f78566J6655M70396L02898j38174k96745j20071J05275K26705K08142l4951
36250F1564m15171n29985j29054M34425O05510L67945J73191J93864J29706j68221
$$ plain form
36320 -271976 -170316 -377745 -766725 -1093027 -1269206 -1311447 -1219825 -1052140 -958363 -984478
36310 -984478 -961638 -753973 -524754 -569814 -916646 -1262493 -1339166 -1211439 -1155314 -1321029
36300 -1321029 -1594249 -1770039 -1786650 -1733261 -1656574 -1465786 -1086346 -620179 -246608 -17221
36290 -17221 137509 255000 339390 457300 637288 695058 397232 -159942 -570249 -590362
36280 -590362 -365138 -104230 183775 482987 591895 404967 141255 18879 -79412 -294872
36270 -294872 -364097 63920 792664 1234489 1196005 1028935 928417 608272 -81144 -678566
36260 -678566 -661911 -191515 111383 -26791 -323536 -443607 -338332 -111627 96515 61564
36250 61564 -353607 -883592 -1012646 -578221 27289 395234 568425 762289 891995 723774
36240G23774l75214k38907l2678r8709k45713n6275L79570N36127K28245j56106
36230F64114k58109j31274Q8419M07987O52045M17258k64402o61689k66364L64172
36220A012157L21263l21533o32703k34862K11612J16684k17998k75207j63328
36211a83915k39068l87513l01727j38910k45837m40029k29127L29050O26297M02209
36201h08570N8865k7977M0093R5260K30578M36217L74087j16093o35398p32545
36191a085483n15154l65586k90689j5127M16870O29338N05754L40215L03512J71441
36181I5091k18886n82759n43510j61845J80569K94005K82029K00075n4032m40424
36171i49687o46210m27879O5246M65596N80658M70834K48898O090j14754j0588
$$ plain form
36240 723774 348560 109653 76975 -21734 -267447 -323722 55848 591975 820220 664114
36230 664114 406005 274731 363150 771137 1423182 1840440 1576038 914349 647985 1012157
36220 1012157 1333420 1011887 379184 144322 355934 472618 254620 -20587 -183915
36211 -183915 -422983 -810496 -1112223 -1251133 -1496970 -1936999 -2166126 -1837076 -1210779 -808570
36201 -808570 -749705 -777682 -737589 -642329 -411751 24466 398553 282460 -352938 -1085483
36191 -1085483 -1600637 -1966223 -2256912 -2272039 -1855169 -1225831 -720077 -379862 -76350 95091
36181 95091 -123795 -706554 -1250064 -1411909 -1231340 -937335 -655306 -455231 -509263 -949687
36171 -949687 -1595897 -2023776 -1958530 -1492934 -912276 -441442 -192544 -186454 -301208 -311796
36161c11796J79057J70167q0228k75999j90245J7617Q5025Q3896K81080O09440
36151E68014O19355Q5318n90066p98066m33240K7084J15696j35714l28531j82990
36141a053140J80444L99012K70201j0260o8099J59465K78355o3910o27571p91117
36131a326620l36689K61206M61658K90801J14743L6284j09997l00190k99158j02276
36121a310238J3215m5970o9564j369p9939l23307l33158O3891M11208K89481L140
36110a382610O0390K90563J51612k67458l13262J50507M72863K10793k56622l86075
36100a269299j88412K5949J46344J84653J08123L5595J99978M69959L78541r8215
36090f784l41713m2949K41311K182l40278j63295K49799J77822k88452l96881
$$ plain form
36161 -311796 -132739 37428 -42800 -318799 -509044 -491427 -406402 -322506 -41426 568014
36151 568014 1187369 1272687 682621 -115445 -548685 -521601 -405905 -541619 -870150 -1053140
36141 -1053140 -872696 -473684 -203483 -213743 -281842 -122377 155978 92068 -535503 -1326620
36131 -1326620 -1663309 -1402103 -940445 -649644 -534901 -498617 -608614 -908804 -1207962 -1310238
36121 -1310238 -1297023 -1342993 -1412557 -1413926 -1493865 -1817172 -2150330 -2086439 -1675231 -1385750 -1382610
36110 -1382610 -1322220 -1031657 -880045 -1147503 -1460765 -1310258 -837395 -626602 -883224 -1269299
36100 -1269299 -1457711 -1431762 -1285418 -1100765 -992642 -957047 -757069 -287110 91431 -6784
36090 -6784 -348497 -391446 -150135 -147953 -488231 -651526 -401727 -223905 -512357 -909238
36080i09238l918K40304K4425j90636o3830J04350N1313N0201L27469N53755L61009
36069E45204n3942k50592j45635M5264J74394J77943O216k00207j48646J50249
36059C00248K77462J5318k74342k02392L6734N465k64504l42616o7460K63226
36049b52861L50631K06926k3609k81616n31413o39813m38339Q1880O44501Q30636
36039e3077M75327r2588l49501j13271L43526O41554N65554J03985m81304p08416
36029C31789l64281J10186J31546j91967k58676J8849Q8456k14256k83166K21051
36019d10469O59199L41374l68073n68634j01578L75986L89952Q9827j99616l12762
$$ plain form
36080 -909238 -913156 -672852 -648427 -839063 -902893 -798543 -747230 -697029 -369560 184195 545204
36069 545204 491262 240670 95035 140299 314693 492636 498852 298645 149999 300248
36059 300248 577710 593028 318686 116294 153028 158493 -106011 -448627 -516087 -252861
36049 -252861 97770 304696 281087 -529 -531942 -1171755 -1610094 -1528214 -883713 -53077
36039 -53077 422250 329662 -19839 -133110 210416 851970 1417524 1521509 1040205 331789
36029 331789 -32492 77694 209240 17273 -241403 -222554 -134098 -348354 -631520 -410469
36019 -410469 248730 590104 222031 -346603 -448181 -72195 317757 407584 207968 -104794
$$ [...]
##END NTUPLES=NMR SPECTRUM
##END=
