##TITLE=31Pdec_DE-170rm_3h
 , 64 sc
31.7.2026
##JCAMPDX= 6.0         $$ Bruker NMR JCAMP-DX V2.0
##DATA TYPE= NMR SPECTRUM
##DATA CLASS= NTUPLES
##ORIGIN= UXNMR, Bruker Analytische Messtechnik GmbH
##OWNER= root
$$ XWIN-NMR		Version 3.5
$$ Fri Jul 31 14:38:53 2026 Russian Standard Time (UT+4h)  she@DPX200
##.OBSERVE FREQUENCY= 81.013821
##.OBSERVE NUCLEUS= ^31P
##.ACQUISITION MODE= SIMULTANEOUS
##.ACQUISITION SCHEME= undefined
##.AVERAGES= 64
##.DIGITISER RES= 17
##SPECTROMETER/DATA SYSTEM= spect
##.PULSE SEQUENCE= zgpg30
##.SOLVENT NAME= CDCl3
##.SHIFT REFERENCE= (INTERNAL, CDCl3, 0, 197.392)
##AUDIT TRAIL= $$ (NUMBER, WHEN, WHO, WHERE, WHAT)
$$ ##TITLE= Audit trail, XWIN-NMR		Version 3.5
$$ ##JCAMPDX= 5.01
$$ ##ORIGIN= Bruker BioSpin GmbH
$$ ##OWNER= she
$$ F:/spectra/data/she/nmr/P31/2/pdata/1/auditp.txt
$$ ##AUDIT TRAIL=  $$ (NUMBER, WHEN, WHO, WHERE, WHAT)
(   1,<2026-07-31 14:37:49.54 +0400>,<she>,<DPX200>,
      <created by zg, POWCHK disabled, PULCHK disabled
       configuration hash MD5:
       00 E9 B6 7A A2 85 ED C7 34 08 36 98 17 FE 4E 26
       data hash MD5: 32K
       6A 46 CD C2 B2 70 A3 F0 95 92 54 B6 A4 6B 68 90>)
(   2,<2026-07-31 14:37:53.81 +0400>,<she>,<DPX200>,
      <Start of raw data processing
       efp BC_mod = 2 LB = 1.5 FT_mod = 6 PKNL = 1 PHC0 = 1903.595 PHC1 = 246.6983 SI = 64K 
       data hash MD5: 64K
       24 D8 28 8F 79 BC 71 CA D8 84 59 5F 32 89 98 5F>)
(   3,<2026-07-31 14:38:12.03 +0400>,<she>,<DPX200>,
      <pk PHC0 = 18.23311 PHC1 = -49.8 
       data hash MD5: 64K
       2A 11 28 18 F2 C1 82 5A D0 9F A8 7A C1 C6 C4 11>)
(   4,<2026-07-31 14:38:15.96 +0400>,<she>,<DPX200>,
      <abs ABSG = 5 
       data hash MD5: 64K
       73 2B F9 2D 85 F8 E3 F2 6B D3 3E ED 4C 4D 00 A6>)
$$ ##END=
$$ 
$$ hash MD5
$$ 76 55 0F 08 C7 C6 E4 12 04 E3 CD DA 27 CB 2D 61
##$RELAX= 
##$RELAX= 
##$RELAX= 
##$RELAX= 
##$RELAX= 
##$RELAX= 
##$RELAX= 
##$RELAX= 
$$ Bruker specific parameters
$$ --------------------------
##$DU= <F:/spectra>
##$EXPNO= 2
##$NAME= <P31>
##$PROCNO= 1
##$TYPE= <nmr>
##$USER= <she>
##$AMP= (0..31)
100 100 100 100 100 100 100 100 100 100 100 100 100 100 100 100 100 100 
100 100 100 100 100 100 100 100 100 100 100 100 100 100 
##$AQSEQ= 0
##$AQ_mod= 1
##$AUNM= <au_zg>
##$AUTOPOS= <>
##$BF1= 81.014009
##$BF2= 200.13
##$BF3= 200.13
##$BF4= 200.13
##$BF5= 200.13
##$BF6= 200.13
##$BF7= 200.13
##$BF8= 200.13
##$BYTORDA= 1
##$CFDGTYP= 0
##$CFRGTYP= 5
##$CHEMSTR= <none>
##$CNST= (0..31)
1 1 145 1 1 1 1 1 1 1 1 1 1 1 1 1 1 1 1 1 1 1 1 1 1 1 1 1 1 1 1 1 
##$CPDPRG= <waltz16>
##$CPDPRG1= <>
##$CPDPRG2= <waltz16>
##$CPDPRG3= <>
##$CPDPRG4= <mlev>
##$CPDPRG5= <mlev>
##$CPDPRG6= <mlev>
##$CPDPRG7= <mlev>
##$CPDPRG8= <mlev>
##$CPDPRGB= <>
##$CPDPRGT= <>
##$D= (0..31)
0 1 0 0 0 0 0 0 0 0.06 0 0.03 2e-05 3e-06 0 0 0.0002 0 0 0 0 0 0 0 0 0 
0 0 0 0 0 0 
##$DATE= 1785494268
##$DBL= (0..7)
120 120 120 11 120 120 24 19 
##$DBP= (0..7)
150 150 150 150 150 150 150 150 
##$DBP07= 0
##$DBPNAM0= <>
##$DBPNAM1= <>
$$ [...]
##$SUBNAM3= <"">
##$SUBNAM4= <"">
##$SUBNAM5= <"">
##$SUBNAM6= <"">
##$SUBNAM7= <"">
##$SUBNAM8= <"">
##$SUBNAM9= <"">
##$SW= 400.765351723535
##$SWIBOX= (0..15)
0 1 3 0 0 0 0 0 0 0 0 0 0 0 0 0 
##$SW_h= 32467.5324675325
##$TD= 32768
##$TD0= 1
##$TE= 0
##$TE2= 300
##$TE3= 300
##$TEG= 300
##$TL= (0..7)
0 120 53 12 22 120 120 120 
##$TP= (0..7)
150 150 150 150 150 150 150 150 
##$TP07= 0
##$TPNAME0= <>
##$TPNAME1= <>
##$TPNAME2= <>
##$TPNAME3= <>
##$TPNAME4= <>
##$TPNAME5= <>
##$TPNAME6= <>
##$TPNAME7= <>
##$TPOAL= (0..7)
0.5 0.5 0.5 0.5 0.5 0.5 0.5 0.5 
##$TPOFFS= (0..7)
0 0 0 0 0 0 0 0 
##$TUNHIN= 0
##$TUNHOUT= 0
##$TUNXOUT= 0
##$USERA1= <user>
##$USERA2= <user>
##$USERA3= <user>
##$USERA4= <user>
##$USERA5= <user>
##$V9= 5
##$VALIST= <valist>
##$VCLIST= <CCCCCCCCCCCCCCC>
##$VD= 0
##$VDLIST= <DDDDDDDDDDDDDDD>
##$VPLIST= <PPPPPPPPPPPPPPP>
##$VTLIST= <TTTTTTTTTTTTTTT>
##$WBST= 1024
##$WBSW= 4
##$XGAIN= (0..3)
0 0 0 0 
##$XL= 0
##$YL= 0
##$YMAX_a= 78269
##$YMIN_a= -68542
##$ZGOPTNS= <>
##$ZL1= 120
##$ZL2= 120
##$ZL3= 120
##$ZL4= 120
##$ABSF1= 197.3918
##$ABSF2= -203.3724
##$ABSG= 5
##$ABSL= 3
##$ALPHA= 0
##$AQORDER= 0
##$ASSFAC= 0
##$ASSFACI= 0
##$ASSFACX= 0
##$ASSWID= 0
##$AUNMP= <proc_1d>
##$AZFE= 0.1
##$AZFW= 0.5
##$BCFW= 0
##$BC_mod= 2
##$BYTORDP= 0
##$COROFFS= 0
##$CY= -3
##$DATMOD= 1
##$DC= 0
##$DFILT= <>
##$DTYPP= 0
##$F1P= 0
##$F2P= 0
##$FCOR= 1
##$FTSIZE= 65536
##$FT_mod= 6
##$GAMMA= 0
##$GB= 0
##$INTBC= 1
##$INTSCL= 9.790993e-09
##$ISEN= 30
##$LB= 1.5
##$LEV0= 0
##$LPBIN= 0
##$MAXI= 10000
##$MC2= 0
##$MEAN= 0
##$ME_mod= 0
##$MI= 50
##$NCOEF= 0
##$NC_proc= -6
##$NLEV= 6
##$NOISF1= 182.463
##$NOISF2= 159.3651
##$NSP= 0
##$NTH_PI= 0
##$NZP= 0
##$OFFSET= 197.3918
##$PC= 4
##$PHC0= 1921.828
##$PHC1= 196.8983
##$PH_mod= 1
##$PKNL= yes
##$PPARMOD= 0
##$PSCAL= 0
##$PSIGN= 0
##$REVERSE= no
##$SF= 81.014063255964
##$SI= 65536
##$SIGF1= 159.3651
##$SIGF2= -187.1042
##$SINO= 113.3802
##$SIOLD= 16384
##$SREGLST= <1H.CDCl3>
##$SSB= 0
##$STSI= 65536
##$STSR= 0
##$SW_p= 32467.5324675325
##$SYMM= 0
##$S_DEV= 0
##$TDeff= 32768
##$TDoff= 0
##$TI= <>
##$TILT= no
##$TM1= 0
##$TM2= 0
##$TOPLEV= 0
##$USERP1= <user>
##$USERP2= <user>
##$USERP3= <user>
##$USERP4= <user>
##$USERP5= <user>
##$WDW= 1
##$XDIM= 65536
##$YMAX_p= 452261483
##$YMIN_p= -105915069
$$ End of Bruker specific parameters
$$ ---------------------------------
##NTUPLES= NMR SPECTRUM
##VAR_NAME=  FREQUENCY,     SPECTRUM/REAL,   SPECTRUM/IMAG
##SYMBOL=    X,             R,               I
##VAR_TYPE=  INDEPENDENT,   DEPENDENT,       DEPENDENT
##VAR_FORM=  AFFN,          ASDF,            ASDF
##VAR_DIM=   65536,         65536,           65536
##UNITS=     HZ,            ARBITRARY UNITS, ARBITRARY UNITS
##FACTOR=    0.49542278885378, 1,            1
##FIRST=     15991.5117654749, 0,            0
##LAST=      -16476.0207020576, 0,           0
##MIN=       -16476.0207020576, -105915069,  0
##MAX=       15991.5117654749, 452261483,    0
$$ Real data points
##PAGE= N=1
##DATA TABLE= (X++(R..R)), XYDATA
$$ [...]
$$ plain form
46751 234315 -237835 19136 938384 1822477 1976068 1389427 673201 255177 -43144 -426438
46741 -426438 -570845 -134589 518808 736762 509374 311944 170779 -316161 -1026429 -1250091
46731 -1250091 -797569 -368568 -470284 -715849 -662346 -640087 -1101719 -1684660 -1673724 -1094064
46721 -1094064 -632144 -612548 -692157 -549678 -337812 -366384 -693346 -1079368 -1130360 -578658
46711 -578658 346185 1002957 1077980 1021732 1399012 2049829 2372507 2270955 2252940 2584241
46701 2584241 2857920 2542018 1631922 674363 330731 808859 1493964 1399553 363283
46692 363283 -545330 -399222 153764 -264127 -1614974 -2287098 -1382613 -71060 34180
46683 34180 -962369 -1582613 -993233 220590 1093026 1275790 980018 551132 252793 117034
$$ packed form
46751B34315m72150K56971R19248Q84093J53591n86641p16226m18024k98321l83294
46741d26438j44407M36256O53397K17954k27388j97430j41165m86940p10268k23662
46731a250091M52522M29001j01716k45565N3503K2259m61632n82941J0936N79660
46721a094064M61920J9596p9609J42479K11866k8572l26962l86022n0992N51702
46711e78658R24843O56772P5023n6248L77280O50817L22678j01552j8015L31301
46701B584241K73679l15902r10096r57559l43632M78128O85105r4411j036270
46692C63283r08613J46108N52986m17891j350847o72124R04485J311553J05240
46683C4180r96549o20244N89380J213823Q72436J82764k95772m28886k98339j35759
$$ plain form
46673 117034 -57000 -356508 -530395 -352056 -11978 141402 31047 -286159 -890305 -1718737
46663 -1718737 -2307125 -2321105 -2109894 -2171192 -2280269 -1805606 -755934 209717 778416 1206359
46653 1206359 1453154 943892 -434154 -1782421 -2148865 -1597635 -891275 -486030 -292359
46644 -292359 -158973 -142898 -388872 -992079 -1861181 -2592310 -2719477 -2229874 -1555155 -950251
46634 -950251 -290270 329413 319313 -623964 -1815092 -2189783 -1485844 -412900 245578
46625 245578 332748 203213 269030 693598 1324211 1890353 2297059 2594860 2680718 2363299
46615 2363299 1821676 1569011 1700541 1584988 682164 -645329 -1526686 -1527802 -851409 82221
46605 82221 807746 864653 233329 -400857 -281212 604711 1662633 2396499 2577075 2043454
$$ packed form
46673A17034j74034k99508j73887J78339L40078J53380j10355l17206o04146q28432
46663a718737n88388j3980K11211o1298j09077M74663J049672R65651N68699M27943
46653A206359K46795n09262j378046j348267l66444N51230P06360M05245J93671
46644b92359J33386J6075k45974o03207q69102p31129j27167M89603O74719O04904
46634i50251O59981O19683j0100r43277j191128l74691P03939J072944O58478
46625B45578Q7170j29535O5817M24568O30613N66142M06706K97801Q5858l17419
46615B363299n41623k52665J31530j15553r02824j327493q81357j116O76393R33630
46605H2221P25525N6907o31324o34186J19645Q85923J057922P33866J80576n33621
$$ plain form
46595 2043454 931686 -106256 -520442 -547015 -689459 -741705 -89653 1106400 1862805
46586 1862805 1599788 692427 -297439 -1194082 -1871635 -2120287 -2094973 -2197294 -2303109 -1879313
46576 -1879313 -1091741 -844752 -1268365 -1169863 250773 2004955 2604760 2084127 1622967
46567 1622967 1608371 1331748 515038 -103270 41161 576054 1022639 1543830 2327449 2874951
46557 2874951 2559241 1541202 574115 102198 11248 98917 294915 432110 245951 -255870
46547 -255870 -708871 -836985 -777949 -785526 -784662 -514150 -65998 85999 -227562 -460748 13492
46536 13492 995446 1612673 1412518 892477 795295 1247491 1839131 2240775 2404168 2344066
46526 2344066 2067680 1659920 1209276 726998 304536 178971 401171 599761 377604
$$ packed form
46595B043454j111768j037942m14186k6573j42444n2246O52052J196053P56405
46586A862805k63017r07361r89866q96643o77553k48652K5314j02321j05815M23796
46576a879313P87572K46989m23613R8502J420636J754182N99805n20633m61160
46567A622967j4596k76623q16710o18308J44431N34893M46585N21191P83619N47502
46557B874951l15710j018039r67087m71917r0950Q7669J95998J37195j86159n01821
46547b55870m53001j28114N9036p577Q64K70512M48152J51997l13561k33186M74240
46536A3492R81954O17227k00155n20041r7182M52196N91640M01644J63393o0102
46526B344066k76386m07760m50644m82278m22462j25565K22200J98590k22157
$$ plain form
46517 377604 -141621 -444228 -255365 201684 513703 420709 -50413 -524293 -438748 395058
46507 395058 1391615 1667811 1002803 98794 -171358 414980 1371125 2015362 1963485 1324575
46497 1324575 566668 122012 44550 52326 -144627 -592934 -1028494 -941126 91054 1833305
46487 1833305 3241080 3254700 1894940 355272 -164977 371496 947059 685891 -224209
46478 -224209 -885829 -851286 -643275 -959870 -1642121 -1875157 -1337154 -581900 -131774 217422
46468 217422 807362 1345117 1298567 760678 310164 161213 33305 -199409 -308854 -208311
46458 -208311 -134216 -218187 -294989 -255611 -242098 -393166 -688327 -1073826 -1439785 -1492332 -1007446
46447 -1007446 -211686 435459 783010 916583 673093 -184296 -1305215 -1925287 -1845972
$$ packed form
46517C77604n19225l02607J88863M57049L12019r2994m71122m73880Q5545Q33806
46507C95058R96557K76196o65008r04009k70152N86338R56145O44237n1877o38910
46497A324575p57907m44656p7462P776j96953m48307m35560Q7368J032180J742251
46487A833305J407775J3620j359760j539668n20249N36473N75563k61168r10100
46478b24209o61620L4543K08011l16595o82251k33036N38003P55254M50126L49196
46468B17422N89940N37755m6550n37889m50514j48951j27908k32714j09445J00543
46458b08311P4095q3971p6802L9378J3513j51068k95161l85499l65959n2547M84886
46447a007446P95760O47145L47551J33573k43490q57389j120919o20072P9315
$$ plain form
46438 -1845972 -1599330 -1428615 -836518 413362 1511154 1493840 526576 -397857 -815544
46429 -815544 -1151091 -1761071 -2298721 -2268630 -1762456 -1294948 -1109851 -986972 -744004 -645205
46419 -645205 -1082388 -1941569 -2605930 -2692950 -2476389 -2337345 -2107926 -1373167 -226483 752424
46409 752424 1165498 975208 162648 -1169720 -2368731 -2587571 -1743514 -582324 293337
46400 293337 835008 922246 185506 -1156282 -2030495 -1655147 -459711 572982 978570
46391 978570 835818 346466 -66147 190466 1091441 1706725 1283701 182240 -799421
46382 -799421 -1470636 -1970870 -2055970 -1522194 -884781 -738002 -821335 -623458 -487512 -1025068
46372 -1025068 -1744160 -1526524 -422428 294870 34711 -339700 26571 832205 1380469
$$ packed form
46438a845972K46642J70715N92097J249880J097792j7314r67264r24433m17687
46429h15544l35547o09980n37650L0091N06174M67508J85097J22879K42968R8799
46419f45205m37183q59181o64361q7020K16561J39044K29419P34759J146684R78907
46409G52424M13074j90290q12560j332368j199011k18840Q44057J161190Q75661
46400B93337N41671Q7238p36740j341788q74213L75348J195436J032693M05588
46391I78570j42752m89352m12613K56613R00975O15284m23024j101461r81661
46382g99421o71215n00234q5100N33776O37413J46779q3333J97877J35946n37556
46372a025068p19092K17636J104096P17298k60159l74411L66271Q05634N48264
$$ plain form
46363 1380469 1526082 1351024 752260 -83158 -524679 -369053 -205847 -406323 -433654 250091
46353 250091 1219114 1683218 1535273 1152983 618919 -171418 -959773 -1335950 -1284339 -1034695
46343 -1034695 -669721 -361720 -615665 -1653699 -2818305 -3198603 -2675305 -1827071 -1055072
46334 -1055072 -410016 -70292 -256716 -662056 -591484 204423 1272291 2072924 2446593
46325 2446593 2449866 2163616 1767425 1499833 1480170 1749656 2345885 3032899 3160458 2274692
46315 2274692 801405 -356967 -880349 -1184999 -1507281 -1444250 -662879 410677 994658
46306 994658 793156 123601 -608396 -1234028 -1677565 -1784951 -1430579 -724567 -10814 394799
46296 394799 441595 257834 -121668 -771142 -1598480 -2271040 -2517002 -2318507 -1737330 -819706
$$ packed form
46363A380469J45613j75058n98764q35418m41521J55626J63206k00476k7331O83745
46353B50091R69023M64104j47945l82290n34064p90337p88355l76177N1611K49644
46343a034695L64974L08001k53945j038034j164606l80298N23298Q48234P71999
46334a055072O45056L39724j86424m05340P0572P95907J067868Q00633L73669
46325B446593L273k86250l96191k67592j9663K69486N96229O87014J27559q85766
46315B274692j473287j158372n23382l04650l22282O3031P81371J073556N83981
46306I94658k01502o69555p31997o25632m43537j07386L54372P06012P13753M05613
46296C94799M6796j83761l79502o49474q27338o72560k45962J98495N81177R17624
$$ plain form
46286 -819706 185136 822056 892236 672601 446410 107128 -488849 -1097201 -1389846 -1405061
46276 -1405061 -1295032 -927283 -228342 358022 354563 -628 -120882 -25447 -194742 -531374
46266 -531374 -306524 676504 1621461 1761383 1233237 616041 172009 -91501 -138988 -103052
46256 -103052 -309174 -701468 -696981 -64547 493241 197797 -688857 -1197431 -902097 -272641
46246 -272641 108832 140309 19505 -70383 -43224 -2434 -244892 -903212 -1673871 -2187742
46236 -2187742 -2480626 -2706559 -2572475 -1623514 -69502 1255222 1866351 2023630 1995653
46227 1995653 1549004 558687 -382935 -546923 -10094 519938 681809 721513 817154 734617
46217 734617 331794 -87569 -230849 -261847 -425311 -507228 -119304 614265 1113646 1063595
$$ packed form
46286h19706J004842O36920P0180k19635k26191l39282n95977o08352k92645j5215
46276a405061J10029L67749O98941N86364l459l55191j20254R5435j69295l36632
46266e31374K24850R83028R44957J39922n28146o17196m44032k63510m7487L5936
46256a03052k06122l92294M487O32434N57788k95444q86654n08574K95334O29456
46246b72641L81473L1477j20804q9888K7159M0790k42458o58320p70659n13871
46236b187742k92884k25933J34084R48961J554012J324724O11129J57279k7977
46227A995653m46649r90317r41622j63988N36829N30032J61871L9704R5641q2537
46217G34617m02823m19363j43280l0998j63464q1917L87924P33569M99381n0051
$$ plain form
46207 1063595 642542 18719 -858235 -1765721 -2015722 -1176743 288003 1487491 1995999
46198 1995999 1934912 1458075 708516 156944 330430 1060326 1511748 1198771 580084 390881
46188 390881 721545 1077462 1118273 989454 1005685 1276664 1643827 1826304 1631098 1117921
46178 1117921 565625 258270 313589 644237 978896 995518 586713 -63447 -775099 -1551433
46168 -1551433 -2240519 -2305869 -1406188 -54493 852930 1114084 1245256 1478144 1504706 1354527
46158 1354527 1626383 2387141 2644012 1626047 36749 -724761 -214925 878964 1851948
46149 1851948 2478505 2624272 2204223 1546144 1158005 1130022 1279056 1712765 2578884 3390308
46139 3390308 3399315 2662945 1960388 1587406 1066342 219911 -370463 -355843 -238922 -472291
$$ packed form
46207A063595m21053o23823q76954r07486k50001Q38979J464746J199488N08508
46198A995999o1087m76837p49559n51572J73486P29896M51422l12977o18687j89203
46188C90881L30664L55917M0811j28819J6231K70979L67163J82477j95206n13177
46178A117921n52296l07355N5319L30648L34659J6622m08805o50160p11652p76334
46168a551433o89086o5350Q99681J351695R07423K61154J31172K32888K6562j50179
46158A354527K71856P60758K56871j017965j589298p61510N09836J093889R72984
46149A851948O26557J45767m20049o58079l88139k7983J49034M33709Q66119Q11424
46139C390308R007p36370p02557l72982n21064q46431n90374J4620J16921k33369
$$ plain form
46129 -472291 -662106 -331204 111518 -53413 -672711 -900526 -423938 175707 282368 -101799
46119 -101799 -645812 -1176262 -1690852 -2122180 -2234712 -1747258 -653032 560242 1268061
46110 1268061 1404302 1475697 1713810 1671212 1033861 365915 419599 980259 1115339 491728
46100 491728 -268753 -612262 -729949 -984772 -1288876 -1425739 -1499150 -1608317 -1435925 -661751
46090 -661751 423151 1208483 1582129 1986760 2633490 3093178 2847721 1965800 1035071
46081 1035071 592922 762628 1273833 1669422 1641388 1362801 1369572 1900083 2490967 2542709
46071 2542709 2184845 2115631 2528482 2769809 2383565 1942323 2201963 2760426 2409569 870108
46061 870108 -631468 -853173 30896 959145 1427817 1767208 2253798 2665848 2778379
$$ packed form
46129d72291j89815L30902M42722j64931o19298k27815M76588N99645J06661l84167
46119a01799n44013n30450n14590m31328j12532M87454J094226J213274P07819
46110A268061J36241P1395K38113m2598o37351o67946N3684N60660J35080o23611
46100D91728p60481l43509j17687k54823l04104j36863p3411j09167J72392P74174
46090f61751J084902P85332L73646M04631O46730M59688k45457q81921r30729
46081A035071m42149J69706N11205L95589k8034k78587O771N30511N90884N1742
46071B542709l57864o9214M12851K41327l86244m41242K59640N58463l50857j539461
46061H70108j501576k21705Q84069R28249M68672L39391M86590M12050J12531
$$ plain form
46052 2778379 2759701 2863670 3035812 3021807 2710522 2241727 1840631 1588927 1348659 983651
46042 983651 668935 780896 1365241 1949274 2089793 1879235 1638942 1350501 774734 -38018
46032 -38018 -810543 -1522836 -2338140 -3035357 -3035621 -2154480 -907277 111145 751392 1017274
46022 1017274 714545 -189917 -1132615 -1352854 -692880 312108 1108712 1592138 1869741
46013 1869741 1853960 1309233 252197 -869084 -1520099 -1598716 -1492316 -1576891 -1826440 -2031491
46003 -2031491 -2155017 -2170286 -1754215 -640053 729626 1422419 1057056 214016 -336967
45994 -336967 -341862 195296 1320425 2646404 3086247 1885783 -203866 -1499280 -1184320
45985 -1184320 11918 945319 1235988 1169866 1052820 1028964 1130927 1161938 820772 197630
$$ packed form
46052B778379j8678J03969J72142j4005l11285m68795m01096k51704k40268l65008
46042I83651l14716J11961N84345N84033J40519k10558k40293k88441n75767q12752
46032c8018p72525p12293q15304o97217k64Q81141J247203J018422O40247K65882
46022A017274l02729r04462r42698k20239O59974J004988P96604M83426K77603
46013A869741j5781n44727j057036j121281o51015p8617J06400q4575k49549k05051
46003b031491j23526j5269M16071J114162J369679O92793l65363q43040n50983
45994c36967m895N37158J125129J325979M39843j200464k089649j295414L14960
45985a184320J196238R33401K90669o6122j17046k3856J01963L1011l41166o23142
$$ plain form
45975 197630 -186151 -88029 98643 31707 28362 482366 1048657 1091315 748796 782344 1344460
45964 1344460 1669657 1221322 467082 153342 396132 935213 1734589 2711024 3274025
45955 3274025 2887778 1936892 1342692 1359316 1406212 1116607 842410 920317 1095436 1029315
45945 1029315 856331 828373 837780 726389 688444 876566 926875 454872 -162851 -124290
45935 -124290 681630 1440670 1412641 727826 18600 -381002 -624667 -958207 -1380375 -1671753
45925 -1671753 -1674292 -1520316 -1501892 -1660810 -1675593 -1307811 -772812 -424099 -235154 88713
45915 88713 579738 909557 780669 173118 -678505 -1292677 -1158825 -375324 126409 -454430
45905 -454430 -1703275 -2466533 -2344783 -1991978 -1881645 -1639628 -936990 -242616 -113324
$$ packed form
45975A97630l83781R8122J86672o6936l345M54004N66291M2658l42519L3548N62116
45964A344460L25197m48335p54240l13740K42790N39081P99376R76435N63001
45955C274025l86247r50886n94200J6624M6896k89605k74197P7907J75119o6121
45945A029315j72984k7958R407j11391l7945J88122N0309m72003o17723L8561
45935a24290Q05920P59040k8029o84815p09226l99602k43665l33540m22168k91378
45925a671753k539J53976J8424j58918j4783L67782N34999L48713J88945L23867
45915H8713M91025L29819j28888o07551q51623o14172J33852P83501N01733n80839
45905d54430j248845p63258J21750L52805J10333K42017P02638O94374J29292
$$ plain form
45896 -113324 -327211 -345323 -168242 -74076 121373 799461 1715385 2150210 1881387 1435677
45886 1435677 1338820 1579445 1841826 1836617 1359866 424881 -585404 -1201608 -1323141 -1127834
45876 -1127834 -632798 243311 1209149 1673048 1429843 920267 650322 637272 576019 297032
45866 297032 -121336 -532220 -857800 -1111264 -1325966 -1431215 -1302603 -1058758 -1129682 -1750734
45856 -1750734 -2496336 -2668933 -2160301 -1609447 -1639503 -2197701 -2725648 -2757962 -2264803 -1571743
45846 -1571743 -1019727 -621733 -84003 737625 1520644 1802767 1546071 1195801 1250458 1888849
45836 1888849 2838075 3446505 3148124 2107744 1136169 693550 352693 -349264 -983641
45827 -983641 -802572 104373 1005013 1649551 2322690 2884678 2771736 2080076 1655570 1788074
$$ packed form
45896a13324k13887j8112J77081R4166J95449O78088R15924M34825k68823m45710
45886A435677r6857K40625K62381n209m76751r34985j010285o16204j21533J95307
45876a127834M95036Q76109R65838M63899k43205n09576k69945j3050o1253k78987
45866B97032m18368m10884l25580k53464k14702j05249J28612K43845p0924o21052
45856a750734p45602j72597N08632N50854l0056n58198n27947l2314M93159O93060
45846a571743N52016L97994N37730Q21628P83019K82123k56696l50270N4657O38391
45836A888849R49226O08430k98381j040380r71575m42619l40857p01957o34377
45827i83641J81069R06945R00640O44538O73139N61988j12942o91660m24506J32504
$$ plain form
45817 1788074 1729207 936315 -51914 -498764 -442355 -199325 343507 1212149 1762375 1446091
45807 1446091 711492 349357 314893 -14890 -721410 -1289505 -1465323 -1403704 -1112760 -495304
45797 -495304 161500 457719 564820 936563 1420151 1423048 960137 721839 964847 1109470
45787 1109470 691944 22730 -433209 -725338 -1070782 -1323509 -1213216 -788158 -283269
45778 -283269 185750 544789 663884 581490 553949 643522 516410 -92160 -912210 -1377917
45768 -1377917 -1212430 -639680 -152892 -146084 -587903 -996229 -935772 -568398 -461628 -838839
45758 -838839 -1338703 -1558276 -1444545 -1030235 -227284 827061 1568879 1560168 1110335 1006998
45748 1006998 1617124 2444865 2617081 1736746 244477 -1047103 -1709310 -1844683 -1558678
$$ packed form
45817A788074n8867p92892r88229m46850N6409K43030N42832Q68642N50226l16284
45807A446091p34599l62135l4464l29783p06520n68095j75818O1619K90944O17456
45797d95304O56804K96219J07101L71743M83588K897m62911k38298K43008J44623
45787A109470m17526o69214m55939k92129l45444k52727J10293M25058N04889
45778b83269M69019L59039J19095q2394k7541Q9573j27112o08570q20050m65707
45768a377917J65487N72750M86788O808m41819m08326O0457L67374J06770l77211
45758h38839m99864k19573J13731M14310Q02951J054345P41818q711m49833j03337
45748A006998O10126Q27741J72216q80335j492269j291580o62207j35373K86005
$$ plain form
45739 -1558678 -752864 308837 780370 225664 -510847 -252901 830658 1453472 1188754
45730 1188754 1128483 2118712 3349152 3508756 2623649 1777253 1428484 1045262 320439
45721 320439 -217858 -63294 474261 713198 493021 309770 689970 1606955 2508171 2880746
45711 2880746 2725507 2363193 1893598 1190184 410005 99 24517 13640 -217173 -142970
45701 -142970 641919 1690188 2358039 2726713 3192116 3542603 3280591 2639274 2396506
45692 2396506 2705862 2932012 2722530 2479780 2612572 3003446 3388238 3614453 3368594
45683 3368594 2359880 1023084 318817 471310 573209 -119797 -1156115 -1714657 -1875083
45674 -1875083 -2303313 -3001118 -3164289 -2268052 -721332 611985 1153807 892829 305908
$$ packed form
45739a558678Q05814J061701M71533n54706p36511K57946J083559O22814k64718
45730A188754o0271R90229J230440J59604q85107q46396l48769l83222p24823
45721C20439n38297J54564N37555K38937k20177j83251L80200R16985R01216L72575
45711B880746j55239l62314m69595p03414p80179m09906K4418j0877k30813P4203
45701a42970P84889J048269O67851L68674M65403L50487k62012o41317k42768
45692B396506L09356K26150k09482k42750J32792L90874L84792K26215k45859
45683C368594j008714j336796p04267J52493J01899o93006j036318n58542j60426
45674a875083m28230o97805j63171Q96237J546720J333317N41822k60978n86921
$$ plain form
45665 305908 30580 324946 820138 985580 745477 398638 49064 -536867 -1474997 -2430260
45655 -2430260 -2856607 -2496205 -1628314 -834906 -432935 -145657 487494 1407625 2082312
45646 2082312 2306952 2475561 2803713 2814841 2099532 1147477 719174 638250 41453 -1163655
45636 -1163655 -1944137 -1525486 -411721 410371 687893 766773 735093 445677 164231 411016
45626 411016 1116525 1612457 1630390 1683012 2157031 2621575 2519393 2063452 1807867 1654654
45616 1654654 1055530 71655 -620448 -867956 -1283430 -2006817 -2140445 -1102546 209175
45607 209175 560347 195323 399394 1455816 2249237 2038946 1454786 1292415 1369812 1273219
45597 1273219 1366383 2126128 3020202 3032375 2083110 1072229 574487 256054 -325317 -959475
$$ packed form
45665C05908k75328K94366M95192J65442k40103l46839l49574n85931r38130r55263
45655b430260m26347L60402Q67891P93408M01971K87278O33151R20131O74687
45646B082312K24640J68609L28152J1128p15309r52055m28303q0924n96797j205108
45636a163655p80482M18651J113765Q22092K77522P8880l1680k89416k81446K46785
45626D11016P05509M95932J7933N2622M74019M64544j02182m55941k55585j53213
45616A654654n99124r83875o92103k47508m15474p23387j33628J037899J311721
45607B09175L51172l65024K04071J056422P93421k10291n84160j62371P7397r6593
45597A273219R3164P59745Q94074J2173r49265j010881m97742l18433n81371o34158
$$ plain form
45587 -959475 -1044369 -294950 890461 1631878 1329056 439753 134945 810299 1419714 898851
45577 898851 -231367 -580130 110879 791254 885093 1025155 1690362 2281005 2218096 2035485
45567 2035485 2506638 3291301 3341743 2333847 951533 -25597 -279359 174748 1013749
45558 1013749 1618165 1631373 1444309 1665529 2261985 2716271 2841522 2839595 2676430 2083578
45548 2083578 1213789 651052 615373 688567 494561 178977 54270 221284 705429 1513411
45538 1513411 2359659 2779532 2746012 2761529 3102059 3396620 3235090 2762484 2336444 2031474
45528 2031474 1898305 2264049 3170770 3823655 3326730 1919551 837425 873342 1646203
45519 1646203 2388495 2814467 2906778 2446594 1343624 144688 -392380 -204952 58481
$$ packed form
45587i59475q4894P49419J185411P41417l02822q89303l04808O75354O09415n20863
45577H98851j130218l48763O91009O80375R3839J40062O65207N90643o2909j82611
45567B035485M71153P84663N0442j007896j382314r77130k53762M54107Q39001
45558A013749O04416J3208j87064K21220N96456M54286J25251j927j63165n92852
45548B083578q69789n62737l5679P3194j94006l15584j24707J67014M84145Q07982
45538A513411Q46248M19873l3520J5517L40530K94561j61530m72606m26040l04970
45528B031474j33169L65744R06721O52885m96925j407179j082126L5917P72861
45519A646203P42292M25972R2311m60184j102970j198936n37068J87428K63433
$$ plain form
45510 58481 -40250 -238304 -136293 191105 469142 778324 1362623 2010038 2159228 1729457
45500 1729457 1363461 1563411 1972981 1935315 1483934 1212874 1233438 885556 -306997 -1872181
45490 -1872181 -2897189 -2971835 -2314398 -1266818 -90657 901482 1471412 1735451 2000159
45481 2000159 2288881 2299635 1870964 1257528 900031 1098373 1878651 2926763 3635023
45472 3635023 3491178 2538313 1306246 284298 -353435 -580472 -450435 -266100 -417962
45463 -417962 -838965 -944370 -397410 325095 470583 -52578 -615496 -638275 -79445 777065
45453 777065 1647096 2310423 2662561 2790893 2766479 2366848 1386432 330224 303907 1774844
45443 1774844 3710002 4499558 3727604 2525159 2054722 2186669 2046143 1424667 989481
$$ packed form
45510E8481r8731j98054J02011L27398K78037L09182N84299O47415J49190m29771
45500A729457l65996J99950M09570l7666m51381k71060K0564l47882j192553j565184
45490a872181j025008p4646O57437J047580J176161R92139N69930K64039K64708
45481B000159K88722J0754m28671o13436l57497J98342P80278J048112P08260
45472C635023j43845r52865j232067j021948o37733k27037J30037J84335j51862
45463d17962m21003j05405N46960P22505J45488n23161n62918k2779N58830Q56510
45453G77065Q70031O63327L52138J28332k4414l99631r80416j056208k6317J470937
45443A774844J935158P89556p71954j202445m70437J31947j40526o21476m35186
$$ plain form
45434 989481 1192157 1656918 1859474 1857920 1975584 2176507 2230710 2205960 2255301 2110073
45424 2110073 1411015 499149 207418 733514 1348414 1461197 1348140 1453493 1576896
45415 1576896 1326115 917906 862093 1139715 1350350 1451053 1652951 1739518 1264662 422213
45405 422213 -55799 34869 177687 174290 514611 1314205 1704951 941128 -468178 -1416766
45395 -1416766 -1544277 -1242976 -749688 -61148 486593 445275 57615 42114 474729 624358
45385 624358 107526 -484559 -442939 156018 803065 1326693 1836624 2244284 2359624 2317319
45375 2317319 2469009 2868855 3161341 3000590 2429992 1875913 1823066 2362778 3005442 3130997
45365 3130997 2679086 2141860 1837710 1593684 1297702 1259627 1644853 1981987 1768392 1276691
$$ packed form
45434I89481K02676M64761K02556j554J17664K00923N4203k4750M9341j45228
45424B110073o99058r11866k91731N26096O14900J12783j13057J05353J23403
45415A576896k50781m08209n5813K77622K10635J00703K01898Q6567m74856q42449
45405D22213m78012R0668J42818l397L40321P99594L90746p63823j409306r48588
45395a416766j27511L01301M93288O88540N47741m1318l87660j5501M32615J49629
45385F24358n16832n92085M1620N98957O47047N23628N09931M07660J15340m2305
45375B317319J51690L99846K92486j60751n70598n54079n2847N39712O42664J25555
45365C130997m51911n37226l04150k44026k95982l8075L85226L37134k13595m91701
$$ plain form
45355 1276691 1172899 1510994 1724611 1538550 1244437 1042217 766749 427638 387682 711236
45345 711236 877300 508692 -54055 -277939 -130444 145785 549513 1139127 1680751 2008076
45335 2008076 2437258 3221943 3830100 3472821 2276458 1217774 874131 971628 1271347
45326 1271347 2041577 3262661 4147210 4094802 3584410 3428480 3547840 3252353 2484327
45317 2484327 1946689 2020542 2333698 2530181 2754788 3119485 3322489 3171564 2986302 3079830
45307 3079830 3271560 3353464 3636839 4458958 5385977 5539770 4703449 3587091 2946401
45298 2946401 2899014 3195592 3654988 4048088 3951111 3172822 2205863 1843524 2283983 2911484
45288 2911484 3113560 3064603 3387575 4136831 4578886 4201525 3536258 3476493 3971210 4057244
$$ packed form
45355A276691j03792L38095K13617j86061k94113k02220k75468l39111l9956L23554
45345G11236J66064l68608n62747k23884J47495K76229M03728N89614N41624L27325
45335B008076M29182P84685O08157l57279j196363j058684l43643R7497K99719
45326A271347P70230J221084Q84549n2408n10392j55930J19360k95487p68026
45317B484327n37638P3853L13156J96483K24607L64697K03004j50925j85262R3528
45307C079830J91730Q1904K83375Q22119R27019J53793q36321j116358o40690
45298B946401m7387K96578M59396L93100r6977p78289r66959l62339M40459O27501
45288B911484K02076m8957L22972P49256M42055l77361o65267n9765M94717Q6034
$$ plain form
45278 4057244 3261121 2270798 1904335 2095831 2456797 3206803 4662355 6157714 6530549
45269 6530549 5704052 4828653 4665943 4765703 4585603 4443586 4689695 4750916 3939291 2740547
45259 2740547 2342242 3082211 4208615 5052791 5580562 5784293 5437913 4719667 4335269
45250 4335269 4630052 5109092 5189234 4970900 4928513 5261173 5911416 6848279 7939979 8852193
45240 8852193 9448006 10015406 10744005 11283758 11259612 10960343 10992703 11390625 11597962 11310406
45230 11310406 10840988 10586957 10574677 10678324 10940555 11472986 12219819 12926394 13237799
45221 13237799 12901175 12096037 11459352 11434796 11650835 11368896 10550022 9943635 9959450 10023178
45211 10023178 9438854 8448604 7919423 8227278 8953323 9533510 9705970 9382613 8602197
$$ packed form
45278D057244p96123r90323l66463J91496L60966P50006J455552J495359L72835
45269F530549q26497q75399j62710R9760j80100j42017K46109O1221q11625j198744
45259B740547l98305P39969J126404Q44176N27771K03731l46380p18246l84398
45250D335269K94783M79040Q0142k18334m2387L32660O50243R36863J091700R12214
45240H852193N95813N67400P28599N39753k4146k99269L2360L97922K07337k87556
45230A1310406m69418k54031j2280J03647K62231N32431P46833P06575L11405
45221A3237799l36624q05138o36685k4556K16039k81939q18874o06387J5815O3728
45211A0023178n84324r90250n29181L07855P26045N80187J72460l23357p80416
$$ plain form
45202 8602197 7695058 7073887 6742375 6357123 5851156 5583887 5712477 5839096 5571748
45193 5571748 5095752 4846374 4892631 5033261 5262309 5647764 5871552 5456805 4524961 3815745
45183 3815745 3757531 3953546 3858297 3554236 3456346 3555630 3478249 3180111 3063171 3358835
45173 3358835 3837609 4228964 4503080 4570829 4152824 3272880 2525676 2420638 2685393 2691066
45163 2691066 2424979 2481363 3067220 3623552 3695341 3667220 4171546 5070915 5587974 5395457
45153 5395457 5064973 5274331 5923943 6285345 5836066 4724183 3521948 2748677 2602650
45144 2602650 2927214 3334752 3480331 3337825 3174112 3163567 3082183 2564962 1720284 1266168
45134 1266168 1801040 3003170 3850648 3713791 2985355 2513153 2673640 3212883 3730762
$$ packed form
45202H602197r07139o21171l31512l85252n05967k67269J28590J26619k67348
45193E571748m75996k49378M6257J40630K29048L85455K23788m14747r31844p09216
45183C815745n8214J96015r5249l04061r7890R9284p7381k98138j16940K95664
45173C358835M78774L91355K74116O7749m18005q79944p47204j05038K64755N673
45163B691066k66087N6384N85857N56332P1789k8121N04326Q99369N17059j92517
45153E395457l30484K09358O49612L61402m49279j111883j202235p73271j46027
45144B602650L24564M07538J45579j42506j63713j0545q1384n17221q44678m54116
45134A266168N34872J202130Q47478j36857p28436m72202J60487N39243N17879
$$ plain form
45125 3730762 3949800 3649429 2803462 1857011 1486566 1911306 2696444 3364560 3911021
45116 3911021 4527742 5125191 5465071 5597526 5795317 6075118 6094210 5589456 4710931 3854259
45106 3854259 3315895 3162702 3298619 3577080 3901607 4224008 4400236 4144943 3318817
45097 3318817 2265252 1655061 1862745 2556705 2985535 2661926 1773340 982959 844296
45088 844296 1363937 2093637 2585728 2673551 2385043 1870835 1538921 1929878 3085293 4187879
45078 4187879 4266187 3288805 2204211 1847973 2181793 2696696 3114989 3424041 3572338
45069 3572338 3490312 3206724 2673556 1734925 595925 26593 597531 1845343 2707253
45060 2707253 2746216 2449251 2336334 2391871 2525436 2927926 3554977 3783481 3173695 2278298
$$ packed form
45125C730762K19038l00371q45967r46451l70445M24740P85138O68116N46461
45116C911021O16721N97449L39880J32455J97791K79801J9092n04754q78525q56672
45106C854259n38364j53193J35917K78461L24527L22401J76228k55293q26126
45097C318817j053565o10191K07684O93960M28830l23609q88586p90381j38663
45088H44296N19641P29700M92091Q7823k88508n14208l31914L90957J155415J102586
45078D187879P8308r77382j084594l56238L33820N14903M18293L09052J48297
45069C572338q2026k83588n33168r38631j139000n69332N70938J247812Q61910
45060B707253L8963k96965j12917N5537J33565M02490O27051K28504o09786q95397
$$ plain form
45050 2278298 2074700 2699405 3320147 3266999 2734029 2241745 1943288 1744474 1688075 1838135
45040 1838135 2048207 2216421 2580136 3360090 4208432 4426941 3784321 2801295 2148982
45031 2148982 2036992 2284622 2705999 3218521 3737953 4169857 4437709 4407909 3896905 2903506
45021 2903506 1777226 1022406 931782 1434306 2203273 2843930 3099091 3023134 2931692 3099564
45011 3099564 3535956 4074274 4562921 4886569 4913691 4547074 3794237 2778158 1795984
45002 1795984 1334752 1739264 2745872 3634439 4037333 4311638 4871580 5506650 5763877
44993 5763877 5696184 5684647 5716888 5482245 5120499 5180282 5724619 6131289 5992586 5609682
44983 5609682 5345283 5125330 4946233 5217776 6038888 6667636 6393874 5572104 5086538
$$ packed form
45050B278298k03598O24705O20742n3148n32970m92284k98457j98814n6399J50060
45040A838135K10072J68214L63715P79954Q48342K18509o42620r83026o52313
45031B148982j11990K47630M21377N12522N19432M31904K67852k9800n11004r93399
45021B903506j126280p54820r0624N02524P68967O40657K55161p5957r1442J67872
45011C099564M36392N38318M88647L23648K7122l66617p52837j016079r82174
45002A795984m61232M04512J006608Q88567M02894K74305N59942O35070K57227
44993E763877o7693j1537L2241k34643l61746N9783N44337M06670j38703l82904
44983E609682k64399k19953j79097K71543Q21112O28748k73762q21770m85566
$$ plain form
44974 5086538 5051571 4784549 3950435 3003945 2466049 2390758 2621516 3005112 3256578 3150462
44964 3150462 2963048 3214821 3857162 4244210 4073659 3815915 3970181 4397930 4692663
44955 4692663 4762844 4716005 4556373 4346244 4337795 4619521 4931263 5099853 5294103 5555682
44945 5555682 5537295 5153592 5043745 5748800 6718950 6872015 6053591 5214968 5048017 5129696
44935 5129696 4712834 3812525 3044129 2681709 2373506 1782369 1169945 1184540 2141264 3610202
44925 3610202 4773834 5191342 5126512 5085910 5185554 5142126 4812098 4514059 4732735 5565137
44915 5565137 6502349 6816415 6281981 5497490 5277775 5680120 5920506 5410957 4565340
44906 4565340 4289096 4921445 6023705 6993676 7478688 7355976 6811728 6412406 6625640
$$ packed form
44974E086538l4967k67022q34114r46490n37896p5291K30758L83596K51466j06116
44964C150462j87414K51773O42341L87048j70551k57744J54266M27749K94733
44955D692663P0181m6839j59632k10129q449K81726L11742J68590J94250K61579
44945E555682j8387l83703j09847P05055R70150J53065q18424q38623j66951Q1679
44935E129696m16862r00309p68396l62420l08203n91137o12424J4595R56724J468938
44925C610202J163632M17508o4830m0602R9644m3428l30028k98039K18676Q32402
44915E565137R37212L14066n34434p84491k19715M02345K40386n09549q45617
44906D565340k76244O32349J102260R69971M85012j22712n44248l99322K13234
$$ plain form
44897 6625640 7220991 7549271 7439137 7376397 7746640 8403330 9131463 10015505 11061738
44888 11061738 11907046 12288900 12493140 12969682 13754988 14619520 15542666 16658214 17935906
44879 17935906 19354750 21266844 24102549 27678926 31224617 34261101 37205842 40956942
44871 40956942 46059809 52403478 59568589 67258550 75352843 83613214 91404737 97721333
44863 97721333 101448466 101648337 97901818 90758428 81818157 72907313 64903604 57548800
44855 57548800 50458463 43885585 38257013 33469067 29201736 25653502 23312716 22034778
44847 22034778 20936737 19332486 17331321 15402825 13790654 12534432 11673607 11163706
44839 11163706 10826307 10542826 10269123 9793073 8845435 7619730 6802660 6813768 7308514
$$ packed form
44897F625640N95351L28280j10134o2740L70243O56690P28133Q84042J046233
44888A1061738Q45308L81854K04240M76542P85306Q64532R23146J115548J277692
44879A7935906J418844J912094K835705L576377L545691L036484K944741L751100
44871D0956942N102867O343669P165111P689961Q094293Q260371P791523O316596
44863I7721333L727133J99871l746519p143390q940271q910844q003709p354804
44855E7548800p090337o572878n628572m787946m267331l548234k340786j277938
44847B2034778j098041j604251k001165j928496j612171j256222q60825n09901
44839A1163706l37399k83481k73703m76050r47638j225705q17070J1108M94746
$$ plain form
44830 7308514 7696563 7848347 7980130 8140008 8206683 8186766 8100753 7719338 6821838 5629980
44820 5629980 4617383 3978681 3645426 3683763 4195906 4871850 5146462 4865403 4359726
44811 4359726 3835263 3205049 2618471 2555220 3110444 3693724 3792958 3614744 3608567 3776982
44801 3776982 3876787 3906540 3917758 3731135 3405022 3602142 4751611 6105544 6509465 6060489
44791 6060489 6060863 7140176 8352890 8585532 8054245 7743481 7953548 8212377 8327019 8710327
44781 8710327 9644628 10808091 11666690 12006232 12037138 12206930 12852098 13836956 14695155
44772 14695155 15317394 16156078 17385161 18289403 18163948 17564290 17810110 19233121 20776079
44763 20776079 21556483 21995770 22934232 24313995 25368991 25656907 25263225 24319607 22996742
$$ packed form
44830G308514L88049J51784J31783J59878O6675j9917q6013l81415q97500j191858
44820E629980j012597o38702l33255L8337N12143O75944K74612k81059n05677
44811D359726n24463o30214n86578o3251N55224N83280R9234j78214o177J68415
44801C776982R9805K9753J1218j86623l26113J97120J149469J353933M03921m48976
44791F060489L74J079313J212714K32642n31287l10764K10067K58829J14642L83308
44781H710327R34301J163463Q58599L39542L0906J69792O45168R84858Q58199
44772A4695155O22239Q38684J229083R04242j25455n99658K45820J423011J542958
44763B0776079P80404M39287R38462J379763J054996K87916l93682r43618j322865
$$ plain form
44754 22996742 21802498 21239443 21174617 21034033 20569039 19957932 19250682 18313755 17340760
44745 17340760 16756270 16416992 15539191 13802740 12028000 11246786 11404229 11495683 10822482
44736 10822482 9607486 8420680 7510452 6846970 6444942 6373434 6581497 6879693 7056462
44727 7056462 6994924 6771940 6624357 6663056 6628324 6129158 5160479 4171662 3560126 3331416
44717 3331416 3356390 3667093 4258431 4825435 5014102 4816171 4447105 3995419 3553620 3545048
44707 3545048 4377834 5700203 6515393 6269145 5427088 4749424 4430929 4289063 4351369
44698 4351369 4720415 5125316 5171166 4899571 4602112 4242698 3658136 3203492 3431836 4039062
44688 4039062 3931636 2708865 1415022 1301099 2318513 3394836 3845419 3909857 4078785
$$ packed form
44754B2996742j194244n63055o4826j40584m64994o11107p07250r36927r72995
44745A7340760n84490l39278q77801j736451j774740p81214J57443R1454o73201
44736A0822482j214996j186806r10228o63482m02028p1508K08063K98196J76769
44727G056462o1538k22984j47583L8699l4732m99166r68679r88817o11536k28710
44717C331416K4974L10703N91338N67004J88667j97931l69066m51686m41799q572
44707C545048Q32786J322369Q15190k46248q42057o77664l18495j41866O2306
44698D351369L69046M04901M5850k71595k97459l59414n84562m54644K28344O07226
44688D039062j07426j222771j293843j13923J017414J076323M50583O4438J68928
$$ plain form
44679 4078785 4462119 4818407 4835093 4408335 3878283 3797380 4194488 4376449 3870290 3229188
44669 3229188 3315309 4029539 4477435 4300582 4041923 4100941 4149462 3901965 3750589 4154334
44659 4154334 4910688 5498759 5716573 5539062 4796810 3551352 2430450 1960137 1779418
44650 1779418 1137200 41196 -710160 -617805 -22203 492078 698198 664586 634339 1098171
44640 1098171 2430279 4203692 5367409 5432435 5064412 5153424 5706832 6105868 6114796 6090577
44630 6090577 6372558 6971956 7749830 8420161 8501513 7847175 7206184 7615221 9073074
44621 9073074 10403649 10691371 10316876 10265479 10995677 12470812 14726426 17618109 20307898
44612 20307898 21882418 22482541 23039018 23777878 23797621 22457256 20428940 18789200 17610603
$$ packed form
44679D078785L83334L56288J6686m26758n30052q0903L97108J81961n06159o41102
44669C229188Q6121P14230M47896j76853k58659N9018M8521k47497j51376M03745
44659D154334P56354N88071K17814j77511p42252j245458j120902m70313j80719
44650A779418o42218j096004p51356R2355N95602N14281K06120l3612l0247M63832
44640A098171J332108J773413J163717O5026l68023Q9012N53408L99036Q928k4219
44630F090577K81981N99398P77874O70331Q1352o54338o40991M09037J457853
44621I073074J330575K87722l74495n1397P30198J475135K255614K891683K689789
44612B0307898J574520O00123N56477P38860J9743j340365k028316j639740j178597
$$ plain form
44603 17610603 16186504 14369898 12900057 12342179 12311555 11994756 11099579 10058734 9448478
44594 9448478 9348154 9253572 8662365 7769468 7365300 7863081 8667870 8819459 8063075 6909347
44584 6909347 5834022 4937553 4299528 4033632 3883676 3370752 2586400 2288930 2855877
44575 2855877 3620331 3704709 3141201 2650947 2588092 2687027 2743526 2968771 3590485 4505963
44565 4505963 5403715 5937004 5825864 5169898 4628103 4828440 5561549 6067066 6203983
44556 6203983 6665607 7681255 8204430 7160385 5137315 3906469 4227141 4989607 4847450
44547 4847450 3938508 3391683 3653362 4082255 4008778 3430530 2606686 1653412 794757 475803
44537 475803 862656 1570824 2185891 2746219 3444221 4203124 4888919 5593934 6286915 6500785
$$ packed form
44603A7610603j424099j816606j469841n57878l0624l16799q95177j040845o10256
44594I448478j00324r4582n91207q92897m04168M97781Q04789J51589p56384j153728
44584F909347j075325q96469o38025k65896j49956n12924p84352k97470N66947
44575B855877P64454Q4378n63508m90254o2855R8935N6499K25245O21714R15478
44565D505963Q97752N33289j11140o55966n41795K00337P33109N05517J36917
44556F203983M61624J015648N23175j044045k023070j230846L20672P62466j42157
44547D847450r08942n46825K61679M28893p3477n78248q23844r53274q58655l18954
44537D75803L86853P08168O15067N60328O98002P58903O85795P05015O92981K13870
$$ plain form
44527 6500785 5896841 4916368 4297956 4091285 3758425 3169464 2804415 2894309 3040965 2896974
44517 2896974 2630785 2481896 2433922 2601101 3311457 4383839 4903076 4301851 3273873
44508 3273873 3017722 3830301 4979552 5732490 5945741 5788879 5451755 5125837 4874396
44499 4874396 4562959 4216551 4232001 4804872 5367393 5179239 4405024 4005382 4477889 5216974
44489 5216974 5287312 4459109 3326647 2661898 2732438 3087801 3077952 2724199 2786959 3651280
44479 3651280 4554609 4529600 3796680 3416840 3729617 4084844 4152673 4433818 5132669 5538971
44469 5538971 5151946 4608977 4736269 5280741 5404090 5011685 4732782 4793519 4729850 4222732
44459 4222732 3556206 3133615 3012113 3030123 3076534 3186380 3582712 4535403 5939574 7175407
$$ packed form
44527F500785o03944r80473o18412k06671l32860n88961l65049Q9894J46656j43991
44517B896974k66189j48889m7974J67179P10356J072382N19237o01225j027978
44508C273873k56151Q12579J149251P52938K13251j56862l37124l25918k51441
44499D874396l11437l46408J5450N72871N62521j88154p74215l99642M72507P39085
44489E216974P0338q28203j132462o64749P0540L55363r849l53753O2760Q64321
44479C651280R03329k5009p32920l79840L12777L55227O7829K81145O98851M06302
44469E538971l87025n42969J27292N44472J23349l92405k78903O0737o3669n07118
44459D222732o66526m22591j21502J8010M6411J09846L96332R52691J404171J235833
$$ plain form
44449 7175407 7659679 7413647 6892032 6505085 6543046 7177628 8116859 8625757 8431949 8306187
44439 8306187 9127751 10634484 11807291 12289218 12580302 12889240 12768583 12133336 11757561
44430 11757561 12280333 13357547 14283731 14919839 15479672 15817277 15500518 14390893 12745575
44421 12745575 10937710 9380163 8447316 8111377 7899234 7553816 7464210 8032990 8869373
44412 8869373 9116559 8480551 7482271 6726157 6335692 6145397 6085365 6233269 6639506 7146360
44402 7146360 7367644 7052485 6589685 6817814 8025017 9435454 10083736 9900660 9439057
44393 9439057 8876145 8070317 7441500 7783417 8958700 9708698 9279834 8475710 8409226
44384 8409226 8854569 8759324 8018018 7665269 8284346 9207788 9618630 9643628 9838904 10185289
$$ packed form
44449G175407M84272k46032n21615l86947L7961O34582R39231N08898j93808j25762
44439H306187Q21564J506733J172807M81927K91084L08938j20657o35247l75775
44430A1757561N22772J077214R26184O36108N59833L37605l16759j109625j645318
44421A2745575j807865j557547r32847l35939k12143l45418q9606N68780Q36383
44412H869373K47186o36008r98280p56114l90465j90295o0032J47904M06237N06854
44402G146360K21284l15159m62800K28129J207203J410437O48282j83076m61603
44393I439057n62912q05828o28817L41917J175283P49998m28864q04124o6484
44384H409226M45343r5245p41306l52749O19077R23442M10842K4998J95276L46385
$$ plain form
44374 10185289 10254736 10068504 10140026 10713406 11445756 11877091 11861908 11542888 11266006 11552281
44364 11552281 12747377 14515582 15953394 16395840 15948047 15157000 14457102 14106924 14323583
44355 14323583 15086126 15949206 16438927 16603579 16820887 17060321 16774859 15723764 14528619
44346 14528619 14021399 14199835 14250482 13627880 12709213 12172489 12027996 11649110 10708335
44337 10708335 9708560 9421587 10006223 10881916 11372345 11278108 10852248 10415078 10071331
44328 10071331 9724892 9310540 8984177 8993365 9315606 9581417 9511478 9289859 9270565 9428226
44318 9428226 9422489 9165694 8938021 8867307 8688772 8201851 7629303 7310822 7353877 7802055
44308 7802055 8760567 9995816 10757528 10498237 9595316 8910588 8791189 8973692 9305874
$$ packed form
44374A0185289O9447j86232P1522N73380P32350M31335j5183l19020k76882K86275
44364A1552281J195096J768205J437812M42446m47793p91047o99898l50178K16659
44355A4323583P62543Q63080M89721J64652K17308K39434k85462j051095j195145
44346A4528619n07220J78436N0647o22602r18667n36724j44493l78886r40775
44337A0708335r99775k86973N84636Q75693M90429r4237m25860m37170l43747
44328A0071331l46439m14352l26363R188L22241K65811o9939k21619j9294J57661
44318I428226n737k56795k27673p0714j78535m86921n72548l18481M3055M48178
44308G802055R58512J235249P61712k59291r02921o84728j19399J82503L32182
$$ plain form
44299 9305874 9940424 10786167 11355130 11331956 10872091 10229764 9538946 9072306 9196553 9836088
44289 9836088 10441821 10755342 11137208 11795302 12159082 11553706 10241764 9270689 9352292
44280 9352292 10258111 11242558 11725238 11597159 11149596 10737111 10403595 9944103 9391624
44271 9391624 9133764 9326465 9529471 9307070 8941509 9075375 9756180 10316011 10233937 9734717
44261 9734717 9436386 9677928 10299502 10919816 11346331 11731454 12267839 12798005 13032405
44252 13032405 13177676 13831587 14993971 15764485 15548235 15047410 15310013 16150210 16398763
44243 16398763 15563865 14315877 13331321 12630426 12229002 12444681 13146353 13590063 13552420
44234 13552420 13848662 15067832 16473444 16942994 16483786 15979319 15806460 15612475 15300791
$$ packed form
44299I305874O34550Q45743N68963k3174m59865o42327o90818m66640J24247O39535
44289I836088O05733L13521L81866O58094L63780o05376j311942r71075Q1603
44280I352292R05819R84447M82680j28079m47563m12485l33516m59492n52479
44271I391624k57860J92701K03006k22401l65561J33866O80805N59831q2074m99220
44261I734717k98331K41542O21574O20314M26515L85123N36385N30166K34400
44252A3032405J45271O53911J162384P70514k16250n00825K62603Q40197K48553
44243A6398763q34898j247988r84556p00895m01424K15679P01672M43710l7643
44234A3552420K96242J219170J405612M69550m59208n04467j72859j93985l11684
$$ plain form
44225 15300791 15329759 15922840 16685137 17210097 17571288 18040270 18695235 19437634 20119396
44216 20119396 20620931 21029672 21623554 22373643 22685431 22135945 21330137 21402474 22623868
44207 22623868 24076674 24832264 24924158 25009800 25607087 26881560 28651490 30261371 30879070
44198 30879070 30316747 29303393 28689137 28673780 29014614 29541728 30084377 30273099 29911120
44189 29911120 29320809 28894302 28516899 27865322 27026560 26269214 25376549 23890389 22058705
44180 22058705 20859641 20792106 21126992 20730384 19345837 17753502 16871641 16971885 17605035
44171 17605035 18022422 17761525 17028519 16441108 16280497 16165715 15635861 14839801 14347662
44162 14347662 14387254 14584197 14437961 13785360 12810634 11884351 11408729 11517733 11855055
$$ packed form
44225A5300791K8968N93081P62297N24960L61191M68982O54965P42399O81762
44216B0119396N01535M08741N93882P50089L11788n49486q05808P2337J221394
44207B2623868J452806P55590R1894Q5642N97287J274473J769930J609881O17699
44198C0879070n62323j013354o14256j5357L40834N27114N42649J88722l61979
44189B9911120n90311m26507l77403o51577q38762p57346q92665j486160j831684
44180B2058705j199064o7535L34886l96608j384547j592335q81861J00244O33150
44171A7605035M17387k60897p33006n87411j60611j14782n29854p96060m92139
44162A4347662L9592J96943j46236o52601r74726r26283m75622J09004L37322
$$ plain form
44153 11855055 11926184 11741913 11790004 12249060 12615494 12367552 11654034 10985057 10571137 10429798
44143 10429798 10847940 12056534 13495397 14116675 13617372 12781898 12335782 12042606 11354761
44134 11354761 10434255 9913381 9948133 10154723 10349243 10713825 11209514 11409069 11079862
44125 11079862 10492186 9966692 9489464 8983437 8643118 8739723 9276074 10021321 10746932
44116 10746932 11306701 11638228 11808809 11961717 12181551 12526693 13121460 13954597 14618915
44107 14618915 14608062 13950617 13213549 12774842 12461691 12070104 11837216 12098458 12777575
44098 12777575 13532880 14173063 14631493 14760372 14488610 14033091 13672309 13452174 13321137
44089 13321137 13313724 13361567 13255617 13138290 13639072 14986671 16319467 16601403 16086420
$$ packed form
44153A1855055P1129j84271M8091M59056L66434k47942p13518o68977m13920j41339
44143A0429798M18142J208594J438863O21278m99303q35474m46116k93176o87845
44134A1354761r20506n20874L4752K06590J94520L64582M95689J99555l29207
44125A1079862n87676n25494m77228n06027l40319R6605N36351P45247P25611
44116A0746932N59769L31527J70581J52908K19834L45142N94767Q33137O64318
44107A4618915j0853o57445p37068m38707l13151l91587k32888K61242O79117
44098A2777575P55305O40183M58430J28879k71762m55519l60782k20135j31037
44089A3321137p413M7843j05950j17327N00782J347599J332796K81936n14983
$$ plain form
44080 16086420 16091384 17256342 18787910 19640197 19736239 19664956 19791907 20148215 20719004 21321076
44070 21321076 21545360 21310396 21157782 21487748 21795615 21273250 19994714 18873156 18511351
44061 18511351 18748702 19378371 20580507 22341866 24035941 25049433 25482449 25809388 26124487
44052 26124487 26179839 25987872 25874757 25937883 25897052 25611555 25417174 25769044 26744660 28028128
44042 28028128 29219048 30048490 30450811 30546275 30458230 30142397 29622973 29425998 30365307
44033 30365307 32578320 35059795 36613267 37179740 37800643 39301049 41492578 43760832
44025 43760832 45894186 47989384 49930183 51465721 52709640 54146292 56059739 58179274
44017 58179274 59987378 61310663 62580657 64484696 67277557 70506304 73621463 76785839
$$ packed form
44080A6086420M964J164958J531568Q52287R6042p1283J26951L56308N70789O02072
44070B1321076K24284k34964j52614L29966L07867n22365j278536j121558l61805
44061A8511351K37351O29669J202136J761359J694075J013492M33016L26939L15099
44052B6124487N5352j91967j13115O3126m0831k85497j94381L51870R75616J283468
44042B8028128J190920Q29442M02321R5464q8045l15833n19424j96975R39309
44033C0365307K213013K481475J553472N66473O20903J500406K191529K268254
44025D3760832K133354K095198J940799J535538J243919J436652J913447K119535
44017E8179274J808104J323285J269994J904039K792861L228747L115159L164376
$$ plain form
44009 76785839 80709653 85677863 91252641 97095103 103453403 110438985 117469916 124149503
44001 124149503 131254622 139996058 150529043 162070233 174348816 187943182 203117393
43994 203117393 219385419 236571128 255347060 276208684 298709067 322219238 346579300
43987 346579300 371243431 394519392 414601851 430884886 443338476 451010141 452261483
43980 452261483 446480322 434716717 418632922 399579311 378641559 356704423 334250095
43973 334250095 311693588 289957296 270045924 252017437 235100335 218914732 203851394
43966 203851394 190203948 177843648 166983767 158298121 151801748 146436008 141330828
43959 141330828 136796121 133549102 131696188 131078679 131844338 133870918 136287092 138484043
$$ packed form
44009G6785839L923814M968210N574778N842462O358300O985582P030931O679587
44001A24149503P105119Q741436J0532985J1541190J2278583J3594366J5174211
43994B03117393J6268026J7185709J8775932K0861624K2500383K3510171K4360062
43987C46579300K4664131K3275961K0082459J6283035J2453590P671665J251342
43980D52261483n781161j1763605j6083795j9053611k0937752k1937136k2454328
43973C34250095k2556507k1736292j9911372j8028487j6917102j6185603j5063338
43966B03851394j3647446j2360300j0859881q685646o496373n365740n105180
43959A41330828m534707l247019j852914o17509P65659K026580K416174K196951
$$ plain form
43951 138484043 141066513 144818906 149176999 152822536 155521329 158246417 161602081 165241016
43943 165241016 168788190 172114210 174534837 175003556 173556081 171482495 169514230 166826753
43935 166826753 162464238 156772736 150595303 143900397 136208747 127736468 119039335 109992303
43927 109992303 100289286 90730757 82812277 76914245 71875527 66583804 61164763 56333928
43919 56333928 52321545 48820164 45466327 42081239 38872541 36530500 35546770 35250220
43911 35250220 34186370 31812134 29212870 27689853 27171538 26549349 25123256 23102929
43903 23102929 21026084 19350930 18428564 18212477 18036306 17255027 16123292 15513451 15703363
43894 15703363 15963818 15527456 14543868 13816060 13862994 14491175 15144013 15468037 15550714 15672875
$$ packed form
43951A38484043K582470L752393M358093L645537K698793K725088L355664L638935
43943A65241016L547174L326020K420627M68719j447475k073586j968265k687477
43935A66826753m362515n691502o177433o694906p691650q472279q697133r047032
43927A09992303r703017r558529p918480n898032n038718n291723n419041m830835
43919E6333928m012383l501381l353837l385088l208698k342041r83730k96550
43911C5250220j063850k374236k599264j523017n18315o22189j426093k020327
43903B3102929k076845j675154r22366k16087j76171p81279j131735o09841J89912
43894A5703363K60455m36362r83588p27808M6934O28181O52838L24024Q2677J22161
$$ plain form
43884 15672875 15875412 15900644 15605679 15183996 14790635 14244670 13449406 12815157 12723448 12746456
43874 12746456 12089437 10834650 10000379 10118095 10474680 10242144 9743513 9896798 10763935
43865 10763935 11434869 11282510 10647031 10187529 10147537 10462451 11075740 11803511 12234805
43856 12234805 12162513 11942668 12087986 12610082 13096665 13391008 13804772 14533696 15190178
43847 15190178 15181152 14380304 13184442 12072404 11427378 11629334 12780630 14250674 15047299
43838 15047299 14947250 14805597 15368084 16256348 16681272 16685581 16834871 16960085 16301294 15006329
43828 15006329 14387474 15227481 16748220 17885398 18780252 20204309 22160692 24032562
43820 24032562 25714059 27567279 29417744 30565012 30803505 30571542 30040646 28946963
$$ packed form
43884A5672875K02537K5232k94965m21683l93361n45965p95264o34249r1709K3008
43874A2746456o57019j254787q34271J17716L56585k32536m98631J53285Q67137
43865A0763935O70934j52359o35479m59502l9992L14914O13289P27771M31294
43856A2234805p2292k19845J45318N22096M86583K94343M13764P28924O56482
43847A5190178r026q00848j195862j112038o45026K01956J151296J470044P96625
43838A5047299j00049j41653N62487Q88264M24924M309J49290J25214o58791j294965
43828A5006329o18855Q40007J520739J137178Q94854J424057J956383J871870
43820B4032562J681497J853220J850465J147268K38493k31963n30896j093683
$$ plain form
43812 28946963 27501892 26565094 26501516 26595211 26109568 25391658 25410816 26580769 28480052
43803 28480052 30438114 32035687 33306433 34742818 36798343 39138344 40810795 41515749
43795 41515749 42247365 44149715 47090656 50016166 52535500 55443939 59586716 64791099
43787 64791099 70207314 75373701 80643211 86663501 93629983 101068343 108283046 114923513
43779 114923513 120999141 126395307 130643511 133308340 134423368 134387902 133555934 132042176
43771 132042176 129802078 126797006 123182681 119346024 115579304 111762387 107669995 103544824
43763 103544824 99880764 96547474 92713199 87932742 82781050 78009014 73580485 69070731
43755 69070731 64568831 60517699 56934326 53451164 49967668 46655386 43470941 40288106
$$ packed form
43812B8946963j445071r36798o3578R3695m85643p17910J9158J169953J899283
43803B8480052J958062J597573J270746J436385K055525K340001J672451P04954
43795D1515749P31616J902350K940941K925510K519334K908439M142777N204383
43787F4791099N416215N166387N269510O020290O966482P438360P214703O640467
43779A14923513O075628N396166M248204K664829J115028l5466q31968j513758
43771A32042176k240098l005072l614325l836657l766720l816917m092392m125171
43763A03544824l664060l333290l834275m780457n151692m772036m428529m509754
43755F9070731m501900m051132l583373l483162l483496l312282l184445l182835
$$ plain form
43747 40288106 37391510 35181823 33446928 31576553 29470743 27565131 25971734 24358230
43739 24358230 22776233 21795187 21535083 21302981 20576670 19710823 19225245 18950763 18381247
43730 18381247 17442505 16437282 15563917 14871196 14338740 13675898 12478669 10947025 9922204
43721 9922204 9731071 9552514 8585755 7330124 6849343 7134384 7220706 6805573 6632888
43712 6632888 7074592 7402541 7009413 6507269 6851242 7900009 8662121 8718816 8603526
43703 8603526 8760263 8832112 8254678 7120327 6137558 5932579 6568745 7557856 8185206
43694 8185206 8040516 7449515 7208408 7646620 8125329 7803347 6784374 6055955 6266403
43685 6266403 7055921 7762808 8245140 8601987 8552164 7736799 6452676 5462270 5106123
$$ packed form
43747D0288106k896596k209687j734895j870375k105810j905612j593397j613504
43739B4358230j581997r81046k60104k32102p26311q65847m85578k74482n69516
43730A8381247r38742j005223q73365o92721n32456o62842j197229j531644j024821
43721I922204j91133j78557r66759j255631m80781K85041Q6322m15133j72685
43712F632888M41704L27949l93128n02144L43973J048767P62112N6695j15290
43703H603526J56737P1849n77434j134351r82769k04979O36166R89111O27350
43694H185206j44690n91001k41107M38212M78709l21982j018973p28419K10448
43685F266403P89518P06887M82332L56847m9823q15365j284123r90406l56147
$$ plain form
43676 5106123 5132302 5347950 5824246 6434133 6876028 7303939 8206631 9381913 9816294
43667 9816294 9103105 8269570 8457533 9315975 9567410 8826290 7913224 7510308 7500602 7739308
43657 7739308 8485790 9647602 10378828 10049201 9144818 8621621 8675335 8739060 8542733 8555792
43647 8555792 9250599 10366849 11209001 11503789 11648090 12039554 12409829 12131736 11181711
43638 11181711 10427120 10723798 12003693 13583405 15108612 16665657 18072761 18754024
43630 18754024 18556427 18172898 18392493 19272685 20382094 21525051 22799436 24184656 25589944
43621 25589944 27233820 29447467 31988075 34000122 34959245 35419573 36506729 38736237
43613 38736237 41592543 44278640 46598576 48914944 51400380 53647621 55111997 55751613
$$ packed form
43676E106123K6179K15648M76296O09887M41895M27911R02692J175282M34381
43667I816294p13189q33535J87963Q58442K51435p41120r13066m02916r706K38706
43657G739308P46482J161812P31226l29627r04383n23197N3714O3725j96327J3059
43647H555792O94807J116250Q42152K94788J44301L91464L70275k78093r50025
43638A1181711p54591K96678J279895J579712J525207J557045J407104O81263
43630A8754024j97597l83529K19595Q80192J109409J142957J274385J385220J405288
43621B5589944J643876K213647K540608K012047R59123M60328J087156K229508
43613C8736237K856306K686097K319936K316368K485436K247241J464376O39616
$$ plain form
43605 55751613 56066460 56558685 57251139 57698056 57418317 56379024 55063802 53946191 52919397
43596 52919397 51495579 49588199 47675174 45970431 43936838 41146175 38250241 36332867
43588 36332867 35381866 34206812 32028465 29392849 27181815 25454253 23852376 22578561
43580 22578561 22142946 22349294 22328583 21666791 20867216 20446800 20058474 18941447 17073251
43571 17073251 15457269 15112955 15942579 16827543 16871009 16286052 15854962 15794805 15647425
43562 15647425 15199796 14847225 14822673 14690828 14068341 13371541 13269266 13718535 14166254
43553 14166254 14475760 14948727 15507542 15604658 15085795 14512758 14393763 14610703 14853433
43544 14853433 15121242 15466963 15671173 15559304 15327133 15180795 14934706 14379208 13840756
$$ packed form
43605E5751613L14847M92225O92454M46917k79739j039293j315222j117611j026794
43596E2919397j423818j907380j913025j704743k033593k790663k895934j917374
43588C6332867r51001j175054k178347k635616k211034j727562j601877j273815
43580B2578561m35615K06348k0711o61792p99575m20416l88326j117027j868196
43571A7073251j615982l44314Q29624Q84964M3466n84957m31090o0157j47380
43562A5647425m47629l52571k4552j31845o22487o96800j02275M49269M47719
43553A4166254L09506M72967N58815R7116n18863n73037j18995K16940K42730
43544A4853433K67809L45721K04210j11869k32171j46338k46089n55498n38452
$$ plain form
43535 13840756 13915713 14689565 15591077 16055826 16071300 16014899 16124469 16183101 15716912 14633281
43525 14633281 13679230 13925434 15538401 17368866 18173626 18048989 18155262 19125375 20358389
43516 20358389 20981676 20877762 20438900 19870226 19295318 19200498 20062249 21537136 22617492
43507 22617492 22771320 22493251 22520561 22928883 23357110 23795898 24619982 25884148 27069820
43498 27069820 27698168 27889324 28106086 28542556 28999959 29284050 29523167 30076714 31213095
43489 31213095 32863912 34667536 36333116 37983322 39973378 42280628 44301868 45518295
43481 45518295 46238961 47357121 49366332 51924812 54458426 56876432 59517092 62641760
43473 62641760 66218650 70038574 73833247 77462946 81250288 85936946 91915954 98595030
$$ packed form
43535A3840756P4957P73852R01512M64749J5474n6401J09570N8632m66189j083631
43525A4633281r54051K46204J612967J830465Q04760j24637J06273R70113J233014
43516B0358389O23287j03914m38862n68674n74908r4820Q61751J474887J080356
43507B2617492J53828k78069K7310M08322M28227M38788Q24084J264166J185672
43498B7069820O28348J91156K16762M36470M57403K84091K39117N53547J136381
43489C1213095J650817J803624J665580J650206J990056K307250K021240J216427
43481D5518295P20666J118160K009211K558480K533614K418006K640660L124668
43473F2641760L576890L819924L794673L629699L787342M686658N979008O679076
$$ plain form
43465 98595030 105010573 111163747 118241624 127201242 137523835 147843750 157622541 167688110
43457 167688110 179114615 192033886 205683038 219206476 232130880 244323309 255814034
43450 255814034 266542870 276002601 283192383 287176031 287705322 285162499 279983546 272368501
43442 272368501 262507996 250785700 237645603 223463720 208692276 193999317 180096804
43435 180096804 167413055 155941594 145357689 135301878 125676778 116727018 108771108
43428 108771108 101837905 95616901 89730164 83957544 78251504 72717680 67628602 63317589
43420 63317589 59957552 57425798 55305947 52981810 49956243 46356382 43014048 40708501
43412 40708501 39354105 38260617 37116746 36205038 35586263 34737436 33394935 32220558
$$ packed form
43465I8595030O415543O153174P077877Q959618J0322593J0319915R778791J0065569
43457A67688110J1426505J2919271J3649152J3523438J2924404J2192429J1490725
43450B55814034J0728836R459731P189782L983648N29291k542823n178953p615045
43442B72368501r860505j1722296j3140097j4181883j4771444j4692959j3902513
43435A80096804j2683749j1471461j0583905j0055811r625100q949760p955910
43428A08771108o933203o221004n886737n772620n706040n533824n089078m311013
43420F3317589l360037k531754k119851k324137l025567l599861l342334k305547
43412D0708501j354396j093488j143871r11708o18775q48827j342501j174377
$$ plain form
43404 32220558 32005907 32481720 32571098 31783559 30771373 30385143 30662906 31005745 31034958
43395 31034958 30952632 31130227 31565396 31849216 31675883 31288427 31236391 31694570 32303409 32773642
43385 32773642 33264391 33909172 34399913 34530514 34818735 35905351 37454989 38409474 38461962
43376 38461962 38582298 39746925 41699753 43438337 44581723 45746125 47647681 50197018
43368 50197018 52557071 53990952 54619641 55244672 56292562 57137226 56839950 55417060 53802309
43359 53802309 52531966 51166391 49289610 47390808 46195408 45585759 44820961 43568045
43351 43568045 42124150 40782146 39566543 38558298 37932670 37563824 36962820 35723081
43343 35723081 33831201 31585698 29433337 27758487 26528762 25259718 23655267 22157207
$$ packed form
43404C2220558k14651M75813Q9378p87539j012186l86230K77763L42839K9213
43395C1034958q2326J77595M35169K83820j73333l87456n2036M58179O08839M70233
43385C2773642M90749O44781M90741J30601K88221J086616J549638R54485N2488
43376C8461962J20336J164627J952828J738584J143386J164402J901556K549337
43368E0197018K360053J433881O28689O25031J047890Q44664k97276j422890j614751
43359E3802309j270343j365575j876781j898802j195400o09649p64798j252916
43351D3568045j443895j342004j215603j008245o25628l68846o01004j239739
43343C5723081j891880k245503k152361j674850j229725j269044j604451j498060
$$ plain form
43335 22157207 21473224 21643564 21982604 21899502 21376399 20694719 20152295 20036710 20365462
43326 20365462 20593514 20117792 19214483 18919375 19720090 20895917 21521301 21632125 21880281
43317 21880281 22415239 22800469 22936283 23355477 24363976 25368401 25475985 24618558 23730687
43308 23730687 23743539 24603082 25430238 25544194 25097019 24676654 24575478 24687126 24945840
43299 24945840 25523812 26588174 28109843 29926374 31812370 33588234 35453722 38101638
43291 38101638 42048213 46833066 51382764 55301581 59296467 64106991 69558739 75016752
43283 75016752 80171951 84755594 87932685 88854155 87752486 85735257 83387237 80233707
43275 80233707 75782334 70460809 65133689 60138627 55239314 50252098 45318038 40736645
$$ packed form
43335B2157207o83983J70340L39040q3102n23103o81680n42424j15585L28752
43326B0365462K28052m75722r03309k95108Q00715J175827O25384J10824K48156
43317B1880281N34958L85230J35814M19194J008499J004425J07584q57427q87871
43308B3730687J2852Q59543Q27156J13956m47175m20365j01176J11648K58714
43299B4945840N77972J064362J521669J816531J885996J775864J865488K647916
43291C8101638L946575M784853M549698L918817L994886M810524N451748N458013
43283G5016752N155199M583643L177091R21470j101669k017229k348020l153530
43275H0233707m451373n321525n327120m995062m899313m987216m934060m581393
$$ plain form
43267 40736645 36857310 33933371 31720919 29418789 26479608 23405328 21221541 20113370
43259 20113370 19153455 17644761 16186959 15850399 16573567 17061612 16316853 14676605 13117343
43250 13117343 12070333 11356325 10896309 10847666 11096445 11190748 10934707 10637364 10571488 10529122
43240 10529122 10183745 9637905 9284274 9244976 9253325 9066145 8732023 8396853 8047203 7593715
43230 7593715 7141081 6994330 7264875 7538709 7208496 6287437 5636448 6047282 7250282
43221 7250282 8259696 8632738 8842756 9326436 9779520 9700052 9096532 8249427 7242925
43212 7242925 6220985 5668128 5826282 6172230 6140340 6078511 6714657 7860059 8539344
43203 8539344 8434335 8301847 8750068 9439277 9837362 9992958 10095379 9950175 9451287
$$ packed form
43267D0736645l879335k923939k212452k302130k939181l074280k183787j108171
43259B0113370r59915j508694j457802l36560P23168M88045p44759j640248j559262
43250A3117343j047010p14008m60016m8643K48779R4303k56041k97343o5876m2366
43240A0529122l45377n45840l53631l9298Q349j87180l34122l35170l49650m53488
43230G593715m52634j46751K70545K73834l30213r21059o50989M10834J203000
43221G250282J009414L73042K10018M83680M53084p9468o03520q47105j006502
43212G242925j021940n52857J58154L45948l1890o1829O36146J145402O79285
43203H539344j05009j32488M48221O89209L98085J55596J02421j45204m98888
$$ plain form
43194 9451287 9014179 8952294 8902177 8476491 8050674 8209203 8723489 8790019 8109996 7109230
43184 7109230 6247741 5711945 5620538 5894429 6053170 5790259 5615305 6203948 7222105
43175 7222105 7644433 7250514 6867332 6952808 6951422 6488036 6223318 6790451 7626651 7731606
43165 7731606 7096927 6514533 6305578 6132208 5893005 5900315 6143557 6196257 6009950 6069118
43155 6069118 6511286 6766253 6445094 6030858 6203907 6864723 7335958 7312722 7125688 7147823
43145 7147823 7380129 7663079 7938288 8159517 8188896 7988675 7818109 8031746 8642639 9241991
43135 9241991 9491748 9598808 10051572 10875761 11500549 11575269 11581771 12216087 13373530 14301313
43125 14301313 14706429 15061225 15645235 15963531 15557704 14841617 14482617 14299919 13560508
$$ packed form
43194I451287m37108o1885n0117m25686m25817J58529N14286O6530o80023j000766
43184G109230q61489n35796r1407K73891J58741k62911j74954N88643J018157
43175G222105M22328l93919l83182Q5476j386m63386k64718N67133Q36200J04955
43165G731606o34679n82394k08955j73370k39203P310K43242N2700j86307N9168
43155F069118M42168K54967l21159m14236J73049O60816M71235k3236j87034K2135
43145G147823K32306K82950K75209K21229K9379k00221j70566K13637O10893N99352
43135I241991K49757J07060M52764Q24189O24788P4720O502O34316J157443R27783
43125A4301313M05116L54796N84010L18296m05827p16087l59000j82698p39411
$$ plain form
43116 13560508 12290500 11476048 11723529 12382840 12432960 11783190 11192438 11193542 11668848 12388720
43106 12388720 13363751 14480293 15218931 15071374 14085841 12791540 11711151 11124147 11135763
43097 11135763 11644190 12215396 12280703 11640314 10675065 9954360 9708512 9755785 9829744 9830314
43087 9830314 9796871 9781077 9778720 9731535 9611571 9545689 9781927 10425602 11255851 11922290
43077 11922290 12288867 12464919 12555906 12565748 12533504 12566646 12700980 12897492 13195129 13660741
43067 13660741 14163499 14469187 14641358 15027026 15659023 16015475 15711480 15166399 15135351
43058 15135351 15707203 16248250 16320796 16152193 16078129 16009450 15719387 15286598 14926904 14654054
43048 14654054 14429029 14409247 14687571 14969793 14911493 14642899 14516152 14417827 13886238 12992599
$$ packed form
43116A3560508j270008q14452K47481O59311N0120o49770n90752J104M75306P19872
43106A2388720R75031J116542P38638j47557r85533j294301j080389n87004J1616
43097A1135763N08427N71206O5307o40389r65249p20705k45848M7273P3959N70
43087I830314l3443j5794k357m7185j19964o5882K36238O43675Q30249O66439
43077A1922290L66577J76052R0987R842l2244L3142J34334J96512K97637M65612
43067A3660741N02758L05688J72171L85668O31997L56452l03995n45081l1048
43058A5135351N71852N41047P2546j68603p4064o8679k90063m32789l59694k72850
43048A4654054k25025j9782K78324K82222n8300k68594j26747r8325n31589q93639
$$ plain form
43038 12992599 12514187 12913977 13614916 13733360 13192611 12570115 12070304 11349884 10418622
43029 10418622 10007089 10637394 11771347 12390058 12216138 11864485 11820362 11757162 11055372
43020 11055372 9687349 8309155 7564842 7501436 7692378 7822064 8026010 8580274 9333230
43011 9333230 9699090 9353496 8703239 8371940 8362643 8129378 7469882 6903316 7007020 7753908
43001 7753908 8722165 9602561 10200474 10276185 9815852 9245458 8905388 8442082 7247607
42992 7247607 5505691 4257763 4247197 5118456 5982915 6398895 6497871 6469051 6343372 6172909
42982 6172909 6068026 6056285 6128532 6383348 6891895 7427834 7564333 7110248 6308899 5548139
42972 5548139 4975363 4448776 3803378 3118547 2715385 2841371 3332582 3683031 3544664
$$ packed form
43038A2992599m78412L99790P00939J18444n40749o22496m99811p20420r31262
43029A0418622m11533O30305J133953O18711j73920l51653m4123o3200p01790
43020A1055372j368023j378194p44313o3406J90942J29686K03946N54264P52956
43011I333230L65860l45594o50257l31299r297k33265o59496n66566J03704P46888
43001G753908R68257Q80396N97913P5711m60333n70394l40070m63306j194475
42992G247607j741916j247928j0566Q71259Q64459M15980R8976k8820j25679j70463
42982F172909j04883j1741P2247K54816N08547N35939J36499m54085q01349p60760
42972E548139n72776n26587o45398o84831m03162J25986M91211L50449j38367
$$ plain form
42963 3544664 3101350 2846193 3026849 3407888 3559350 3310615 2960056 3089103 4064335
42954 4064335 5591249 6827832 7099304 6495711 5670321 5131585 4910784 4858862 4969067
42945 4969067 5268819 5574486 5558511 5051406 4187134 3257408 2487532 1980894 1849754 2280026
42935 2280026 3289176 4403191 4849605 4331618 3472612 3173476 3586582 4094420 4300466
42926 4300466 4535174 5153695 5822299 5979686 5713649 5605655 5797289 5790434 5252236 4489645
42916 4489645 3927045 3586695 3388638 3541988 4185573 4893544 5035066 4567129 4082546
42907 4082546 4081051 4490448 4849082 4655125 3656488 2231219 1421268 2033261 3588140
42898 3588140 4696827 4694415 4366529 4728222 5645471 6223403 6136972 5863577 5796803 5867853
$$ packed form
42963C544664m43314k55157J80656L81039J51462k48735l50559J29047R75232
42954D064335J526914J236583K71472o03593q25390n38736k20801n1922J10205
42945D969067K99752L05667j5975n07105q64272r29726p69876n06638j31140M30272
42935B280026J009150J114015M46414n17987q59006k99136M13106N07838K06046
42926D300466K34708O18521O68604J57387k66037j07994J91634o855n38198p62591
42916D489645n62600l40350j98057J53350O43585P07971J41522m67937m84583
42907D082546j495M09397L58634j93957r98637j425269q09951O11993J554879
42898C588140J108687k412l27886L61693R17249N77932q6431k73395o6774P1050
$$ plain form
42888 5867853 6032766 6422625 6848878 6767761 5992791 4973512 4168852 3650737 3546204
42879 3546204 4231684 5612609 6743976 6817375 6200159 5838927 5880459 5646767 4898671
42870 4898671 4272496 4238419 4358666 4017907 3369322 3040075 3226925 3603637 3948473 4368276
42860 4368276 4933328 5495715 5913471 6165390 6238494 6183607 6269610 6737379 7333716 7450696
42850 7450696 6912274 6327600 6415264 7204452 8193811 9111356 10113745 11243213 12078024
42841 12078024 12116192 11344469 10309544 9725311 10022408 11079756 12288460 13024523 13170481
42832 13170481 13088177 13087366 13151522 13233013 13462972 13833955 14005795 13822086 13777267 14425115
42822 14425115 15378114 15507403 14339822 12757251 11969541 12165410 12590946 12673297 12509762
$$ packed form
42888E867853J64913L89859M26253q1117p74970j019279q04660n18115j04533
42879C546204O85480J380925J131367P3399o17216l61232M1532k33692p48096
42870D898671o26175l4077J20247l40759o48585l29247J86850L76712L44836M19803
42860D368276N65052N62387M17756K51919P3104n4887Q6003M67769N96337J16980
42850G450696n38422n84674Q7664P89188R89359R17545J002389J129468Q34811
42841A2078024L8168p71723j034925n84233K97097J057348J208704P36063J45958
42832A3170481q2304q11O4156Q1491K29959L70983J71840j83709m4819O47848
42822A4425115R52999J29289j167581j582571p87710J95869M25536Q2351j63535
$$ plain form
42813 12509762 12301474 11888121 11106870 10269661 9917043 10165792 10559294 10604951 10305922
42804 10305922 10101654 10392556 11197423 12171897 12821599 12759146 11968748 10879016 10000265
42795 10000265 9400452 8708046 7726435 6806945 6412530 6535095 6819602 7058280 7215700
42786 7215700 7171820 6923499 6924959 7647048 8773410 9435603 9373962 9236481 9489048 9710385
42776 9710385 9413738 8950630 8954389 9318811 9448307 9261913 9211145 9395496 9361545 8839725
42766 8839725 8110866 7560009 7355852 7607409 8291321 8909076 8769783 7856936 6973023
42757 6973023 6762073 6971225 6960345 6580336 6162861 5870877 5509708 5003679 4736266 5195701
42747 5195701 6296616 7222082 7167760 6300421 5735763 6373238 7946387 9436400 10167247
$$ packed form
42813A2509762k08288m13353p81251q37209l52618K48749L93502M5657k99029
42804A0305922k04268K90902Q04867R74474O49702o2453p90398j089732q78751
42795A0000265n99813o92406r81611r19490l94415J22565K84507K38678J57420
42786G215700m3880k48321J460P22089J126362O62193o1641j37481K52567K21337
42776I710385k96647m63108L759L64422J29496j86394n0768J84351l3951n21820
42766H839725p28859n50857k04157K51557O83912O17755j39293r12847q83913
42757F973023k10950K09152j0880l80009m17475k91984l61169n06029k67413M59435
42747E195701J100915R25466n4322q67339n64658O37475J573149J490013P30847
$$ plain form
42738 10167247 10166672 9726651 9133213 8722124 8654643 8606525 8126798 7316525 6725175 6620183
42728 6620183 6853523 7375751 8231685 9011750 9050044 8388603 7866146 7970491 8279400 8374041
42718 8374041 8553444 9099328 9524812 9313873 8930027 9244596 10190363 10777968 10408867
42709 10408867 9493890 8713363 8266034 8043662 8095413 8583038 9385586 9955504 9716920
42700 9716920 8726251 7798850 7631177 7853541 7479883 6355303 5441205 5357753 5429562 4788640
42690 4788640 3737217 3173914 3170819 3107073 2933473 3249627 4147678 4963305 5319112 5521193
42680 5521193 5669027 5227228 3935721 2501355 1866347 2185886 2913128 3528949 3822594
42671 3822594 3779236 3599104 3653579 4100078 4627476 4780945 4450129 3907616 3470273 3249153
$$ packed form
42738A0167247n75m40021n93438m11089o7481m8118m79727q10273n91350j04992
42728F620183K33340N22228Q55934P80065L8294o61441n22457J04345L08909R4641
42718H374041J79403N45884M25484k10939l83846L14569R45767N87605l69101
42709A0408867r14977p80527m47329k22372N1751M87625Q02548N69918k38584
42700I716920r90669r27401j67673K22364l73658j124580r14098q3452P1809o40922
42690D788640j051423n63303l095o3746j73600L16154Q98051Q15627L55807K02081
42680E521193J47834m41799j291507j434366o35008L19539P27242O15821K93645
42671C822594m3358j80132N4475M46499N27398J53469l30816n42513m37343k21120
$$ plain form
42661 3249153 3202639 3369718 3946912 4945166 5816178 5855782 5173719 4764413 5220737 5901689
42651 5901689 5986702 5846276 6459080 7750848 8560566 8257281 7396110 6630768 5945286
42642 5945286 5237585 4756505 4590315 4516555 4655236 5374071 6199587 5897407 4267046
42633 4267046 2813238 2739089 3187871 2608905 1165869 438752 1058447 2015191 2395549
42624 2395549 2595903 3397521 4685992 5618826 5639919 4992903 4457769 4665028 5439742
42615 5439742 5894516 5450743 4568541 4071078 4029344 3921202 3682507 3804624 4365599 4767634
42605 4767634 4677470 4540343 4803270 5202557 5281695 5197078 5483242 6220634 6921450 7241480
42595 7241480 7457483 8094727 9208532 10193772 10395795 9869422 9342906 9347759 9615370 9542666
$$ packed form
42661C249153m6514J67079N77194R98254Q71012L9604o82063m09306M56324O80952
42651E901689Q5013j40426O12804J291768Q09718l03285q61171p65342o85482
42642E945286p07701m81080j66190p3760J38681P18835Q25516l02180j630361
42633D267046j453808p4149M48782n78966j443036p27117O19695R56744L80358
42624B395549K00354Q01618J288471R32834K1093o47016n35134K07259P74714
42615E439742M54774m43773q82202m97463m1734j08142k38695J22117N60975M02035
42605D767634r0164j37127K62927L99287P9138q4617K86164P37392P00816L20030
42595G241480K16003O37244J113805R85240K02023n26373n26516M853K67611p2704
$$ plain form
42585 9542666 9039763 8591294 8590778 8955635 9376647 9662077 9838554 10133649 10806919 11785048
42575 11785048 12571265 12774741 12620413 12653291 13053156 13556463 13958742 14363018 14992538
42566 14992538 16042032 17601142 19416833 20873955 21571174 21808964 22185751 22882852 23692792
42557 23692792 24483434 25141399 25297175 24708318 23771951 23061332 22495207 21596472 20404697
42548 20404697 19386081 18567250 17616086 16723325 16418772 16436862 15857873 14659657 14012502
42539 14012502 14533758 15323642 15427396 15252573 15634880 16361436 16725009 16935549 17783490
42530 17783490 19198546 20259706 20560544 20628171 21025916 21906508 23442397 25815616 28638677
42521 28638677 31131458 33044639 34786904 36560484 38059249 39139634 40032462 40626918
$$ packed form
42585I542666n02903m48469n16L64857M21012K85430J76477K95095O73270R78129
42575A1785048P86217K03476j54328L2878L99865N03307M02279M04276O29520
42566A4992538J049494J559110J815691J457122O97219K37790L76787O97101Q09940
42557B3692792P90642O57965J55776n88857r36367p10619n66125q98735j191775
42548B0404697j018616q18831r51164q92761l04553J8090n78989j198216o47155
42539A4012502N21256P89884J03754j74823L82307P26556L63573K10540Q47941
42530A7783490J415056J061160L00838O7627L97745Q80592J535889K373219K823061
42521B8638677K492781J913181J742265J773580J498765J080385Q92828N94456
$$ plain form
42513 40626918 40290098 38852832 37174169 36144793 35516253 34328496 32319961 30319240
42505 30319240 29159785 28642423 27848902 26322940 24614185 23512024 22966667 22172588 20769900
42496 20769900 19490418 19263246 19990547 20651776 20448720 19428390 18132379 17109944 16692930
42487 16692930 16754394 16685436 16031630 15110316 14560886 14389801 14034272 13328464 12724967 12466829
42477 12466829 12258916 11993897 12080850 12639464 12993054 12508085 11489151 10696016 10313671
42468 10313671 9924963 9228044 8264030 7141398 6026276 5254818 5018917 5086610 5215549
42459 5215549 5596992 6392401 7068082 6866646 5923874 5279415 5652493 6743588 7896560
42450 7896560 8893589 9801171 10511216 10890772 11151890 11672457 12533688 13496882 14332190
$$ packed form
42513D0626918l36820j437266j678663j029376o28540j187757k008535k000721
42505C0319240j159455n17362p93521j525962j708755j102161n45357p94079j402688
42496B0769900j279482k27172P27301O61229k03056j020330j296011j022435m17014
42487A6692930O1464o8958o53806r21314n49430j71085l55529p05808o03497k58138
42477A2466829k07913k65019Q6953N58614L53590m84969j018934p93135l82345
42468A0313671l88708o96919r64014j122632j115122p71458k35901O7693J28939
42459E215549L81443P95409O75681k01436r42772o44459L73078J091095J152972
42450G896560R97029R07582P10045L79556K61118N20567Q61231R63194Q35308
$$ plain form
42441 14332190 14904629 15014326 14483066 13511386 12746684 12772035 13483572 14090818 13888371
42432 13888371 13048355 12482109 12810898 13662692 14213219 14249652 14310175 14802804 15463609 15873718
42422 15873718 16094867 16438731 16872800 17069171 16931080 16686830 16480835 16210746 15801341
42413 15801341 15335892 14849869 14263225 13587323 12930043 12219239 11238028 10088407 9289921
42404 9289921 9143859 9249041 8971217 8214081 7387209 6766430 6304566 6022217 6134450
42395 6134450 6699651 7502440 8380701 9317803 10109414 10358879 10029445 9609381 9404337
42386 9404337 9010576 7922936 6415678 5290794 4832705 4554105 4075854 3773422 4256728
42377 4256728 5477891 6681277 7180067 6954329 6439807 5885902 5107911 3912615 2560889
$$ packed form
42441A4332190N72439J09697n31260r71680p64702K5351P11537O07246k02447
42432A3888371q40016n66246L28789Q51794N50527L6433O0523M92629O60805M10109
42422A5873718K21149L43864M34069J96371j38091k44250k05995k70089m09405
42413A5801341m65449m86023n86644o75902o57280p10804r81211j149621p98486
42404I289921j46062J05182k77824p57136q26872o20779m61864k82349J12233
42395F134450N65201Q02789Q78261R37102P91611K49465l29434m20064k05044
42386I404337l93761j087640j507258j124884m58089k78600m78251l02432M83306
42377D256728J221163J203386M98790k25738n14522n53905p77991j195296j351726
$$ plain form
42368 2560889 1549709 1032887 847396 1126129 2319551 4302593 5986966 6378833 5704655
42359 5704655 4932073 4497819 4215344 4167783 4720359 5595366 5911174 5456446 5072105 5341409
42349 5341409 5717366 5528287 5087578 5035598 5196794 5010043 4677633 4876025 5491531 5628952
42339 5628952 4915419 3910529 3096815 2347591 1682141 1679914 2580904 3602843 3835390
42330 3835390 3460121 3419675 4024568 4521804 4143616 3107876 2300577 2193458 2404360
42321 2404360 2356184 2095510 2192743 2920523 3905339 4696038 5274996 5735523 5857392 5468196
42311 5468196 4923996 4665048 4523641 4137231 3869285 4461253 5728480 6523459 6265871
42302 6265871 5624177 5258449 4800936 3777680 2749085 2594215 3173198 3679407 3991894
$$ packed form
42368B560889j011180n16822j85491K78733J193422J983042J684373L91867o74178
42359E704655p72582m34254k82475m7561N52576Q75007L15808m54728l84341K69304
42349E341409L75957j89079m40709n1980J61196j86751l32410J98392O15506J37421
42339E628952p13533j004890q13714p49224o65450k227R00990J021939K32547
42330C835390l75269m0446O04893M97236l78188j035740q07299j07119K10902
42321B404360m8176k60674R7233P27780R84816P90699N78958M60527J21869l89196
42311E468196n44200k58948j41407l86410k67946N91968J267227P94979k57588
42302F265871o41694l65728m57513j023256j028595j54870N78983N06209L12487
$$ plain form
42293 3991894 4665135 5720720 6469400 6596364 6505774 6444664 6178513 5782044 5855403 6522370
42283 6522370 6996287 6684949 6065577 5861024 5941145 5751445 5340362 5115321 4879874 4054172
42273 4054172 2838293 2267934 2858787 3882023 4346059 4168248 3945934 3967533 3981904
42264 3981904 3789545 3573029 3586644 3831674 4138164 4377342 4513961 4592701 4749278 5121813
42254 5121813 5680738 6257696 6820516 7563934 8547271 9376882 9575343 9275872 9153181
42245 9153181 9469713 9591592 8866903 7682194 7020257 7041569 6834241 5795745 4590750
42236 4590750 4264028 4898588 5743637 6318667 6679995 6744741 6139603 4891273 3660216
42227 3660216 2995394 2780072 2689487 2800202 3357709 4174924 4675176 4519610 3960986 3579087
$$ packed form
42293C991894O73241J055585P48680J26964r0590o1110k66151l96469P3359O66967
42283F522370M73917l11338o19372k04553Q0121j89700m11083k25041k35447q25702
42273D054172j215879n70359N90853J023236M64036j77811k22314K1599J4371
42264C981904j92359k16516J3615K45030L06490K39178J36619P8740J56577L72535
42254E121813N58925N76958N62820P43418R83337Q29611J98461k99471j22691
42245I153181L16532J21879p24689j184709o61937K1312k07328j038496j204995
42236D590750l26722O34560Q45049N75030L61328O4746o05138j248330j231057
42227C660216o64822k15322r0585J10715N57507Q17215N00252j55566n58624l81899
$$ plain form
42217 3579087 3793166 4581335 5540365 6205143 6345435 5974139 5209760 4314236 3753678
42208 3753678 3875722 4452553 4820635 4573834 3885573 3117219 2470407 2150797 2447458
42199 2447458 3335001 4288828 4818847 4973605 5063818 5182820 5335175 5724084 6432231 7013528
42189 7013528 6911163 6197741 5456306 5030059 4861138 4946634 5351225 5769714 5707426 5196729
42179 5196729 4720803 4309815 3457748 2234250 1657865 2341657 3429282 3703374 3288112
42170 3288112 3265481 3826694 3960722 3184828 2493978 2950172 4089656 4580768 4066016
42161 4066016 3460980 3511289 3909292 4046576 3902168 3724238 3370814 2620717 1889460 1922538
42151 1922538 2722312 3392476 3283437 2785362 2621066 2770648 2626508 2003553 1426553
$$ packed form
42217C579087K14079P88169R59030O64778J40292l71296p64379q95524n60558
42208C753678J22044N76831L68082k46801o88261p68354o46812l19610K96661
42199B447458Q87543R53827N30019J54758R0213J19002J52355L88909P08147N81297
42189G013528j02365p13422p41435m26247j68921Q5496M04591M18489o2288n10697
42179E196729m75926m10988q52067j223498n76385O83792J087625K74092m15262
42170C288112k2631N61213J34028p75894o90850M56194J139484M91112n14752
42161D066016o05036N0309L98003J37284j44408j77930l53424p50097p31257L3078
42151A922538P99774O70164j09039m98075j64296J49582j44140o22955n77000
$$ plain form
42142 1426553 1420960 1999366 2912032 3942837 4797799 5117889 4870029 4452884 4194465 3990312
42132 3990312 3633887 3227971 3018619 3069103 3368605 4010914 4911312 5527522 5277938 4227251
42122 4227251 3079306 2517002 2748622 3560819 4498570 5063931 5072353 4832166 4751883 4839596
42112 4839596 4823913 4610742 4265574 3695669 2842141 2143270 2238682 3095792 3961079 4377121
42102 4377121 4721791 5437732 6252160 6651339 6762623 7190442 8134028 9168407 9823976
42093 9823976 9939007 9501089 8627386 7756709 7405994 7561661 7646070 7276036 6793425 6844096
42083 6844096 7610475 8623336 9189727 8892823 7848398 6636564 5869688 5683669 5705101
42074 5705101 5533697 5080753 4401399 3513961 2615305 2212878 2677951 3763308 4881030
$$ packed form
42142A426553n593N78406R12666J030805Q54962L20090k47860m17145k58419k04153
42132C990312l56425m05916k09352N0484K99502O42309R00398O16210k49584j050687
42122D227251j147945n62304K31620Q12197R37751N65361Q422k40187q0283Q7713
42112D839596j5683k13171l45168n69905q53528o98871R5412Q57110Q65287M16042
42102D377121L44670P15941Q14428L99179J11284M27819R43586J034379O55569
42093I823976J15031m37918q73703q70677l50715J55667Q4409l70034m82611N0671
42083F844096P66379J012861N66391k96904j044425j211834p66876j86019K1432
42074E705101j71404m52944o79354q87438q98656m02427M65073J085357J117722
$$ plain form
42065 4881030 5775854 6573647 7243856 7522500 7498457 7779142 8741615 9967979 10811908
42056 10811908 11264716 11825454 12715725 13760458 14986532 16740717 19047375 21342474
42048 21342474 23139898 24633804 26360865 28518228 30870862 33114588 35092487 36848992
42040 36848992 38661516 40761433 42801241 43909189 43594406 42327500 40884207 39421124
42032 39421124 37631862 35492049 33248674 30888304 28319240 25999551 24608516 23981475
42024 23981475 23096134 21339068 19114728 16944481 14721523 12335984 10346583 9329418
42016 9329418 9009171 8753027 8599776 9016496 9784050 9959023 9113126 7997178 7674691
42007 7674691 8337749 9210650 9424810 8843085 8120930 7988690 8441286 8775401 8494768
$$ packed form
42065D881030Q94824P97793O70209K78644k4043K80685R62473J226364Q43929
42056A0811908M52808N60738Q90271J044733J226074J754185K306658K295099
42048B1342474J797424J493906J727061K157363K352634K243726J977899J756505
42040C6848992J812524K099917K039808J107948l14783j266906j443293j463083
42032C9421124j789262k139813k243375k360370k569064k319689j391035o27041
42024B3981475q85341j757066k224340k170247k222958k385539j989401j017165
42016I329418l20247k56144j53251M16720P67554J74973q45897j115948l22487
42007G674691O63058Q72901K14160n81725p22155j32240M52596L34115k80633
$$ plain form
41998 8494768 7867057 7357054 6893642 6144752 5215590 4500636 4034554 3616908 3438398
41989 3438398 3816126 4288061 3856845 2477054 1530912 2237027 4093247 5537061 5833280
41980 5833280 5636172 5792251 6271418 6507269 6357253 6306995 6746248 7331221 7310304 6463772
41970 6463772 5421492 4855394 4642770 4221787 3583788 3354814 3873757 4726740 5322686
41961 5322686 5445202 5105261 4394534 3704606 3529201 3738766 3602005 2894823 2397405
41952 2397405 2791440 3644578 4142714 4309647 4674788 5108634 4969613 4306106 3957328
41943 3957328 4334338 4913816 5148526 5148674 5176241 5108754 4759187 4226071 3629447 2976041
41933 2976041 2542578 2837235 3797396 4524197 4288382 3422955 2756676 2516931 2335187
$$ packed form
41998H494768o27711n10003m63412p48890r29162p14954m66082m17646j78510
41989C438398L77728M71935m31216j379791r46142P06115J856220J443814K96219
41980E833280j97108J56079M79167K35851j50016n0258M39253N84973k0917q46532
41970F463772j042280n66098k12624m20983o37999k28974N18943Q52983N95946
41961E322686J22516l39941p10727o89928j75405K09565j36761p07182m97418
41952B397405L94035Q53138M98136J66933L65141M33846j39021o63507l48778
41943C957328L77010N79478K34710J48K7567o7487l49567n33116n96624o53406
41933B976041m33463K94657R60161P26801k35815q65427o66279k39745j81744
$$ plain form
41924 2335187 2085024 2090860 2521289 3069143 3329255 3177800 2724230 2157938 1713741 1581992
41914 1581992 1750273 2009665 2144139 2092925 1972317 1945216 2000424 1936190 1742477 1875160
41904 1875160 2762757 4035863 4732177 4442779 3795700 3549443 3685119 3766252 3727514 3774696
41894 3774696 3844117 3750944 3658190 3835208 4133968 4290998 4586547 5518423 6839231 7597905
41884 7597905 7257902 6210414 5096060 4234006 3860787 4222085 5040640 5453066 4978930
41875 4978930 4219466 4159454 5008087 6093235 6703261 6686879 6345489 6033822 5859122 5667895
41865 5667895 5372569 5191187 5292803 5332193 4849892 4131748 3987523 4466632 4557446 3648120
41855 3648120 2591675 2588250 3497590 4099974 3754513 2945574 2297450 1907327 1748010 1966707
$$ packed form
41924B335187k50163N836M30429N47854K60112j51455m53570n66292m44197j31749
41914A581992J68281K59392J34474n1214j20608k7101N5208o4234j93713J32683
41904A875160Q87597J273106O96314k89398o47079k46257J35676Q1133l8738M7182
41894C774696O9421r3173r2754J77018K98760J57030K95549R31876J320808P58674
41884G597905l40003j047488j114354q62054l73219L61298Q18555M12426m74136
41875D978930p59464o0012Q48633J085148O10026j6382l41390l11667j74700j91227
41865E667895k95326j81382J01616L9390m82301p18144j44225M79109R0814r09326
41855C648120j056445l425R09340O02384l45461q08939o48124l90123j59317K18697
$$ plain form
41845 1966707 2513525 3000410 3166005 3119141 3056950 3150745 3696318 4840052 6103337 6754955
41835 6754955 6768081 6815742 7171308 7282228 6713938 5849723 5231625 4804748 4351906 4189760
41825 4189760 4806784 6100731 7520748 8753427 9835512 10872499 12108808 13950296
41817 13950296 16353048 18489716 19717707 20710166 22849624 26446101 30254039 32943763
41809 32943763 34457458 35623081 36897285 37867897 37770108 36225071 33575931 30627508
41801 30627508 28018638 25920756 24433632 23949448 24683354 26013622 26840902 26613126 25540495
41792 25540495 23881137 21656064 19134043 16880922 15036280 13119543 10869790 8743168
41784 8743168 7246975 6326488 5792343 5769404 6197468 6418073 5915061 5091384 4674417
$$ packed form
41845A966707N46818M86885J65595m6864o2191R3795N45573J143734J263285O51618
41835F754955J3126M7661L55566J10920n68290q64215o18098m26877m52842j62146
41825D189760O17024J293947J420017J232679J082085J036987J236309J841488
41817A3950296K402752K136668J227991R92459K139458L596477L807938K689724
41809C2943763J513695J165623J274204R70612r7789j545037k649140k948423
41801C0627508k608870k097882j487124m84184P33906J330268Q27280k27776j072631
41792B5540495j659358k225073k522021k253121j844642j916737k249753k126622
41784H743168j496193r20487n34145k2939M28064K20605n03012q23677m16967
$$ plain form
41775 4674417 4694048 4712761 4702559 4874501 4913901 4373352 3768153 4207080 5694346 6804308
41765 6804308 6530134 5588492 5203106 5291973 4774925 3334900 1922030 1458457 1771134
41756 1771134 2040169 1806362 1246884 769189 635052 860056 1268145 1657063 1969821
41747 1969821 2228316 2265250 1699161 380660 -1179875 -2086449 -1907216 -1106228 -438595
41738 -438595 -53396 469624 1238278 1719867 1550063 1215870 1446359 2185732 2714676 2643481
41728 2643481 2196956 1587128 806968 165062 288190 1227794 2166391 2480324 2573522 3063516
41718 3063516 3562992 3068942 1479170 -21471 -285428 591244 1644417 2252973 2599980
41709 2599980 3034856 3350696 2949582 1696514 323137 -267712 50525 711492 1347021
$$ packed form
41775D674417J9631J8713j0202J71942L9400n40549o05199M38927J487266J109962
41765F804308k74174r41642l85386Q8867n17048j440025j412870m63573L12677
41756A771134K69035k33807n59478m77695j34137K25004M08089L88918L12758
41747A969821K58495L6934n66089j318501j560535r06574J79233Q00988O67633
41738d38595L85199N23020P68654M81589j69804l34193K30489P39373N28944p1195
41728B643481m46525o09828p80160o41906J23128R39604R38597L13933R3198M89994
41718C063516M99476m94050j589772j500641k63957Q76672J053173O08556L47007
41709B599980M34876L15840m01114j253068j373377n90849L18237O60967O35529
$$ plain form
41700 1347021 2035671 2617445 2486440 1481965 424539 202111 706500 1216090 1437349
41691 1437349 1501875 1259097 404787 -760706 -1467023 -1427129 -1030950 -574075 45395 801392
41681 801392 1389794 1732981 1998368 2011934 1386091 438787 201234 1109983 2350399 2936999
41671 2936999 2838278 2559902 2225865 1692756 1124029 822521 789779 938337 1389398 2082343
41661 2082343 2502465 2354202 2104157 2243165 2425637 2087560 1561449 1663217 2323137
41652 2323137 2592263 2100548 1620937 1888039 2553204 2692729 1879316 453102 -872033
41643 -872033 -1430584 -1013820 -116204 491200 588924 654781 1117556 1807552 2269740 2310686
41633 2310686 2094505 1915784 1922052 1872665 1293805 173043 -728831 -762004 -371402 -497473
$$ packed form
41700A347021O88650N81774j31005j004475j057426k22428N04389N09590K21259
41691A437349O4526k42778q54310j165493p06317L9894L96179M56875O19470P55997
41681H01392N88402L43187K65387J3566o25843r47304k37553R08749J240416N86600
41671B936999r8721k78376l34037n33109n68727l01508l2742J48558M51061O92945
41661B082343M20122j48263k50045J39008J82472l38077n26111J01768O59920
41652B323137K69126m91715m79611K67102O65165J39525q13413j426214j325135
41643h72033n58551M16764Q97616O07404R7724O5857M62775O89996M62188M0946
41633B310686k16181j78721O268m9387n78860j120762r01874l3173L90602j26071
$$ plain form
41623 -497473 -1107435 -1215668 -475111 243631 260205 128512 607336 1345902 1421018 665714
41613 665714 -359843 -1313633 -2114732 -2327382 -1477394 5392 1003925 1048317 785666
41604 785666 947358 1444511 1742848 1657669 1471653 1543162 1980087 2501548 2620341 2254114
41594 2254114 2063651 2697749 3711214 3869292 2743119 1395055 1087412 1820566 2662144
41585 2662144 3108737 3451212 3984014 4566844 5032282 5428168 5677676 5520872 5063485
41576 5063485 4914940 5401960 6051402 6359892 6736977 7959390 9792312 11019946 11121143
41567 11121143 11146308 12374024 14660851 16821709 18260509 19420411 20819516 22512727
41559 22512727 24499529 26746050 28566993 28844119 27327627 25098514 23312584 22081329
$$ packed form
41623d97473o09962j08233P40557P18742J6574j31693M78824P38566P5116p55304
41613F65714j025557r53790q01099k12650Q49988J482786R98533M4392k62651
41604G85666J61692M97153K98337q5179j86016P1509M36925N21461J18793l66227
41594B254114j90463O34098J013465J58078j126173j348064l07643P33154Q41578
41585B662144M46593L42475N32802N82830M65438L95886K49508j56804m57387
41576E063485j48545M87020O49442L08490L77085J222413J832922J227634J01197
41567A1121143K5165J227716K286827K160858J438800J159902J399105J693211
41559B2512727J986802K246521J820943K77126j516492k229113j785930j231255
$$ plain form
41551 22081329 21018045 20174662 19754271 19471891 19025467 18833147 19495574 20799787 22064452
41542 22064452 23246192 24814129 26607698 27703474 27466454 25953087 23300212 19671913
41534 19671913 15952880 13436937 12350361 11513779 9978448 8229419 7186892 6777585
41526 6777585 6286281 5546532 4883929 4233168 3247859 2199800 1935918 2805664 4194197
41517 4194197 5222141 5487268 5128710 4623844 4538218 5031480 5573056 5531235 5002038 4606443
41507 4606443 4541061 4439630 4231679 4421409 5190712 5845766 5675409 4944103 4458140 4404238
41497 4404238 4234166 3625629 2952871 2677896 2762520 2931689 3170975 3651877 4359751 5087141
41487 5087141 5694441 6120643 6193454 5700876 4708402 3628159 2899492 2688148 2885392
$$ packed form
41551B2081329j063284q43383m20391k82380m46424j92320O62427J304213J264665
41542B2064452J181740J567937J793569J095776k37020j513367k652875l628299
41534A9671913l719033k515943j086576q36582j535331j749029j042527m09307
41526F777585m91304p39749o62603o50761r85309j048059k63882Q69746J388533
41517D194197J027944K65127l58558n04866q5626M93262N41576m1821n29197l95595
41507D606443o5382j01431k07951J89730P69303O55054j70357p31306m85963n3902
41497D404238j70072o08537o72758k74975Q4624J69169K39286M80902P07874P27390
41487E087141O07300M26202P2811m92578r92474j080243p28667k11344J97244
$$ plain form
41478 2885392 3249920 3530346 3613240 3621974 3768611 4099567 4527055 5090728 5958155 7131067
41468 7131067 8414864 9748125 11231429 12673644 13497176 13422660 12947350 12744396 12821114
41459 12821114 12721614 12366496 12125736 12091910 11838851 11012626 9719392 8221189 6675644
41450 6675644 5313252 4458608 4181480 4239761 4468154 4848368 5111898 4784997 3889730
41441 3889730 3156199 3185395 3717721 4041583 3824836 3222543 2446825 1603350 796278 118959
41431 118959 -340063 -373375 171674 947826 1227486 731148 -13569 -384317 -316769 27043
41421 27043 683001 1484283 1758061 1128024 310298 386369 1437993 2551571 3031650 2924528
41411 2924528 2430179 1573946 600680 46974 153592 581844 809407 475219 -565833
$$ packed form
41478B885392L64528K80426Q2894Q734J46637L30956M27488N63673Q67427J172912
41468G131067J283797J333261J483304J442215Q23532p4516m75310k02954P6718
41459A2821114r9500l55118k40760l3826k53059q26225j293234j498203j545545
41450F675644j362392q54644k77128N8281K28393L80214K63530l26901q95267
41441C889730p33531K9196N32326L23862k16747o02293p75718q43475q07072o77319
41431A18959m59022l3312N45049P76152K79660m96338p44717l70748O7548L43812
41421B7043O55958Q01282K73778o30037q17726P6071J051624J113578M80079j07122
41411B924528m94349q56233r73266n53706J06618M28252K27563l34188j041052
$$ plain form
41402 -565833 -1988626 -2823380 -2181127 -318786 1531713 2523864 2870354 3061898 3069939
41393 3069939 2658505 1977684 1424988 1190417 1197936 1246637 1068065 553935 23775 -92532
41383 -92532 124849 257586 365301 956687 1950396 2430219 1890432 1057174 860599 1119874
41373 1119874 944808 58855 -1005164 -1776571 -2200348 -2277112 -2060160 -1965449 -2404507 -3045765
41363 -3045765 -3046244 -2136523 -935246 -54988 553876 1155988 1671823 1934877 2110769 2424164
41353 2424164 2695376 2565968 2086155 1706190 1680624 1784432 1689376 1377695 1052091 811045
41343 811045 601061 419240 373697 530580 854297 1326324 1937049 2468291 2502368 1879464
41333 1879464 1026027 564380 651183 973342 1355205 1999327 3006493 3973035 4310987
$$ packed form
41402e65833j422793q34754O42253J862341J850499R92151L46490J91544Q041
41393C069939m11434o80821n52696k34571P519M8701j78572n14130n30160j16307
41383i2532K17381J32737J07715N91386R93709M79823n39787q33258j96575K59275
41373A119874j75066q85953j064019p71407m23777p6764K16952R4711m39058o41258
41363c045765m79R09721J201277Q80258O08864O02112N15835K63054J75892L13395
41353B424164K71212j29408m79813l79965k5566J03808r5056l11681l25604k41046
41343H11045k09984j81821m5543J56883L23717M72027O10725N31242L4077o22904
41333A879464q53437m61647Q6803L22159L81863O44122J007166R66542L37952
$$ plain form
41324 4310987 3851323 2997155 2372884 2356778 2779354 3011811 2533780 1492417 533742
$$ packed form
41324D310987m59664q54168o24271j6106M22576K32457m78031j041363r58675
$$ [...]
##END NTUPLES=NMR SPECTRUM
##END=
