##TITLE=31Pdec_DE-170K_TFA_d6
 DMSO+CCl4, 64 sc
7.8.2026
##JCAMPDX= 6.0         $$ Bruker NMR JCAMP-DX V2.0
##DATA TYPE= NMR SPECTRUM
##DATA CLASS= NTUPLES
##ORIGIN= UXNMR, Bruker Analytische Messtechnik GmbH
##OWNER= root
$$ XWIN-NMR		Version 3.5
$$ Fri Aug  7 13:13:17 2026 Russian Standard Time (UT+4h)  she@DPX200
##.OBSERVE FREQUENCY= 81.013821
##.OBSERVE NUCLEUS= ^31P
##.ACQUISITION MODE= SIMULTANEOUS
##.ACQUISITION SCHEME= undefined
##.AVERAGES= 64
##.DIGITISER RES= 17
##SPECTROMETER/DATA SYSTEM= spect
##.PULSE SEQUENCE= zgpg30
##.SOLVENT NAME= CDCl3
##.SHIFT REFERENCE= (INTERNAL, CDCl3, 0, 197.392)
##AUDIT TRAIL= $$ (NUMBER, WHEN, WHO, WHERE, WHAT)
$$ ##TITLE= Audit trail, XWIN-NMR		Version 3.5
$$ ##JCAMPDX= 5.01
$$ ##ORIGIN= Bruker BioSpin GmbH
$$ ##OWNER= she
$$ F:/spectra/data/she/nmr/P31/2/pdata/1/auditp.txt
$$ ##AUDIT TRAIL=  $$ (NUMBER, WHEN, WHO, WHERE, WHAT)
(   1,<2026-08-07 13:12:06.10 +0400>,<she>,<DPX200>,
      <created by zg, POWCHK disabled, PULCHK disabled
       configuration hash MD5:
       00 E9 B6 7A A2 85 ED C7 34 08 36 98 17 FE 4E 26
       data hash MD5: 32K
       7A 2B 34 7E D3 83 33 4C E6 52 60 E9 51 6B 70 25>)
(   2,<2026-08-07 13:12:08.57 +0400>,<she>,<DPX200>,
      <Start of raw data processing
       efp BC_mod = 2 LB = 1.5 FT_mod = 6 PKNL = 1 PHC0 = 1921.828 PHC1 = 196.8983 SI = 64K 
       data hash MD5: 64K
       5F 3B 78 29 F4 70 AB 71 20 37 15 0F C7 7D EF 8F>)
(   3,<2026-08-07 13:12:28.84 +0400>,<she>,<DPX200>,
      <pk PHC0 = 5.924461 PHC1 = 0 
       data hash MD5: 64K
       53 BF AC 73 FE 3C 46 1D B8 55 6A 4A DB 23 08 46>)
(   4,<2026-08-07 13:12:31.76 +0400>,<she>,<DPX200>,
      <abs ABSG = 5 
       data hash MD5: 64K
       06 77 29 0F 75 78 07 AD 4A 69 B6 68 40 AD 39 FA>)
$$ ##END=
$$ 
$$ hash MD5
$$ 16 56 F2 03 57 48 DA 64 A5 BD A2 D5 CC 66 BC D1
##$RELAX= 
##$RELAX= 
##$RELAX= 
##$RELAX= 
##$RELAX= 
##$RELAX= 
##$RELAX= 
##$RELAX= 
$$ Bruker specific parameters
$$ --------------------------
##$DU= <F:/spectra>
##$EXPNO= 2
##$NAME= <P31>
##$PROCNO= 1
##$TYPE= <nmr>
##$USER= <she>
##$AMP= (0..31)
100 100 100 100 100 100 100 100 100 100 100 100 100 100 100 100 100 100 
100 100 100 100 100 100 100 100 100 100 100 100 100 100 
##$AQSEQ= 0
##$AQ_mod= 1
##$AUNM= <au_zg>
##$AUTOPOS= <>
##$BF1= 81.014009
##$BF2= 200.13
##$BF3= 200.13
##$BF4= 200.13
##$BF5= 200.13
##$BF6= 200.13
##$BF7= 200.13
##$BF8= 200.13
##$BYTORDA= 1
##$CFDGTYP= 0
##$CFRGTYP= 5
##$CHEMSTR= <none>
##$CNST= (0..31)
1 1 145 1 1 1 1 1 1 1 1 1 1 1 1 1 1 1 1 1 1 1 1 1 1 1 1 1 1 1 1 1 
##$CPDPRG= <waltz16>
##$CPDPRG1= <>
##$CPDPRG2= <waltz16>
##$CPDPRG3= <>
##$CPDPRG4= <mlev>
##$CPDPRG5= <mlev>
##$CPDPRG6= <mlev>
##$CPDPRG7= <mlev>
##$CPDPRG8= <mlev>
##$CPDPRGB= <>
##$CPDPRGT= <>
##$D= (0..31)
0 1 0 0 0 0 0 0 0 0.06 0 0.03 2e-05 3e-06 0 0 0.0002 0 0 0 0 0 0 0 0 0 
0 0 0 0 0 0 
##$DATE= 1786093925
##$DBL= (0..7)
120 120 120 11 120 120 24 19 
##$DBP= (0..7)
150 150 150 150 150 150 150 150 
##$DBP07= 0
##$DBPNAM0= <>
##$DBPNAM1= <>
$$ [...]
##$SUBNAM3= <"">
##$SUBNAM4= <"">
##$SUBNAM5= <"">
##$SUBNAM6= <"">
##$SUBNAM7= <"">
##$SUBNAM8= <"">
##$SUBNAM9= <"">
##$SW= 400.765351723535
##$SWIBOX= (0..15)
0 1 3 0 0 0 0 0 0 0 0 0 0 0 0 0 
##$SW_h= 32467.5324675325
##$TD= 32768
##$TD0= 1
##$TE= 0
##$TE2= 300
##$TE3= 300
##$TEG= 300
##$TL= (0..7)
0 120 53 12 22 120 120 120 
##$TP= (0..7)
150 150 150 150 150 150 150 150 
##$TP07= 0
##$TPNAME0= <>
##$TPNAME1= <>
##$TPNAME2= <>
##$TPNAME3= <>
##$TPNAME4= <>
##$TPNAME5= <>
##$TPNAME6= <>
##$TPNAME7= <>
##$TPOAL= (0..7)
0.5 0.5 0.5 0.5 0.5 0.5 0.5 0.5 
##$TPOFFS= (0..7)
0 0 0 0 0 0 0 0 
##$TUNHIN= 0
##$TUNHOUT= 0
##$TUNXOUT= 0
##$USERA1= <user>
##$USERA2= <user>
##$USERA3= <user>
##$USERA4= <user>
##$USERA5= <user>
##$V9= 5
##$VALIST= <valist>
##$VCLIST= <CCCCCCCCCCCCCCC>
##$VD= 0
##$VDLIST= <DDDDDDDDDDDDDDD>
##$VPLIST= <PPPPPPPPPPPPPPP>
##$VTLIST= <TTTTTTTTTTTTTTT>
##$WBST= 1024
##$WBSW= 4
##$XGAIN= (0..3)
0 0 0 0 
##$XL= 0
##$YL= 0
##$YMAX_a= 8097
##$YMIN_a= -8853
##$ZGOPTNS= <>
##$ZL1= 120
##$ZL2= 120
##$ZL3= 120
##$ZL4= 120
##$ABSF1= 197.3918
##$ABSF2= -203.3724
##$ABSG= 5
##$ABSL= 3
##$ALPHA= 0
##$AQORDER= 0
##$ASSFAC= 0
##$ASSFACI= 0
##$ASSFACX= 0
##$ASSWID= 0
##$AUNMP= <proc_1d>
##$AZFE= 0.1
##$AZFW= 0.5
##$BCFW= 0
##$BC_mod= 2
##$BYTORDP= 0
##$COROFFS= 0
##$CY= -3
##$DATMOD= 1
##$DC= 0
##$DFILT= <>
##$DTYPP= 0
##$F1P= 0
##$F2P= 0
##$FCOR= 1
##$FTSIZE= 65536
##$FT_mod= 6
##$GAMMA= 0
##$GB= 0
##$INTBC= 1
##$INTSCL= 9.790993e-09
##$ISEN= 30
##$LB= 1.5
##$LEV0= 0
##$LPBIN= 0
##$MAXI= 10000
##$MC2= 0
##$MEAN= 0
##$ME_mod= 0
##$MI= 50
##$NCOEF= 0
##$NC_proc= -6
##$NLEV= 6
##$NOISF1= 182.463
##$NOISF2= 159.3651
##$NSP= 0
##$NTH_PI= 0
##$NZP= 0
##$OFFSET= 197.3918
##$PC= 4
##$PHC0= 1927.752
##$PHC1= 196.8983
##$PH_mod= 1
##$PKNL= yes
##$PPARMOD= 0
##$PSCAL= 0
##$PSIGN= 0
##$REVERSE= no
##$SF= 81.014063255964
##$SI= 65536
##$SIGF1= 159.3651
##$SIGF2= -187.1042
##$SINO= 113.3802
##$SIOLD= 16384
##$SREGLST= <1H.CDCl3>
##$SSB= 0
##$STSI= 65536
##$STSR= 0
##$SW_p= 32467.5324675325
##$SYMM= 0
##$S_DEV= 0
##$TDeff= 32768
##$TDoff= 0
##$TI= <>
##$TILT= no
##$TM1= 0
##$TM2= 0
##$TOPLEV= 0
##$USERP1= <user>
##$USERP2= <user>
##$USERP3= <user>
##$USERP4= <user>
##$USERP5= <user>
##$WDW= 1
##$XDIM= 65536
##$YMAX_p= 287438572
##$YMIN_p= -7870668
$$ End of Bruker specific parameters
$$ ---------------------------------
##NTUPLES= NMR SPECTRUM
##VAR_NAME=  FREQUENCY,     SPECTRUM/REAL,   SPECTRUM/IMAG
##SYMBOL=    X,             R,               I
##VAR_TYPE=  INDEPENDENT,   DEPENDENT,       DEPENDENT
##VAR_FORM=  AFFN,          ASDF,            ASDF
##VAR_DIM=   65536,         65536,           65536
##UNITS=     HZ,            ARBITRARY UNITS, ARBITRARY UNITS
##FACTOR=    0.49542278885378, 1,            1
##FIRST=     15991.5117654749, 0,            0
##LAST=      -16476.0207020576, 0,           0
##MIN=       -16476.0207020576, -7870668,    0
##MAX=       15991.5117654749, 287438572,    0
$$ Real data points
##PAGE= N=1
##DATA TABLE= (X++(R..R)), XYDATA
$$ [...]
44848D4278P4637L54786n3283l85916l04823l44601o14144m94452J4451L3774
44838a675293n90366p53326J48838J154453J254781Q46955P10271N70343j45307
44829A521349r18077p87203Q8388O93923O57013L89634J7407o60215j223299q33135
44819a054215L94922J205177P82579k11188o10842k18851J48439k17516j117769
44810h99264j668126j172321J35596J210545J201752L05608n39270o98889l39878
44801b464247L4682K08668L13232M58392M81977J47085m06537o22431k12210K91413
44791a769976J58883m09185m56471K64503P89026L63406l64846l19780L79904
44782a364536O75207J71826m31404m90790j71156Q0509J43323J07026N6390J23029
$$ plain form
44848 44278 118915 473701 420418 34502 -270321 -614922 -1229066 -1723518 -1709067 -1675293
44838 -1675293 -2265659 -3018985 -2870147 -1715694 -460913 386042 1096313 1666656 1521349
44829 1521349 603272 -183931 -95543 598380 1255393 1645027 1662434 1002219 -221080 -1054215
44819 -1054215 -659293 545884 1328463 1117275 506433 287582 436021 218505 -899264
44810 -899264 -2567390 -3739711 -3604115 -2393570 -1191818 -886210 -1425480 -2124369 -2464247
44801 -2464247 -2429565 -2220897 -1907665 -1449273 -967296 -820211 -1226748 -1849179 -2061389 -1769976
44791 -1769976 -1611093 -2020278 -2476749 -2212246 -1423220 -1059814 -1424660 -1744440 -1364536
44782 -1364536 -689329 -517503 -948907 -1439697 -1610853 -1530344 -1387021 -1279995 -1223605 -1100576
44772a100576L39966M05958M9165l89935l10229J71403K64584k69053o29649j37110
44762a605476P13769R57185N24127J89769K82848K07471n17030j336952j305550
44753a889839l82026N03657P05670N82257O72039P25789K03330n96555p64989
44744b40667j51988L57709J86852j46751l2149K31984J03891j82088r0710J77862
44734B13945J9323m82791o77014m11778j44326n4096J26876L94261L90254J19702
44724e05644j5159M815k24295o33248n52481K11373Q90987P57195M4121n00874
44714e23210n20855j69815K49187M59566L59295J84328K06295K48829k7970m03930
44704F1720l30244Q2221J28030k65420l03831L07099P26448L29164j98890L7175
$$ plain form
44772 -1100576 -760610 -354652 -305487 -695422 -1005651 -834248 -569664 -838717 -1468366 -1605476
44762 -1605476 -891707 65478 589605 779374 1062222 1269693 752663 -584289 -1889839
44753 -1889839 -2271865 -1768208 -1062538 -480281 191758 917547 1120877 524322 -240667
44744 -240667 -392655 -34946 151906 5155 -26994 204990 308881 126793 36083 213945
44734 213945 233268 -249523 -926537 -1338315 -1482641 -1536737 -1409861 -1015600 -625346 -505644
44724 -505644 -520803 -515988 -740283 -1373531 -1926012 -1714639 -823652 -66457 -22336 -523210
44714 -523210 -1044065 -1213880 -964693 -505127 -145832 38496 244791 493620 465650 61720
44704 61720 -268524 -186303 -58273 -323693 -627524 -320425 406023 735187 536297 573472
44694E73472O58479O34364q1189n87076m91804l21399m55230n41559j91549L88442
44684d15049P20935O09021K08417j52843j77237J13230L15815J29247k02146k16860
44674I32530J19767M32248M75062L00000j6594m37804p91914q55683o07391j92152
44664f41931K59490N86318N77082K57477k2281n7365p1116k27466k45325L9795
44654D54678J28557m55668j191688j070509m0940Q41444Q43954M05445K68272
44645A83545L96054K20223m22516j075498j241027q47470j89144L86911P08750
44636a880172P70923N79426J52731k86935l86342j20708P6659q0997k70405o7149
44626a512969L46611M54255J74687j68820m72999q32976r96627n33557L93805
$$ plain form
44694 573472 1231951 1866315 1785126 1198050 706246 384847 -70383 -611942 -803491 -415049
44684 -415049 305886 914907 1123324 970481 793244 906474 1222289 1351536 1149390 932530
44674 932530 1052297 1484545 1959607 2259607 2243013 1805209 1013295 157612 -449779 -641931
44664 -641931 -382441 203877 780959 1038436 1016155 958790 887674 660208 414883 454678
44654 454678 583235 127567 -1064121 -2134630 -2175570 -1334126 -490172 -84727 183545
44645 183545 579599 799822 377306 -698192 -1939219 -2786689 -2975833 -2588922 -1880172
44636 -1880172 -1109249 -529823 -377092 -664027 -1050369 -1171077 -1094418 -1175415 -1445820 -1512969
44626 -1512969 -1166358 -712103 -537416 -706236 -1179235 -2012211 -3008838 -3542395 -3148590
44617c148590J060757J091014P65134L60178j55408o28695o29576j22679L80125
44608a027740N79680O59865N84600n1042j052564j383462n69533M05997M39753
44599a414446j01583j05331M79087P09444K86389q7047j2972R1247L0187K71316
44589A46291Q75449R78031N8682j008959j011661n0610O57723L83571m28983r43749
44579c44215p55577K1056Q94863J181143N38409n65361j254246j130692m87754
44570a902374K13012O51165N89625Q1168l12541j17637K51732J0297o32242n57577
44560a725372M72835J130888L62138r32623j097323n7682P34073M72454j21816
44551g62428k23640n2344j37886l20423j13204M58304R18957R37697N18336j14005
$$ plain form
44617 -3148590 -2087833 -996819 -231685 128493 -26915 -655610 -1285186 -1407865 -1027740
44608 -1027740 -448060 211805 796405 745363 -307201 -1690663 -2260196 -1854199 -1414446
44599 -1414446 -1516029 -1621360 -1142273 -432829 -146440 -233487 -246459 -155212 -125025 146291
44589 146291 1021740 1999771 2058453 1049494 37833 -12777 644946 1028517 599534 -344215
44579 -344215 -1099792 -1078736 -183873 997270 1535679 970318 -283928 -1414620 -1902374
44570 -1902374 -1689362 -1038197 -448572 -367404 -679945 -797582 -545850 -535553 -1167795 -1725372
44560 -1725372 -1252537 -121649 240489 -692134 -1789457 -1847139 -1113066 -640612 -762428
44551 -762428 -986068 -1038412 -1176298 -1496721 -1609925 -1151621 -232664 705033 1223369 1109364
44541A109364n90814o64917n22732m86278m07207J00910P99863R20603L12390
44532E71182k60782k77050j24696k07229k17568J02859K64336j65211p01272o67686
44522a683117k13746J52979M48826P90659P21143l4990o87171l80777L56509L83395
44512a46290j99487l12660J91289L55480j08222l74543j12177q9054o73986j059687
44502b529337o35637L4751L13342M55875O98474M70992m78883j108992m14739
44493c194154Q90111J216459K66742p34003p98019j76232L94587O07130N90631
44484i36748N61956O20138O20165L23838j40889k84013M276J45255k77045q08049
44474a71116q16283m85723m37551o38463m34423L78598J156633J183125M49133
$$ plain form
44541 1109364 518550 -146367 -669099 -1155377 -1562584 -1461674 -661811 258792 571182
44532 571182 310400 33350 -91346 -298575 -516143 -413284 -148948 -314159 -1015431 -1683117
44522 -1683117 -1896863 -1743884 -1295058 -504399 216744 181754 -505417 -886194 -529685 -146290
44512 -146290 -345777 -658437 -467148 -111668 -219890 -594433 -706610 -795664 -1469650 -2529337
44502 -2529337 -3164974 -3130223 -2816881 -2361006 -1662532 -1191540 -1670423 -2779415 -3194154
44493 -3194154 -2304043 -1087584 -820842 -1554845 -2352864 -2529096 -2134509 -1527379 -936748
44484 -936748 -374792 245346 865511 1189349 1048460 764447 768723 913978 636933 -171116
44474 -171116 -987399 -1473122 -1910673 -2549136 -2983559 -2604961 -1448328 -265203 183930
44465A83930l89948o01209K111Q29341J054083N06540k35138o76018q26499o94393
44455h47200q1451P85937J191777R72991Q27337R99115O05992q26892k092373
44446A535233j818973n73822K902k89820j98968O16335R51046J37421p95967p32529
44436a167142j0471M21636M15644L72761L33844J25710j06945j81555k56725m01277
44426d54520k53406L52095Q52794O19035j70879p87304p99882l01052L81203Q17389
44416B55473O60896P3445l33471k69411r1799q5929M6878N26963Q49218M50777
44406B083040l24890o42938l79886k03083m50493o02556j09285P15599J001838
44397A087346L94826m64347o42628r750N99150M33900k35065n81939l92862j85212
$$ plain form
44465 183930 -206018 -807227 -805116 24225 1078308 1584848 1349710 673692 -152807 -847200
44455 -847200 -928651 -142714 1049063 2022054 2849391 3848506 4454498 3627606 1535233
44446 1535233 -283740 -857562 -854660 -1144480 -1343448 -727113 223933 361354 -434613 -1167142
44436 -1167142 -1177613 -755977 -340333 32428 366272 491982 385037 203482 -53243 -454520
44426 -454520 -707926 -355831 496963 1115998 945119 157815 -642067 -943119 -561916 255473
44416 255473 916369 989814 656343 386932 295133 209204 256082 783045 1632263 2083040
44406 2083040 1758150 1115212 735326 532243 81750 -520806 -630091 85508 1087346
44397 1087346 1482172 1017825 375197 365447 964597 1398497 1163432 581493 188631 3419
44387C419k27032j72704J34318K30067j82400o17945m93612M8290N04175P33870
44377c9554P73616M02747m01812r42513n33692M25814Q84778N43868M4617k09047
44367I48822n19146r70308r19515M2432J203957J468309P20037j08399k53055
44358A613134Q6715K49889K4996k09940j27081Q0332J7125k82181l40166R1043
44348A203866O34584P62963M41772L2696k66280n37305p84026q29708o06112k42580
44338a90130J76150O54298J027481R56517L11568o37028j476469j885727j628601
44329b691941p14831K86754N45615o4218o38543l41314M45958O77754K01814l0268
44319b323220N23657J094696P48250k09426p43519o08205m30804m27760p3299
$$ plain form
44387 3419 -223613 -396317 -261999 -31932 -214332 -832277 -1325889 -1277599 -773424 -39554
44377 -39554 734062 1136809 734997 -207516 -741208 -315394 569384 1113252 1157869 948822
44367 948822 429676 -540632 -1460147 -1417715 -213758 1254551 1974588 1866189 1613134
44358 1613134 1699849 1949738 1974734 1764794 1637713 1718045 1735170 1452989 1112823 1203866
44348 1203866 1838450 2601413 3043185 3075881 2809601 2272296 1488270 658562 52450 -190130
44338 -190130 -13980 640318 1667799 2624316 2935884 2298856 822387 -1063340 -2691941
44329 -2691941 -3406772 -3120018 -2574403 -2638621 -3277164 -3618478 -3172520 -2494766 -2292952 -2323220
44319 -2323220 -1799563 -704867 43383 -166043 -909562 -1517767 -1948571 -2376331 -2449630
44310b449630P46313J224834P94800M0771j66314J42209L63115L25713K39559
44301A261370N9771l10493n06785k00497J61711k7978m18742j62431O28416R37147
44291A421489L94025k91977n96923p79624r47969o77227k5271J87349k60809m18313
44281a995250K73576Q77556M25774m13860l60288M38427P24851J52538l46135
44272b22811j64993K10865K18627r832j72682k92398l78270k27045J54449M14900
44262d69190L66276K44723L30751O10616Q39691O98421L2436p74467r67857l80059
44252E31341J60017o6588n87326n13785K7509K27295O1492K35389P10231N80280
44242A365855l11428q63700l42495N40703Q08114N39735K91432K5309n04023r25385
$$ plain form
44310 -2449630 -1703317 -478483 316317 357088 190774 332983 696098 1021811 1261370
44301 1261370 1321141 1010648 503863 303366 465077 437099 18357 -144074 484342 1421489
44291 1421489 1815514 1523537 926614 146990 -800979 -1478206 -1503477 -1316128 -1576937 -1995250
44281 -1995250 -1721674 -844118 -418344 -832204 -1192492 -754065 -29214 123324 -222811
44272 -222811 -387804 -176939 41688 31856 -140826 -433224 -811494 -1038539 -884090 -469190
44262 -469190 -102914 141809 472560 1083176 1922867 2621288 2653724 1879257 911400 531341
44252 531341 691358 624770 37444 -476341 -448832 -221537 -160045 75344 785575 1365855
44242 1365855 1054427 190727 -151768 388935 1197049 1736784 2028216 2053525 1549502 624117
44232F24117p38531k18691J0373j9233J23862K78191j05688q09917q49402R5216
44222a609703R97549P38734l97168j040265m23678P34252J177130O05594j18071
44213F64374j59494L41191O91528O06024L28477N0176k63930n40640o00680n17060
44203E99966n22045n54270l78152j48407k78022o60039o38418M3667Q32254J129054
44193e74412R25536M49252k08831p87984p91251j73239M03516M30505J96469J54038
44183B3599J80504K587j32994J41251N80493O12836J33813m88344r50235j091776
44173i88266p46667k6988N22126N41816L34509K66461J26257l40619p30061n62873
44163a604305j61161q1622m2376N48724J237408R34719k49500q62089j96087O37572
$$ plain form
44232 624117 -114414 -333105 -322732 -341965 -218103 60088 -45600 -855517 -1704919 -1609703
44222 -1609703 -612154 126580 -270588 -1310853 -1734531 -1000279 176851 782445 664374
44213 664374 504880 846071 1537599 2143623 2472100 2522276 2258346 1717706 1117026 599966
44203 599966 77921 -476349 -854501 -1002908 -1280930 -1940969 -2579387 -2535720 -1703466 -574412
44193 -574412 351124 800376 591545 -196439 -987690 -1160929 -757413 -326908 -130439 23599
44183 23599 204103 206690 73696 214947 795440 1408276 1542089 1053745 103510 -988266
44173 -988266 -1734933 -1761921 -1239795 -697979 -363470 -97009 29248 -311371 -1041432 -1604305
44163 -1604305 -1765466 -1847088 -1889464 -1340740 -103332 831387 581887 -280202 -476289 161283
44153A61283M05260m50188o32910J7110M09730j07667q56943p89372K19629J285409
44143c38659J477705P10284k57054o41405l95784n7063J5241p7589k04122m44544
44133b12990p38801p23369k14069M50538Q21164Q19423N63851O5100n32605p16771
44123d18529j30316P93018J209480Q73691L30215O4103p5522m25614q83634j054432
44113B82460q06064l59295P8236M69172P48884P50946M36612K4370k35974l17761
44103A071586l45883l68987l32673k24167j12782n8660p1863j40494k30312l03567
44093a117802l89197n21500n37640j49862N81075J074089Q73833L11139Q7754
44084B11889K88571L28014q5736n01599m34997k5321K87061L25602J63086n7996
$$ plain form
44153 161283 566543 116355 -516555 -499445 -89715 -197382 -1054325 -1843697 -1624068 -338659
44143 -338659 1139046 1849330 1592276 950871 555087 498024 513265 435676 231554 -212990
44133 -212990 -951791 -1675160 -1889229 -1438691 -617527 201896 765747 830847 298242 -418529
44123 -418529 -548845 244173 1453653 2327344 2657559 2721662 2646140 2220526 1336892 282460
44113 282460 -523604 -882899 -804663 -335491 413393 1164339 1600951 1625321 1389347 1071586
44103 1071586 725703 356716 24043 -200124 -312906 -371566 -443429 -583923 -814235 -1117802
44093 -1117802 -1506999 -2028499 -2566139 -2716001 -2134926 -1060837 -187004 124135 211889
44084 211889 500460 828474 742738 241139 -193858 -219179 67882 393484 556570 498574
44074D98574o5951L24685P13578M02256m99879r34076l58467L52723J96360m39594
44064A90209n08453m8262k0161o29093j029673p57896l11567r8561J06995L36961
44054b769501J32875m23730l91237O24041J575584J316049K10435m34325j15102
44045b74911N10795P27316M53826j3223l16297j98917J50337J12890n07254r49791
44035c05229m68369M28120N41167k56679p29778l326J196057J509492O33884n14740
44025B030599j031762q56886m48127j30285N3998J23803N1608j52970l89671n28128
44015a277821m73797j99053J91888M39054L33509N807j85826j55035k04073m40023
44005a965370m35991R9044O39127M91789l7415L4780Q10240J184914M53210o05825
$$ plain form
44074 498574 432623 757308 1470886 1873142 1373263 439187 80720 433443 629803 190209
44064 190209 -318244 -366506 -386667 -1015760 -2045433 -2803329 -3114896 -3213457 -3106462 -2769501
44054 -2769501 -2636626 -3060356 -3451593 -2827552 -1251968 64081 274516 -159809 -274911
44045 -274911 235884 963200 1417026 1403803 1087506 888589 1038926 1151816 644562 -305229
44035 -305229 -773598 -345478 195689 -60990 -790768 -794094 401963 1911455 2545339 2030599
44025 2030599 998837 141951 -306176 -436461 -382463 -258660 -207052 -360022 -749693 -1277821
44015 -1277821 -1751618 -1950671 -1758783 -1319729 -986220 -980413 -1166239 -1321274 -1525347 -1965370
44005 -1965370 -2401361 -2302317 -1663190 -1171401 -1208816 -1174036 -363796 821118 1274328 668503
43995F68503q48280k85540K41448L58686L00357J41894k16545m93754k96692J39920
43985b90003K54394J12121K48776O12710N75151Q3121j51744J35608L12107L349
43975A895590k43897m8247m1916p88191j572646j314805k39121M60935M06057
43966a486241L42216O56011P50332K55091j77866P4763N49554M64053j4744j41071
43956A272098R3885l4499o83094j052775n92565J30070K52656j67561l36630J14584
43946a003831P15670Q79951N68190J06991k94892o10684p66232o22294k05610
43937a232741K02621L21327J86317J03173K46154M43687M93010N11265O66081
43928A940894O71881O6419q98850j234394m85759M48738L86361n47800j115105
$$ plain form
43995 668503 -179777 -465317 -223869 134817 435174 577068 360523 -133231 -429923 -290003
43985 -290003 -35609 76512 325288 937998 1513149 1596270 1444526 1580134 1892241 1895590
43975 1895590 1651693 1603446 1561530 773339 -799307 -2114112 -2353233 -1892298 -1486241
43966 -1486241 -1144025 -488014 262318 517409 339543 414306 963860 1427913 1413169 1272098
43956 1272098 1365983 1331484 648390 -404385 -996950 -866880 -614224 -781785 -1118415 -1003831
43946 -1003831 -288161 591790 1159980 1266971 972079 361395 -404837 -1027131 -1232741
43937 -1232741 -1030120 -708793 -522476 -419303 -173149 270538 763548 1274813 1940894
43928 1940894 2612775 2679194 1780344 545950 60191 508929 895290 347490 -767615
43919g67615o49356K17960O26037N29354L43135J63861j60575n59223q03604q31339
43909a891365o76943l12036J57351M13537L72489M15295P92457J089283P78880
43900A138948R3852k46025j11943j30760o25768r91486n28695M65425R65941N12746
43890E42235k29073l59193J50341N71481M71189J74526R9798J24214n4941l16522
43880A174055l64519l12488m38157n43909k57621J23466o3194o10143m77935N51295
43870a219150J215454M72993q87204j228992k01456J001817J267723O41810j00377
43861I62618k78817K21801P80603N18527n62668j272728o97369M61301Q71928
43852A005196N12604M77799R90486R45632k51135j581097j772663r03300P582
$$ plain form
43919 -767615 -1416971 -1199011 -572974 -43620 299515 463376 302801 -256422 -1060026 -1891365
43909 -1891365 -2568308 -2880344 -2722993 -2309456 -1936967 -1521672 -729215 360068 1138948
43900 1138948 1232800 986775 874832 744072 118304 -873182 -1401877 -936452 29489 542235
43890 542235 313162 -46031 104310 675791 1146980 1321506 1421304 1545518 1490577 1174055
43880 1174055 809536 497048 58891 -485018 -742639 -619173 -682367 -1292510 -1770445 -1219150
43870 -1219150 -3696 469297 -417907 -1646899 -1848355 -846538 421185 1062995 962618
43861 962618 683801 905602 1686205 2204732 1642064 369336 -328033 133268 1005196
43852 1005196 1517800 1995599 2986085 3931717 3680582 2099485 326822 -576478 -568896
43843e68896L41567J76534k34499o30674p12588m51496j85559q2566J39416O31780
43833a576981R83697P95626L22957R5192J79259K55983J84315N3399j45774m75620
43823F72053p63871p07683k57578L02215O21735N42221J93693j10504k01307k36436
43813E4538l74303m38623k72379k14527o28922j077358p40550K72350Q90344N99968
43803a929462J29290K14174N48618N43884L29847K58440R0089m66993r19807n93243
43793a795163K58054P64394O23223K27545j27529m01542l77458J46799Q15053
43784A33376J006154N83377j45289r29247j470139j246105k25085O28134M67307
43775a197517j41146n9512N84030O38725r1656n12460r7159K98918k656l91436
$$ plain form
43843 -568896 -227329 -50795 -285294 -915968 -1628556 -2080052 -2265611 -2348177 -2208761 -1576981
43833 -1576981 -593284 202342 525299 620491 799750 1055733 1240048 1293447 1147673 672053
43823 672053 -91818 -799501 -1057079 -754864 -133129 409092 602785 492281 290974 54538
43813 54538 -319765 -758388 -1030767 -1245294 -1874216 -2951574 -3692124 -3419774 -2529430 -1929462
43803 -1929462 -1800172 -1585998 -1037380 -493496 -163649 94791 184880 -282113 -1201920 -1795163
43793 -1795163 -1537109 -772715 -149492 78053 -49476 -451018 -828476 -681677 133376
43784 133376 1139530 1722907 1577618 648371 -821768 -2067873 -2292958 -1664824 -1197517
43775 -1197517 -1338663 -1398175 -814145 -175420 -267076 -779536 -876695 -577777 -580433 -971869
43765i71869j74904J64132j33331p17435o51931J39639Q49824R38753N67957R1337
43755A02172k34171j79988K34833N44312L21629k22250n10001l54218q2304K54
43745c79732n3057j985K56502M99261L23703k93983o77966j77921P59603R06987
43735A161412j16564j221641j276134n04165J18642K85321M21400P08352Q38431
43726D15054O11000J52397l54657o69075m23683M05397J157071J155599N42900
43717B992003o1201m53011p91923r45411o50367j71635j8661q7835J22779N00366
43707D35104L97407k15636n91224l90854j27213j26028K7799N40319P90098L18781
43697A058553k98371l39063r3920k87654p83216p93893j66186M51365O67022P28307
$$ plain form
43765 -971869 -1146773 -982641 -1115972 -1833407 -2485338 -2345699 -1495875 -557122 10835 102172
43755 102172 -131999 -311987 -77154 467158 788787 566537 56536 -297682 -379986 -379732
43745 -379732 -432789 -434774 -178272 320989 644692 350709 -327257 -505178 254425 1161412
43735 1161412 1044848 -176793 -1452927 -1957092 -1838450 -1553129 -1131729 -423377 415054
43726 415054 1026054 1178451 823794 154719 -268964 136433 1293504 2449103 2992003
43717 2992003 2930802 2477791 1685868 740457 90090 -81545 -100206 -188041 -65262 435104
43707 435104 832511 616875 25651 -365203 -492416 -618444 -590645 -50326 739772 1058553
43697 1058553 760182 421119 327199 39545 -743671 -1537564 -1703750 -1252385 -585363 142944
43687A42944P71419M96472j53823o60649o23898k80535j1K47077N12986M40084
43677H92066j98348q10874n60300L82703Q61473K63834n79209n24912K87592O95383
43667G09408K12335l69910k94504N3135p3467m88212l87525L17858Q76347Q85069
43657A440534P30246O61868L10152m49309r41921o54791j39227j83896n39049
43648B34607l52284L70735P04139K21591m23710n63168l56242j95174K3903M67842
43638A32239P09973J98184q13214j405077j084705l08011J64459J15775m9845
43629b340222J16087N97291R40676P38812P0327n62862p14896l62632J39234L52611
43619a025574Q8442l70157m60814l881M33997K06138m57680o80483j74007L90124
$$ plain form
43687 142944 914363 1410835 1257012 596363 -27535 -308070 -308081 -61004 451982 892066
43677 892066 693718 -117156 -677456 -294753 566720 830554 251345 -273567 14025 709408
43667 709408 921743 551833 257329 310464 236997 -251215 -638740 -320882 555465 1440534
43657 1440534 2170780 2832648 3142800 2693491 1751570 1096779 957552 773656 234607
43648 234607 -117677 253058 957197 1178788 755078 191910 -164332 -359506 -335603 132239
43638 132239 842212 1040396 227182 -1177895 -2262600 -2570611 -2406152 -2290377 -2340222
43629 -2340222 -2224135 -1626844 -686168 52644 122971 -439891 -1154787 -1517419 -1378185 -1025574
43619 -1025574 -937132 -1307289 -1768103 -1771984 -1337987 -1131849 -1589529 -2270012 -2444019 -2053895
43609b053895M79709M58695P36506Q40735J80486o90692o14827M26243J123625
43600H86585O31492l51293p21039m21822j32308o5110J46672O02546Q88928O98114
43590B162765J97157k74755n11784m27159q5742J89321M5285m61797q59869p54422
43580g81000j76855N42994J044116J075991O18513n6801o01128q95328r96025
43571b25523q33976k81942L98458N53853r2360q67981p77230K61537J182571J000189
43561C17596J022o54347m03497J33155J70369j55523j76171J63013K30529k15943
43551e89797n68256k64922L94793P52177O85330N07336L04514p382j51489K74456
43541A336760R71183J011563K5473j167089j466406p35791J90742N20681J92758
$$ plain form
43609 -2053895 -1574186 -1115491 -378985 461750 642236 -48456 -663283 -237040 886585
43600 886585 1518077 1166784 445745 23923 -108385 -173495 -26823 575723 1464651 2162765
43590 2162765 2359922 2085167 1573383 1146224 1060482 1249803 1295088 833291 -26578 -781000
43580 -781000 -957855 -414861 629255 1705246 2323759 2266958 1665830 770502 -225523
43571 -225523 -1059499 -1341441 -942983 -389130 -481490 -1349471 -2126701 -1865164 -682593 317596
43561 317596 318618 -335729 -739226 -606071 -435702 -591225 -767396 -604383 -373854 -589797
43551 -589797 -1158053 -1422975 -1028182 -276005 409325 916661 1221175 1213793 1062304 1336760
43541 1336760 2307943 3319506 3344979 2177890 711484 -24307 166435 687116 879874
43532H79874l21635n84312n21359l55379k85354k68610j81010r0526j37574j84083
43522b049968P0008N40715P24005M20042J04926K18271M10081K4044q24131j255058
43512a617065p88529L8139M48007L82313L24268M77563N88274M91138L81582M37676
43502A163366M88657K57479k21125n93784n48531j13860L34892L60835q9259m90741
43492E47929k30812N63266R52538K52857r97153j545167q82415K19413P11394
43483d08150M02215j01692k24779J10506N92786P78063L99523k96765o68310l93874
43473A89523P9786J03468l14627n80907l73150k2181L1603j51631j09281M29566
43463g17831J130774J270087M99437o00282j039311n98104n3250J8054O9733O65455
$$ plain form
43532 879874 558239 -26073 -547432 -902811 -1188165 -1456775 -1637785 -1728311 -1865885 -2049968
43522 -2049968 -1979960 -1439245 -715240 -295198 -190272 27999 438080 462124 -362007 -1617065
43512 -1617065 -2405594 -2367455 -1919448 -1537135 -1212867 -735304 -147030 344108 725690 1163366
43502 1163366 1652023 1909502 1688377 1094593 546062 432202 767094 1127929 1038670 547929
43492 547929 317117 880383 1832921 2085778 1088625 -456542 -1338957 -1119544 -408150
43483 -408150 -5935 -107627 -332406 -221900 370886 1148949 1548472 1251707 583397 189523
43473 189523 269309 372777 58150 -522757 -895907 -918088 -886485 -1038116 -1147397 -717831
43463 -717831 412943 1683030 2182467 1582185 542874 -55230 -108480 -90426 -20693 644762
43453F44762J295699J045405J63025j39485M75004R14748L07709p52025j183877
43444B770965q86447n35927m70255m83271l85471j54966K29839O28559O74508
43435A387534K84747r6026j65730k48240o04024p45699j52250O92444P94671K5332
43425A172759p68810r53533o66552k12381L28003P56844P26249K79822j05015
43416E57386j90724j99330k41607r9641K21308L02747j1005k47365k033L97415
43406D87151L55657j24670m61610k63564K46321N53216M03152K8478j24213P1963
43396A171881K35362q964m31399m50627J0824L21951l8761p76496j141642q18767
43386a926638k12774J00090K4728l4191K13954M82979L19901r0686l6693O07640
$$ plain form
43453 644762 1940461 2985866 3148891 3009406 3484410 4399158 4706867 3954842 2770965
43444 2770965 1884518 1348591 878336 395065 9594 -145372 84467 713026 1387534
43435 1387534 1672281 1576255 1410525 1162285 558261 -187438 -339688 352756 1147427 1172759
43425 1172759 403949 -549584 -1216136 -1428517 -1100514 -343670 382579 662401 557386
43416 557386 366662 167332 -74275 -173916 47392 350139 339134 91769 89736 487151
43406 487151 842808 718138 256528 -7036 239285 792501 1195653 1224131 1099918 1171881
43396 1171881 1407243 1398279 966880 516253 527077 849028 810267 33771 -1107871 -1926638
43386 -1926638 -2139412 -2039322 -2014594 -2048785 -1834831 -1351852 -1031951 -1122637 -1159330 -551690
43376e51690R70874L98038m44657m53394K50102M77624k58677j085053j058433
43367a755266l02904M35793O89444M28655p6701l12898M694L85714J41484m53566
43357h15551m68204R8042J88047m53562n95969M91431J593464J283429J33945
43348A455072k43737K88732M40158k37142p32047l63472K26092K49840j71431
43339I12065n63461p79118p30308k69209K91775L18376j41274k70405K41359O60668
43329c29532M06068l6665M028L10385K86974k3110j59508m3693J20165L43562
43319H78674N86876M06536l70280r67500n35293M90260Q38849J97877m21402l10262
43309G94335o8546m45772r84696o83259L78116R95901M67138n01075p98981k79421
$$ plain form
43376 -551690 419184 817222 372565 -80829 169273 646897 388220 -696833 -1755266
43367 -1755266 -2058170 -1622377 -932933 -504278 -580979 -893877 -889183 -503469 -361985 -815551
43357 -815551 -1283755 -1185713 -997666 -1451228 -2047197 -1555766 37698 1321127 1455072
43348 1455072 1211335 1500067 1940225 1703083 971036 607564 833656 1083496 912065
43339 912065 348604 -430514 -1160822 -1430031 -1138256 -819880 -961154 -1231559 -990200 -329532
43329 -329532 76536 39871 43899 354284 641258 618148 458640 414947 535112 878674
43319 878674 1465550 1872086 1501806 534306 -987 489273 1328122 1525999 1104597 794335
43309 794335 725789 280017 -704679 -1387938 -1009822 -13921 453217 -47858 -846839 -1126260
43299a126260L38135N75647O13654O73076N87278K01009k59063n30955o86642
43290C85879p98900n91854O4486N82079K58560o11596r50136l35832M68281O75446
43280h53587M58184L45909K92567j7776l87685l40429J00448M89241O24848N51076
43270A262796J25775o84659j219311o94576N34677J121349M31438o37098r49129
43261g08738n44364j70445j8689K40225M82704J41231p39602j251405p63282K09152
43251c123213O65576L14677k80852n33987l94087j33409N3604J36857J73556K83540
43241b837738N61439Q76086Q60530L01455m46217o41181N4350J019541J162404
43232I10669J14047j212417j510408n23417O60995Q63855R4457o68012p47490
$$ plain form
43299 -1126260 -788125 -212478 401176 1074252 1661530 1862539 1603476 1072521 385879
43290 385879 -413021 -1004875 -940389 -358310 -99750 -711346 -1661482 -1997314 -1529033 -853587
43280 -853587 -395403 -49494 243073 225297 -162388 -502817 -402369 86872 711720 1262796
43270 1262796 1388571 703912 -515399 -1209975 -675298 446051 877489 240391 -708738
43261 -708738 -1253102 -1423547 -1442236 -1202011 -719307 -578076 -1317678 -2569083 -3332365 -3123213
43251 -3123213 -2457637 -2142960 -2423812 -2957799 -3351886 -3485295 -3431691 -3294834 -3121278 -2837738
43241 -2837738 -2276299 -1400213 -539683 -238228 -684445 -1325626 -1271276 -251735 910669
43232 910669 1024716 -187701 -1698109 -2221526 -1560531 -696676 -602219 -1270231 -2017721
43223b017721l81390p0066J51639M81310P60558O24002J34459k17356k13087j73014
43213i20666l51499m79027k36421J24244R4559k78476l93142K0345M53781L01428
43203a664874l14104p10667m89786R5631N63560P01417O02445M50101L80552M03139
43193A7414L53475N4716l82804n76624l26993Q9432K74923K28605K37088L34474
43183C03706K54111k3529r7023K40912N71894M14660l1687j84465J0258K2557
43173A481394l56631o40481m31028p0032q3825l49151l41892j8318J13793k20333
43163i16504p05609r24333p56622k15022O38065J419697J546142R42765K58892
43154A287471K8661j2140l33770p04136n16329J51112N37490L27281P3597K48846
$$ plain form
43223 -2017721 -2399111 -2469177 -2317538 -1836228 -1075670 -451668 -317209 -534565 -747652 -920666
43213 -920666 -1272165 -1751192 -1987613 -1863369 -1768810 -2047286 -2440428 -2420083 -1966302 -1664874
43203 -1664874 -1978978 -2689645 -3179431 -3083800 -2520240 -1818823 -1216378 -766277 -385725 17414
43193 17414 370889 425605 42801 -533823 -860816 -771384 -496461 -267856 -30768 303706
43183 303706 557817 534288 437265 678177 1250071 1664731 1633044 1448579 1458837 1481394
43173 1481394 1124763 484282 53254 -16778 -100603 -449754 -791646 -809964 -696171 -916504
43163 -916504 -1622113 -2546446 -3303068 -3518090 -2880025 -1460328 85814 1028579 1287471
43154 1287471 1316132 1303992 970222 266086 -250243 -99131 438359 765640 839237 1088083
43144A088083N06481L12160j82154m24725l02414j46881r8459q538J05470L1358
43134H80381j87163k29701j5068J46593J6571k87164n41260o27693m39155N4457
43124a229202N48467N97152K08445j27654j54162j65075l85257m95183j50075
43115a352544M00020O53119N44246L50845J64367l6813J3676N83020J267369J211676
43105C798981J83707j014729j443692j029241m65377l46327o03204o79596j40066
43096a739544Q17523J435231J114244P4672q43963j031690o02613q4191J59614
43087g00717J60790J85222L94210N92039L90493k48047p93779p21849j66357L00024
43077f07971M15746L83706L62986K70900J16624N7624M91l98764j110180j485557
$$ plain form
43144 1088083 1594564 1906724 1724570 1299845 997431 850550 752091 743553 849023 880381
43134 880381 693218 463517 448449 595042 611613 324449 -216811 -844504 -1283659 -1229202
43124 -1229202 -680735 -83583 124862 -2792 -156954 -322029 -707286 -1202469 -1352544
43115 -1352544 -952524 -299405 244841 595686 760053 723240 736916 1319936 2587305 3798981
43105 3798981 3982688 2967959 1524267 495026 29649 -316678 -919882 -1599478 -1739544
43096 -1739544 -922021 513210 1627454 1702126 858163 -173527 -776140 -860331 -700717
43087 -700717 -539927 -354705 39505 631544 1022037 773990 -19789 -741638 -907995 -607971
43077 -607971 -192225 191481 554467 825367 941991 999615 1000106 601342 -508838 -1994395
43067a994395r43442L11166J460593J804692J230008K08973n41545o46017m27120
43058D62913m47349o81873n35823K16958R76814J048944M44516l17485q30133
43049C37482r06929m51116L56970R86375J058932P50064M01129P923n44250j018395
43039I78185j059697p17946l11617O0474M27269N37334R2671o37369r63953o32929
43029b227578j03804J37596J56449K87108N81286P64660O11488K32378K6954L06468
43019G73005Q59389J017990L77296o37934j180756r20949l35311p4706k68162
43010c90138m83816k41352M30378R09547O24813j53135m99984k9292N26183L40536
43000A033740l07943n08164j16900J22584j56322m01368j07184L92385N06630
$$ plain form
43067 -1994395 -2937837 -2626671 -1166078 638614 1868622 2077595 1536050 890033 462913
43058 462913 15564 -666309 -1202132 -985174 -8360 1040584 1485100 1167615 337482
43049 337482 -569447 -1020563 -663593 322782 1381714 2131778 2532907 2540830 1996580 978185
43039 978185 -81512 -799458 -1111075 -1050601 -623332 -85998 6673 -630696 -1594649 -2227578
43029 -2227578 -2331382 -2193786 -2037337 -1750229 -1168943 -404283 207205 439583 466537 773005
43019 773005 1632394 2650384 3027680 2389746 1208990 288041 -47270 -121976 -390138
43010 -390138 -873954 -1115306 -684928 224619 849432 696297 196313 167021 693204 1033740
43000 1033740 725797 217633 100733 223317 66995 -334373 -441557 -49172 457458
42991D57458K34401j8595r0275j04549j34642j91828l27457m39669k27175L39560
42981e02771P58506N97061J40107j7635J10980n3105o42373r33227k83218Q74937
42971D9262J447579J004377K31611n5657P5187J1746l45956m55086q1522K21174
42961B102715j00868p72095j070422p50860j52846L80084P05374O68269K07393
42952A216744l65353o34958n89316m56502j94143L10871O65957L21651m47325
42943a72374o71969n1270N09830J20956q94701j470621j047528M3075J067960
42934b566642J402591R29565K80955K98763R20333J080203J60457r89693j125433
42925C91099k83245L90674K54385k23431m36376l82125k35774Q5979N41766O79953
$$ plain form
42991 457458 691859 673264 582989 478440 343798 151970 -175487 -615156 -842331 -502771
42981 -502771 255735 852796 992903 975268 1086248 1033143 390770 -542457 -825675 49262
42971 49262 1496841 2501218 2732829 2677172 2752359 2764105 2418149 1963063 1881541 2102715
42961 2102715 2001847 1229752 159330 -591530 -744376 -364292 341082 1009351 1216744
42952 1216744 851391 216433 -372883 -829385 -1023528 -712657 -46700 274951 -172374
42943 -172374 -844343 -895613 -385783 -264827 -1159528 -2630149 -3677677 -3634602 -2566642
42934 -2566642 -1164051 -234486 46469 345232 1265565 2345768 2506225 1516532 391099
42925 391099 107854 498528 752913 529482 93106 -289019 -524793 -438814 102952 782905
42915G82905K26074l52019l57901J68434M45142k8701p95617r99242m20839L44489
42905i87275P00816O75698N83633M31972M8647m03486n27363k77006O892J54217
42895D06745K83619L33435N2906l79488l49668K57755O92437L47660l58855o34754
42885F51792m23577k62525l31847l02015j5400K54735K41371j4458k85478l16844
42875h04246O396M05341L53976k31694p36819o07830m1163M44459P01519P45308
42865B35247L33661n51381j160624p32265L64770R94577O83602L146l81163l34085
42855e44515J3890M37607N28211R9308l42960j83102L41427M67850P1222l02958
42845E85980m42947n88651o31716k38465K33771R0471l53625p3922P98229Q76133
$$ plain form
42915 782905 1008979 656960 299059 467493 912635 883934 88317 -910925 -1331764 -987275
42905 -987275 -286459 389239 972872 1404844 1453491 1050005 522642 245636 252528 406745
42895 406745 690364 1023799 1076705 697217 347549 605304 1297741 1645401 1286546 651792
42885 651792 228215 -34310 -366157 -668172 -683572 -428837 -187466 -201924 -487402 -804246
42875 -804246 -797850 -392509 -38533 -270227 -1007046 -1614876 -1656039 -1211580 -510061 235247
42865 235247 568908 17527 -1143097 -1875362 -1510592 -516015 167587 170733 -210430 -544515
42855 -544515 -530625 -93018 435193 534501 191541 8439 349866 817716 888938 585980
42845 585980 143033 -445618 -1077334 -1315799 -1082028 -991557 -1345182 -1419104 -620875 255258
42835B55258k09813r80509m09413M23211J89218m77708j79432Q07403J044258
42826D62473L40203j16326J39144K85413j07676l53354L712L67787J59958k58552
42816I22782k66780J40870N87782Q14543O42381L1854n87477o50939l07423k77959
42806A049634o88458p96252j76428N65153O74888J97354l86033q50398j095064
42797a505604q79564k04653M74986Q24601R66209R37848M69532k50767l49436
42788D83152M67831J099838M55195q16582j124811k32518M80826J45859m38364
42779E20426k55739L57455M05663j72221n33936k76704J21112K09337J77422L26629
42769H79444M84642L21316p7963l49252l99434m45609n58544n39410l21468j51233
$$ plain form
42835 255258 45445 -935064 -1344477 -921266 -732048 -1209756 -1389188 -581785 462473
42826 462473 802676 686350 825494 1110907 1003231 649877 653589 1021376 1181334 922782
42816 922782 656002 796872 1384654 2199197 2841578 2873432 2285955 1635016 1327593 1049634
42806 1049634 361176 -435076 -611504 -46351 628537 825891 439858 -410540 -1505604
42797 -1505604 -2385168 -2589821 -2114835 -1290234 -324025 613823 1083355 832588 483152
42788 483152 950983 2050821 2506016 1689434 564623 332105 812931 958790 520426
42779 520426 264687 622142 1027805 855584 321648 44944 166056 375393 552815 879444
42769 879444 1364086 1685402 1607439 1258187 858753 413144 -145400 -684810 -1006278 -1157511
42759a157511j80483j55682J99445O71110P74894M42163J50698L02887P32410
42750A779931R39384O39041j3674o12081q47588p62385o42821n87604l43426K16128
42740b35095O69400N30841L2336j38400J10037J36601l31268o59522k81999M02062
42730B34993O61733M52868J65356j75938o65839q39670k03278O93090P28131j56798
42720H94648p99223n48595j39278l31159o51700l08042L92079N55693K11919K09385
42710e14273P17238R00405L09288l25233j78614M17960M42250l89179j231246
42701A48596j162937k63944N14233M28924k62565o76829l80927J75974L98468
42692a081007L41205M12960N74362L89560j98601p21503q70212p79554n24167
$$ plain form
42759 -1157511 -1337994 -1493676 -1294231 -623121 151773 593936 744634 1047521 1779931
42750 1779931 2719315 3358356 3344682 2732601 1885013 1122628 479807 -107797 -451223 -235095
42740 -235095 434305 965146 997482 859082 969119 1105720 774452 114930 -167069 234993
42730 234993 896726 1349594 1514950 1339012 673173 -166497 -369775 323315 1051446 894648
42720 894648 95425 -453170 -592448 -923607 -1575307 -1883349 -1491270 -935577 -723658 -514273
42710 -514273 202965 1103370 1412658 1087425 908811 1326771 1769021 1379842 148596
42701 148596 -1014341 -1278285 -764052 -335128 -597693 -1274522 -1655449 -1479475 -1081007
42692 -1081007 -739802 -326842 247520 637080 438479 -283024 -1153236 -1932790 -2456957
42683b456957N1592P46061Q64043J22372p71562r39730l74905K95943P01283Q26735
42673i35125N89229N09m55511l17558R4887J16800j76618j33331K39555J80738
42663g96425m30338o01088K48799J148036Q46410l21730q54364j57431P76347
42654a41784Q72862L26149O6621M19108P74943M42232m88337j176493r19882n378
42644A70041N21242R4654o44128p21747j59425J76166m8124j74287K91420P89245
42634B95057N16397l41526q42259n34054J52321O84810R71889J018221O40149
42625B561005j36796p99384q84607n84726m28516m94834l67993J36671O42481
42616c56699P58152N96330M87007M31166J74383l01739p07074q54199q43068p73557
$$ plain form
42683 -2456957 -2405365 -1659304 -795261 -672889 -1444451 -2384181 -2759086 -2463143 -1761860 -935125
42673 -935125 -345896 -345387 -800898 -1118456 -1023569 -906769 -1083387 -1216718 -977163 -796425
42663 -796425 -1226763 -1827851 -1579052 -431016 415394 93664 -760700 -918131 -141784
42654 -141784 731078 1057227 1123848 1542956 2317899 2760131 2271794 1095301 175419 170041
42644 170041 691283 785937 141809 -579938 -739363 -563197 -611321 -785608 -494188 295057
42634 295057 811454 469928 -372331 -906385 -754064 -69254 902635 1920856 2561005
42625 2561005 2424209 1624825 740218 155492 -273024 -767858 -1135851 -999180 -356699
42616 -356699 401453 997783 1484790 1915956 2090339 1788600 1081526 227327 -615741 -1389298
42606a389298n28305K3477P47943J278233J269883O53459k27247p69512o17822
42597D40811l5928M03387M54602K77037k4676m83344q42323o13362J39217N77727
42587B93148J39992n59512m79774L90928R86196N82616l31102p82597m37910K58544
42577F0529P07238O17911Q1107n18886p39369m40017Q7803M29248M45138L20200
42567A050902K70636K64708N9910m43542r30440r32393m20637Q8952J71207n533
42557h26230l0567J46751K82224K93799K72319J82599n6428l12526m34919n37964
42547a020942o66277m33378L79776J063935O60017n69745j245116o95075J83899
42538b342906L29528m6447p3240L71834O72554N22550K23086J17826L11955P72886
$$ plain form
42606 -1389298 -1917603 -1894126 -1146183 132050 1401933 2055392 1828145 1058633 440811
42597 440811 404883 808270 1262872 1539909 1515233 1031889 189566 -423796 -284579 293148
42587 293148 433140 -126372 -606146 -215218 770978 1353594 1022492 239895 -198015 60529
42577 60529 767767 1385678 1466785 947899 208530 -231487 -143684 285564 730702 1050902
42567 1050902 1321538 1586246 1646156 1202614 272174 -660219 -1080856 -991904 -820697 -826230
42557 -826230 -856797 -710046 -427822 -134023 138296 320895 264467 -48059 -482978 -1020942
42547 -1020942 -1687219 -2120597 -1740821 -676886 -16869 -586614 -1831730 -2526805 -2342906
42538 -2342906 -2013378 -2059825 -2133065 -1761231 -1088677 -566127 -343041 -225215 86740 859626
42528H59626J202354J038573J26182q20420r64937l80759J75997K94056J37954
42519A668626j00364l00788j45689M96202J003410O12983l91314r15032n71298
42510A356736j11847j39088l05777k22465k77397q53746j389937j058239j5855
42501c017615Q02458R38649P31964M85895O9283n12100p79037l71802L51183O50985
42491f50137K44824m03010o09465j74772M73538P79475O00988K19992l3124J0173
42481D58482L73157Q34941Q76569J65336q15870j086667l57490N09877N59677
42472A518012r6900n83404m24635P5507M37046M59260J19565m87450j023362j088066
42462a094427o46121m1131M19494O39640N50127J19910l94517n66555l09211l168
$$ plain form
42528 859626 2061980 3100553 3226735 2406315 1441378 1060619 1236616 1530672 1668626
42519 1668626 1568262 1267474 1121785 1617987 2621397 3234380 2843066 1928034 1356736
42510 1356736 1244889 1105801 800024 577559 300162 -553584 -1943521 -3001760 -3017615
42501 -3017615 -2215157 -1276508 -544544 -58649 10634 -501466 -1280503 -1652305 -1301122 -650137
42491 -650137 -405313 -808323 -1417788 -1592560 -1119022 -339547 261441 481433 448309 458482
42481 458482 831639 1666580 2543149 2708485 1892615 805948 448458 958335 1518012
42472 1518012 1421112 837708 413073 488580 925626 1384886 1504451 1017001 -6361 -1094427
42462 -1094427 -1740548 -1781679 -1362185 -722545 -172418 -52508 -447025 -1013580 -1322791 -1325959
42452a325959J7889j23940r9807J68086M62546N59808M30243K24796J32838J95100
42442F41600K45790J11435j69618m25506n72597o11482m93124j96934J15321K37801
42432a117314J65907J5004j85804l64772k44121K96012Q00961O88516J07854j94411
42422c2168M1290K34355o0498m15322k05796M12661P30936M49929m2142k30911
42412H82334J8536L90690L32032m28826j351446j428560l93593P88256J052019
42403a38558M75836j06784l20653l88577l78050j43420J02240r147k34564K3907
42393a117770O52014Q75504N06716K15069L06194K30225k50873m37109O5148M28432
42383A473550r9482p60279l35674Q61060J353056O91237k6267M3500L93020K89845
$$ plain form
42452 -1325959 -1308070 -1432010 -1531817 -1363731 -901185 -341377 88866 313662 446500 641600
42442 641600 887390 998825 829207 403701 -168896 -780378 -1273502 -1470436 -1355115 -1117314
42432 -1117314 -951407 -936403 -1122207 -1486979 -1731100 -1435088 -634127 54389 162243 -32168
42422 -32168 9122 243477 182979 -232343 -438139 -25478 705458 1155387 1113245 882334
42412 882334 900870 1291560 1623592 1194766 -156680 -1585240 -1978833 -1190577 -138558
42403 -138558 337278 230494 -90159 -478736 -856786 -1000206 -897966 -907113 -1141677 -1117770
42393 -1117770 -465756 409748 916464 1131533 1437727 1667952 1417079 979970 1045118 1473550
42383 1473550 1374068 613789 278115 1139175 2492231 3183468 3157201 3200701 3593721 3883566
42373C883566m9450o4494J19588n953m54006p98673q34692o81769m58489k68987
42363C86641k95561n18380n47431j01982N32478Q72380Q45640O54066K67823m24580
42353A671094j077796j095966m81297K8471r1239m49595l13628L61183Q69151
42344e79622O86067J15040j39374J70413O33896P75177N77549L11228O1985l08881
42334B303478q03506j164456j173774q79276m57972l7438K70480L53136K47562
42325a341766J66925K50505L99122M54803M07512L13373J56576o0547k21995k69067
42315B55441l69268p07822j124072j131153l85599Q70385J849828J802348P32385
42306A792473m54235p37011j7129P99839Q47067K14043l20494k41498K63298O55996
$$ plain form
42373 3883566 3834116 3769622 3889210 3883257 3429251 2630578 1795886 1114117 655628 386641
42363 386641 91080 -427300 -974731 -1076713 -544235 328145 1173785 1827851 2095674 1671094
42353 1671094 593298 -502668 -983965 -955494 -1046733 -1496328 -1809956 -1448773 -579622
42344 -579622 106445 221485 82111 252524 886420 1661597 2239146 2550374 2612359 2303478
42334 2303478 1499972 335516 -838258 -1717534 -2175506 -2212944 -1942464 -1589328 -1341766
42325 -1341766 -1174841 -924336 -525214 -70411 337101 650474 807050 746503 524508 255441
42315 255441 -113827 -821649 -1945721 -3076874 -3462473 -2592088 -742260 1060088 1792473
42306 1792473 1338238 601227 584098 1383937 2231004 2445047 2124553 1883055 2146353 2802349
42296B802349N44736j00409r24906j357716j055426k71172L75427N44799M20339
42287I78021K48937q7569p46164j297105r32981M07971J506606J078839m92239
42278F64316j359978m79518J013674J343245M46909k11797O8111L89397l2525
42269A841834n52667k42237N52624P92591L59076O5878K94546N74361M98651K13544
42259D398201j12279n59326r95085r86360m74540m5573j99113o89137q74029m87075
42249a024316J50477N08375L10815k28632n83099m61723j33901j7548q1045K3433
42239a537164L44949N76106N85020N54997N45761L79196J00665J04768N37600
42230B191898R03365N93238l27369j092192r85400o9572Q12456Q44111J27953
$$ plain form
42296 2802349 3347085 3246676 2321770 964054 -91372 -362544 12883 557682 978021
42287 978021 1226958 1139389 393225 -903880 -1836861 -1428890 77716 1156555 664316
42278 664316 -695662 -1175180 -161506 1181739 1628648 1416851 1484962 1874359 1841834
42269 1841834 1289167 1046930 1599554 2392145 2751221 2817099 3111645 3686006 4184657 4398201
42259 4398201 4285922 3726596 2731511 1745151 1270611 1225038 1025925 336788 -537241 -1024316
42249 -1024316 -873839 -365464 -54649 -283281 -866380 -1328103 -1462004 -1479552 -1560597 -1537164
42239 -1537164 -1192215 -616109 -31089 523908 1069669 1448865 1549530 1654298 2191898
42230 2191898 3095263 3688501 3361132 2268940 1283540 1213968 2026424 2870535 2998488
42221B998488m05619j44736M33188M71850p7037n14118m77799l21710l67468l98713
42211A196326j15836L60262O79505O61506L64572l085k12087k81292n05021r10021
42201A234829r45805k33431O28248P17125J12460k47003M685K73940J50552l2586
42191A663014n5427k69733p72857r98564o42455j95014l1456K08416P41145R98012
42181F45081O06849K09814M21948P02775K90429l48212j89341N90129P76987p827
42171C698632p47185n40157K37149O12937K16349n27137r73267p93030j77554
42162A006737L69328N21183L14785j40620p32974j041602o07148K08361M00233
42153B98283j69892l36276N60149J371125P61969o59335j221988o57751j29590
$$ plain form
42221 2998488 2592869 2448133 2881321 3353171 3276134 2762016 2284217 1962507 1595039 1196326
42211 1196326 1080490 1440752 2120257 2781763 3146335 3143250 2931163 2649871 2144850 1234829
42201 1234829 289024 55593 683841 1400966 1513426 1266423 1271108 1545048 1695600 1663014
42191 1663014 1607587 1337854 564997 -433567 -1076022 -1271036 -1302492 -1094076 -352931 645081
42181 645081 1251930 1461744 1883692 2586467 2876896 2528684 2339343 2929472 3706459 3698632
42171 3698632 2951447 2411290 2648439 3261376 3477725 2950588 1977321 1184291 1006737
42162 1006737 1376065 1897248 2212033 2071413 1338439 296837 -310311 -101950 298283
42153 298283 128391 -207885 352264 1723389 2485358 1826023 604035 -53716 -183306
42144a83306q0115K36306R65227J088027J66866p64116p60584k78261j72088l50270
42134a32314k42308J23644L10478K52051K06824K86649M55591O39592N91694J20504
42124B612405l79731k47165M01236O61069J56394m07874l88342j10092j19080
42115B178820k52662r1815K14544K16505j22435m74258n79724k88859M20748J153294
42105B374158J270547O56503j25902o21268q73963r05291n43201k3585M1937l55748
42095H94187m85561p6300K44080J42830K02167P27379R74533M00367k70922k08407
42085B544353J48623l3333m72554l60200J07681Q8167l49885l09106L86050Q67576
42075B617372N21723l20379j061906j404650j167812k83012Q65048J600519J574177
$$ plain form
42144 -183306 -263421 -27115 938112 2026139 2193005 1428889 668305 390044 217956 -132314
42134 -132314 -374622 -250978 59500 311551 518375 805024 1260615 1900207 2491901 2612405
42124 2612405 2232674 1985509 2386745 3047814 3204208 2796334 2407992 2297900 2178820
42115 2178820 1926158 1834343 2048887 2265392 2142957 1668699 1088975 800116 1220864 2374158
42105 2374158 3644705 4301208 4175306 3554038 2680075 1774784 1231583 1207998 1249935 894187
42095 894187 408626 332326 576406 719236 921403 1648782 2623315 3023682 2752760 2544353
42085 2544353 2692976 2659643 2187089 1826889 1934570 2022737 1672852 1363746 1749796 2617372
42075 2617372 3139095 2818716 1756810 352160 -815652 -1098664 -233616 1366903 2941080
42066B941080R70505K45554j29013j409J51480k75067j019232j171754o18934
42057A093210k74901m71054l58420L88572O88844l8937n21983L28713J342414
42048B176458Q87993l43891m66742M90427Q64225K60786j36796O4156R9425J9106
42038C915147P28466J900929K092638J226932P95135J279718J594666J427806
42030A4961437J793067K780160L176653K922739L480109N156902O692941Q070323
42022D9034331J0746143J4603234J8535188K4800168L7069956N0867243N1785351
42015B57441614K9996958n807939l5262665m6315665m3136313l5500673k7790177
42008I3625140k0237060j4155440j1029038r550264p523572n109523l608843k777534
$$ plain form
42066 2941080 3911585 4157139 4028126 4026717 4178197 3903130 2883898 1712144 1093210
42057 1093210 818309 347255 -11165 377407 1066251 1027314 505331 834044 2176458
42048 2176458 3064451 2720560 2253818 2744245 3608470 3869256 3732460 3796616 3896041 3915147
42038 3915147 4643613 6544542 8637180 9864112 10659247 11938965 13533631 14961437
42030 14961437 16754504 19534664 22711317 25634056 29114165 34271067 40964008 49034331
42022 49034331 59780474 74383708 92918896 117719064 154789020 205656263 257441614
42015 257441614 287438572 281630633 246367968 200052303 156915990 121415317 93625140
42008 93625140 73388080 59232640 48203602 38653338 31129766 26020243 22411400 19633866
42000A9633866j782399j245305j919484k609851j764705j66918J99152p58872
41992I585484j412082j165371r53364j157847r65859j3402Q71262R29450L74658
41983F092929k25702o06346o78098m44357j48351l0390l1249q6424l41220o53211
41973B847581m50634L31203Q22064M64081P831L49953J033710J030632M99479
41964F935900M85705J149360J600201J441524J230634J273168J082904L07479
41956A5506875p26671j630663k311164k556263k076883j146521m59154k19067
41948D380489q7840l7331l63111p86272n72905K12508O10735K81397M6012L95536
41938D079218N45216k07457j110459r95199p1298M27397P3909l36965j40518L77957
$$ plain form
42000 19633866 17851467 16606162 14686678 12076827 10312122 10145204 10344356 9585484
41992 9585484 8173402 7008031 6054667 4896820 3930961 3917559 4788821 5718271 6092929
41983 6092929 5867227 5260881 4582783 4138426 3990075 3959685 3928436 3842012 3500792 2847581
41973 2847581 2396947 2728150 3550214 4014295 4022126 4372079 5405789 6436421 6935900
41964 6935900 7421605 8570965 10171166 11612690 12843324 14116492 15199396 15506875
41956 15506875 14780204 13149541 10838377 8282114 6205231 5058710 4599556 4380489
41948 4380489 4292649 4255318 3892207 3105935 2533030 2745538 3356273 3637670 3683682 4079218
41938 4079218 4624434 4416977 3306518 2311319 2240021 2667418 2741327 2404362 2263844 2641801
41928B641801O66222O52408N23141K80288j47762o24010q67351o88896j08362
41919B327479O33027J171076J278882J064575Q56031R19818J298556J817083K268483
41910A3635010K764522L786155N460551O762593O049322K789977j603866n055203
41902C4589061o613781o647557n757316m232587k433883r63980k29649j74844
41894G535464n10324r21764j106362r71661p85702q01199q07390m46235J22325
41885A307152L76458K40330J71357L40169L08258k28808q93290j166111j068903
41876f13388r38251q53143o73372l89232n8517L93853R53133J275511J034637
41867A31231L78590k61072o45823p11203l30504M32841J006639Q16677J16695
$$ plain form
41928 2641801 3308023 3960431 4483572 4763860 4616098 3992088 3124737 2435841 2327479
41919 2327479 2960506 4131582 5410464 6475039 7331070 8250888 9549444 11366527 13635010
41910 13635010 16399532 20185687 25646238 32408831 38458153 41248130 39644264 34589061
41902 34589061 27975280 21327723 15570407 11337820 8903937 7939957 7710308 7535464
41894 7535464 7025140 6103376 4997014 4025353 3239651 2438452 1631062 1184827 1307152
41885 1307152 1683610 1923940 2095297 2435466 2743724 2514916 1621626 455515 -613388
41876 -613388 -1551639 -2404782 -3078154 -3467386 -3525903 -3132050 -2178917 -903406 131231
41867 131231 509821 248749 -397074 -1108277 -1438781 -1005940 699 817376 934071
41858I34071k27230J16295N26911L61517j81002m55173k67030K5070R5599n9579
41848H69449l33324o46824q43359p00800j65916N07173R00251P31002J11554m54747
41838b5541m89517n8142K78506J65878p7231O4779N03002N87696K119p23706q12419
41827e84576j72589N27463O72618L28781k2555j42754j79762k39670j52426J95094
41817B29624N36976M86406Q434n65268q83034p47365j49869N40102O34808j01291
41807a0477q28229m43015Q70086J628650R42867k80724o13473K267M43296J31435
41797A842683l72134m61058k89042k57778l78676m54652m13422k06036K07323
41788g82792N64840M25108j88466o62335n46731p0461L05476M58820M99470M85185
$$ plain form
41858 934071 706841 823136 1350047 1711564 1530562 1075389 808359 833429 929028 869449
41848 869449 536125 -110699 -954058 -1654858 -1820774 -1313601 -413350 317652 429206 -25541
41838 -25541 -515058 -573200 -294694 -128816 -206047 -141268 361734 949430 951549 227843 -584576
41827 -584576 -757165 -229702 442916 771697 749142 606388 426626 186956 34530 229624
41817 229624 766600 1253006 1261440 696172 -186862 -934227 -1084096 -543994 90814 -10477
41807 -10477 -838706 -1281721 -411635 1217015 2159882 1879158 1265685 1267952 1711248 1842683
41797 1842683 1470549 1009491 720449 462671 83995 -370657 -784079 -990115 -782792
41788 -782792 -217952 207156 18690 -643645 -1190376 -1260837 -955361 -496541 2929 488114
41778D88114N04987O77327Q20265N26928j60803n94083l60884J46609L54440K13778
41768B616678j12133o83009j311598j235241r3232J161805J278478M27141q2932
41759A965957K56747N73602J54442n13922p27311o63847p86284q19395j89403
41750g49414Q36883J277721P08820j79770m50442K611M26276J53364n62460q03376
41740F60213j58541O40545O39291k5094l98567k32310l05305r41905j221045m10972
41730a753690O17066M81962o48461j274539p36474J4355M0566k74973j07074M47520
41720c193742O38010K39282k52341m10315k72739P705M25179R29365J250171J055876
41710D16451K75422o82928j097321o03885K36408M25206k21345p36626k85658
$$ plain form
41778 488114 993101 1670428 2490693 3017621 2856818 2262735 1901851 2048460 2402900 2616678
41768 2616678 2504545 1821536 509938 -725303 -818535 343270 1621748 2048889 1965957
41759 1965957 2222704 2796306 2950748 2436826 1709515 1045668 259384 -560011 -749414
41750 -749414 87469 1365190 2074010 1894240 1443798 1446409 1872685 2026049 1463589 660213
41740 660213 501672 1142217 1781508 1756414 1357847 1125537 820232 -121673 -1342718 -1753690
41730 -1753690 -1136624 -654662 -1303123 -2577662 -3314136 -3299781 -3259215 -3534188 -3641262 -3193742
41720 -3193742 -2555732 -2316450 -2568791 -2979106 -3251845 -3244140 -2818961 -1889596 -639425 416451
41710 416451 691873 8945 -1088376 -1692261 -1455853 -1030647 -1251992 -1988618 -2274276
41701b274276O33907Q55487J39468o26527p74204n98082n28933l35005L11912
41692c196253J003037J020532L78320j99346k80165j33265r8482r3004P8153L59735
41682a160738O12478P80589O95627J15116p50998j146611o37671K00065M53018
41673h39125N7582k19707P3015N31109O08851L38800O2955j45111m22999p14585
41663f69215p67206m53853J13752P14452J118461J179111R63042O72398L44825
41654C215767j73631q14494j089481n91866M07882J123300J002217K00385o02567
41645B677512p55196j68373N34443N62188j61181q36402p30625o6257L53183K23993
41635A633285M92R7876L11426K13522j98915n18980m39793j9118N21486J056172
$$ plain form
41701 -2274276 -1640369 -784882 -645414 -1271941 -2046145 -2644227 -3173160 -3508165 -3196253
41692 -3196253 -2193216 -1172684 -794364 -993710 -1273875 -1407140 -1505622 -1598626 -1520473 -1160738
41682 -1160738 -548260 232329 927956 1043072 292074 -854537 -1492208 -1292143 -839125
41673 -839125 -781543 -1001250 -928235 -397126 211725 550525 613480 468369 45370 -669215
41663 -669215 -1436421 -1890274 -1776522 -1062070 56391 1235502 2198544 2870942 3215767
41654 3215767 3042136 2227642 1138161 546295 954177 2077477 3079694 3280079 2677512
41645 2677512 1922316 1753943 2288386 2850574 2689393 1852991 1122366 1056109 1409292 1633285
41635 1633285 1633777 1731653 2043079 2256601 2057686 1538706 1098913 1079795 1601281 2657453
41625B657453J518847J726538J483753R60924P00473R26575J054227M06370o66097
41616A0769063j104882p13972n21731j118946j587602r76036l3399j72119j146566
41607C393810j312695k27836N94816K4952j025591j163938n80985l86870o48486
41598a332823m04520O22616J483127J274805J92471q44463j129254o87652j87833
41589a013526k49695o44493n15797L41276R83345O15419j99413l75104J33842
41580i24146M98864L88903J66522q7487o63811j326387j355872o56226P5644M28729
41570c455267O41054P75916N47839J97845M52774J201674J301325K92384p34852
41561A220692p58894l46828n83191j263283j289179l87426O56112J188853J150994
$$ plain form
41625 2657453 4176300 5902838 7386591 8347515 9047988 9974563 11028790 11435160 10769063
41616 10769063 9664181 8950209 8428478 7309532 5721930 4745894 4712495 4540376 3393810
41607 3393810 2081115 1853279 2448095 2473047 1447456 283518 -297467 -684337 -1332823
41598 -1332823 -1737343 -1114727 368400 1643205 1835676 991213 -138041 -825693 -1013526
41589 -1013526 -1263221 -1907714 -2423511 -2082235 -1098890 -483471 -682884 -1057988 -924146
41580 -924146 -425282 -36379 130143 42656 -621155 -1947542 -3303414 -3959640 -3883996 -3455267
41570 -3455267 -2814213 -2038297 -1490458 -1292613 -839839 361835 1663160 1955544 1220692
41561 1220692 461798 114970 -468221 -1731504 -3020683 -3408109 -2751997 -1563144 -412150
41552d12150O00267k43995o54719r5606P70447P31335k57475r48141n67814K18021
41542h59830M74727L06420M11288Q72061J049915N19350l62581q72062p07826
41533H31462k64790q0661j16037R1256N28571N49400n4106m81521q6416M87027
41523A404185K61058m36484m61974K35085N25368l078m40241k05131N1447j85525
41513G44710l03685J89672N75288J76133k58194K67802J126068Q43461n71232
41504B790023j525804j098084j14195K79344M4967j67203o8205J13388M9421l90124
41494h6472r21337r14981j13167Q21116J023927N68887K28707K63973K89512K59788
41484A419953N67918J044021R20626J11144m96593m33639l05494n39802n85436
$$ plain form
41552 -412150 188117 -55878 -710597 -806203 -35756 695579 438104 -510037 -1077851 -859830
41542 -859830 -385103 -78683 332605 1204666 2254581 2773931 2411350 1539288 831462
41533 831462 566672 486011 369974 461230 989801 1539201 1485095 1003574 917158 1404185
41523 1404185 1665243 1228759 766785 1001870 1527238 1524160 1083919 878788 930235 744710
41513 744710 441025 630697 1205985 1382118 1123924 1391726 2517794 3361255 2790023
41504 2790023 1264219 166135 51940 331284 376251 209048 140843 254231 303652 -86472
41494 -86472 -1007809 -1922790 -2035957 -1214841 -190914 377973 606680 870653 1160165 1419953
41484 1419953 1987871 3031892 3952518 4063662 3567069 3133430 2827936 2288134 1702698
41475A702698j13600P5929o05486j228648o59274N33139R18106M80466M52040
41466A555370J020844R32281k85068j280853q37406L48370P74132J60148n87178
41457A800640q34932p03805m44196j77604j02823l07476m92958l85273k09920
41448a858347k54728k27926L25070J138952J442372J034886N21361L91270M36431
41439B949341K63754r4237l43253l75720l00639k07110q0954J10933K99916K59683
41429B481714j86550p97102j015309o89264l73322n18973p11613l17497L82476
41420a745440N21577L7357j90340K43857O54811M59999R5943J32375K57919l9235
41410D28823l87179q7636O00724P27742P9152n80919p16176o10663o18305o14194
$$ plain form
41475 1702698 1589098 1665027 1059541 -169107 -828381 -295242 622864 1103330 1555370
41466 1555370 2576214 3508495 3223427 1942574 1105168 1453538 2227670 2387818 1800640
41457 1800640 965708 261903 -182293 -359897 -462720 -770196 -1263154 -1648427 -1858347
41448 -1858347 -2113075 -2341001 -2015931 -876979 565393 1600279 2121640 2512910 2949341
41439 2949341 3213095 3118858 2775605 2399885 2099246 1892136 1811182 1922115 2222031 2481714
41429 2481714 2295164 1498062 482753 -206511 -579833 -1098806 -1810419 -2127916 -1745440
41420 -1745440 -1223863 -1186506 -1376846 -1132989 -478178 -18179 77764 210139 468058 428823
41410 428823 41644 -45992 554732 1282474 1361626 780707 64531 -546132 -1164437 -1778631
41400a778631m46995k51436j7897N12542J178409J237613L50783p55197j128806
41391a099615p54054l56308l11246l03340J0741M88089P37422N95846K84386J84048
41381e24031M20027O40988L90058k45890o32313l69843K29210O51326Q15432Q65604
41371B240568O60477k9026r35078j386986j045201k45871M02108N33351J84666
41362C79008l00817n14674l03535J49037N98224R17930R51284N43972n6847k57264
41352B106318O1664K17330k47574o56537j03577J017187J364037N35363l85554
41343C908657m19788J01568L62782K71940K34036L50358M93402O99100R08366
41334F910421Q28461O56052J297903K954894L996436K503817j082415m029706
$$ plain form
41400 -1778631 -2225626 -2477062 -2494959 -1982417 -804008 433605 784388 29191 -1099615
41391 -1099615 -1853669 -2209977 -2521223 -2824563 -2813822 -2325733 -1588311 -992465 -708079 -524031
41381 -524031 -104004 536984 927042 681152 48839 -321004 -91794 559532 1374964 2240568
41371 2240568 2901045 2872019 1936941 549955 -495246 -741117 -339009 194342 379008
41362 379008 78191 -436483 -740018 -590981 7243 925173 1876457 2420429 2363582 2106318
41352 2106318 2167982 2385312 2137738 1481201 1377624 2394811 3758848 4294211 3908657
41343 3908657 3488869 3590437 3953219 4225159 4459195 4809553 5302955 6002055 6910421
41334 6910421 7738882 8394934 9692837 12647731 16644167 19147984 18065569 14035863
41326A4035863m332151k711737j220250p94180q99585q92457p60099o92153o91483
41317A041768p08299p10617n64397j68356K85744M84200M31821M46140O72147
41308A210151Q44350O24952L1323n59164p72062n76951k87473k09765l28233m32036
41298d54908m66791n13215m46981j1610O35748Q75690M28603j47575j50976L62851
41288A10836Q02555Q77077O82737K19198m89218r10469m41991N71265J017883
41279B439873M57429l11770l99410J70895R45282J718972K162286J574380j07135
41270H650802j618182j694135p44750j96967m22360m90132K6737K93857l07098
41261C497772j032644q35025J36433Q01827M83983n61383j550011j661322n86193
$$ plain form
41326 14035863 9703712 6991975 5771725 4977545 4077960 3185503 2425404 1733251 1041768
41317 1041768 333469 -377148 -941545 -1109901 -824157 -339957 91864 538004 1210151
41308 1210151 2054501 2679453 2710776 2151612 1379550 802599 515126 305361 -22872 -454908
41298 -454908 -921699 -1434914 -1881895 -1893505 -1257757 -382067 46536 -101039 -252015 110836
41288 110836 913391 1790468 2473205 2692403 2203185 1292716 850725 1421990 2439873
41279 2439873 2897302 2585532 2186122 2357017 3302299 5021271 7183557 8757937 8650802
41270 8650802 7032620 5338485 4593735 4396768 3974408 3484276 3511013 3804870 3497772
41261 3497772 2465128 1630103 1766536 2568363 3052346 2490963 940952 -720370 -1306563
41252a306563R30266J540619Q08659j69178k03507M33734O29119J55369k01372
41243B617146q8198j12249p05484j323404j219514m64652K43916M42031K19964
41234c90444n0476j0464M61442J042454J109812L47743p96668j421781j011423
41225g19805L3796P54818O02326q054k77131o3357M6739k54305m70785r1822N97003
41214A49423R49060Q02884M06030r3188m97380l26162N31779J262861J042497
41205D227804K44013j43065m3316j87630o29057o19696p1152J71843j48970k22550
41195B578224K64341M14645k21077n73725K15294J106040O52600n84207p44439
41186C107696N48748J726434J648483R88039Q82890J402395J913414K093666K000672
$$ plain form
41252 -1306563 -376297 1164322 1972981 1803803 1600296 2034030 2663149 2818518 2617146
41243 2617146 2528948 2416699 1711215 387811 -831703 -1296355 -1052439 -610408 -390444
41234 -390444 -440920 -451384 10058 1052512 2162324 2510067 1713399 291618 -719805
41225 -719805 -686009 68809 671135 663081 385950 322593 369332 115027 -355758 -447580 149423
41214 149423 1098483 1901367 2307397 2214209 1716829 1390667 1922446 3185307 4227804
41205 4227804 4471817 4328752 4285436 4097806 3468749 2849053 2777901 2949744 2800774 2578224
41195 2578224 2842565 3257210 3036133 2462408 2677702 3783742 4436342 3852135 3107696
41186 3107696 3656444 5382878 7031361 8019400 8902290 10304685 12218099 14311765 16312437
41177A6312437J748248J613486K017677L017310M174335N189856O300397P861179
41169D8234925R959667J2614031J5789878J8774579J9896745J7469672J1189697
41162A53929194K576529n874765j2045996j5142789j5740825j5032742j3960016
41155G8708590j2865913j1632837r972691p811986n603284m048635l345055l015468
41147B0412721k680168k514099k581036k317070j345933l22943j16804m80796
41139H053872m81894l8756L5134m96588q96749p42872n64611q18017j148942j124158
41129A776419q64778n02429J60570R38163J062977L53487k08338J71064Q70566
41120C757701Q49327K61588O0838L89358M59064o9297o10086o88021o00533p53264
$$ plain form
41177 16312437 18060685 19674171 21691848 24709158 28883493 34073349 40373746 48234925
41169 48234925 58194592 70808623 86598501 105373080 125269825 142739497 153929194
41162 153929194 156505723 150630958 138584962 123442173 107701348 92668606 78708590
41155 78708590 65842677 54209840 44237149 36425163 30821879 26773244 23428189 20412721
41147 20412721 17732553 15218454 12637418 10320348 8974415 8651472 8534668 8053872
41139 8053872 7571978 7533222 7568356 7071768 6175019 5432147 4867536 4049519 2900577 1776419
41129 1776419 911641 409212 569782 1507945 2570922 2924409 2716071 2887135 3757701
41120 3757701 4607028 4868616 4929454 5318812 5777876 5708579 5098493 4410472 3809939 3056675
41110C056675r64310q10245l01995J19348J27631j28223j95905J61056O44509
41101A708541P58175M37958Q2570n6856j48361l56736n61293o22453n15033j33059
41091E93453M96752P75714Q9157j029732j245933k95584N50779M43037J40357
41082E18000L90036M78153k49269o87989L29736J592177J047279p03099j036466
41073A678558M68591J198085k92743j893572j314253L86588P52840k21429o03165
41064A59500R5698N20860J21285j15602K84539N04852J23928j43462Q3383K02349
41054A837330N4265M59876J504933J752007L26805j379726j447982m9435J032248
41045D090321R01530J73710n03018j058286j218722n72663L69030M67159l35336
$$ plain form
41110 3056675 2092365 1282120 980125 1099473 1227104 1098881 902976 1064032 1708541
41101 1708541 2466716 2904674 2987244 2930388 2782027 2425291 1863998 1241545 726512 593453
41091 593453 1090205 1865919 1955076 925344 -320589 -616173 -65394 377643 518000
41082 518000 908036 1386189 1136920 448931 778667 2370844 3418123 2715024 1678558
41073 1678558 2147149 3345234 3052491 1158919 -155334 231254 984094 762665 159500
41064 159500 255198 776058 897343 781741 1066280 1571132 1695060 1551598 1634981 1837330
41054 1837330 1891595 2351471 3856404 5608411 5935216 4555490 3107508 3058073 4090321
41045 4090321 4991851 5165561 4662543 3604257 2385535 1812872 2181902 2649061 2313725
41036B313725p85547k45144L65189J97166j35913K39542Q65632P63524J31776
41027C709950n1184L37180O30428P75279J281528J859529J551351M01495l90975
41018A0104581l39556l20595q47903j121376o11904k36582q06332j447049r61095
41009C412189R9813K56957n66525j118106r08404o37073n86071j72753O61063
41000D41090J061206O86326K59810K28848P7379m59729o77362j45623L60504N0855
40990A883304o13618p58015m78088m27339n94770m98380k15153k41613n21039
40981b464711m74209O4969O42850Q73168P77927N33658L45187M07017N70952L34802
40971A611610l78891q24012m11906L00852L53986j97280m66749j72909L6028k67971
$$ plain form
41036 2313725 1528178 1283034 1648223 1845389 1709476 1949018 2814650 3578174 3709950
41027 3709950 3658766 3995946 4626374 5401653 6683181 8542710 10094061 10495556 10104581
41018 10104581 9765025 9444430 8596527 7475151 6863247 6626665 5820333 4373284 3412189
41009 3412189 3512002 3768959 3202434 2084328 1175924 538851 -47220 -219973 441090
41000 441090 1502296 2188622 2448432 2677280 2754659 2294930 1617568 1471945 1832449 1883304
40990 1883304 1269686 511671 33583 -393756 -988526 -1486906 -1702059 -1943672 -2464711
40981 -2464711 -2938920 -2873951 -2231101 -1357933 -580006 -46348 298839 705856 1276808 1611610
40971 1611610 1232719 408707 -3199 297653 651639 454359 -12390 -185299 -149271 -417242
40961d17242o73499o56748k45670K40323N47812M62256j8007l92254j23478N26739
40951g49768P47102L40237n5568m1472K7891j22604j58171J05136J71239k72811
40941h789o09737j88037N10219M90623k16522n86699j75268K73919R7783k32530
40931f45038M4094O20307M73334n14231j166306o05279M57349P21000J76647J2783
40921d25340O43777R60849J03294j011978r62984m947L29644l59670p56774J1983
40911a472146R56644P71983j72992m88978J19562N52198N1998p46197p78657Q4185
40901a122400R98691J135446M30200m89431r50837q32842n22097l04926m3790
40892a701986L88301O62971L86392k04022l98020P1251O49827O68491J51096l13959
$$ plain form
40961 -417242 -1090741 -1747489 -1993159 -1752836 -1205024 -742768 -760775 -1153029 -1276507 -749768
40951 -749768 -2666 337571 282003 240531 268422 145818 -12353 92783 264022 -8789
40941 -8789 -618526 -806563 -296344 194279 -22243 -608942 -784210 -510291 -412508 -645038
40931 -645038 -600944 19363 492697 -21534 -1187840 -1793119 -1335770 -614770 -438123 -425340
40921 -425340 218437 1179286 1282580 270602 -692382 -697329 -367685 -727355 -1484129 -1472146
40911 -1472146 -515502 256481 83489 -405489 -285927 266271 318269 -427928 -1206585 -1122400
40901 -1122400 -123709 1011737 1441937 952506 1669 -831173 -1353270 -1658196 -1701986
40892 -1701986 -1313685 -650714 -264322 -468344 -866364 -795113 -145286 523205 674301 360342
40882C60342l52035j59844n3693N8295M57312R38857Q09390j73027j230173j442179
40872g86755r60073o61522o85894k28922R33142J686806J061487k55016q19212
40863g15959m02500j1991j44533j86667K55799N19587m0574q80237r00453R4713
40853b412815J195042J506580J012269L37768K36k7783j31489m84961p53022n16411
40843b74586R5808N14309M75493K84694K37144J78153j39177n88268q27954o96433
40833g40817k56954K82557N26016J35046n92844p64061N9685J106733J183115
40824I38476J00606j126762j460434q02819J85976Q04146P57684K56382j71005
40815e17750j52461J50456K75893M1223l10533m98562m83739l61932k25286j52686
$$ plain form
40882 360342 8307 -151537 -205230 -146935 310377 1249234 2058624 1885597 655424 -786755
40872 -786755 -1746828 -2408350 -3094244 -3323166 -2390024 -703218 358269 103253 -715959
40863 -715959 -1118459 -1130450 -1274983 -1461650 -1205851 -686264 -726838 -1607075 -2507528 -2412815
40853 -2412815 -1217773 288807 1301076 1638844 1639080 1611297 1479808 994847 241825 -274586
40843 -274586 -178778 335531 811024 1095718 1332862 1511015 1371838 783570 -44384 -740817
40833 -740817 -997771 -715214 -189198 -54152 -646996 -1411057 -1351372 -244639 938476
40824 938476 1039082 -87680 -1548114 -2350933 -2164957 -1360811 -603127 -346745 -517750
40815 -517750 -670211 -519755 -243862 -202639 -513172 -1011734 -1495473 -1857405 -2082691 -2235377
40805b235377j31964o239K93699N30613M44787J84954J20794K74970L39974K52991
40795F9202K84049M69201M63847J57371o4950K7420P3407k48036n58864l05607
40785C67040L01433M70707q3225p39104p49137p0244O91573R35687N79548L5180
40775A739458l05207n37181r89628j494864j377381m45041N01159O49954K58300
40766b000431J05465K39699J24679j74772O13O25824P88564J34824m58811k30452
40756h44798L11438L18888l6023l8885K49637J63192l33730n52066j94756K62000
40746f95103L65651J60670j90284n81328o81258j53207O91532J067399O97781
40737F81853O5256l96285o86283o96678j09838Q16805J150931M97678l46410n32102
$$ plain form
40805 -2235377 -2367341 -2373580 -2079881 -1549268 -1104481 -919527 -798733 -523763 -183789 69202
40795 69202 353251 822452 1286299 1443670 1378720 1406140 1479547 1231511 672647 367040
40785 367040 668473 1139180 1055955 316851 -432286 -502530 189043 1124730 1704278 1739458
40775 1739458 1434251 897070 -92558 -1587422 -2964803 -3409844 -2908685 -2258731 -2000431
40766 -2000431 -1894966 -1655267 -1530588 -1705360 -1704747 -1078923 -290359 -155535 -614346 -844798
40756 -844798 -533360 -214472 -250495 -289380 -39743 123449 -210281 -762347 -957103 -695103
40746 -695103 -329452 -168782 -359066 -940394 -1621652 -1774859 -1083327 -15928 681853
40737 681853 747109 350824 -335459 -1032137 -1141975 -325170 825761 1323439 977029 444927
40727D44927l14574l51749m31056J17886J019779J145467J38790r39129r68184
40718a37843j56808L85989R9476m83546n59203o9409K74425n1297o05585m66027
40708a769828M97472J281035R76197m1400o12594k14734O40093J216455J164838
40699C137534M60444n64121j120804o38791L11742M85270l94149j180841q99287
40690d03003o3111K19491j39423l14759M2674M19569M13611K98324M23372O55444
40680A552189P00566N59494L73123J12722k94599p09223q84341p59215n16821
40671A33895l87297m35305m97907l58915m5145J48504M2413j67491k20326j82956
40661a970530k36352k25760J54342P59672J034311P44575K82203J01995K18834
$$ plain form
40727 444927 130353 -221396 -652452 -534566 485213 1630680 1769470 830341 -137843
40718 -137843 -294651 91338 190814 -292732 -851935 -921344 -646919 -698216 -1303801 -1769828
40708 -1769828 -1272356 8679 984876 943476 330882 116148 756241 1972696 3137534
40699 3137534 3597978 3033857 1913053 1274262 1586004 2071274 1677125 496284 -403003
40690 -403003 -466114 -246623 -386046 -700805 -658131 -238562 175049 473373 896745 1552189
40680 1552189 2252755 2812249 3185372 3298094 3003495 2294272 1409931 650716 133895
40671 133895 -253402 -688707 -1186614 -1545529 -1590674 -1442170 -1399757 -1567248 -1787574 -1970530
40661 -1970530 -2206882 -2432642 -2278300 -1518628 -484317 260258 542461 644456 863290
40652H63290M13187N65754N81526L24375j27408m55948n59202p12285j025274
40643a31985j105395o18969J20684N41041N37264L85944J73350j82675m93494
40634g74235m29043n8437K15163K48661K33362J99696l5724l66835l60091J16896
40624a010587O62276R06755R15827Q45815N85803r327p91181j406747j536088
40615h37454j038640j58247M60750L73318p3822k12952l1480k6671j38001K58850
40605a424349J083722J299377M58907m28306l33966K77317K77227m18733r68574
40596a77378r64160o60411j85830M62699Q76681O66781K38289K02157K89233j07496
40586F40565o25869m32136J89741K00128k92495j28050P02177P49932m03019j160285
$$ plain form
40652 863290 1276477 1842231 2423757 2748132 2620724 2164776 1605574 893289 -131985
40643 -131985 -1237380 -1856349 -1735665 -1194624 -657360 -271416 -98066 -280741 -774235
40634 -774235 -1203278 -1261715 -1046552 -797891 -564529 -364833 -400557 -767392 -1127483 -1010587
40624 -1010587 -348311 558444 1474271 2320086 2905889 2896562 2105381 698634 -837454
40615 -837454 -1876094 -2034341 -1573591 -1200273 -1274095 -1487047 -1518527 -1545198 -1683199 -1424349
40605 -1424349 -340627 958750 1417657 989351 655385 932702 1209929 791196 -177378
40596 -177378 -1141538 -1801949 -1987779 -1525080 -648399 18382 256671 458828 748061 640565
40586 640565 14696 -417440 -227699 -27571 -320066 -448116 254061 1003993 600974 -559311
40576e59311m12654O29289M28498m85490o97663l04719l39600o71465m13927J15494
40566b711548j43064p89118k79385J381795K259206J346563J7454k17656J73166
40557A037413k9730p42075j055035q79159p69787o50765R603R89804J420666J079953
40547D10888O36346N23133M02369n2435n54905p12643o04801m75159k23611L57222
40537b93596J011608J133706N21706k90752o46377n11055l45317l64321l38725
40528a23123j61171r6303k06283m0618O08056J055775N28146n98503j112107n15079
40518f61210M33381P97000M21913k92713q88803r07753j43256Q41887J057575
40509F58021L04319m89456m87010O0094M22162M25548L73847L98392M09950L61614
$$ plain form
40576 -559311 -971965 -342676 85822 -399668 -1097331 -1402050 -1741650 -2413115 -2827042 -2711548
40566 -2711548 -2854612 -3643730 -3923115 -2541320 -282114 1064449 1081903 864247 1037413
40557 1037413 1007683 265608 -789427 -1668586 -2438373 -3089138 -3079535 -2089731 -669065 410888
40547 410888 1047234 1570367 1972736 1920301 1365396 652753 47952 -427207 -650818 -293596
40537 -293596 718012 1851718 2373424 2082672 1436295 925240 579923 215602 -123123
40528 -123123 -284294 -380597 -586880 -627498 -19442 1036333 1564479 965976 -146131 -661210
40518 -661210 -227829 569171 991084 698371 -190432 -1098185 -1241441 -399554 658021
40509 658021 962340 472884 -14126 45968 468130 893678 1267525 1665917 2075867 2437481
40499B437481J55949l37613q37346p25421K1307N50295K99441j66510j34326Q2073
40489A345330j79917o09544l71100L93688O56404Q7487n23628n98147n14015o90781
40479a004223q18864m95814M5309L67151M91311O49435P52912N57474J01504l61779
40469B84416o63434p22248m99500j57788j929o1961l894L40368O25686M19579
40459d40705k19505p90991q34509k65277N63250J042567Q05006J56381k09656
40450a93439p123L84850N04457L07637j3799l32987n11752l64302N5711L94212
40440B23465M36822L62438L74207L61646J50370j81481m66666o68956p18880m27371
40430e54406J54846N71123M82378J28150n6577l7569j1446J16901N65078J066990
$$ plain form
40499 2437481 2593430 2255817 1418471 693050 714357 1264652 1564093 1397583 1263257 1345330
40489 1345330 1165413 555869 184769 578457 1234861 1322348 798720 200573 -313442 -1004223
40479 -1004223 -1823087 -2318901 -2273592 -1906441 -1415130 -765695 -12783 544691 646195 284416
40469 284416 -379018 -1101266 -1600766 -1758554 -1760483 -1822444 -1826338 -1485970 -860284 -440705
40459 -440705 -660210 -1451201 -2285710 -2550987 -1987737 -945170 -140164 16217 -193439
40450 -193439 -200562 184288 688745 996382 982583 649596 137844 -226458 -170747 223465
40440 223465 660287 1022725 1396932 1758578 1908948 1727467 1260801 591845 -127035 -554406
40430 -554406 -399560 171563 653941 782091 725514 687945 676499 793400 1358478 2425468
40420B425468R94564K12801o16078p99879l94498J0247N7731j03655k12525k43423
40410A330753k78450k62352j12206J9836j03938l28358j07124P64966J680168
40401B603295J847626J226831M08072k85338r81432j551512j452028n90880K42400
40392A467034K78871l00683p65690p83140n06717r5876K97021L50518j5638k73125
40382c47425N5740N72064N36385P8957J6922M38341M50496l19905r17354m19621
40372A44600O02418Q65263K00722l59503k19285L9521j98713n26661j80081P15530
40362A083811J236517Q69490M8151n85596r44053j230809j286286p17413L27210
40353a198978J002020O96305j23378m13184J33957O96351M14798m93689j067739
$$ plain form
40420 2425468 3420032 3632833 3016755 2216876 1822378 1832625 1890356 1786701 1574176 1330753
40410 1330753 1052303 789951 677745 697581 593643 265285 158161 923127 2603295
40401 2603295 4450921 5677752 6085824 5800486 4819054 3267542 1815514 1224634 1467034
40392 1467034 1745905 1445222 679532 -103608 -610325 -706201 -409180 -58662 -74300 -347425
40382 -347425 -291685 280379 816764 895721 912643 1350984 1801480 1481575 564221 144600
40372 144600 747018 1612281 1813003 1453500 1234215 1273736 1075023 548362 368281 1083811
40362 1083811 2320328 3189818 3237969 2652373 1708320 477511 -808775 -1526188 -1198978
40353 -1198978 -196958 499347 375969 -37215 96742 793093 1207891 714202 -353537
40344c53537q13555j15405M80068Q12012P99906K15870p73198j291683o61494
40335a701016N53092J089034N54545k22963m81629l76017k83552r7265K46687
40326g19084K82517j82059l92615K72598J010857N36459q75507j548976p47542
40317b363352L76648N91549J99375J47828M62157M60559n6751o69862j006264
40308a858113q84555j94937P41774J132862O78739J28408J96325M51770J24543
40299E16816m95213n22311j1691J44280k45504m10015K099L89733L12776J45925
40289a73105K66564M50012M32586L08529P2354m48960r51170q13666j94006J3371
40279a037491l17837k04472O94167J188442L66254p73418p12774L50546R89030
$$ plain form
40344 -353537 -1167092 -1282497 -802429 9583 809489 1025359 252161 -1039522 -1701016
40335 -1701016 -1147924 -58890 495655 272692 -208937 -584954 -868506 -965771 -719084
40326 -719084 -436567 -618626 -1011241 -738643 272214 808673 -66834 -1615810 -2363352
40317 -2363352 -1986704 -1395155 -1195780 -1047952 -585795 -125236 -181987 -851849 -1858113
40308 -1858113 -2742668 -2937605 -2195831 -1062969 -384230 -255822 -59497 392273 516816
40299 516816 21603 -500708 -512399 -368119 -613623 -1023638 -1021539 -631806 -319030 -173105
40289 -173105 93459 543471 976057 1284586 1356940 907980 -43190 -856856 -1050862 -1037491
40279 -1037491 -1355328 -1559800 -865633 322809 689063 -84355 -797129 -446583 542447
40270E42447P06579K27694k8275l26920n60108j98687N46481P61878K83461l6239
40260A918311J89101K97387o9962j95948M20328R89050N62658m42663q04106j70009
40250B694147O50714Q39058L11848n14204j106719j073026n06799J5743J03768
40241A414530k0353n4742j53514m50151m97503J06515Q23159P27012j04143n57641
40231A233169J0489R20077J085650K86350p63533j240414q63838r913O23149O43387
40221A924573L20186J32209Q6768j23092m06252l28778M5448M3799n88580j154001
40211d7720r48207k67829O7039j37326l49753j71121K58862O20409O87158K97520
40201I032m55509r96766p21600K06648R20612Q58558L44768j5424j46062l76846
$$ plain form
40270 542447 1249026 1476720 1448445 1121525 561417 362730 909211 1671089 1954550 1918311
40260 1918311 2107412 2404799 2334837 2138889 2559217 3548267 4110925 3668262 2864156 2694147
40250 2694147 3344861 4183919 4495767 3981563 2874844 1801818 1295019 1310762 1414530
40241 1414530 1394177 1339435 1185921 735770 238267 344782 1167941 1894953 1790810 1233169
40231 1233169 1243658 2163735 3249385 3535735 2772202 1531788 667950 658037 1281186 1924573
40221 1924573 2244759 2376968 2463736 2340644 1934392 1605614 1651062 1694861 1106281 -47720
40211 -47720 -995927 -1263756 -1196717 -1334043 -1683796 -1854917 -1596055 -975646 -288488 9032
40201 9032 -446477 -1443243 -2164843 -1958195 -1037583 -179025 165743 150319 4257 -372589
40191c72589p27609p28016l4522R76554J420693P86714m27580j106367o34910
40182h47632M78753J191875R70990J04076p80651j185040r07410j74680M17783
40173g31936M82755L30089M72295P15422L45218o78436j393055j053188j16207
40164a627043M55773M10123J66164n2386l61077o54077n70942p8607L95217M89758
40154a427097K45894o1702j22140K67387Q98149J143753O75759R629j57231N4256
40144A526657N225l31540l68441k6939P1595k37934k71786K84017O60727J95343
40134A506924n14905m93523J22551L98268P4576k21769j26802m749j73580l89985
40124A77006l05666N7123M20897N06893K13356j39934K8418P20798J038253L57896
$$ plain form
40191 -372589 -1100198 -1828214 -1862736 -886182 534511 1321225 893645 -212722 -847632
40182 -847632 -368879 822996 1793986 1898062 1117411 -67629 -975039 -1149719 -731936
40173 -731936 -249181 80908 553203 1268625 1613843 935407 -457648 -1510836 -1627043
40164 -1627043 -1171270 -761147 -594983 -647369 -1008446 -1662523 -2233465 -2312072 -1916855 -1427097
40154 -1427097 -1181203 -1242905 -1365045 -1097658 -199509 944244 1620003 1629632 1472401 1526657
40144 1526657 1531882 1200342 831901 804962 876557 638623 366837 650854 1311581 1506924
40134 1506924 992019 498496 621047 1019315 1093891 872122 745320 740571 566991 177006
40124 177006 -128660 -71537 349360 856253 1069609 929675 958093 1678891 2717144 3075040
40114C075040n44350m73743L47390O01976j463l17042K00451N02181k30834j076921
40104B082685q39978j2317J16533l78017l31688L87302O37223j1746n39112j76121
40094I34764M12138L33069j45668k54839n3097j76171o42812p74955k36823M69752
40084a34642O02153p4559j093942j612527j092689Q7758R04333Q10456L35768
40075a267891K65989N56364N48538N9200l54195k54452O3034K3634m78612r98576
40065a836967j037840m79604L76629J113445J529244J647972J426853O97521m11657
40056C025596j218908j049685q0069O90483M55908n46578j296540j026461M2199
40047a004055R51056R71736K94349l12371m33635l42311m00769n32474n08360
$$ plain form
40114 3075040 2530690 2056947 2404337 3006313 3004850 2687808 2888259 3390440 3159606 2082685
40104 2082685 1242707 1230390 1346923 968906 637218 1024520 1661743 1649997 1110885 934764
40094 934764 1346902 1679971 1534303 1279464 1226367 1050196 407384 -367571 -604394 -134642
40084 -134642 467511 392952 -700990 -2313517 -3406206 -3318448 -2414115 -1603659 -1267891
40075 -1267891 -1001902 -445538 103000 162200 -191995 -446447 -383413 -359779 -838391 -1836967
40065 -1836967 -2874807 -3354411 -2977782 -1864337 -335093 1312879 2739732 3437253 3025596
40056 3025596 1806688 757003 676934 1367417 1823325 1276747 -19793 -1046254 -1004055
40047 -1004055 -52999 918737 1213086 900715 467080 124769 -276000 -808474 -1316834
40038a316834l96142l66338l13458o7592K15910K82061K09122J94381J09071k31591
40028a681410n41233m15661j01962k18254p04954q02476k04276N12820Q20892
40019c336514Q31215O55008M0655q14314r28554J55285J328963J149276k07676
40010a126656j158086p55393L38364R44963O59287q7843o13526m47246K99958
40001a946178R12403Q20376L51654K56539N81524O76128L20850O1789K15683L17776
39991B568544l8711m80739m99097k87943l40363n72239m86382l7350K54681O2289
39981A42690l15922l90603j03884J05935j71556p38080q49560p6699J005108J384456
39971h115Q62835K34633J32958L01711K71293J14253O7087l6328l58785n42144
$$ plain form
40038 -1316834 -1712976 -2079314 -2392772 -2460364 -2244454 -1962393 -1753271 -1558890 -1449819 -1681410
40028 -1681410 -2222643 -2638304 -2740266 -2958520 -3663474 -4465950 -4670226 -4157406 -3336514
40019 -3336514 -2505299 -1850291 -1809636 -2623950 -3552504 -3397219 -2068256 -918980 -1126656
40010 -1126656 -2284742 -3040135 -2701771 -1756808 -1097521 -1185364 -1798890 -2246136 -1946178
40001 -1946178 -1033775 -213399 138255 394794 976318 1652446 1973296 2035085 2250768 2568544
39991 2568544 2529833 2049094 1549997 1262054 921691 349452 -136930 -174280 80401 142690
39981 142690 -173232 -563835 -667719 -561784 -733340 -1471420 -2320980 -2397679 -1392571 -8115
39971 -8115 854720 1089353 1222311 1524022 1795315 1909568 1976655 1940327 1581542 1039398
39961A039398k64673M6899j96183p04343o68327m8629L34558O6677l05213k07797
39951i07633J62196L16589J98428L6474j21449l49127n69851o30538m74023r3510
39941b432444M57395R11482R32033N34894J03460r8349j39010j11517O556J06549
39931B71049j8909k69579k81512n129K14518K58859L84412N66091L61710k22639
39921A258871m53821j1653K86286l18096j169414j034462L3672P61177N37140
39912a10300J42795L68804Q83734R49716N15029L4180k73842m56517m98773m20460
39902A134366l95514m12226j65097L53845N76869J57173l44371j88499L90098
39893A106644M72705j70612p14756m34086L64755Q30777N61974j70056q58618
$$ plain form
39961 1039398 774725 821624 625441 -78902 -747229 -795858 -461300 -394623 -699836 -907633
39951 -907633 -745437 -428848 -230420 -193946 -315395 -664522 -1234373 -1864911 -2338934 -2432444
39941 -2432444 -1975049 -1063567 -131534 403360 506820 408471 269461 157944 164500 271049
39931 271049 252140 -17439 -298951 -304080 -89562 169297 553709 1119800 1481510 1258871
39921 1258871 805050 793397 1079683 761587 -407827 -1442289 -1408617 -647440 -110300
39912 -110300 32495 401299 1285033 2234749 2749778 2783958 2510116 2053599 1554826 1134366
39902 1134366 738852 326626 161529 515374 1092243 1249416 905045 716546 1106644
39893 1106644 1579349 1408737 693981 259895 624650 1455427 2017401 1847345 988727
39884I88727j121523q41105k46109K16827K70356L3023j75920j33335J94430O41076
39874a73553Q64781O24073J32766j09332K3550P0096l54321r46088j085217o45904
39864a599149p7938K42067L72415M90733N47414L76969k9816m81977p20197n68495
39854a447974q6524L96578N22284K26261k25376m84493l50624J10472N24733M44102
39844c70561j21993n37148k37358M78091P75478M15806N6430K49614O31385M79037
39834A818781k57674r19808r75083n19646k7273J06369j57600m27977j85999N92932
39824i52978J243219J118576L88601j88548k06885K9470P5266r5886k07309j01490
39814A102036Q7529Q5732k09179n19580m44799m7305R4053l07919p06712m58686
$$ plain form
39884 988727 -132796 -973901 -1220010 -1003183 -732827 -699804 -875724 -1009059 -814629 -173553
39874 -173553 691228 1315301 1448067 1338735 1362285 1432381 1078060 131972 -953245 -1599149
39864 -1599149 -1677087 -1435020 -1062605 -571872 -24458 352511 322695 -159282 -879479 -1447974
39854 -1447974 -1534498 -1137920 -615636 -389375 -614751 -1099244 -1449868 -1339396 -814663 -370561
39844 -370561 -492554 -1029702 -1267060 -788969 -13491 402315 458745 708359 1339744 1818781
39834 1818781 1561107 641299 -333784 -853430 -880703 -774334 -931934 -1359911 -1545910 -952978
39824 -952978 290241 1408817 1797418 1608870 1401985 1431455 1506721 1410835 1203526 1102036
39814 1102036 1189565 1275297 1066118 546538 101739 54434 148487 -159432 -866144 -1324830
39804a324830J53258K78980k02325m71301K5735Q37768J221918R97330L99271
39795A915804l35562q74493q29928l30589o4304l07474m25818J24619Q18352P71336
39785D61943K3187o51397q93722q93834o17274J32090R11346Q99409J47039l49001
39775h30214j24045R9128l00161p59271m65309K83111N30764J24245j74625O8895
39765a547482M24852M15849J85297O5406k5399l63124q46756j014247n99235J51705
39755c153134P63687J009021J002782Q87229O28475K44446J6005J45074L01772
39746A845357l8543p49143j050861n89241o098j8618l67119k83090K66884N33127
39736d57345J68364k29765J0419P20190J146375Q11886j10557j033451j372253
$$ plain form
39804 -1324830 -1171572 -892592 -1094917 -1566218 -1540483 -702715 519203 1516533 1915804
39795 1915804 1580242 705749 -124179 -454768 -519072 -826546 -1252364 -1127745 -309393 461943
39785 461943 485130 -166267 -1059989 -1953823 -2571097 -2439007 -1527661 -628252 -481213 -830214
39775 -830214 -954259 -855131 -1155292 -1914563 -2379872 -2096761 -1565997 -1441752 -1616377 -1547482
39765 -1547482 -1122630 -706781 -521484 -456078 -481477 -844601 -1691357 -2705604 -3304839 -3153134
39755 -3153134 -2389447 -1380426 -377644 509585 1138060 1382506 1398511 1543585 1845357
39746 1845357 1806814 1057671 6810 -582431 -588529 -607147 -974266 -1257356 -990472 -457345
39736 -457345 -288981 -518746 -508327 211863 1358238 2170124 2059567 1026116 -346137
39727c46137r57990k20205K10333J88041J33454L51975N78822L96633j54596o35147
39717d54817o97369l05122L58310R48820J060896N59545j83999n65345k86390
39708D34529M09116R43874Q20618K4742q62506j130861o66908n0956J82863J24123
39698B28634J21298J49977n3756l91993m12667L7066N40338O27032L02135q6518
39688A061546l20281m68131o25484o43230k50091M77093R04471M26486o81497
39679a19118j377312j040673j81147L59308M95272O60330Q27854N35271j84367
39670b4582o73374n98122l53824l06350k78484r7640k2773j83414j39720M46550
39660b231733J105148J104384M46575k14226m52776l70523j69000P5157K69178
$$ plain form
39727 -346137 -1304127 -1524332 -1313999 -1125958 -992504 -640529 -61707 334926 180330 -454817
39717 -454817 -1152186 -1457308 -1098998 -150178 910718 1470263 1286264 720919 434529
39708 434529 843645 1787519 2608137 2632879 1770373 639512 -27396 -78352 104511 228634
39698 228634 349932 499909 446153 54160 -358507 -321441 218897 845929 1148064 1061546
39688 1061546 741265 273134 -352350 -995580 -1245671 -768578 135893 562379 -119118
39679 -119118 -1496430 -2537103 -2718250 -2358942 -1863670 -1203340 -375486 159785 -24582
39670 -24582 -697956 -1296078 -1649902 -1956252 -2234736 -2332376 -2355149 -2538563 -2678283 -2231733
39660 -2231733 -1126585 -22201 424374 210148 -242628 -613151 -782151 -706994 -437816
39651d37816L38618L51032L24417R9317k85014l89727j0686K96521n2679o42010
39641d08027n19680L50818R21214N13235l07760o50945m49087k15234j32094L7032
39631h60528L45165M91147K73061r1095j91195J06736M68347M53752J18786J9176
39621A133352L89125O27879Q9610q39053j134013n74782l2777j57516n34356m98081
39611a530612r5223K53681M83614P19906Q25560O73164N20120N86198N69102R3125
39601C098635o43423j151869j286483j132389o45175L6115L25422n3001l88178
39592a840346J17448J030065J201162M75219j61238k05703k94061q69170j271617
39583a818241q51297j52191j01138n43513n35446J40069O78733N33967J85863
$$ plain form
39651 -437816 -99198 251834 576251 675568 390554 827 -9859 286662 233983 -408027
39641 -408027 -927707 -576889 344325 857560 549800 -101145 -550232 -765466 -897560 -860528
39631 -860528 -515363 -24216 248845 157750 -33445 73291 541638 995390 1114176 1133352
39621 1133352 1522477 2150356 2239966 1400913 266900 -307882 -340659 -498175 -1032531 -1530612
39611 -1530612 -1625835 -1372154 -888540 -168634 656926 1330090 1850210 2436408 3005510 3098635
39601 3098635 2455212 1303343 16860 -1115529 -1760704 -1724589 -1399167 -1452168 -1840346
39592 -1840346 -1722898 -692833 508329 983548 822310 616607 322546 -546624 -1818241
39583 -1818241 -2669538 -2821729 -2922867 -3466380 -4001826 -3861757 -3183024 -2649057 -2463194
39574b463194L17857Q00922R73661O46473L13129L61043N03543K43737l38992
39565A358179o40181l48968J53086L41789J63896j28081m31790p24690p79793
39556a036553m03429J54021M54449M66556M77333M90449K30877k33862m26787
39547A73054j59856J80237K28333R4560L5990Q9780K30886M82500O55934L99652
39537B411070k52184p96699r68518j058281j230476j077458l42140M00155M29233
39528b485298o1366k69169L9025L52885L70613M07347O99167R11754O53967P1910
39518F90835l89110n49388n37879m52770k58860K8445K56837K75879J03176p2460
39508i05295q1460J4522k2361k70120m66451l00561J80550O14203P34942N83997
$$ plain form
39574 -2463194 -2145337 -1344415 -370754 275719 588848 949891 1453434 1697171 1358179
39565 1358179 717998 369030 522116 863905 1027801 899720 467930 -256760 -1036553
39556 -1036553 -1439982 -1285961 -831512 -364956 112377 602826 833703 599841 173054
39547 173054 13198 193435 421768 516328 552318 642098 872984 1355484 2011418 2411070
39537 2411070 2158886 1362187 393669 -664612 -1895088 -2972546 -3314686 -2914531 -2485298
39528 -2485298 -2546664 -2815833 -2776808 -2423923 -2053310 -1645963 -946796 -35042 618925 690835
39518 690835 301725 -247663 -785542 -1238312 -1497172 -1468727 -1211890 -936011 -832835 -905295
39508 -905295 -986755 -972233 -994594 -1264714 -1731165 -2031726 -1851176 -1236973 -502031 81966
39498H1966L18973K205l40571n73195n09048j52061J98204K04474j04109l11961
39488a185123j20001K57177L90011K05348l2562k17139m52171n86150k17236N82409
39478a375437J002234L99615p60927j322071p43863L21633P93686L16037l91524
39469a760617l16359O54238J453280J050293j64598p79813k31094M59943K15628
39460E80901n53604o73593K8307O20618N42692K25595J41118R5699j76073l56719
39450D74941K6227Q38943J403084J214680M30642k78141l51558M5874J44397m73162
39440C475927j242341j347644q75166o27522q50689q90404l09097L74605M90646
39431a801685K10228J83263N24308P27732M59901m4540l78684m12781l01461k65534
$$ plain form
39498 81966 400939 403144 62573 -510622 -1019670 -1171731 -973527 -769053 -873162 -1185123
39488 -1185123 -1305124 -1047947 -657936 -452588 -485150 -702289 -1154460 -1740610 -1957846 -1375437
39478 -1375437 -373203 26412 -734515 -2056586 -2800449 -2478816 -1685130 -1369093 -1760617
39469 -1760617 -2076976 -1422738 30542 1080835 916237 136424 -94670 365273 580901
39460 580901 27297 -646296 -617989 2629 545321 770916 912034 1007733 831660 474941
39450 474941 501168 1340111 2743195 3957875 4388517 4110376 3758818 3804692 3949089 3475927
39440 3475927 2233586 885942 10776 -616746 -1467435 -2357839 -2666936 -2292331 -1801685
39431 -1801685 -1591457 -1408194 -883886 -156154 303747 259207 -119477 -532258 -833719 -1099253
39421a099253m11278o33697o78268l73263J91718P26285R53403Q14157N30608
39412B0412L79456L17841J8508n50255q63608n25441M7914J75940l3352J00261
39402i12324N82951O02797r0486n59193m5130P55318O34794l40913r39278n21192
39392h32656K22290M36327K10039J35366L15213L22137r0016o52810r19350o91782
39382a545242j35465L73961N33847L59359J44726J27166K35797K45202J11936
39373D51287J0167K0839l1708k90405n40698m19459P1315N37600P38220Q34093
39363A381251R37268P88805K31185l06959k91507J04263J84264l13844r39090
39354A775636j203423j034935n29542J83205O97618N33841j70327o73431n96029
$$ plain form
39421 -1099253 -1510531 -2144228 -2822496 -3195759 -3004041 -2277756 -1324353 -510196 20412
39412 20412 399868 717709 736217 185962 -677646 -1203087 -1155173 -979233 -1012585 -912324
39402 -912324 -329373 273424 182938 -376255 -421385 333933 968727 627814 -311464 -832656
39392 -832656 -610366 -174039 36000 171366 486579 808716 718700 65890 -853460 -1545242
39382 -1545242 -1680707 -1306746 -772899 -413540 -268814 -141648 94149 339351 451287
39373 451287 461454 482293 450585 160180 -380518 -799977 -728662 -191062 547158 1381251
39363 1381251 2318519 3107324 3338509 3031550 2740043 2844306 3028570 2714726 1775636
39354 1775636 572213 -462722 -992264 -809059 -111441 422400 252073 -421358 -1017387
39345a017387l67262m18122m95924k21074J96969L73802M63271P91502J063101
39336C68876O78907k23899p56508m24424K77562O16124M99803L22274K62243J20377
39326A741335k37909n97652o63474m65203l05688l02066k08516J47178M80497
39317d11498M29197J65741J85403N09436N96602J46789m83745q24856p87767m45388
39307i20086J76340Q27074J032069O79300K04024n4377k16555l70636l15442j11743
39297I29968k27485o96135q05462j67972N64705O75969L93199K21207J263m82789
39287D06468o73327j07780M63738N9020q65631j026641k85784L68622O13508J048117
39277C10J641528J508741N49058j69446j26691o3196m27676n10175J23682O35282
$$ plain form
39345 -1017387 -1384649 -1802771 -2298695 -2519769 -2322800 -1948998 -1485727 -694225 368876
39336 368876 1047783 823884 67376 -357048 -79486 536638 1036441 1358715 1620958 1741335
39326 1741335 1503426 905774 242300 -222903 -528591 -830657 -1039173 -891995 -411498
39317 -411498 17699 183440 368843 878279 1474881 1621670 1137925 313069 -474698 -920086
39307 -920086 -743746 83328 1115397 1794697 1998721 1944344 1727789 1357153 1041711 929968
39297 929968 702483 6348 -799114 -967086 -402381 273588 666787 887994 889257 406468
39287 406468 -266859 -374639 89099 148119 -717512 -1744153 -2029937 -1661315 -1047807 310
39277 310 1641838 3150579 3699637 3530191 3403500 3340304 2912628 2402453 2526135 3161417
39267C161417K74173l88762n57734n02296p17497p86750k68291J38193l79848
39258b7395j206705j125658j96951N31114P89536J127923J409471Q35783l81519
39249A755599q71053j19210O15562J23795r93433j263601m22502L79687K50708
39240e44448l60007m19031L13324J025147R21212K17783k25227j05963K4350k35338
39230F11802n01786l78935k28383n03894q12411m78995K56527N22626J69553r0239
39220a434135P3931J49032k30764o56479o30285k00419L90703J037529J425454
$$ plain form
39267 3161417 3435590 3046828 2489094 1986798 1269301 482551 214260 352453 -27395
39258 -27395 -1234100 -2359758 -2556709 -2025595 -1236059 -108136 1301335 2137118 1755599
39249 1755599 884546 765336 1380898 1504693 511260 -752341 -1174843 -795156 -544448
39240 -544448 -904455 -1323486 -1010162 14985 936197 1153980 928753 822790 847140 611802
39230 611802 110016 -268919 -497302 -1001196 -1813607 -2292602 -2036075 -1513449 -1343896 -1434135
39220 -1434135 -1360204 -1211172 -1441936 -2098415 -2728700 -2929119 -2538416 -1500887 -75433
$$ [...]
##END NTUPLES=NMR SPECTRUM
##END=
