##TITLE=31Pdec_DE-165rm_2h
 , 64 sc
 14.7.2026
##JCAMPDX= 6.0         $$ Bruker NMR JCAMP-DX V2.0
##DATA TYPE= NMR SPECTRUM
##DATA CLASS= NTUPLES
##ORIGIN= UXNMR, Bruker Analytische Messtechnik GmbH
##OWNER= root
$$ XWIN-NMR		Version 3.5
$$ Tue Jul 14 13:34:26 2026 Russian Standard Time (UT+4h)  she@DPX200
##.OBSERVE FREQUENCY= 81.013821
##.OBSERVE NUCLEUS= ^31P
##.ACQUISITION MODE= SIMULTANEOUS
##.ACQUISITION SCHEME= undefined
##.AVERAGES= 64
##.DIGITISER RES= 17
##SPECTROMETER/DATA SYSTEM= spect
##.PULSE SEQUENCE= zgpg30
##.SOLVENT NAME= DMSO
##.SHIFT REFERENCE= (INTERNAL, DMSO, 0, 197.392)
##AUDIT TRAIL= $$ (NUMBER, WHEN, WHO, WHERE, WHAT)
$$ ##TITLE= Audit trail, XWIN-NMR		Version 3.5
$$ ##JCAMPDX= 5.01
$$ ##ORIGIN= Bruker BioSpin GmbH
$$ ##OWNER= she
$$ F:/spectra/data/she/nmr/P31/2/pdata/1/auditp.txt
$$ ##AUDIT TRAIL=  $$ (NUMBER, WHEN, WHO, WHERE, WHAT)
(   1,<2026-07-14 13:33:12.53 +0400>,<she>,<DPX200>,
      <created by zg, POWCHK disabled, PULCHK disabled
       configuration hash MD5:
       00 E9 B6 7A A2 85 ED C7 34 08 36 98 17 FE 4E 26
       data hash MD5: 32K
       68 F1 AE D0 49 0F 28 8B 69 03 32 29 52 F2 16 11>)
(   2,<2026-07-14 13:33:16.81 +0400>,<she>,<DPX200>,
      <Start of raw data processing
       efp BC_mod = 2 LB = 1.5 FT_mod = 6 PKNL = 1 PHC0 = 1942.214 PHC1 = 143.6991 SI = 64K 
       data hash MD5: 64K
       27 CA 5C F0 A6 86 1E 50 1E 2B 87 E3 F7 F1 A2 BC>)
(   3,<2026-07-14 13:33:41.15 +0400>,<she>,<DPX200>,
      <pk PHC0 = -9.68091 PHC1 = 16.4 
       data hash MD5: 64K
       6A 98 B0 8A 98 E9 63 FA 65 16 21 1E E8 B6 AE C4>)
(   4,<2026-07-14 13:33:48.29 +0400>,<she>,<DPX200>,
      <abs ABSG = 5 
       data hash MD5: 64K
       94 25 FE 58 85 49 1F 88 57 72 9F 04 E2 09 8B 1B>)
$$ ##END=
$$ 
$$ hash MD5
$$ B1 26 18 69 90 23 A8 45 00 41 40 6F D8 94 C5 B0
##$RELAX= 
##$RELAX= 
##$RELAX= 
##$RELAX= 
##$RELAX= 
##$RELAX= 
##$RELAX= 
##$RELAX= 
$$ Bruker specific parameters
$$ --------------------------
##$DU= <F:/spectra>
##$EXPNO= 2
##$NAME= <P31>
##$PROCNO= 1
##$TYPE= <nmr>
##$USER= <she>
##$AMP= (0..31)
100 100 100 100 100 100 100 100 100 100 100 100 100 100 100 100 100 100 
100 100 100 100 100 100 100 100 100 100 100 100 100 100 
##$AQSEQ= 0
##$AQ_mod= 1
##$AUNM= <au_zg>
##$AUTOPOS= <>
##$BF1= 81.014009
##$BF2= 200.13
##$BF3= 200.13
##$BF4= 200.13
##$BF5= 200.13
##$BF6= 200.13
##$BF7= 200.13
##$BF8= 200.13
##$BYTORDA= 1
##$CFDGTYP= 0
##$CFRGTYP= 5
##$CHEMSTR= <none>
##$CNST= (0..31)
1 1 145 1 1 1 1 1 1 1 1 1 1 1 1 1 1 1 1 1 1 1 1 1 1 1 1 1 1 1 1 1 
##$CPDPRG= <waltz16>
##$CPDPRG1= <>
##$CPDPRG2= <waltz16>
##$CPDPRG3= <>
##$CPDPRG4= <mlev>
##$CPDPRG5= <mlev>
##$CPDPRG6= <mlev>
##$CPDPRG7= <mlev>
##$CPDPRG8= <mlev>
##$CPDPRGB= <>
##$CPDPRGT= <>
##$D= (0..31)
0 1 0 0 0 0 0 0 0 0.06 0 0.03 2e-05 3e-06 0 0 0.0002 0 0 0 0 0 0 0 0 0 
0 0 0 0 0 0 
##$DATE= 1784021591
##$DBL= (0..7)
120 120 120 11 120 120 24 19 
##$DBP= (0..7)
150 150 150 150 150 150 150 150 
##$DBP07= 0
##$DBPNAM0= <>
##$DBPNAM1= <>
##$DBPNAM2= <>
$$ [...]
##$SUBNAM3= <"">
##$SUBNAM4= <"">
##$SUBNAM5= <"">
##$SUBNAM6= <"">
##$SUBNAM7= <"">
##$SUBNAM8= <"">
##$SUBNAM9= <"">
##$SW= 400.765351723535
##$SWIBOX= (0..15)
0 1 3 0 0 0 0 0 0 0 0 0 0 0 0 0 
##$SW_h= 32467.5324675325
##$TD= 32768
##$TD0= 1
##$TE= 0
##$TE2= 300
##$TE3= 300
##$TEG= 300
##$TL= (0..7)
0 120 53 12 22 120 120 120 
##$TP= (0..7)
150 150 150 150 150 150 150 150 
##$TP07= 0
##$TPNAME0= <>
##$TPNAME1= <>
##$TPNAME2= <>
##$TPNAME3= <>
##$TPNAME4= <>
##$TPNAME5= <>
##$TPNAME6= <>
##$TPNAME7= <>
##$TPOAL= (0..7)
0.5 0.5 0.5 0.5 0.5 0.5 0.5 0.5 
##$TPOFFS= (0..7)
0 0 0 0 0 0 0 0 
##$TUNHIN= 0
##$TUNHOUT= 0
##$TUNXOUT= 0
##$USERA1= <user>
##$USERA2= <user>
##$USERA3= <user>
##$USERA4= <user>
##$USERA5= <user>
##$V9= 5
##$VALIST= <valist>
##$VCLIST= <CCCCCCCCCCCCCCC>
##$VD= 0
##$VDLIST= <DDDDDDDDDDDDDDD>
##$VPLIST= <PPPPPPPPPPPPPPP>
##$VTLIST= <TTTTTTTTTTTTTTT>
##$WBST= 1024
##$WBSW= 4
##$XGAIN= (0..3)
0 0 0 0 
##$XL= 0
##$YL= 0
##$YMAX_a= 86154
##$YMIN_a= -75293
##$ZGOPTNS= <>
##$ZL1= 120
##$ZL2= 120
##$ZL3= 120
##$ZL4= 120
##$ABSF1= 197.3918
##$ABSF2= -203.3724
##$ABSG= 5
##$ABSL= 3
##$ALPHA= 0
##$AQORDER= 0
##$ASSFAC= 0
##$ASSFACI= 0
##$ASSFACX= 0
##$ASSWID= 0
##$AUNMP= <proc_1d>
##$AZFE= 0.1
##$AZFW= 0.5
##$BCFW= 0
##$BC_mod= 2
##$BYTORDP= 0
##$COROFFS= 0
##$CY= -3
##$DATMOD= 1
##$DC= 0
##$DFILT= <>
##$DTYPP= 0
##$F1P= 0
##$F2P= 0
##$FCOR= 1
##$FTSIZE= 65536
##$FT_mod= 6
##$GAMMA= 0
##$GB= 0
##$INTBC= 1
##$INTSCL= 9.790993e-09
##$ISEN= 30
##$LB= 1.5
##$LEV0= 0
##$LPBIN= 0
##$MAXI= 10000
##$MC2= 0
##$MEAN= 0
##$ME_mod= 0
##$MI= 50
##$NCOEF= 0
##$NC_proc= -5
##$NLEV= 6
##$NOISF1= 182.463
##$NOISF2= 159.3651
##$NSP= 0
##$NTH_PI= 0
##$NZP= 0
##$OFFSET= 197.3918
##$PC= 4
##$PHC0= 1932.533
##$PHC1= 160.0991
##$PH_mod= 1
##$PKNL= yes
##$PPARMOD= 0
##$PSCAL= 0
##$PSIGN= 0
##$REVERSE= no
##$SF= 81.014063255964
##$SI= 65536
##$SIGF1= 159.3651
##$SIGF2= -187.1042
##$SINO= 113.3802
##$SIOLD= 16384
##$SREGLST= <1H.CDCl3>
##$SSB= 0
##$STSI= 65536
##$STSR= 0
##$SW_p= 32467.5324675325
##$SYMM= 0
##$S_DEV= 0
##$TDeff= 32768
##$TDoff= 0
##$TI= <>
##$TILT= no
##$TM1= 0
##$TM2= 0
##$TOPLEV= 0
##$USERP1= <user>
##$USERP2= <user>
##$USERP3= <user>
##$USERP4= <user>
##$USERP5= <user>
##$WDW= 1
##$XDIM= 65536
##$YMAX_p= 304182819
##$YMIN_p= -35103362
$$ End of Bruker specific parameters
$$ ---------------------------------
##NTUPLES= NMR SPECTRUM
##VAR_NAME=  FREQUENCY,     SPECTRUM/REAL,   SPECTRUM/IMAG
##SYMBOL=    X,             R,               I
##VAR_TYPE=  INDEPENDENT,   DEPENDENT,       DEPENDENT
##VAR_FORM=  AFFN,          ASDF,            ASDF
##VAR_DIM=   65536,         65536,           65536
##UNITS=     HZ,            ARBITRARY UNITS, ARBITRARY UNITS
##FACTOR=    0.49542278885378, 1,            1
##FIRST=     15991.5117654749, 0,            0
##LAST=      -16476.0207020576, 0,           0
##MIN=       -16476.0207020576, -35103362,   0
##MAX=       15991.5117654749, 304182819,    0
$$ Real data points
##PAGE= N=1
##DATA TABLE= (X++(R..R)), XYDATA
$$ [...]
47361 607903 544771 153503 -195211 -440318 -566880 -459350 -215214 -148330 -277574 -232401
47351 -232401 140796 508720 597857 559839 524816 256552 -365968 -913543 -903247 -458025
47341 -458025 -48195 183535 387488 488775 217016 -375509 -857100 -930275 -697198 -401761
47331 -401761 -193824 -160682 -311411 -476322 -435039 -181083 95525 250481 238219 22045
47321 22045 -315877 -457858 -169680 268558 285725 -260245 -893166 -1148587 -1086843 -1016899
47311 -1016899 -999271 -889311 -700575 -632607 -769123 -954943 -990489 -829452 -582849 -410154
47301 -410154 -390049 -429963 -331833 -19345 322086 404485 140701 -250717 -443139 -285258
47291 -285258 95465 443181 615814 661771 656789 543429 235645 -136818 -232558 160612
47281 160612 838180 1314237 1253963 749051 176235 -177877 -320803 -396224 -411827 -245489
47271 -245489 78211 281751 120481 -321439 -746060 -969504 -993808 -851563 -602492 -444996
47261 -444996 -557826 -770752 -648701 -39801 663836 975624 854492 616585 478834 446704
47251 446704 549598 865265 1275545 1475774 1354619 1175181 1228505 1437539 1471993 1184749
47241 1184749 757850 412123 125304 -281731 -850912 -1373155 -1580887 -1420171 -1112907
47232 -1112907 -949101 -1012777 -1103276 -933033 -431344 129964 345469 67983 -407755 -621517
47222 -621517 -437285 -182521 -234730 -549820 -736548 -570236 -242910 -24314 148486 538047
47212 538047 1117686 1456225 1194569 497008 -116423 -323782 -243426 -152868 -155103 -202969
47202 -202969 -288487 -407640 -381166 46673 813459 1409602 1358011 782040 277512 183859
47192 183859 220511 -3441 -340451 -274047 330059 997801 1273243 1264614 1345800 1541968
47182 1541968 1529116 1158143 667902 362639 331459 515806 796008 946509 775255 429464
47172 429464 307456 512710 672238 524690 391625 688473 1187232 1274507 885831 617335
47162 617335 776940 883129 446509 -207443 -410001 -174774 -156008 -638785 -1166126 -1313628
47152 -1313628 -1296722 -1476442 -1665882 -1405441 -743141 -249016 -244319 -432009 -406600 -177804
47142 -177804 13268 110106 179889 113840 -266024 -829404 -1174889 -1112581 -870579 -722792
47132 -722792 -630209 -406501 -58645 255468 509252 811135 1141624 1299009 1154460 804493
47122 804493 421982 102517 -84487 -55590 156043 343165 330955 174098 41997 -10125
47112 -10125 -26831 8055 142689 308396 389833 434059 572382 695116 455407 -255909
47102 -255909 -1038509 -1390068 -1253626 -948533 -684788 -436539 -241522 -261654 -447753 -475937
47092 -475937 -239935 -155586 -655448 -1492421 -1887491 -1411188 -466175 189141 192618 -254522
47082 -254522 -776843 -1162669 -1358885 -1331905 -1047308 -564980 -83925 176768 172972 69535
47072 69535 32029 36482 -33393 -161699 -223067 -222520 -332593 -618989 -880455 -886074 -681188
47061 -681188 -534409 -632441 -926927 -1230899 -1358234 -1204835 -815161 -385175 -124694 -95349
47051 -95349 -203101 -308056 -293688 -89786 271093 625978 787926 699375 458996 221518
47041 221518 90301 50212 -32628 -273382 -582901 -719430 -608099 -490963 -618055 -890517
47031 -890517 -1006346 -904755 -830087 -934255 -1047089 -934213 -598312 -200140 172352 502776
47021 502776 710505 684989 441100 129883 -103527 -205409 -185424 -84809 32567 117757
47011 117757 163579 160283 62483 -129904 -280156 -206446 90816 364636 373888 190320 151059
47000 151059 443330 820330 867062 530368 204871 218842 411021 383046 46413 -310772
46990 -310772 -454927 -452266 -444092 -409125 -262028 -20652 249274 527855 764118 833294 714207
46979 714207 606316 698215 870260 798721 358089 -222824 -640124 -838312 -989833 -1212608
46969 -1212608 -1392363 -1314989 -952606 -558636 -430355 -608362 -873611 -1001927 -917829 -632669
46959 -632669 -205469 189381 322916 145063 -151320 -376734 -527239 -637213 -622548 -438346
46949 -438346 -264369 -323654 -571530 -747746 -704429 -524450 -360304 -326628 -508069 -874763
46939 -874763 -1201824 -1273411 -1177447 -1199498 -1403812 -1539418 -1421751 -1181611 -1020843 -922694
46929 -922694 -764683 -562070 -414453 -315274 -200823 -127040 -215381 -434984 -590147 -544188
46919 -544188 -355531 -188333 -176553 -371003 -724058 -1103840 -1378817 -1490434 -1412719 -1105280
46909 -1105280 -605723 -126027 83534 -12427 -222900 -387660 -529749 -721544 -935957 -1110652
46899 -1110652 -1240466 -1291262 -1120873 -644617 -39743 373212 455269 317758 69633 -315881
46889 -315881 -802938 -1133634 -1037595 -542653 53566 487054 697317 747517 724730 729246
46879 729246 838688 1036795 1240655 1404394 1526276 1561161 1419845 1079047 631380 217518
46869 217518 -54837 -167780 -234181 -413837 -689498 -810483 -599898 -224658 29645 147767
46859 147767 277258 321341 38044 -412920 -463190 124382 872945 1199174 1080060 839625
46849 839625 617804 433855 477890 853474 1214545 1161199 883872 892074 1157012 1096326
46839 1096326 478288 -215052 -495066 -432596 -290593 -65750 286984 559036 570077 458910
46829 458910 391522 276641 95281 198820 850463 1678931 2026496 1722437 1132401 584549
46819 584549 184528 97004 481294 1070050 1268056 853285 257789 -9734 66833 189623
46809 189623 221431 240919 293386 329008 327915 316526 283212 187173 38352 -91821 -126357
46798 -126357 -38843 104053 163572 57075 -141144 -285144 -308503 -223252 -49116 127761
46788 127761 105904 -227577 -664379 -837766 -630966 -265516 -7753 14839 -256880 -773096
46778 -773096 -1201938 -1099198 -425540 307636 569694 321839 -123012 -520288 -762483 -723468
46768 -723468 -333179 240284 707401 946295 1030980 1032407 956900 831157 680201 457451
46758 457451 150055 -95028 -115138 43371 213235 358081 525538 597212 362172 -118217
46748 -118217 -483967 -523356 -425292 -457004 -605073 -718937 -822786 -1031257 -1260660 -1306313
46738 -1306313 -1198848 -1216963 -1469916 -1692988 -1605885 -1314679 -1156519 -1211343 -1183067 -806259
46728 -806259 -204124 262332 399236 301978 119113 -145610 -541627 -988311 -1289873 -1325039
46718 -1325039 -1167445 -1011339 -994344 -1079448 -1101209 -958117 -770707 -794451 -1131647 -1574443
46708 -1574443 -1793486 -1650812 -1264117 -803348 -333151 131530 521461 737543 743402 592113
46698 592113 387728 244490 241745 369281 526497 610554 613707 626750 741429 933724 1039188
46687 1039188 891834 534773 239540 213860 312550 183941 -259395 -676264 -712374 -439519
46677 -439519 -199421 -104280 44344 310880 379709 -45514 -735885 -1078135 -738909 -21126
46667 -21126 502279 586934 455024 418176 511416 531731 329028 -46783 -456193 -800230
46657 -800230 -993306 -920076 -552442 -83886 182679 113333 -167762 -461491 -645408 -633142
46647 -633142 -368570 18727 189478 -96595 -696657 -1242755 -1526824 -1587722 -1488021 -1212689
46637 -1212689 -791593 -332296 99649 468250 631835 445100 54518 -155399 -43658
46628 -43658 87604 -39742 -229732 -98788 337103 688033 752609 720113 767217 770530 567777
46617 567777 266879 100056 116380 196520 259665 273178 142314 -195799 -578695 -712475
46607 -712475 -505231 -161943 99491 268436 381327 305347 -100762 -649755 -890670 -613306
46597 -613306 -135875 54943 -132531 -339120 -215587 218456 670266 871766 749678 439388
46587 439388 193929 187703 377748 638568 984792 1461801 1827002 1653976 905982 129153
46577 129153 -170776 -123491 -168446 -332834 -259243 93445 237425 -197839 -921950 -1296623
46567 -1296623 -1019135 -346939 212373 307297 -36359 -473596 -674169 -628138 -537093 -462699
46557 -462699 -302529 -102096 -79103 -230162 -225578 89381 347733 113922 -468745 -798999
46547 -798999 -541721 32423 433935 454591 235307 16353 -81474 -102211 -153227 -267027
46537 -267027 -381759 -452315 -515015 -633345 -855222 -1201235 -1559309 -1621170 -1158154 -411777
46527 -411777 47467 -33943 -337651 -494407 -548265 -665405 -694149 -394567 77852 308434
46517 308434 150591 -216660 -649750 -1096521 -1376421 -1301968 -1006656 -805809 -766467 -759132
46507 -759132 -832682 -1075216 -1175900 -719674 21264 237839 -262077 -690883 -424096 107721
46497 107721 182769 -85833 -66235 295697 455114 219516 -6632 18183 10023 -262018
46487 -262018 -558216 -583308 -430241 -354927 -402311 -483786 -584565 -687400 -693744 -602787 -585976
46476 -585976 -726342 -870637 -892361 -896067 -972703 -947672 -613960 -93724 261700 262678 -3033
46465 -3033 -350507 -600812 -589244 -295394 51197 169978 19612 -245025 -531087 -822936
46455 -822936 -989611 -835739 -393799 48184 290756 416489 562961 700616 770188 856654
46445 856654 1013731 1025823 608753 -137610 -709893 -752343 -486637 -436475 -784507 -1181803
46435 -1181803 -1237727 -1035618 -994218 -1265426 -1490044 -1264310 -700999 -327915 -466808 -911106
46425 -911106 -1241767 -1257759 -1006967 -602152 -205050 -63797 -306296 -692401 -779167 -398915
46415 -398915 153633 445730 294385 -183940 -726867 -1030541 -863767 -271796 358891 580057
46405 580057 271497 -270718 -608900 -505641 -64811 389141 593135 555119 471265 441784
46395 441784 353981 82448 -293805 -556561 -575437 -409348 -231478 -183107 -223140 -110649
46385 -110649 326432 875939 1097322 884866 629498 637216 654761 288249 -326447 -708025
46375 -708025 -775783 -898873 -1160580 -1116194 -519462 161114 313507 -32249 -366144 -432267
46365 -432267 -403664 -440506 -474714 -444902 -429565 -481342 -538946 -534783 -425490 -144699 279890
46354 279890 603474 596466 394833 371458 633030 895184 905865 717702 431402 -46927
46344 -46927 -771729 -1471080 -1753935 -1537274 -1073406 -605654 -188209 168767 372993 345127
46334 345127 143034 -70253 -146578 -42909 138094 187405 -46202 -475429 -801682 -783915
46324 -783915 -471329 -126807 66926 161005 290772 460224 553250 512305 406170 333128
46314 333128 354434 509774 768470 960084 924226 780585 847390 1168001 1331606 992111
46304 992111 409320 170191 422496 696311 526521 -24292 -554783 -790844 -725223 -487511
46294 -487511 -246437 -128167 -97125 2308 207840 358709 333510 226461 167341 94393
46284 94393 -142069 -528257 -867569 -955703 -699620 -177268 316409 430179 144274 -99255
46274 -99255 143642 769969 1220452 1096306 523424 -66470 -324966 -147835 347161 894235
46264 894235 1218292 1182192 812491 252806 -239134 -362581 -20396 537107 958334 1119365
46254 1119365 1049802 675077 -29086 -661683 -622081 110529 787752 755398 220014 -160946
46244 -160946 -181331 -143606 -195601 -165963 -78030 -260290 -726594 -931838 -513503 81921
46234 81921 172762 -184199 -317112 42814 433048 463942 419464 739380 1285119 1541126
46224 1541126 1336805 945761 576412 209180 -54215 54576 482754 692218 283500
46215 283500 -432796 -799086 -630497 -367597 -441940 -783250 -1024936 -964022 -683847 -371511
46205 -371511 -167243 -127004 -201523 -256403 -187768 -22486 127387 185144 145326 16666 -209809
46194 -209809 -517586 -811426 -932050 -759315 -345197 58394 169054 -83547 -511986 -892071
46184 -892071 -1169927 -1382775 -1440315 -1148745 -510729 129055 382090 230436 15549 3743
46174 3743 92658 15097 -271718 -522147 -500407 -242528 -1894 16437 -149208 -276670 -228859
46163 -228859 -147801 -296129 -685585 -1002938 -1011525 -889104 -967719 -1213302 -1223623 -777409
46153 -777409 -152023 200602 108485 -288286 -763041 -1103739 -1146926 -908690 -610575 -440573
46143 -440573 -379877 -378228 -529347 -858859 -1087641 -917481 -510958 -367638 -675751 -1079681
46133 -1079681 -1201561 -1132621 -1228417 -1598840 -1993433 -2085899 -1725980 -1020428 -322358 -45500
46123 -45500 -300467 -730533 -832392 -427098 248525 821295 1036205 852840 499220 393536
46113 393536 791102 1462101 1878315 1765065 1333787 952608 775919 768692 880516 1012068
46103 1012068 943494 528112 -54790 -408842 -302534 163488 745612 1263869 1605541 1680423
46093 1680423 1454179 953428 223179 -606716 -1211222 -1237693 -717602 -156740 -34310 -309660
46083 -309660 -603681 -750618 -888795 -1035489 -923475 -406818 240585 665403 901192 1221697
46073 1221697 1608642 1670654 1161282 359428 -198769 -253442 21265 298246 391666 291616
46063 291616 59522 -210142 -372670 -309559 -93972 -9033 -273797 -743375 -1008200 -849875
46053 -849875 -482660 -246487 -178165 -59704 169881 287181 132367 -113767 -157578 10693
46043 10693 135319 84396 19921 101083 186970 28607 -289115 -325196 193390 965130 1385716
46032 1385716 1175323 609699 167369 79232 201095 189528 -190486 -803380 -1215217 -1176529
46022 -1176529 -964091 -1001961 -1200711 -1047770 -423646 110249 87465 -186034 -108297 354494
46012 354494 732764 787496 672846 456360 25024 -480001 -660158 -467682 -375931 -704256
46002 -704256 -1140373 -1209824 -914307 -595030 -401887 -238353 -91506 -86236 -237946 -382288
45992 -382288 -362787 -180156 -4817 -91372 -532588 -1020001 -1058797 -566031 -41823 40711
45982 40711 -208267 -392873 -458053 -658079 -1009887 -1169413 -896591 -361503 85170 254123
45972 254123 193270 90918 132667 326371 477281 445722 359305 422765 612990 759750
45962 759750 837829 933092 979246 812337 486604 257125 201127 108364 -181210 -556495
45952 -556495 -832770 -969426 -1011565 -1001231 -1020700 -1138453 -1235227 -1075587 -654825 -302857
45942 -302857 -323061 -653110 -972729 -1028332 -785771 -392320 -52590 168981 436099 885988
45932 885988 1321305 1411855 1219361 1180037 1431752 1519207 1043105 304527 -84470 -52723
45922 -52723 -81559 -392430 -586093 -265762 324928 591573 366174 81406 149447 424527
45912 424527 447982 95512 -260442 -260506 -11759 109259 -45656 -291423 -405364 -299771
45902 -299771 45582 557111 967494 1018924 825854 765822 930425 996146 790990 643667
45892 643667 870543 1176887 969048 166050 -667638 -999036 -830717 -492877 -217376 -35587
45882 -35587 93102 192585 234765 136240 -142218 -479774 -669089 -631927 -496160 -446080 -543673
45871 -543673 -688275 -713208 -550388 -326102 -234339 -294091 -338521 -286453 -273770 -421624 -635019
45860 -635019 -772741 -861985 -960210 -945166 -679913 -305588 -129357 -247485 -475222 -615399
45850 -615399 -610296 -473964 -273098 -144852 -158238 -209151 -212008 -276291 -479096 -625211 -551078
45839 -551078 -523982 -911874 -1509799 -1681605 -1236509 -686846 -492154 -519576 -471569 -372324
45829 -372324 -299924 -72372 350729 492653 -71029 -940508 -1227934 -636090 260290 830956
45819 830956 1045935 1212723 1455260 1661240 1690749 1447198 921416 318921 -14120 48537
45809 48537 229010 156472 -198139 -494515 -391099 110360 646417 801830 500534 90118
45799 90118 -38344 108176 184977 999 -226316 -174839 180436 593174 869110 1013118
45789 1013118 1087572 1066958 882911 557551 244513 128758 277522 582549 850739 946098
45779 946098 846991 611312 330982 92911 -73593 -203468 -308622 -312131 -136264 161298
45769 161298 424070 584481 744049 1030721 1415051 1700017 1691733 1392243 1031203 864571
45759 864571 912401 949714 796780 534539 351994 279517 222219 191109 297226 508511
45749 508511 620019 542626 448408 514136 654110 645155 429191 155895 -23986 -89416 -107759
45738 -107759 -165243 -313109 -495105 -550448 -357123 62957 626295 1269862 1841291 2037312
45728 2037312 1684598 1058394 673522 697883 798444 671058 478881 556152 870407 1088509
45718 1088509 1107413 1183489 1472381 1735686 1668512 1313670 958389 761697 687989 710221
45708 710221 845691 1009123 1035573 879059 634568 344588 -54896 -548940 -947921 -1048212
45698 -1048212 -796701 -272710 370404 919846 1216310 1323833 1453824 1654660 1730579 1558177
45688 1558177 1308771 1207424 1221320 1179019 1087087 1098083 1202385 1173224 851455 331888
45678 331888 -166953 -505428 -682490 -796202 -952315 -1131930 -1175251 -985567 -696283 -509762
45668 -509762 -417186 -233387 109425 462838 663398 691602 625434 567187 603805 691627 603027
45657 603027 176121 -378198 -631547 -452304 -162087 -94650 -189305 -152986 109410 368046
45647 368046 321714 -78802 -522412 -598617 -282401 -60538 -340343 -823529 -845727 -344625
45637 -344625 3284 -195337 -400408 79304 1036099 1631412 1496522 996845 489411 -72042
45627 -72042 -693636 -1053646 -924287 -521263 -180600 48498 283621 537455 779533 1039499
45617 1039499 1228760 1073873 474581 -243163 -670338 -753928 -664976 -427373 -4238 378593
45607 378593 378004 -10824 -467831 -808857 -1094766 -1272132 -1120326 -692870 -409519 -457063
45597 -457063 -444923 360 579456 699775 346565 76418 168817 307516 233923 207925
45587 207925 507830 869022 858547 580280 535928 864870 1178422 1186205 1061444 1036037
45577 1036037 996935 734019 344392 115017 133438 245921 318178 341052 342933 375184 527588
45566 527588 786328 929355 751472 374190 145111 209075 341148 251347 -72367 -380847
45556 -380847 -438008 -242427 -36267 -95897 -444972 -787164 -801815 -489956 -148042 -33444
45546 -33444 -155765 -355486 -453657 -348145 -114511 -3478 -167828 -384067 -252974 259172
45536 259172 696944 669644 342244 178076 336432 591171 789501 1062431 1461949 1660887
45526 1660887 1292546 504992 -108657 -191758 -5448 5688 -174163 -198281 74596 391098
45516 391098 504373 468651 425780 363068 248107 163768 95174 -193888 -793152 -1336958
45506 -1336958 -1401527 -1101742 -935813 -1093691 -1298739 -1330986 -1292746 -1265370 -1111385 -812745
45496 -812745 -664535 -875239 -1220454 -1343496 -1204740 -997458 -798671 -568149 -375127 -363696
45486 -363696 -524771 -674038 -622726 -280248 292574 813228 912340 514732 -17607 -271622
45476 -271622 -205940 -68756 -55105 -210404 -510177 -826907 -943665 -798264 -590887 -468717
45466 -468717 -272864 172023 695176 1002151 1121490 1297944 1527448 1546897 1262140 864329
45456 864329 524409 276956 197273 349917 512200 292646 -343448 -929812 -1018807 -651512
45446 -651512 -212960 -5214 -59177 -213182 -285834 -251523 -238157 -272278 -157044 213080
45436 213080 590603 727055 816974 1169030 1549549 1401651 748903 297427 456022 793554
45426 793554 750894 407289 178543 161707 188800 213005 232338 88032 -264653 -504674
45416 -504674 -342330 31951 250814 298855 358058 365896 188449 46904 254903 623476
45406 623476 639539 219881 -190235 -289873 -236670 -238689 -279207 -348881 -542822 -794289 -869791
45395 -869791 -752954 -694323 -766531 -722567 -436459 -140634 -57544 -113555 -187832 -325082 -507549
45384 -507549 -528990 -324375 -146161 -179657 -250349 -158194 -32604 -64074 -122126 24826 281761
45373 281761 356254 203138 30399 -58553 -143340 -269190 -411093 -593005 -791814 -795332
45363 -795332 -434500 87329 381207 370076 317051 365142 367614 233740 123615 161634 227099
45352 227099 211802 261324 533530 875476 996062 887728 828004 956698 1074274 942532
45342 942532 623335 386773 365700 440656 448453 372085 283752 205212 111028 15741 -34213
45331 -34213 -37300 -31593 -26111 -1994 40990 106530 224551 351295 299229 -72997 -602100
45320 -602100 -921888 -863688 -602029 -362578 -171078 21143 156635 176459 172911 271409
45310 271409 448559 609809 751662 883392 867527 533169 -62374 -635989 -950299 -981596
45300 -981596 -842151 -649726 -469000 -296529 -111161 26640 12198 -98761 -62517 214171
45290 214171 415756 132963 -566453 -1094040 -947982 -251597 370862 388613 -176576 -802846
45280 -802846 -950924 -539305 44163 385397 419496 349864 334822 361640 339999 215882
45270 215882 61543 104225 526008 1159025 1570569 1574370 1428854 1351635 1130456 540273
45260 540273 -105962 -276851 30457 332449 396762 441043 573898 575537 386527 308607
45250 308607 467854 525702 243869 -53563 33653 346335 445454 307320 288906 515434
45240 515434 740461 800417 818666 890625 876267 626161 219052 -121610 -231553 -92910
45230 -92910 179352 429667 614606 824937 1086359 1236617 1123974 839905 616917 570821
45220 570821 666411 832121 959571 900759 642283 390144 313655 313987 224336 96807 54761
45209 54761 -1428 -234605 -494522 -434831 -6616 462432 698295 702044 523861 147374
45199 147374 -299915 -520760 -396227 -141481 31480 205166 544873 956788 1148667 971406
45189 971406 580686 281916 244731 324788 199288 -230238 -646486 -686589 -413450 -176453
45179 -176453 -68620 152496 587313 991574 1156683 1168388 1134494 955495 562350 127646
45169 127646 -166808 -360020 -533610 -630946 -632623 -671159 -781766 -800187 -710836 -780135 -1063109
45158 -1063109 -1115763 -600660 98245 345787 146073 38463 219613 345878 221816 110237
45148 110237 209804 322429 260201 168347 200431 236633 190562 266095 596851 893508 789341
45137 789341 364480 20013 -38412 84447 244191 345238 246271 -115216 -520566 -652018
45127 -652018 -475772 -211556 62133 491701 1084646 1548760 1662825 1619651 1795251 2263391
45117 2263391 2725881 2905552 2848525 2803375 2929392 3202868 3513643 3712748 3586770 2962913
45107 2962913 1941869 922929 265028 -31894 -203184 -360103 -427748 -385625 -318363 -178308
45097 -178308 252961 1025191 1830354 2326393 2513346 2615037 2716456 2732901 2652191 2553665
45087 2553665 2380063 1913987 1066367 67685 -687178 -922055 -631285 -73583 378847
45078 378847 511295 422032 326250 229930 -48065 -511647 -840942 -739090 -307361 86685
45068 86685 272191 440188 801965 1211756 1271421 816289 177542 -137411 20037 343048
45058 343048 498844 495155 546356 729533 933316 1062496 1101214 982665 583605 -73704
45048 -73704 -714755 -989614 -745785 -140634 463309 740841 630365 335511 71859 -141334
45038 -141334 -384294 -625262 -739342 -692898 -568599 -429061 -289842 -206027 -241591 -361531
45028 -361531 -484094 -606110 -730383 -736781 -540125 -327957 -370153 -595777 -669670 -539201
45018 -539201 -556985 -923815 -1347026 -1456647 -1252420 -900452 -409696 163802 488178 356920
45008 356920 109512 181078 372518 105408 -618932 -1085286 -831068 -249228 15601 -139073
44998 -139073 -385226 -538903 -663736 -795467 -882314 -886212 -717014 -225389 492369 951566
44988 951566 746601 61385 -570277 -910382 -1104946 -1220564 -1111740 -803680 -610148 -692112
44978 -692112 -796378 -642713 -334435 -150239 -117095 -62138 29071 2728 -135582 -153249
44968 -153249 84750 417132 594052 541306 348274 138263 54972 249412 716013 1180503
44958 1180503 1295042 970000 441512 19704 -149186 -86129 128316 399806 624617 726770
44948 726770 699673 609203 573084 704868 998131 1257398 1228578 840811 274241 -213764
44938 -213764 -458931 -419221 -202460 -107795 -433221 -1085241 -1528135 -1323720 -638520 -26250
44928 -26250 206570 192843 143120 103448 109514 280551 617617 910999 988075 908847 818918
44917 818918 756776 684367 544702 228597 -306768 -814659 -922358 -648217 -459511 -620843
44907 -620843 -808130 -660728 -391689 -422892 -657486 -638537 -315140 -96851 -142652 -139274
44897 -139274 114331 416626 618052 860169 1122966 1030442 461461 -66153 -43795 332570
44887 332570 562417 630252 854106 1146073 1045064 485392 -21405 -89445 104517 232207
44877 232207 259874 282622 244008 66692 -151532 -273599 -299659 -275709 -191753 -81450 -53756
44866 -53756 -135161 -255414 -432802 -721539 -916704 -657076 12851 536857 557439 399505
44856 399505 521466 818660 923164 921320 1178269 1560166 1491230 878779 364257 403471
44846 403471 637989 559630 349681 533866 1066002 1337874 1067556 671964 636949 900726
44836 900726 1065041 968709 822220 879332 1143793 1378095 1334760 1010705 678590 586016
44826 586016 627556 450084 -67917 -574503 -582477 16548 843222 1367354 1296606 724252
44816 724252 7831 -517681 -779988 -925804 -1041746 -1017219 -749409 -372824 -137537 -101166
44806 -101166 -97674 -19195 25729 -102213 -350362 -535532 -559966 -468328 -323633 -121891 159835
44795 159835 483227 724900 715168 342395 -316801 -986790 -1380541 -1408205 -1168506 -778690
44785 -778690 -308413 139122 427693 533494 586034 689062 791224 810024 770282 699804
44775 699804 504116 129632 -225431 -293285 -113580 10532 -50236 -130070 -154343 -327340
44765 -327340 -741124 -1088017 -1067465 -873214 -908429 -1128560 -1067781 -510942 243932 844869
44755 844869 1222516 1351479 1084231 486588 24006 73331 435660 645419 599329 530789
44745 530789 485821 261225 -111301 -247909 38211 387117 347000 -18266 -242303 -63782
44735 -63782 349771 745836 1064522 1293488 1303903 1048052 795865 910914 1367525 1703137
44725 1703137 1543365 1012174 509501 249645 191828 269489 424916 496955 368037 205804
44715 205804 264633 452112 442365 254483 276657 559934 583731 65255 -445730 -288287
44705 -288287 313066 577230 319122 119415 353371 693780 722600 470456 129325 -259286
44695 -259286 -547035 -376930 295991 946143 1111276 977811 965121 1036617 882188 560011
44685 560011 439676 591418 710834 650966 596132 647770 630423 433071 224616 182495
44675 182495 252995 309800 330066 285132 65091 -326576 -655688 -694997 -485913 -243839
44665 -243839 -86284 35915 203885 434043 686487 896173 1007248 1010363 929851 773486
44655 773486 543763 313401 239686 461317 965225 1534810 1849122 1729386 1345506 1100106
44645 1100106 1218010 1495207 1532241 1173224 639060 267310 193440 265430 236362 68524
44635 68524 7199 229573 474965 286239 -337891 -860725 -938191 -883906 -1119152 -1486918
44625 -1486918 -1536251 -1253836 -1006822 -883311 -636844 -271928 -122151 -239334 -228753 120648
44615 120648 520511 730682 954001 1359552 1630353 1411473 913051 620450 596537 509637
44605 509637 244444 55996 119904 284521 326523 198041 -23300 -227916 -293026 -179185
44595 -179185 -23380 -4925 -139144 -318420 -486925 -628356 -663959 -546109 -393015 -340853
44585 -340853 -309306 -115990 193353 328999 101930 -356397 -737215 -812782 -568323 -186515
44575 -186515 108865 264392 404030 579621 648376 503545 263311 59365 -205113 -660046
44565 -660046 -1158472 -1423345 -1417234 -1297876 -1083684 -676962 -194801 60613 19477 -61917
44555 -61917 -8337 48095 -31921 -114362 19959 364188 701773 833220 720461 524553
44545 524553 528662 859705 1247418 1249669 783824 246556 28998 108990 219131 204937 62343
44534 62343 -200448 -540745 -818616 -919060 -881569 -808548 -726782 -631166 -572541 -604637 -717492
44523 -717492 -878932 -1034391 -1031677 -733271 -303196 -168610 -499754 -888281 -791276 -213052
44513 -213052 308671 380361 173637 112228 336046 601129 613378 335254 -31652 -288737
44503 -288737 -409509 -468642 -477206 -384495 -225650 -130243 -128907 -70082 179931 548022 868633
44492 868633 1100737 1294630 1396008 1253350 857116 456671 363314 665831 1170526 1601220
44482 1601220 1834957 1941218 2007886 1978294 1717801 1235172 766340 590513 768123 1064516
44472 1064516 1139291 864542 487501 399632 671884 916125 741945 263487 -50257 4434
44462 4434 134446 -23822 -474983 -946990 -1192668 -1090248 -644113 -66582 271354 159940
44452 159940 -225008 -522331 -536788 -314734 880 260870 361801 357143 449407 743983
44442 743983 1071025 1165299 962166 613347 281594 27261 -174255 -416032 -795850 -1258133
44432 -1258133 -1558207 -1491784 -1115813 -661948 -297122 -53594 78018 90606 -31087 -281970
44422 -281970 -566318 -682728 -528567 -318829 -386009 -705129 -856249 -560712 -1908 518843
44412 518843 946429 1273139 1278852 813669 154946 -255540 -303158 -129080 267412 963960
44402 963960 1719625 2042859 1720598 1034728 447877 273474 567870 1074791 1337276 1138708
44392 1138708 780587 685289 851537 992323 1029066 1043907 896612 393651 -226603 -504778
44382 -504778 -443900 -441184 -543005 -409579 -112324 -232119 -874338 -1285697 -910527 -237666
44372 -237666 -37653 -239652 -210830 185485 492221 447976 251003 102768 36247 172378
44362 172378 631493 1160585 1321124 1123726 1056860 1380207 1762562 1753765 1301978 670797
44352 670797 123848 -160822 -99573 201557 496334 642591 688557 696544 649720 575675 585003
44341 585003 705808 808014 764683 603225 458494 441189 554680 683510 690595 570332
44331 570332 436334 323078 140092 -111944 -283368 -358331 -548038 -895207 -1053988 -779367
44321 -779367 -402300 -410900 -718551 -810323 -542281 -305153 -368450 -529968 -517699 -328157
44311 -328157 -49473 259546 386459 66286 -547923 -882536 -630132 -123837 176560 248347
44301 248347 321057 437783 487584 445238 322188 80464 -186338 -207104 109250 489787
44291 489787 686525 810677 1047029 1288464 1324354 1160737 888263 484127 28056 -179034
44281 -179034 -65322 -52328 -423893 -716032 -308611 554773 998160 747261 467330 720902
44271 720902 1190876 1233848 740650 95283 -390756 -647782 -669838 -501342 -313549 -271347
44261 -271347 -365749 -472243 -477706 -310924 -13263 187581 91433 -143422 -146480 122775 299527
44250 299527 207594 167993 479370 923047 1111562 1069251 1091400 1212040 1216309 1082981 1014436
44239 1014436 1049307 1020791 936144 1044088 1411526 1718287 1635348 1228916 857735 790501
44229 790501 1011516 1302407 1449881 1435451 1424070 1510804 1570861 1496987 1454313 1638791 1856781
44218 1856781 1686647 1087767 497184 215726 56893 -205726 -404832 -310911 -112217 -149086
44208 -149086 -325867 -235353 161038 418941 268503 -2217 -3621 236576 461264 637321
44198 637321 888049 1097486 949503 415732 -66069 -47883 421186 858135 849182 410709
44188 410709 -96630 -327743 -234472 -46538 -8719 -160915 -377723 -546415 -614485 -514262
44178 -514262 -203538 190629 437236 500775 618863 941404 1249718 1264202 1125446 1250456
44168 1250456 1695399 2002042 1824056 1407996 1209188 1268275 1297543 1228918 1257283 1342039
44158 1342039 1106007 427746 -183911 -110610 617470 1348326 1542837 1264323 945786 884780
44148 884780 1051351 1257580 1376890 1396825 1334572 1170514 887504 530467 170996 -149316
44138 -149316 -358639 -294166 130413 687238 967911 850248 652763 687316 830229 739133
44128 739133 368808 25686 -37112 153258 439570 672734 696982 454627 175831 237547
44118 237547 728184 1337521 1768291 2039259 2243050 2249933 1923151 1487166 1356273 1598540
44108 1598540 1854754 1866789 1832405 2063025 2466755 2628446 2379486 2056177 2098872 2539250
44098 2539250 3013193 3194660 3071187 2842134 2728345 2900176 3407380 4089208 4683445
44089 4683445 5103692 5476223 5838137 6007216 5905533 5800322 5975770 6325435 6557644
44080 6557644 6659741 6786925 6778275 6256607 5284470 4470361 4225262 4279139 4161884 3819994
44070 3819994 3468480 3137880 2735685 2352967 2133064 1954965 1598253 1154594 947328
44061 947328 1061319 1235325 1222889 1024754 770434 578240 516938 530614 453034 247788
44051 247788 100325 77317 -91527 -568151 -945694 -693216 33250 534825 526904 411068
44041 411068 492516 507198 199356 -141787 -123011 147425 317986 371719 502769 627775
44031 627775 502996 239757 241398 602157 954899 997533 853083 793390 864868 936381 941569
44020 941569 924143 924115 902362 739714 328333 -236492 -596446 -447146 42769 304360 -28153
44009 -28153 -689418 -1065315 -834245 -224888 304368 494382 382068 132932 -87093 -142777
43999 -142777 -12449 129570 70817 -127805 -143526 158888 462599 395741 59509 -114775
43989 -114775 41657 297649 447818 519647 513350 320120 42129 35124 413869 814408
43979 814408 885893 745323 687814 714783 656365 533630 468029 417052 324161 342799 556533
43968 556533 661297 344926 -144486 -260066 71614 383962 363171 167562 32990 7880
43958 7880 149652 526845 888111 769446 143885 -403218 -360786 184574 903670 1697307
43948 1697307 2498178 2960454 2795081 2247041 1845746 1760562 1727420 1547362 1328064 1218021
43938 1218021 1178152 1095814 954093 818640 748615 749391 769111 760836 760687 824125 876111 772540
43926 772540 561751 513398 798454 1303952 1837587 2290714 2484545 2151739 1332593 570518
43916 570518 394463 723242 1054203 1116033 1044884 1044526 1219684 1654421 2257454 2559698
43906 2559698 2114800 1187750 614543 798221 1239104 1314708 1138728 1233546 1610034 1713301
43896 1713301 1279678 763126 714863 1066685 1306195 1180519 920736 817047 873927 977454
43886 977454 1161101 1495950 1839383 1947967 1847635 1867532 2221284 2734129 3107075 3290737
43876 3290737 3421732 3513299 3445898 3225091 3004593 2817778 2511452 2044653 1663350 1621328
43866 1621328 1841304 2008386 1929375 1655838 1314134 993624 799403 829510 1024479 1167021
43856 1167021 1121531 984550 919134 942677 990913 1090389 1296992 1523737 1640480 1738029
43846 1738029 2049590 2541105 2832004 2684341 2361862 2286662 2499526 2710794 2765521 2773836
43836 2773836 2847923 3002772 3279833 3654903 3836374 3527088 2961901 2800774 3309454 3983210
43826 3983210 4215392 4030136 3855015 3843455 3831288 3830826 4133004 4870150 5784065 6528110
43816 6528110 7015443 7407242 7905581 8625144 9591802 10835034 12487664 14720246 17540028
43807 17540028 20758874 24162004 27464649 30000424 30804701 29386204 26305103 22685627
43799 22685627 19248306 16095588 13267884 11009016 9405346 8179214 7054150 6088227
43791 6088227 5477584 5209794 5064917 4844498 4495857 4095677 3767457 3550011 3357972
43782 3357972 3153874 3081258 3270815 3586205 3756581 3708526 3577197 3479036 3507686 3834781
43772 3834781 4485418 5093233 5274004 5234794 5602781 6623867 7982695 9496190 11471270
43763 11471270 14156750 17292997 20451027 23347352 25498047 26069962 24635805 21821477
43755 21821477 18721516 15873048 13238274 10920311 9259467 8264769 7526343 6784499
43747 6784499 6154285 5727892 5388416 5114594 5047654 5102444 4901419 4308940 3711550 3527640
43737 3527640 3683654 3803942 3716019 3543807 3460699 3557827 3830685 4119101 4179657 3972201
43727 3972201 3739647 3650470 3535509 3195385 2802149 2684792 2786661 2682098 2186107 1641938
43717 1641938 1463610 1639363 1887287 2108588 2406346 2734864 2843265 2637473 2356037
43708 2356037 2242462 2211556 2017663 1640362 1299319 1141183 1127108 1229815 1514497 1941873
43698 1941873 2272217 2296522 2065700 1800418 1666498 1710798 1898847 2105575 2161379 2024699
43688 2024699 1849606 1797524 1855918 1922316 1973017 2049246 2164400 2324665 2547406 2758756
43678 2758756 2791290 2614962 2446968 2461819 2503182 2300819 1914670 1729568 1987749 2494989
43668 2494989 2819177 2678207 2168834 1729752 1801424 2355398 2831536 2738690 2253997 1998638
43658 1998638 2277744 2829923 3318645 3720500 4107686 4355194 4287505 3943318 3513446 3149706
43648 3149706 2979298 3149365 3655046 4211669 4493918 4485923 4466310 4662830 5016243 5262934
43638 5262934 5175660 4752182 4237460 3948619 4037157 4417794 4891031 5272621 5471268 5599111
43628 5599111 5981596 6835710 7883793 8524141 8520816 8313323 8455744 8947136 9387581 9658319
43618 9658319 10082575 10884772 11819449 12497672 12873644 13221732 13760933 14503997 15425429
43609 15425429 16575145 17987951 19630638 21511071 23722297 26280963 29029835 31861084
43601 31861084 34982016 38751969 43223204 48038033 52842631 57551624 62011004 65621011
43593 65621011 67635884 67799464 66399583 63720985 59805540 54866398 49591707 44737044
43585 44737044 40534948 36717780 33032668 29529948 26394641 23709842 21438163 19511715
43577 19511715 17870961 16457649 15209957 14072420 13017638 12037209 11076482 10023688
43569 10023688 8857282 7778022 7057783 6726891 6524602 6192482 5714017 5254325 4998560
43560 4998560 5064505 5396778 5684847 5562411 4986483 4274522 3696426 3222727 2779815 2508566
43550 2508566 2542626 2699267 2663517 2408048 2192473 2184642 2302197 2412633 2475390 2465134
43540 2465134 2346844 2181158 2103243 2129991 2097014 1855439 1472522 1196167 1244258 1616378
43530 1616378 2071990 2316230 2253914 2050905 1942194 2029901 2250283 2420056 2315190 1887696
43520 1887696 1462400 1500931 2035289 2539033 2541551 2179203 1919088 1930940 2024850 2056571
43510 2056571 2034399 1894257 1548686 1176507 1108184 1348730 1534048 1459055 1332369 1357689
43500 1357689 1366225 1100518 651798 358316 380750 590443 809574 982765 1142249 1334756
43490 1334756 1566696 1747322 1734747 1507080 1231419 1098554 1144092 1284583 1462076 1682732
43480 1682732 1945493 2178291 2249499 2086721 1831279 1785275 2080540 2480876 2682056 2716847
43470 2716847 2814137 2929819 2782953 2405634 2251001 2552963 2917745 2835692 2341527 1858444
43460 1858444 1608486 1541291 1685339 2133132 2698362 3000210 2984125 3031178 3407065 3859554
43450 3859554 3933182 3502213 2837099 2294333 2103777 2344350 2931387 3638093 4254614 4745634
43440 4745634 5205154 5684345 6121227 6422199 6570214 6667681 6894584 7387082 8115959 8897016
43430 8897016 9535149 9930841 10043550 9828717 9293560 8603330 8043719 7806304 7808277 7767686
43420 7767686 7485363 7027070 6589879 6224872 5787908 5183573 4545010 4080859 3820213
43411 3820213 3642602 3534320 3650934 4065932 4591404 4973139 5198771 5470481 5878097
43402 5878097 6246539 6374915 6319814 6330338 6550856 6896981 7205587 7400079 7509269 7627861
43392 7627861 7859097 8179216 8363718 8217381 7913719 7899952 8363243 9006531 9516461 10023097
43382 10023097 10830628 11884598 12867119 13713625 14618459 15548092 16228525 16747836 17705350
43373 17705350 19469745 21639022 23594388 25341782 27418593 30138190 33360633 36964068
43365 36964068 41099050 45839802 50879735 55754449 60206784 64183994 67551911 69906822
43357 69906822 70656830 69328271 65937397 61135820 55920983 51098228 46931090 43211118
43349 43211118 39630720 36165663 33139533 30846742 29122939 27461545 25607235 23813270
43341 23813270 22390176 21258757 20182073 19202099 18504751 18005507 17469988 16997642 16976376
43332 16976376 17500317 18185777 18657633 18900986 19028459 19027309 18905223 18806933 18787377 18677618
43322 18677618 18326646 17754711 16938843 15743384 14280277 13045755 12387604 12053210 11598011
43313 11598011 11049815 10762412 10716413 10426778 9600697 8505319 7560778 6880550 6362786
43304 6362786 5959809 5658321 5396641 5207135 5287938 5723129 6232438 6400868 6110093 5592279
43294 5592279 5131057 4890257 4974455 5403715 5960282 6249981 6050277 5532063 5075226 4926428
43284 4926428 5054167 5225581 5185039 4901213 4719411 5099175 6037525 6899107 7060717 6644067
43274 6644067 6322441 6417939 6541373 6242982 5668737 5288831 5207490 5107549 4802589 4484260
43264 4484260 4358027 4305610 4042079 3451850 2662760 1898543 1351388 1129875 1254454 1706823
43254 1706823 2454318 3365209 4156695 4557114 4521890 4204017 3760757 3313368 3020854 2975843
43244 2975843 3022382 2890601 2564605 2328336 2376128 2544845 2507490 2088988 1347780 526044
43234 526044 -19935 -49632 283076 549919 552243 527834 749086 1135489 1446211 1665539
43224 1665539 1957729 2349253 2678946 2808784 2719304 2462249 2160027 1968952 1916089 1883283
43214 1883283 1867490 2069451 2532571 2898067 2808765 2410822 2123914 2015057 1785510 1362470
43204 1362470 1095250 1258121 1692099 2080126 2290914 2297251 2036896 1585095 1273237 1397883
43194 1397883 1902264 2492946 2956318 3228493 3299682 3230304 3166497 3184756 3211946 3229316
43184 3229316 3415016 3892983 4469037 4870547 5175750 5709822 6502099 7148532 7330115
43175 7330115 7224891 7233413 7480562 7799394 8075472 8342076 8557536 8541009 8207755 7700803
43165 7700803 7205194 6763865 6354646 6009470 5747495 5511249 5288285 5167230 5124235 4903424
43155 4903424 4346681 3746556 3581411 3912363 4316974 4424366 4218692 3802012 3246095
43146 3246095 2795769 2793599 3148105 3259994 2820352 2335356 2419382 2868164 3001260 2742841
43136 2742841 2690591 3093040 3430266 3230755 2743960 2472268 2476164 2523672 2582857 2737039
43126 2737039 2833748 2642939 2257558 1980899 1889486 1834228 1817203 2013251 2385445 2603734
43116 2603734 2475019 2227430 2201627 2386659 2432485 2104508 1599775 1339266 1479315 1738076
43106 1738076 1768645 1594828 1523572 1701177 1985929 2243564 2481345 2624675 2483558 2118329
43096 2118329 1946248 2221677 2638836 2753765 2618774 2645664 2947301 3199481 3161828 2999742
43086 2999742 3018564 3339603 3909689 4594696 5170168 5412275 5300087 5002562 4635759 4201542
43076 4201542 3808227 3749532 4230975 5115279 6035970 6715112 7132591 7438967 7731220 7905340
43066 7905340 7782984 7409873 7095575 7053621 7154479 7202784 7295575 7655540 8245864 8873594
43056 8873594 9594921 10641883 11946336 13128851 14041746 14955227 16090287 17353164 18716704
43047 18716704 20462485 22723985 25098549 27108178 28863645 30872819 33273501 35648412
43039 35648412 37627742 39315957 40940908 42271842 42619179 41465397 39044386 36210140
43031 36210140 33663945 31378893 28918892 26220320 23735745 21753656 19961631 17939239
43023 17939239 15800160 14003286 12706687 11691229 10847140 10331327 10176005 10079467 9764635
43014 9764635 9356230 9218855 9479528 9826661 9797753 9238295 8435495 7755621 7224696 6633092
43004 6633092 6001722 5621691 5523862 5268567 4542592 3681894 3235964 3224513 3248394 3183998
42994 3183998 3261832 3483809 3495447 3170291 2875111 2947411 3262466 3537224 3756060 4042737
42984 4042737 4345872 4514961 4552392 4595483 4746728 5028485 5372935 5594932 5562125 5439331
42974 5439331 5506185 5659758 5436075 4701772 3982661 3819517 4064774 4146216 3829783 3372885
42964 3372885 3045838 2845796 2653318 2407317 2126561 1918037 1899109 1996224 1978745 1823944
42954 1823944 1797112 1962596 1941479 1513655 1152589 1444512 2163626 2521752 2287998 2034996
42944 2034996 2181036 2407334 2283202 1943572 1776115 1825163 1918543 2127152 2675746 3495062
42934 3495062 4183920 4398025 4107516 3558957 3129604 3096097 3393692 3714329 3937073 4264451
42924 4264451 4795723 5216114 5155702 4669796 4097988 3604387 3149140 2789585 2671802 2755157
42914 2755157 2846474 2917810 3123036 3470325 3738053 3796950 3809124 4010344 4451887 5049676
42904 5049676 5757583 6579183 7469113 8307350 8967482 9392566 9600833 9591110 9258755 8500516
42894 8500516 7420374 6297495 5298148 4381429 3566930 3068565 2980508 3036832 2943865 2804554
42884 2804554 2925784 3310166 3641660 3697783 3458090 2876155 1937257 965366 474582 587567
42874 587567 905866 1056492 1056571 1043485 1017732 1037470 1305205 1792081 2082571 1910363 1606706
42863 1606706 1680588 2149460 2638943 2979661 3294872 3572839 3586841 3298891 2990833 2883048
42853 2883048 2896377 2905319 2981977 3238667 3609011 3942103 4206341 4483408 4838030 5276984
42843 5276984 5781163 6343325 7043810 8088846 9651463 11626019 13610810 15128180 15785966
42834 15785966 15336230 13855269 11914470 10294373 9365918 8945041 8886477 9520293 11151132
42825 11151132 13276069 14749014 14826507 13764949 12290564 10797400 9284718 7809147
42817 7809147 6601610 5753676 5091895 4446901 3856475 3432160 3191904 3101299 3120912 3118923
42807 3118923 2898337 2450414 2056325 1983684 2177087 2391883 2516583 2568945 2475389 2123450
42797 2123450 1635740 1354731 1497112 1983956 2617493 3230049 3650726 3768012 3698597 3685823
42787 3685823 3767960 3771163 3686419 3755371 4040364 4213897 4008294 3622894 3414991 3404973
42777 3404973 3393129 3376040 3486201 3644330 3658807 3617319 3796842 4184234 4466566 4555335
42767 4555335 4752258 5275111 5952297 6552235 7118553 7767072 8387715 8783685 8942998
42758 8942998 8957956 8803620 8400129 7806259 7177266 6604917 6146470 5920179 5990473 6196591
42748 6196591 6254287 6030178 5619494 5181385 4799457 4489259 4253237 4116939 4138142 4344314
42738 4344314 4638530 4839619 4864767 4806188 4782881 4803138 4840840 4955336 5217249 5541821
42728 5541821 5699231 5532036 5151732 4894844 5018432 5393302 5589475 5385904 5112195
42719 5112195 5289799 5968885 6657619 6927235 6824958 6616526 6418151 6266767 6304785 6627501
42709 6627501 7073935 7393120 7531109 7583195 7584727 7542613 7551017 7653693 7693106 7532223 7340998
42698 7340998 7406127 7714814 8000049 8168318 8380607 8678531 8838633 8716556 8485992 8379039
42688 8379039 8387294 8409349 8559090 9106914 10130492 11375212 12498994 13390536 14221066
42679 14221066 15215619 16414137 17686766 18959437 20325902 21882806 23545667 25134959
42671 25134959 26595920 28032343 29568043 31287188 33284268 35665212 38503149 41845517
42663 41845517 45700500 49953810 54420333 59105782 64315612 70394327 77515739 85814963
42655 85814963 95257283 104761583 111612260 112656972 106732346 95774967 83284064 71838515
42647 71838515 62157936 53970721 47045730 41349521 36764341 33002154 29706116 26579655
42639 26579655 23569836 20956307 19073599 17875999 16930655 15887681 14764350 13682504
42631 13682504 12573221 11374468 10364600 9974978 10256258 10794230 11218980 11533801 11807364
42622 11807364 11830903 11381272 10650900 10047265 9625505 9109354 8476092 8042150 7810979
42613 7810979 7256610 6150866 5199156 5286488 6290147 7232234 7544310 7557880 7667508
42604 7667508 7678767 7321903 6890260 6875401 7247213 7551032 7562646 7441868 7335308 7227887
42594 7227887 7181519 7366381 7790773 8275021 8764882 9426167 10329675 11247702 11890884 12214445
42584 12214445 12407222 12726502 13439511 14747366 16554660 18371112 19635271 20156325 20122973
42575 20122973 19734771 19070951 18377367 18166524 18749905 19847313 21022706 22446454 24813634
42566 24813634 28460582 33023951 38172236 44237506 51814594 61108825 71947187 83826874
42558 83826874 95359947 104337979 109542269 112399124 115576707 119487879 121134087 117061335
42550 117061335 106841954 93158995 79260513 67132264 57461766 50072408 44220598
42543 44220598 39215013 34971427 31649258 28949812 26347055 23892250 22156331 21365350
42535 21365350 21143414 21114253 21208432 21355493 21427655 21548976 21948430 22495085 22947469 23670610
42525 23670610 25438472 28462274 32393530 37453150 44533985 53463626 61811335 66328531
42517 66328531 65517117 60411303 53214990 45764264 39046744 33398722 28843239 25416790
42509 25416790 23207144 22026798 21310170 20586536 19879685 19458169 19463100 20016142 21389266
42500 21389266 23798358 27339210 32282911 38734385 45389254 49302112 48071496 42330117
42492 42330117 35274231 29648113 25894985 23212916 21279163 20322795 20261429 20595397 20895560
42483 20895560 20847148 20060003 18380351 16266195 14395650 12972916 11782920 10795142 10259016
42474 10259016 10224314 10399963 10563887 10769293 11069523 11374336 11705331 12299756 13304813
42465 13304813 14616811 16165130 18082575 20428408 23112508 26453096 31429310 38599031
42457 38599031 46594524 52329628 53300474 49685923 44026349 39026690 35841976 34088428
42449 34088428 32824099 31345309 29470642 27427896 25452128 23453940 21208753 18844553
42441 18844553 16860849 15555200 14669141 13752691 12683934 11677533 10969954 10669694 10746821
42432 10746821 10972403 10990922 10627743 10031897 9411716 8796834 8183023 7681847 7319982
42423 7319982 6901414 6327426 5883877 5932314 6438173 7054892 7541853 7852788 7985570 8054394
42413 8054394 8352995 8988324 9566560 9614479 9224624 8906848 8894277 9023466 9232726 9675967
42403 9675967 10302853 10811055 11126121 11504086 12066465 12685967 13443809 14679045 16344886
42394 16344886 17785914 18463536 18512348 18282075 17744834 16750473 15523983 14450678 13578688
42385 13578688 12731379 11923599 11278684 10703035 10049979 9489510 9309907 9407257 9349445 8948723
42375 8948723 8456846 8182517 8185207 8348419 8502749 8467835 8203044 7941871 8003905 8480002
42365 8480002 9236039 10137547 11073222 11838313 12239474 12315670 12294927 12375116 12685934 13356218
42355 13356218 14411137 15678331 17002743 18498251 20400596 22725796 25224288 27576627
42347 27576627 29484296 30709605 31224294 31211837 30787239 29909179 28724993 27710582 27205290
42338 27205290 27109781 27377511 28469148 30841880 34239482 38027628 42091375 46935030
42330 46935030 53107926 61080856 71520372 85196791 102934259 126040280 155543315
42323 155543315 188948723 217808011 231149156 223494919 199300899 168820777 140319603
42316 140319603 116745414 97964010 83405111 72240528 63108952 55055111 48186782
42309 48186782 42832855 38644430 35011424 31787472 29039545 26512089 23932946 21605955
42301 21605955 20146022 19671735 19640540 19476208 19078828 18693357 18475113 18255935 17700142
42292 17700142 16714841 15696156 15247071 15605871 16451842 17291031 17915320 18487181 19340997
42283 19340997 20739744 22684123 24919400 27214856 29572321 32006375 34233442 35853433
42275 35853433 36791278 37269356 37411850 37283280 37335807 38323084 40564267 43692253 47368866
42266 47368866 51871254 57700720 65033102 73982450 85099557 99192036 117055853 140015927
42258 140015927 170139855 208113091 249698321 285114586 304182819 304028430 292118919
42251 292118919 280725149 277019357 277725361 273140672 256253793 228155220 195679184
42244 195679184 165343166 139942206 119392019 102783544 89201389 77785297 68034576
42237 68034576 59957050 53577270 48502658 44226141 40604432 37737541 35555137 33811764
42229 33811764 32386036 31349860 30810201 30841402 31477279 32640503 34205262 36243201 39050820
42220 39050820 42847776 47693928 53841353 61893814 72516280 86437725 104817801 128408675
42212 128408675 154909614 177394910 187279006 180395538 160247372 134992813 111546389
42205 111546389 92565803 77706789 65975662 56613641 49000293 42733223 37691254
42198 37691254 33687428 30279398 27160893 24461048 22357721 20613268 18814795 16932951
42190 16932951 15320296 14196742 13385245 12549041 11515129 10393026 9514539 9185433 9343055
42181 9343055 9545270 9460824 9248552 9228844 9313939 9109508 8565516 8148559 8236519 8642633
42171 8642633 8943236 9060464 9271689 9745691 10301221 10628803 10618710 10451485 10418992 10645543
42161 10645543 10982255 11242177 11519024 12113599 13097020 14140403 14924911 15582593 16550110
42152 16550110 18076942 20078382 22430240 25183843 28436435 32150031 36178816 40353770
42144 40353770 44415561 47903182 50252039 51125133 50690766 49532826 48242885 47157418
42136 47157418 46558756 46941656 48660450 51118915 52625495 51526255 47629904 42400538
42128 42400538 37742043 34677259 33060563 32212880 31673320 31509754 32102130 33649728 35883367
42119 35883367 38295989 40574068 42615386 44127170 44482926 43184242 40379551 36784169
42111 36784169 33139550 29838527 26956234 24423288 22129327 20005469 18103365 16546826
42103 16546826 15344249 14281792 13091685 11773516 10694429 10259332 10449932 10793503
42095 10793503 10867910 10743266 10804422 11234611 11872145 12533050 13234750 14100788 15361015
42086 15361015 17555075 21320973 26511549 31586686 34342401 33525947 29721504 24698576
42078 24698576 20092308 16696178 14598746 13521402 12961225 12347822 11388167 10291507
42070 10291507 9516767 9252920 9237362 9110944 8810576 8503463 8264619 8027453 7818702
42061 7818702 7813788 8100442 8568433 9113180 9781786 10614592 11500843 12331675 13179783 14194976
42051 14194976 15425201 16859380 18518857 20359201 22223371 24110391 26415092 29669180
42043 29669180 34014035 39008583 43838140 47541769 49195454 48261543 44938446 40098072
42035 40098072 34842458 30073052 26216338 23098467 20210441 17367993 15010727 13584253
42027 13584253 12804991 11962469 10851696 9883446 9256423 8616119 7726642 6915855 6513269
42018 6513269 6311243 5992813 5708294 5761976 6022482 6140206 6150979 6379311 6875638 7418820
42008 7418820 7997078 8832568 9943689 11066433 11986166 12611730 12821927 12649545 12536278
41999 12536278 12948178 13779911 14610627 15504439 17002945 19299665 22033599 25032599 28634387
41990 28634387 33015135 37759234 42361867 46547902 49714025 50709333 48836813 44735301
41982 44735301 39728022 34620556 29650085 25174755 21603675 18788749 16237458 13933139
41974 13933139 12299038 11337197 10478882 9413030 8434148 7779900 7228532 6624770 6234246
41965 6234246 6193845 6084166 5503172 4720430 4296470 4288085 4279353 4051868 3798609 3730264
41955 3730264 3832216 4011730 4199132 4283748 4168601 3906915 3638513 3428380 3294120 3289789
41945 3289789 3386847 3375783 3098487 2708389 2495345 2519467 2626526 2749714 2948259 3190439
41935 3190439 3365404 3510201 3758308 4024161 4002366 3571974 2980687 2528062 2274988 2180809
41925 2180809 2300213 2641509 2982952 3069263 2941403 2879030 3036183 3315595 3618252 4024975
41915 4024975 4616657 5223351 5508870 5318587 4854311 4464143 4306549 4261932 4139820 3919306
41905 3919306 3794130 4011296 4626282 5357744 5736942 5526871 5000877 4687889 4822097
41896 4822097 5176511 5466646 5724920 6153886 6780636 7458821 8124794 8842891 9619799
41887 9619799 10348193 10926544 11277612 11257966 10731351 9788753 8779436 8072640 7832636
41878 7832636 7966124 8156518 8002906 7332542 6416848 5725076 5431677 5305283 5078793
41869 5078793 4730570 4372131 4097878 4045466 4367766 4968512 5448977 5529603 5403619 5465133
41859 5465133 5786044 6094089 6209482 6235505 6283608 6257181 6034445 5700356 5430709 5221208
41849 5221208 4897501 4401179 3929286 3714953 3752162 3853349 3946407 4146131 4463754 4616090
41839 4616090 4314202 3670684 3105830 2851981 2764612 2660604 2600623 2702368 2863482 2856842
41829 2856842 2607361 2238246 1927233 1816635 1941954 2127732 2090148 1791260 1556749 1678301
41819 1678301 2047212 2376280 2613133 2865229 3071172 3102178 3107104 3355404 3739077 3854340
41809 3854340 3659211 3615112 3993668 4450677 4554927 4372577 4183647 3943462 3473079 2971987
41799 2971987 2842059 3075468 3282670 3315470 3391163 3538164 3416302 2893709 2376244 2261388
41789 2261388 2386973 2359785 2183493 2180716 2437762 2703755 2788028 2732703 2618913 2512798
41779 2512798 2602091 3076254 3829899 4561733 5192371 5867643 6495847 6665816 6200141 5450495
41769 5450495 4819427 4318965 3886939 3782084 4201219 4727656 4710059 4143771 3658716 3594747
41759 3594747 3625177 3463389 3409953 3835624 4498507 4823926 4676389 4446599 4449032 4580622
41749 4580622 4569967 4296065 3851531 3491177 3488990 3851584 4223615 4277373 4115058 4039970
41739 4039970 4033401 3829282 3514260 3626214 4464415 5621957 6464313 6854963 7134033 7541317
41729 7541317 7992345 8397027 8886187 9598937 10410431 11004143 11159709 10896766 10379423
41720 10379423 9760510 9123241 8505984 7924228 7380260 6902083 6560274 6368512 6177208
41711 6177208 5809679 5359959 5182596 5446847 5860984 6044654 6030388 6110460 6290497 6278210
41701 6278210 6027368 5882814 6052536 6315529 6461731 6660964 7102042 7591426 7897385
41692 7897385 8234863 8928831 9730338 9988102 9513854 8798591 8274419 7823129 7208624
41683 7208624 6567458 6158741 5952601 5830360 5945925 6458892 7044796 7153923 6791497
41674 6791497 6596180 6973675 7524077 7606696 7192370 6780763 6625604 6489926 6195389 5964009
41664 5964009 5988059 6002246 5640499 5035789 4675069 4713661 4821692 4749756 4650681 4678945
41654 4678945 4632569 4285144 3830078 3652189 3778042 3874945 3744054 3508249 3303200 3074993
41644 3074993 2775822 2543584 2560834 2847500 3256984 3581274 3639040 3384530 2977201 2661888
41634 2661888 2563325 2652840 2851652 3047404 3092166 2975725 2949037 3239074 3643952 3674894
41624 3674894 3174064 2562389 2364970 2672657 3167647 3491750 3466501 3119575 2648799 2265568
41614 2265568 1982033 1650670 1247396 944211 841003 832740 849827 1017540 1419789 1887691
41604 1887691 2202463 2364872 2500241 2637369 2744592 2847375 2948692 2966253 2890615 2841308
41594 2841308 2824441 2657066 2330024 2190796 2474492 2878564 2961096 2778902 2716974 2819358
41584 2819358 2775624 2541998 2460885 2658026 2784802 2558687 2182637 1994171 2008771 2067211
41574 2067211 2184739 2469800 2842476 3071374 3016775 2708520 2297070 2020171 2049823 2254454
41564 2254454 2284292 2012807 1706339 1625022 1671807 1622745 1505096 1511476 1678606 1881571
41554 1881571 2045362 2153741 2140366 1979091 1818396 1841057 2034293 2235605 2334979 2317164
41544 2317164 2219520 2175320 2350713 2684365 2858213 2713625 2514603 2574614 2819113 2994250
41534 2994250 3100637 3252128 3270962 2877256 2216187 1729972 1501708 1205536 772238 584459
41524 584459 823627 1117742 1138872 1124973 1425409 1870620 2039734 1916189 1805703 1750024
41514 1750024 1519704 1157107 1033040 1262249 1484487 1411558 1245432 1303144 1494066 1488230
41504 1488230 1264080 1160183 1390813 1783159 2063009 2180644 2230094 2224607 2151389 2156543
41494 2156543 2431778 2892970 3190058 3136096 2942570 2881051 2884118 2716783 2436714 2380260
41484 2380260 2671213 3013226 3056020 2748783 2241591 1672716 1204194 1052421 1259989 1562796
41474 1562796 1690824 1710245 1869874 2185435 2398421 2332646 2092284 1871395 1712776 1509441
41464 1509441 1167288 737994 416141 370662 559840 797808 1019839 1315108 1630323 1684456
41454 1684456 1370785 1014108 929422 902371 504432 -149431 -414757 26347 725391 1059508
41444 1059508 933683 676798 525243 488570 530433 592378 550503 397765 374642 668878
41434 668878 1054112 1099295 740302 391594 421815 725983 942985 959097 1020709 1355824
41424 1355824 1821019 2030210 1817309 1443347 1252894 1228747 1073622 695539 358717 285062
41414 285062 362416 405600 476872 712588 1007447 1160087 1229066 1430538 1711389 1743378
41404 1743378 1399432 962659 759689 809387 947176 1089412 1220631 1273577 1191654 1031758
41394 1031758 891547 805601 781621 830099 886781 846065 764041 848901 1087071 1064935 443583
41383 443583 -468566 -933915 -621336 40565 437015 440273 341761 335698 353037 319123 269193
41372 269193 163753 -145673 -624012 -916544 -713799 -172291 223130 196464 -85489 -300502
41362 -300502 -290418 -45443 415859 988674 1417978 1469991 1157638 714194 390621 340791
41352 340791 593362 991778 1231673 1123831 799159 522608 356762 178383 -21185 -84303
41342 -84303 40714 201323 290535 399745 628904 920361 1172170 1323909 1224979 665500
41332 665500 -245811 -938451 -916698 -354101 121803 189019 104069 241676 661606 1175281
41322 1175281 1549460 1543921 1029398 241076 -310863 -382037 -262821 -313434 -442170 -334055
41312 -334055 -30341 112785 7358 -40133 123237 224055 60114 -71528 211002 754632
41302 754632 1071723 1058629 1078831 1307596 1446242 1280510 1144598 1491271 2201452 2665333
41292 2665333 2484962 1830010 1142089 742879 722162 954057 1164035 1163110 1054928 1056723
41282 1056723 1135503 1050262 768805 558720 561395 555125 332326 79489 121205 436263 715464
41271 715464 829334 937140 1104083 1093371 694273 100064 -228652 -56696 392155 718022
41261 718022 765031 673618 574076 417332 202359 186166 610509 1266951 1625962 1471876
41251 1471876 1155232 1092110 1259198 1374363 1360604 1365714 1446890 1507992 1511933 1538564 1638087
41240 1638087 1776558 1896469 1924845 1813265 1681579 1761862 2027725 2074076 1629251 1017490
41230 1017490 778810 949227 1097747 1007988 892677 916874 957587 954441 1085373 1399176
41220 1399176 1616459 1513262 1214970 906818 548125 121333 -108704 95936 533719
41211 533719 738680 481540 -85184 -650564 -935972 -810340 -410264 -36071 200885 461915
41201 461915 800440 964237 786833 504059 387857 304160 -10286 -423061 -564547 -392430
41191 -392430 -174246 37428 458558 1046350 1344266 1045741 441822 112395 306369 731358
41181 731358 868778 484758 -81374 -211955 269609 827189 911415 770784 1167518 2331800
41171 2331800 3656582 4532761 5062345 5720674 6633638 7464648 7824656 7558657 6749503
41162 6749503 5632482 4464928 3412254 2614858 2278875 2449381 2717672 2512104 1796117
41153 1796117 1153186 1019202 1164678 1172699 1098307 1286890 1750788 2147604 2320509 2475923
41143 2475923 2754931 2924906 2671744 2068880 1577930 1545543 1784230 1792979 1431577 1168331
41133 1168331 1443327 1967035 2043984 1551876 1129827 1284988 1787291 2180756 2426823 2667346
41123 2667346 2742749 2434932 1949172 1681718 1674474 1735406 1907397 2291152 2527042 2071611
41113 2071611 1043897 231675 101531 303759 363671 360460 566634 809671 676377 194935
41103 194935 -121594 70257 545964 850955 843972 771618 868344 1030939 990258 750310
41093 750310 656756 947106 1444759 1884674 2325967 2928093 3486684 3644838 3552872 3831879
41083 3831879 4729728 5731537 6246984 6335189 6447593 6724274 6893421 6709633 6170639
41074 6170639 5391905 4554856 3935152 3727452 3824567 3914731 3757950 3263266 2446229 1527718
41064 1527718 950543 995382 1388756 1561359 1332474 1088135 1206799 1563013 1764563 1685768
41054 1685768 1525298 1419346 1262136 962098 667526 595055 750443 980234 1222007 1493024
41044 1493024 1648344 1419344 802221 176416 -136618 -230346 -321585 -328317 -66763 289639
41034 289639 365580 156604 23880 93316 112742 20330 176783 776716 1441197 1742348
41024 1742348 1811304 2030300 2356756 2386880 1982151 1449692 1143714 1201494 1622046 2281803
41014 2281803 2865696 3059935 2856720 2493556 2138035 1834908 1680040 1766896 1971389 2038454
41004 2038454 1891238 1653868 1408435 1162961 1016044 1078639 1232547 1228196 1033184 835701
40994 835701 716648 613260 614109 936553 1510258 1912201 1885574 1662801 1600260 1724476
40984 1724476 1826125 1801007 1701255 1614653 1675417 2024821 2545603 2772876 2324019 1381101
40974 1381101 558447 311581 612911 1141877 1588322 1757320 1586701 1208663 932175
40965 932175 1022539 1433643 1804310 1805497 1501132 1280731 1409836 1766777 2087766 2307443
40955 2307443 2499713 2630235 2612003 2535651 2587733 2758828 2869835 2867417 2839227 2763647 2564068
40944 2564068 2434806 2739476 3448893 4011854 3980453 3496913 2980583 2619201 2396303 2333326
40934 2333326 2389524 2327287 2003706 1651432 1560341 1613268 1478947 1176760 1070081 1290342
40924 1290342 1529042 1509037 1377033 1460453 1808763 2136641 2146591 1817070 1420040 1289469
40914 1289469 1511226 1814382 1816554 1387239 743284 226283 44496 184822 476068 722301
40904 722301 820226 766982 586771 314194 26475 -218080 -467727 -768465 -979668 -893873
40894 -893873 -561003 -248001 -6555 424598 1132043 1753373 1958337 1954209 2180029 2672119
40884 2672119 3087542 3241501 3246716 3164235 2889984 2431315 1987179 1680464 1450610 1254386
40874 1254386 1135078 1044646 833096 493448 224269 171054 257750 329904 338982 360653 538652
40863 538652 986794 1618154 2108145 2158072 1757882 1119337 502714 207875 443629 944509
40853 944509 1028220 446939 -86851 241236 1171969 1720660 1599193 1487387 1782681 1951681
40843 1951681 1520088 944298 890425 1202150 1270186 1052187 1014637 1265839 1434499 1365285
40833 1365285 1337509 1542773 1838322 2100440 2397496 2700834 2781675 2532582 2134422 1817328
40823 1817328 1673247 1731482 1969662 2205775 2216712 2016522 1812436 1668793 1447518 1113979
40813 1113979 856588 823845 938428 1042573 1064864 1007856 942241 1031192 1361012 1711734
40803 1711734 1707026 1268149 744501 517999 623503 811340 834202 624431 336368 255957
40793 255957 522184 907017 1024391 776944 425870 211574 126434 107781 200891 403400
40783 403400 560028 575986 583803 750207 1046398 1339988 1575771 1717226 1643934 1295714
40773 1295714 838895 511561 348216 208641 34050 -86671 -85676 10940 193201 498530
40763 498530 874870 1127521 1091624 804227 441079 138076 -34300 38688 480754 1183435
40753 1183435 1723945 1727468 1320173 1032034 1176327 1507867 1623730 1510460 1461896 1584801
40743 1584801 1696033 1689193 1675047 1669111 1449041 932172 479728 544324 1084876 1578372
40733 1578372 1630435 1385213 1269108 1476919 1821492 2004771 1893910 1539812 1084408 745693
40723 745693 767261 1176729 1601635 1549384 973223 386265 270524 522406 667361 495407
40713 495407 240301 186448 357381 616380 857073 1028872 1124795 1189705 1230999 1139645
40703 1139645 844550 506490 365889 417719 454182 422739 483616 665358 726034 466809
40693 466809 -16892 -480262 -727612 -620178 -159239 325840 362548 -92247 -496396 -358557
40683 -358557 167148 550486 555506 357224 129095 -143210 -440335 -589576 -459317 -117976
40673 -117976 265022 578340 795835 928420 1003588 1086539 1296437 1719650 2218594 2411592
40663 2411592 2043420 1371890 959576 1027941 1240770 1203526 938326 753493 883567 1390236
40653 1390236 2161992 2842549 3025680 2739847 2494664 2615616 2801432 2636115 2276219
40644 2276219 2236770 2656224 3166464 3400809 3281294 2894570 2443799 2257147 2483049 2813503
40634 2813503 2841130 2627541 2556137 2689713 2706620 2479640 2270609 2262850 2313021 2305036 2382274
40623 2382274 2655284 2980756 3194982 3317685 3406888 3455702 3508583 3606061 3558096 3098472
40613 3098472 2343233 1739009 1455527 1230578 966181 1019930 1622907 2410274 2887359 3047111
40603 3047111 3161569 3242168 3112634 2814155 2540693 2316062 2091655 2015141 2225447 2501510
40593 2501510 2506976 2306732 2248874 2379698 2388084 2152663 1938094 1941901 1999783 1908567 1766208
40582 1766208 1789240 1968872 2096513 2049561 1932577 1968896 2281801 2734589 3020841 3006825
40572 3006825 2921377 3055386 3332468 3391168 3089729 2698519 2529627 2579460 2639010 2584068
40562 2584068 2412860 2108680 1630908 1034885 508294 259693 370799 732927 1125723
40553 1125723 1386822 1507624 1564849 1614944 1691143 1830877 2026756 2192633 2247573 2200068
40543 2200068 2109100 2027976 2024507 2147434 2302517 2290543 2078123 1905238 1984563 2205988
40533 2205988 2292707 2146546 1880846 1625687 1479085 1523976 1672889 1617284 1201846 759070
40523 759070 761978 1187432 1556865 1611997 1588316 1736010 1929450 1934704 1776413 1607552 1419986
40512 1419986 1127631 815098 685587 812569 1087871 1363120 1528919 1512392 1309125 999584
40502 999584 685914 455284 417620 678492 1213662 1829194 2284164 2432083 2297363 2101392
40492 2101392 2131714 2426097 2652749 2505712 2158297 2059767 2305056 2525295 2450395 2238498
40482 2238498 2121887 2059068 1944419 1887552 2039321 2337960 2640989 2935850 3253451 3584415
40472 3584415 4040341 4818313 5785725 6415567 6440860 6258180 6285975 6236439 5570929 4462365
40462 4462365 3632171 3265783 2806065 1991082 1404979 1598095 2182321 2323233 1823257
40453 1823257 1207812 917711 915082 1023348 1170052 1216105 951234 441285 107358 265012
40443 265012 757049 1195925 1408659 1471520 1450839 1347031 1245328 1282194 1418177 1433195
40433 1433195 1232212 1002473 955602 1049465 1122035 1194951 1430191 1814319 2108047 2150366
40423 2150366 2021094 1842153 1617368 1371527 1247387 1298020 1338496 1194137 975974 910350
40413 910350 998031 1062973 1059931 1091630 1170270 1221082 1301634 1532277 1781265 1723076 1313186
40402 1313186 928820 883395 1035933 1058808 880399 660811 531258 609700 1099473 2035816
40392 2035816 2991660 3368532 3034997 2434208 2016841 1826769 1737798 1814006 2190613 2738688
40382 2738688 3118096 3174566 3108012 3196634 3467251 3706073 3738686 3628288 3581936 3677021
40372 3677021 3723743 3463618 2908511 2384512 2173348 2209295 2263591 2348342 2700233 3314290
40362 3314290 3744483 3576971 2974919 2507744 2468716 2606746 2577059 2402911 2330821 2416992
40352 2416992 2510390 2595513 2895104 3536028 4264006 4647155 4549572 4290744 4273520 4503456
40342 4503456 4581853 4201816 3532457 2998743 2776605 2703599 2656139 2743208 3032023 3341371
40332 3341371 3510465 3683658 4073938 4565981 4835310 4806071 4706387 4673618 4592854 4384504
40322 4384504 4182411 4111196 4105126 4075224 4065070 4106300 4101985 4014955 4010494 4218038 4467427
40311 4467427 4468108 4185371 3844602 3591168 3332270 2943122 2496991 2236760 2360425 2819402
40301 2819402 3290647 3413702 3135244 2767446 2635679 2745195 2879782 2918153 2902866 2880177
40291 2880177 2861711 2912514 3088346 3289509 3366370 3389141 3612220 4107682 4624279 4912093
40281 4912093 5018105 5127568 5261117 5298384 5188222 4935673 4454496 3678555 2839253 2391982
40271 2391982 2536270 2950975 3148928 3011559 2833338 2891294 3137522 3340964 3391377 3368727
40261 3368727 3368950 3355808 3211172 2913564 2637181 2619425 2893248 3202912 3261004 3048890
40251 3048890 2761328 2499242 2190794 1832489 1597729 1594123 1684913 1703728 1703404 1810620 1957739
40240 1957739 1979550 1893111 1847478 1855042 1827030 1834289 2032908 2316605 2368452 2143530 1976943
40229 1976943 2061318 2131843 1905154 1567828 1527181 1846950 2236540 2497706 2684909 2864547
40219 2864547 2983470 2988306 2880623 2663465 2396629 2247302 2285676 2285739 1968500 1430450 1085303
40208 1085303 1146184 1387095 1480609 1383702 1312965 1482178 1920166 2425345 2676283 2517078
40198 2517078 2143337 1875985 1775588 1649054 1404094 1169528 1051629 1007739 1004964 1069298
40188 1069298 1118690 992781 731408 575932 595918 578220 407346 256620 216613 49142
40178 49142 -399291 -798775 -712801 -211232 258913 506636 717270 983282 1113162 965621
40168 965621 634435 215635 -286846 -705328 -694936 -204291 289887 296487 -87261 -350524
40158 -350524 -251482 -40826 -8834 -88227 -26973 226456 488251 625429 710155 858406
40148 858406 1033179 1096147 1000412 828978 656493 493673 398925 507534 847402 1227627
40138 1227627 1442634 1504701 1508758 1344384 803384 9127 -536350 -501763 -141297 34218
40128 34218 -135876 -409500 -588392 -710735 -790605 -693462 -421850 -261431 -398887 -574109
40118 -574109 -418060 -43776 68348 -184458 -286477 177051 870424 1127275 849427 572858
40108 572858 652530 806062 626724 208402 -20475 106441 348186 415009 222495 -153920
40098 -153920 -525670 -608869 -264330 219786 330703 -57969 -481727 -465900 -143923 -48825
40088 -48825 -370240 -724822 -730910 -524873 -485698 -619589 -537323 -46891 534549 801829
40078 801829 763985 700869 674101 487964 119435 -119303 31572 425516 680420 583600
40068 583600 227198 -142186 -303201 -186664 72507 265343 327241 334292 289121 100335
40058 100335 -182776 -354835 -378675 -463474 -656341 -648767 -254287 198540 317761 272182
40048 272182 508872 977546 1163958 904790 636131 687765 819447 717558 550502 687411
40038 687411 1128475 1545444 1718975 1655550 1405438 1025646 643988 366408 190998 116848
40028 116848 175944 248554 94466 -248818 -376794 -92730 208483 97279 -193001 -100642
40018 -100642 374859 665777 520410 335903 455349 645269 568062 371665 419560 685932
40008 685932 824916 723205 609439 633025 666732 602584 583620 790650 1140284 1348485
39998 1348485 1251276 954778 669798 485866 359895 281623 348620 629476 1015273 1287715
39988 1287715 1314147 1109304 741057 286734 -108729 -252578 -65851 307945 608974 685041
39978 685041 615576 619279 816660 1084075 1196238 1106353 972082 886984 772812 632347
39968 632347 671484 946072 1104765 835429 432942 473851 935069 1139475 728425 196979
39958 196979 151527 448125 512556 244664 92088 326345 732657 1041769 1243047 1370877
39948 1370877 1353299 1236682 1258479 1493727 1654522 1447650 963635 519181 265513 165380
39938 165380 232132 524249 927198 1185840 1206116 1136848 1076955 878973 391286 -213685
39928 -213685 -544556 -418496 -29225 336914 587707 745895 764458 626499 534298 724407
39918 724407 1064944 1103762 646992 68582 -149751 -15084 85735 -21983 -122881 -34091
39908 -34091 80350 -51589 -421517 -732179 -720378 -423441 -161287 -252163 -674823 -1034221
39898 -1034221 -963393 -529404 -106884 113371 285857 559951 805375 814758 610252 388578
39888 388578 259846 182278 93311 -16596 -133697 -251605 -394031 -609954 -859425 -918326
39878 -918326 -575007 22902 420068 378462 174579 218759 552912 925226 1197140 1404273
39868 1404273 1511835 1415462 1184970 1049238 1101254 1215236 1261138 1201656 1002400 700424
39858 700424 552870 796891 1196986 1182787 604456 22538 -5492 362022 585960 564879
39848 564879 675347 1061973 1346878 1173362 713245 449226 654106 1230302 1880347 2269544
39838 2269544 2173709 1680998 1196121 1072965 1246229 1339054 1118745 736194 515788 608684
39828 608684 871316 1007053 807143 327661 -127419 -248068 -402 336991 444116 263743
39818 263743 27062 35 234653 555308 732437 646399 343173 4006 -168332 -131362
39808 -131362 -73260 -188077 -360668 -240862 269793 784165 887053 699680 702055 1035470
39798 1035470 1322823 1255127 1006318 869996 796723 605011 435909 612070 1120278 1590747
39788 1590747 1789580 1815651 1788611 1663156 1422265 1151471 826582 328163 -216115 -427765
39778 -427765 -192714 136398 270529 372172 599283 618664 77170 -649781 -778411 -182400
39768 -182400 422185 487319 308323 422829 772261 870108 556115 151266 -74997 -237371
39758 -237371 -570444 -1044614 -1349440 -1214776 -741437 -396551 -566270 -1083698 -1363758 -1083505
39748 -1083505 -540410 -208908 -152292 -94988 81933 205428 124831 -81776 -223673 -150309
39738 -150309 191984 695645 1112245 1288166 1339391 1452185 1596090 1616927 1517109 1412054
39728 1412054 1294489 1116584 1032030 1214308 1452847 1325703 849630 554882 743277 1046829
39718 1046829 970478 543292 125761 -142291 -328432 -360181 -125688 171413 183127 -41440
39708 -41440 -48776 415509 1093887 1583874 1746503 1663649 1459759 1299890 1329371 1446518
39698 1446518 1317928 794805 173547 -128209 -44952 148420 225334 206498 215688 295339
39688 295339 367747 292342 -2822 -369403 -495138 -231599 200043 475001 582011 790221
39678 790221 1207027 1577789 1600406 1272351 821516 439534 227593 286075 649321 1154492
39668 1154492 1565293 1860538 2246789 2839483 3493793 4041463 4535905 5105365 5674307
39659 5674307 6024489 6076699 5909149 5524418 4841962 3965735 3206371 2711372 2292255 1789809
39649 1789809 1400581 1386807 1612835 1684845 1492248 1285032 1210322 1127850 986178 1015639
39639 1015639 1301580 1455454 1079627 434877 255367 851638 1698506 2044300 1720910
39630 1720910 1182766 875732 781581 600230 224641 -102230 -114752 101647 204721 67894
39620 67894 -20653 236305 676343 842718 589681 283257 336267 741273 1160517 1298772
39610 1298772 1058178 495162 -181336 -664775 -790776 -671995 -462729 -108874 456960
39601 456960 981580 1071032 719495 349570 231735 155088 -160787 -593566 -807221 -732552
39591 -732552 -587505 -525508 -524723 -561702 -640383 -677718 -595297 -500320 -537009 -583448 -372049
39580 -372049 78560 448787 575275 588283 496294 28545 -853752 -1620522 -1719861 -1278886
39570 -1278886 -900091 -880551 -999963 -1011639 -929444 -774776 -423289 124558 590566 730476
39560 730476 621726 482342 368128 232810 166258 352125 795427 1241648 1407607 1236821
39550 1236821 920995 707100 685509 747345 728307 554279 243614 -134338 -427016 -429240
39540 -429240 -91998 353453 624110 680183 632923 452720 30442 -500935 -819587 -847733
39530 -847733 -825923 -855418 -704378 -264045 136560 188212 120590 370158 874370 1134477
39520 1134477 971310 791327 969284 1310645 1359350 1027236 656748 537698 594373 590362
39510 590362 492368 509378 783910 1151579 1302703 1149759 902715 762609 709563 683345
39500 683345 788374 1125375 1537928 1766960 1830441 2044680 2671315 3720368 5074703
39491 5074703 6571629 7912385 8713299 8780729 8246605 7395647 6465401 5600657 4821004
39482 4821004 4004509 3087888 2301651 1961062 1954960 1742901 1050859 305709 92043 360446
39472 360446 520363 240047 -207148 -416796 -327939 -102551 169060 426133 509231 342730
39462 342730 147848 211997 467123 544652 287932 -31048 -117817 -65261 -167894 -469715
39452 -469715 -729796 -778792 -684753 -576907 -516363 -542769 -619890 -515937 -17405 648220
39442 648220 899911 491798 -144008 -456555 -417072 -325783 -248344 -53539 157311 137683
39432 137683 -27388 510 220922 250591 -2310 -81694 353296 983526 1255777 1087979
39422 1087979 851059 843075 1050884 1278690 1279467 906852 345996 35081 156392 380894
39412 380894 318839 9169 -280018 -492299 -693761 -752820 -513611 -169788 -55604 -123456
39402 -123456 -35017 244582 364654 162664 -65549 8045 358012 758398 1035278 1059986
39392 1059986 779691 396190 264363 470774 730548 813402 828353 949308 1101225 1098992
39382 1098992 913930 646725 398141 283411 385418 570190 545384 232067 -112054 -246280
39372 -246280 -196894 -46808 236116 586870 752744 641324 482349 401648 152194 -401678
39362 -401678 -849674 -732140 -238969 90289 203891 506290 1037082 1295869 1020341 604621
39352 604621 500258 623362 637821 491732 365044 318209 280665 244236 249898 285775 325240
39341 325240 339973 228046 -51276 -236433 6068 499539 612496 120443 -413749 -459985
39331 -459985 -292585 -450365 -793073 -753841 -331841 -95343 -206914 -192179 152392 330975
39321 330975 -26081 -500961 -513807 -161111 68886 70018 73133 78230 -100109 -345961 -353211
39310 -353211 -201764 -320641 -838224 -1425378 -1838875 -2151773 -2341878 -2155744 -1608693 -1165402
39300 -1165402 -1105295 -1090690 -745029 -337133 -417111 -959024 -1364524 -1277361 -943009 -714254
39290 -714254 -620967 -580658 -679909 -982095 -1252540 -1149806 -652703 -120977 85579 -40785
39280 -40785 -199969 -132456 107353 235213 69727 -280930 -565001 -614693 -392102 44046
39270 44046 505795 740069 676110 505526 370917 119643 -421718 -1076375 -1521505 -1773742
39260 -1773742 -2117869 -2566490 -2768022 -2519945 -2015577 -1475736 -903978 -368721 -143842
39251 -143842 -302672 -492398 -419750 -286613 -405143 -631428 -590337 -294018 -101301 -143136
39241 -143136 -208009 -172044 -132569 -89277 106765 404702 527768 420354 377106 560320
39231 560320 701415 499319 72871 -202507 -120346 279399 855951 1372774 1529736 1241774
39221 1241774 793620 518712 421515 311481 196985 286684 623323 949831 986271 694578
39211 694578 247913 -133658 -297355 -227948 -48851 110544 260348 508202 871634 1180451
39201 1180451 1183807 779473 194090 -101611 187568 802697 1134531 895326 426509 226161
39191 226161 368690 586176 732382 860096 924871 749386 321835 -129983 -420939 -550773
39181 -550773 -531044 -320006 -17711 110620 -53056 -322249 -489612 -592002 -741417 -859676
39171 -859676 -786497 -552705 -341720 -221753 -97511 73580 170319 58970 -217867 -433031
39161 -433031 -348056 57162 501891 635976 415863 167227 196537 425225 505912 228204
39151 228204 -291376 -752716 -902609 -699951 -368771 -218210 -297527 -319245 -55728 307022
39141 307022 407563 203422 -21087 -88234 -82153 -68637 25850 174248 196854 101335 188683
39130 188683 599907 1003598 1017196 748574 581274 539952 266844 -353862 -930954 -1075583
39120 -1075583 -891994 -754748 -794922 -846425 -792680 -709531 -657534 -539623 -253906 130442
39110 130442 459982 713700 1020931 1436280 1783716 1818522 1525878 1153225 916543 783379
39100 783379 621534 452445 413370 525440 666792 769388 876330 980192 980137 870990
39090 870990 808840 865380 843972 499410 -116140 -659185 -816680 -525737 67486 724820
39080 724820 1196290 1316288 1084373 631754 127817 -257820 -393850 -302772 -192394 -246398
39070 -246398 -400780 -443583 -311477 -145118 -56124 -4289 62119 113371 152717 256934 396204
39059 396204 369171 72769 -279655 -392824 -271123 -174070 -228324 -297364 -258092 -192238 -208354
39048 -208354 -243988 -183215 -61853 -13469 -77153 -190339 -320725 -457799 -489851 -251382
39038 -251382 250271 760907 1002379 915935 646640 357018 124030 -20409 -33795 117864
39028 117864 399865 698290 914121 1085327 1355524 1760267 2103535 2150080 1898491 1531034
39018 1531034 1134698 677767 277008 212685 526697 839867 809172 605665 657506 1022751
39008 1022751 1343392 1401267 1372929 1445296 1486771 1276710 848288 417103 112822 -59551
38998 -59551 -113653 -89135 -72333 -84556 -36875 104396 217524 201638 144525 199005 390377
38987 390377 642211 873277 978588 876570 698664 747201 1094097 1406554 1388663 1226675
38977 1226675 1336733 1804882 2348984 2715239 2822769 2638398 2253965 2001770 2104899
38968 2104899 2247055 1906981 1140178 577516 547312 671124 549578 407626 707230 1437678
38958 1437678 2195951 2789270 3357898 3952061 4328199 4239958 3766347 3307590 3298507 3846136
38948 3846136 4583332 4986768 4901860 4627064 4462006 4405228 4369541 4390304 4436790 4306878
38938 4306878 3968017 3753564 3913223 4168845 4050215 3524908 2970691 2656741 2584197 2703149
38928 2703149 2900918 2867514 2399482 1825425 1719196 2153092 2618815 2733319 2609983 2431694
38918 2431694 2102550 1560406 1083025 981329 1200109 1464919 1645100 1754711 1764665 1648829
38908 1648829 1505372 1432321 1368293 1219242 1051272 997502 1050414 1098314 1111464 1157222 1264275
38897 1264275 1373657 1402520 1304619 1114992 961070 948323 1006926 944725 672002 269319
38887 269319 -163617 -575189 -868070 -924060 -776061 -592226 -449879 -297657 -153607 -107289
38877 -107289 -90218 74607 319864 353102 158342 110731 355278 437753 -76715 -889735
38867 -889735 -1305445 -1116292 -724020 -480613 -363488 -290909 -295606 -274083 39615 652666
38857 652666 1151359 1172479 844741 574980 545389 612336 611654 567677 581883 632104 567772
38846 567772 316681 35774 -46166 67683 148533 104196 138384 410838 731031 799337
38836 799337 601875 345785 166366 156446 486782 1126174 1602199 1513107 1200219 1359584
38826 1359584 1958153 2172397 1616186 982834 1027114 1442822 1372592 701668 137606 98472
38816 98472 208038 17951 -340009 -489888 -395279 -292403 -284799 -284801 -210061 -23143 291211
38805 291211 593614 576187 116837 -445481 -643347 -454313 -292552 -421706 -642304 -642820
38795 -642820 -403495 -93145 210107 463546 501144 235916 -63383 -34001 247332 352892
38785 352892 199875 251395 793467 1381079 1392391 901554 547330 634147 841194 863304
38775 863304 885060 1232239 1889377 2606747 3293627 4134651 5475366 7670928 10756452
38766 10756452 14046063 16296881 16604318 15120498 12762274 10354574 8229268 6440157
38758 6440157 4979031 3753020 2645411 1728116 1259339 1359491 1764939 1982415 1679532
38749 1679532 931268 133210 -311629 -251761 201548 809840 1289285 1396401 1153009 951030
38739 951030 1174744 1679336 1905971 1579891 987842 449306 -98287 -723221 -1096603 -918821
38729 -918821 -509897 -447368 -696120 -624267 62915 889515 1270784 1211962 1127638 1274444
38719 1274444 1610404 1991915 2257584 2253149 1987888 1695053 1598578 1689682 1820825 1918386
38709 1918386 2014366 2164198 2404990 2705154 2924818 2950158 2878487 2894767 2942180 2748221
38699 2748221 2258807 1795868 1632933 1639071 1541666 1357075 1329102 1564201 1952549 2372368
38689 2372368 2771424 3094052 3291819 3371584 3327738 3112628 2776270 2504534 2391379 2331004
38679 2331004 2284980 2439055 2846549 3128787 2896104 2344905 2020627 2027852 1942425 1585078
38669 1585078 1384114 1702214 2202870 2286637 1928129 1652943 1769161 2037736 2157553 2214049
38659 2214049 2456358 2848374 3068807 2889853 2410028 1953460 1847165 2242710 3009861
38650 3009861 3792738 4285774 4495082 4659954 4920810 5184662 5340593 5434147 5511354 5450679
38640 5450679 5166722 4907446 5093418 5822876 6731331 7393785 7692171 7747428 7710071 7720857
38630 7720857 7870820 8053185 8025106 7755801 7526581 7523594 7553517 7411729 7334181 7736623
38620 7736623 8583006 9342946 9570985 9265789 8697897 8182687 7999567 8189236 8383560
38611 8383560 8158327 7607892 7224099 7137699 6910663 6275212 5641185 5518430 5775233 5911209
38601 5911209 5842260 5915616 6226556 6429704 6313438 6127033 6130835 6132677 5738604 4896899
38591 4896899 3945868 3194040 2670120 2294621 2113171 2242339 2633250 2999594 3037171 2691272
38581 2691272 2169418 1728130 1522104 1619048 1992373 2428664 2588250 2309956 1813123 1484809
38571 1484809 1480006 1600398 1541395 1203260 783961 588776 704588 884126 865736 773461
38561 773461 973111 1483740 1824411 1626009 1128168 794671 661404 433549 88570 -55703
38551 -55703 128709 395237 556892 733155 1002529 1132343 897551 461434 194571 215181
38541 215181 286793 118741 -328571 -774835 -824975 -365567 215881 362638 -67544 -712930
38531 -712930 -1183974 -1359524 -1188430 -593487 217176 692515 532732 129615 85186 458279
38521 458279 828405 957241 973812 959641 803890 564579 575349 975897 1406633 1429127
38511 1429127 1109956 945439 1240559 1757313 2040970 1989818 1971897 2342259 2966423 3400500
38501 3400500 3508105 3614120 3928830 4132504 3837062 3245629 2938013 3073164 3242280
38492 3242280 3153184 3012106 3050031 3067784 2755349 2205087 1789464 1685036 1798066 2022341
38482 2022341 2250636 2200451 1588377 566949 -264148 -431691 -57415 330655 347622 26976
38472 26976 -355454 -588450 -636566 -534707 -276401 135488 558174 732145 504673 6677
38462 6677 -433206 -540045 -262690 235156 706761 997888 1152993 1327959 1570928 1734635
38452 1734635 1641203 1280052 796540 344521 14724 -151449 -177299 -160050 -170972 -145361
38442 -145361 41160 373750 670163 798984 841807 953534 1128433 1246582 1346344 1666252
38432 1666252 2311410 3029191 3498925 3753580 4103803 4726636 5626194 6970601 9076119
38423 9076119 12005952 15700719 20696429 27934208 37026768 45086492 48413399 45733299
38415 45733299 39221522 32180314 26378476 21860635 18322294 15673639 13624228 11708910
38407 11708910 9862768 8414559 7458315 6707659 5989357 5386390 4828907 4048203 3095660
38398 3095660 2457783 2424423 2686182 2762754 2506512 1982797 1212301 340623 -214146 -147069
38388 -147069 335196 776920 998388 1096337 1076295 837201 495371 403385 760662 1383432
38378 1383432 1901298 2049026 1788547 1329197 1041986 1167880 1549876 1786068 1683811
38369 1683811 1422422 1234153 1110295 937353 766278 750638 870139 909647 748223 521846
38359 521846 422166 443629 441820 375773 357287 474857 697000 955035 1180498 1235003 984925
38348 984925 543839 260687 297049 369811 149713 -198713 -191565 276802 764992 924245
38338 924245 971571 1282929 1765625 1979822 1786536 1523157 1495151 1591974 1542965 1326744
38328 1326744 1116539 952430 725242 471749 428033 680266 958921 963809 762420 632776
38318 632776 593476 403052 52482 -100418 127130 369335 175539 -353396 -724946 -725387
38308 -725387 -577712 -494824 -453729 -432795 -502016 -581835 -445941 -108856 78464 -106071
38298 -106071 -433498 -541233 -367993 -109486 64582 86395 -29282 -115339 53091 421006
38288 421006 591063 298506 -191518 -352450 32239 686169 1100723 901459 164515 -519074
38278 -519074 -545104 -20197 281678 -127905 -846452 -1170153 -949042 -510346 -60237 370129
38268 370129 620764 569662 465980 584080 657462 223223 -515344 -799440 -382710 109070
38258 109070 81435 -310769 -609381 -705533 -695780 -523207 -189657 -11889 -234442 -603835
38248 -603835 -722761 -644125 -708757 -927001 -954620 -657862 -308882 -156038 -112519 22749
38238 22749 265608 483249 575241 523009 360966 163733 -4959 -155563 -319777 -432442
38228 -432442 -355790 -64193 241393 259136 -139214 -746829 -1176457 -1226090 -1042085 -850058
38218 -850058 -631882 -256495 142698 224313 -60824 -322036 -252537 -57302 -122740 -442328
38208 -442328 -661403 -611244 -507647 -594653 -814494 -911632 -733785 -356233 25883 276537
38198 276537 402361 470309 477674 368446 150874 -118662 -457985 -899940 -1291543 -1366262
38188 -1366262 -1107420 -832428 -782612 -825531 -724400 -501962 -325878 -209381 -75038 24189
38178 24189 16733 31698 210795 375337 204614 -259937 -607406 -611280 -498268 -546807 -664948
38167 -664948 -554449 -162731 203745 201338 -181303 -576101 -588945 -243416 10835 -172545
38157 -172545 -618206 -909515 -956290 -1001254 -1122921 -1099439 -847839 -644367 -700143 -790834
38147 -790834 -590023 -198309 -25527 -210956 -472091 -570060 -642857 -917658 -1277310 -1349433
38137 -1349433 -998381 -530529 -344546 -504541 -746979 -806794 -611390 -224423 236163 632914
38127 632914 911253 1171386 1493787 1712219 1571048 1135730 798457 778818 858633 742345
38117 742345 426695 37135 -423971 -896205 -1073573 -748809 -191707 159261 253712 323360
38107 323360 359136 145730 -222120 -339350 -89258 171450 136893 -123376 -477032 -939707
38097 -939707 -1366347 -1335660 -662085 248155 848122 1039835 1051664 965907 706407 350635
38087 350635 114505 70701 129867 237476 344316 241331 -288552 -1108233 -1735071 -1814626
38077 -1814626 -1479475 -1161646 -1101406 -1111164 -852622 -311230 137434 218454 138931 232563
38067 232563 354297 38817 -705015 -1219984 -1036912 -493128 -207665 -278291 -401155 -522424
38057 -522424 -854673 -1322171 -1486237 -1118833 -504089 -56756 98619 71657 -37807 -197436
38047 -197436 -398362 -648733 -928926 -1126899 -1105363 -841323 -443903 -89191 5338 -310130
38037 -310130 -870533 -1181701 -878867 -157953 418510 479066 65849 -538322 -956330 -834936
38027 -834936 -162931 559028 773840 483902 135922 -45145 -235869 -538442 -767164 -831106
38017 -831106 -923509 -1125740 -1167997 -835766 -341435 -37236 18332 -20484 -69177 -69407 98262
38006 98262 362433 341199 -164464 -718938 -709293 -184026 207015 144345 55678 414202 1001288
37995 1001288 1194491 779088 128726 -341377 -566420 -638338 -527219 -191493 193349 360036
37985 360036 300194 302515 570536 934876 1058737 851118 543656 388461 421536 541633
37975 541633 673261 755209 666005 318364 -153053 -416680 -256761 160009 420617 293391
37965 293391 -60872 -351151 -511078 -649582 -737370 -592057 -214481 100909 112970 -101596
37955 -101596 -358860 -626158 -879395 -919843 -618068 -198128 23640 72412 157085 179362
37945 179362 -169151 -795430 -1138929 -886321 -391205 -154541 -178067 -102950 217724 571361
37935 571361 708787 594051 392426 359865 667128 1200141 1600419 1600190 1253001 800168
37925 800168 437641 237357 107261 -212800 -868853 -1527497 -1597848 -985456 -316317 -165269
37915 -165269 -357133 -359971 -101379 54619 669 54694 392894 728333 710883 381124
37905 381124 66700 -24524 40 -135962 -545091 -952079 -920055 -408368 78513 104521
37895 104521 -132819 -154694 62038 128262 -52171 -116754 132797 393880 334614 34826
37885 34826 -258459 -496350 -704121 -764641 -603832 -398216 -338244 -333584 -183737 96336
37875 96336 345084 523522 687694 789177 724083 519853 294755 104603 -11829 53717
37865 53717 322873 584388 617204 484549 398039 377439 291799 166988 156845 216570 106439
37854 106439 -229550 -570976 -779001 -945560 -1050293 -790686 -35319 761657 946124 421145
37844 421145 -252917 -511673 -292567 134109 552391 854500 903811 602286 89401 -294158
37834 -294158 -298645 44114 527043 974496 1303667 1464111 1423237 1228661 1019083 909687
37824 909687 868087 762568 571543 488128 712652 1140786 1391830 1227397 830600 539718
37814 539718 402810 209526 -58584 -89612 306913 808434 868549 342786 -357069 -732490
37804 -732490 -681245 -487821 -443882 -549832 -582399 -430370 -296172 -465568 -905891 -1269749
37794 -1269749 -1340459 -1258788 -1191031 -1018056 -585181 -50926 330910 624137 1017215 1302705
37784 1302705 1026180 226821 -435256 -499969 -271142 -287473 -556992 -665388 -417511 5704
37774 5704 402183 700451 813929 682560 476012 469896 659773 718807 409865 -118723
37764 -118723 -495707 -469305 -96941 268203 200355 -420055 -1226003 -1682739 -1588679 -1165844
37754 -1165844 -718621 -359734 -31403 366987 843396 1173405 1002326 294146 -439525
37745 -439525 -655429 -450014 -366419 -575458 -699869 -527831 -390454 -567334 -766126 -603144
37735 -603144 -281937 -303007 -657256 -802037 -434790 122873 386080 230678 -131990 -441261
37725 -441261 -545209 -463487 -363821 -340038 -241479 78182 408655 394927 112091 61178 473113
37714 473113 971743 1131701 1039840 1005457 981062 661713 35603 -543639 -820564 -866073
37704 -866073 -824673 -705925 -478951 -148098 323313 969954 1656667 2139613 2340818 2379617
37694 2379617 2302169 2012722 1556716 1225706 1211732 1336312 1304867 1089923 870536 706218
37684 706218 497119 231222 67372 139571 399343 677250 837023 885012 966120 1178899
37674 1178899 1346279 1111210 390506 -402885 -789122 -780831 -783458 -993520 -1171444 -1038706
37664 -1038706 -634273 -184166 155795 304656 206864 -58550 -260048 -251278 -111410 57653
37654 57653 296451 582386 655698 337904 -81401 -119021 224498 395920 22210 -574820
37644 -574820 -811470 -579454 -272223 -191538 -252452 -290147 -336020 -427279 -373640 30851 647955
37633 647955 1083926 1140024 982350 836722 717217 553942 412174 411187 515808 585570
37623 585570 601186 679014 842765 918742 723376 289512 -135075 -283695 -73559 328375
37613 328375 641725 725111 684130 689776 745117 726728 616503 552658 632003 786655 907364
37602 907364 984454 1050101 1057885 931124 730021 674539 913220 1275215 1371045 1044206 630570
37591 630570 571163 809098 873215 631370 580703 1127736 1921037 2321100 2296441 2322506
37581 2322506 2499320 2384202 1783213 1120349 787943 631385 380077 141568 88163 20867
37571 20867 -321909 -779838 -1000963 -944390 -777294 -497829 -82741 185138 6928 -431722
37561 -431722 -694696 -726155 -795732 -925425 -901497 -816606 -1014813 -1421963 -1512153 -1121190
37551 -1121190 -744029 -746577 -782553 -375622 318576 781067 891110 955765 1110798 1124136
37541 1124136 806098 304287 -79718 -203519 -191094 -311987 -704889 -1160790 -1296023 -1018384
37531 -1018384 -661882 -542069 -561727 -444069 -206124 -153580 -444328 -852795 -998444 -729911
37521 -729911 -287568 -90600 -287410 -545728 -449798 -75396 99022 -111694 -344892 -291969
37511 -291969 -188235 -388660 -729123 -713453 -216378 366002 633625 560238 376649 323997
37501 323997 503776 767126 793733 457727 23534 -208827 -301570 -468928 -643998 -617249
37491 -617249 -497144 -603521 -903422 -978142 -641087 -209563 -25772 -47073 -85955 -153457
37481 -153457 -335708 -539743 -580213 -400217 -83550 219356 310880 84842 -271857 -430522
37471 -430522 -367535 -419167 -765737 -1125340 -1150507 -892930 -647386 -535625 -490937 -480776
37461 -480776 -471585 -295446 179859 820559 1376562 1751594 1909533 1677279 968096 115517
37451 115517 -371976 -390056 -257374 -160217 53348 445851 733772 655633 315870 -45946
37441 -45946 -383232 -713454 -896089 -831308 -715177 -782691 -902560 -751606 -328474 56990
37431 56990 293739 570218 875856 827274 253590 -374600 -466383 -68201 275902 302616
37421 302616 244551 271813 168958 -256222 -787953 -1088171 -1146753 -1183195 -1251843 -1226849 -1114407
37410 -1114407 -1106544 -1283321 -1442540 -1298828 -782155 -132499 257934 153497 -296101 -684898
37400 -684898 -756797 -589581 -348610 -75586 138878 37347 -441572 -858256 -726933 -220166
37390 -220166 -5157 -339136 -748673 -753016 -514469 -518453 -904400 -1402071 -1722947 -1740755
37380 -1740755 -1452073 -1029293 -781386 -805777 -798471 -459972 45022 324948 334529 350844
37370 350844 431318 304704 -126323 -544470 -637156 -464747 -235303 25981 363070 649791
37360 649791 706394 525300 183700 -321972 -932636 -1370271 -1419330 -1277035 -1298819 -1424790
37350 -1424790 -1230082 -621690 -105406 -141770 -533088 -746249 -635037 -487173 -458225 -353143
37340 -353143 -23043 346500 487165 370996 140307 -118355 -383192 -594766 -675670 -587688
37330 -587688 -308624 145118 623470 913631 984282 1015225 1107036 1137712 1010986 838086
37320 838086 712542 515955 165528 -137389 -171038 -46528 -10744 -47159 -7913 -9006 -274587
37309 -274587 -634769 -633240 -193639 247755 383918 388476 451629 387448 -3656 -502929 -735170
37298 -735170 -652678 -479603 -367066 -365597 -534807 -776123 -732054 -201451 445375 616343
37288 616343 234098 -199131 -297503 -249270 -465797 -991084 -1438472 -1456098 -1127687 -847654
37278 -847654 -811728 -762443 -387735 138151 319007 54700 -184163 -52074 191717 187613
37268 187613 102565 323979 766573 983271 874665 805907 999019 1229636 1206568 906124
37258 906124 446034 -63624 -455988 -570278 -462870 -320728 -140328 224415 671133 859655
37248 859655 725597 642881 885093 1205733 1183589 780960 330376 105631 111162 211707
37238 211707 300814 366226 464902 595136 596741 295728 -238531 -712073 -896130 -776711
37228 -776711 -453676 -76551 145641 98045 -64348 -104640 -48924 -91019 -181328 -47347
37218 -47347 327435 592231 507995 225538 -27927 -215659 -309687 -184395 118652 328668
37208 328668 343020 383076 559144 614363 344914 -54469 -343265 -602728 -919146 -1014435
37198 -1014435 -607342 62351 456134 338738 -135841 -723462 -1158098 -1179974 -878712 -767764
37188 -767764 -1112497 -1453592 -1278072 -878469 -919037 -1341410 -1437757 -984623 -548091 -526062
37178 -526062 -600172 -416556 -190708 -249686 -442356 -406413 -92340 300755 615741 702631
37168 702631 422533 -33520 -156333 243410 709701 763385 539982 450976 506155 410736
37158 410736 133185 -83268 -182968 -368224 -741884 -1199407 -1623447 -1892118 -1772056 -1123107
37148 -1123107 -176744 655164 1186097 1430875 1338068 908648 468628 391213 560080 514549
37138 514549 136845 -223841 -341025 -357392 -347776 -147716 160627 82660 -611206 -1418676
37128 -1418676 -1708502 -1488878 -1169804 -847104 -333995 259761 536769 403716 189279
37119 189279 126964 145668 227201 502960 844618 819542 321215 -138201 -91368 238251
37109 238251 317895 78357 -116167 -106232 -86967 -164372 -196188 -129342 -124548 -241798 -312527
37098 -312527 -239119 -145134 -112113 -38788 99571 115615 -93195 -344907 -454685 -499754 -607805
$$ [...]
##END NTUPLES=NMR SPECTRUM
##END=
