##TITLE=31Pdec_DE-165rm_1h
 , 64 sc
 14.7.2026
##JCAMPDX= 6.0         $$ Bruker NMR JCAMP-DX V2.0
##DATA TYPE= NMR SPECTRUM
##DATA CLASS= NTUPLES
##ORIGIN= UXNMR, Bruker Analytische Messtechnik GmbH
##OWNER= root
$$ XWIN-NMR		Version 3.5
$$ Tue Jul 14 13:14:37 2026 Russian Standard Time (UT+4h)  she@DPX200
##.OBSERVE FREQUENCY= 81.013821
##.OBSERVE NUCLEUS= ^31P
##.ACQUISITION MODE= SIMULTANEOUS
##.ACQUISITION SCHEME= undefined
##.AVERAGES= 64
##.DIGITISER RES= 17
##SPECTROMETER/DATA SYSTEM= spect
##.PULSE SEQUENCE= zgpg30
##.SOLVENT NAME= DMSO
##.SHIFT REFERENCE= (INTERNAL, DMSO, 0, 197.392)
##AUDIT TRAIL= $$ (NUMBER, WHEN, WHO, WHERE, WHAT)
$$ ##TITLE= Audit trail, XWIN-NMR		Version 3.5
$$ ##JCAMPDX= 5.01
$$ ##ORIGIN= Bruker BioSpin GmbH
$$ ##OWNER= she
$$ F:/spectra/data/she/nmr/P31/2/pdata/1/auditp.txt
$$ ##AUDIT TRAIL=  $$ (NUMBER, WHEN, WHO, WHERE, WHAT)
(   1,<2026-07-14 13:13:23.54 +0400>,<she>,<DPX200>,
      <created by zg, POWCHK disabled, PULCHK disabled
       configuration hash MD5:
       00 E9 B6 7A A2 85 ED C7 34 08 36 98 17 FE 4E 26
       data hash MD5: 32K
       CC 8C 84 FE F8 12 3E 18 FD 68 AE 76 75 EE 8C CA>)
(   2,<2026-07-14 13:13:26.78 +0400>,<she>,<DPX200>,
      <Start of raw data processing
       efp BC_mod = 2 LB = 1.5 FT_mod = 6 PKNL = 1 PHC0 = 1952.166 PHC1 = 139.8991 SI = 64K 
       data hash MD5: 64K
       97 30 42 F2 E4 6C DF 40 57 12 98 5A 36 AF C6 F5>)
(   3,<2026-07-14 13:13:59.14 +0400>,<she>,<DPX200>,
      <pk PHC0 = -9.952127 PHC1 = 3.800001 
       data hash MD5: 64K
       50 44 80 0A 50 9F AD 90 07 FA 08 CE 18 75 86 64>)
(   4,<2026-07-14 13:14:07.51 +0400>,<she>,<DPX200>,
      <abs ABSG = 5 
       data hash MD5: 64K
       41 31 8C BC 4C FB 22 36 F6 A5 5E B0 B7 6D 9E 4C>)
$$ ##END=
$$ 
$$ hash MD5
$$ A8 A7 18 9C C8 79 50 BF DF F6 F6 E9 9F 6F 1A 47
##$RELAX= 
##$RELAX= 
##$RELAX= 
##$RELAX= 
##$RELAX= 
##$RELAX= 
##$RELAX= 
##$RELAX= 
$$ Bruker specific parameters
$$ --------------------------
##$DU= <F:/spectra>
##$EXPNO= 2
##$NAME= <P31>
##$PROCNO= 1
##$TYPE= <nmr>
##$USER= <she>
##$AMP= (0..31)
100 100 100 100 100 100 100 100 100 100 100 100 100 100 100 100 100 100 
100 100 100 100 100 100 100 100 100 100 100 100 100 100 
##$AQSEQ= 0
##$AQ_mod= 1
##$AUNM= <au_zg>
##$AUTOPOS= <>
##$BF1= 81.014009
##$BF2= 200.13
##$BF3= 200.13
##$BF4= 200.13
##$BF5= 200.13
##$BF6= 200.13
##$BF7= 200.13
##$BF8= 200.13
##$BYTORDA= 1
##$CFDGTYP= 0
##$CFRGTYP= 5
##$CHEMSTR= <none>
##$CNST= (0..31)
1 1 145 1 1 1 1 1 1 1 1 1 1 1 1 1 1 1 1 1 1 1 1 1 1 1 1 1 1 1 1 1 
##$CPDPRG= <waltz16>
##$CPDPRG1= <>
##$CPDPRG2= <waltz16>
##$CPDPRG3= <>
##$CPDPRG4= <mlev>
##$CPDPRG5= <mlev>
##$CPDPRG6= <mlev>
##$CPDPRG7= <mlev>
##$CPDPRG8= <mlev>
##$CPDPRGB= <>
##$CPDPRGT= <>
##$D= (0..31)
0 1 0 0 0 0 0 0 0 0.06 0 0.03 2e-05 3e-06 0 0 0.0002 0 0 0 0 0 0 0 0 0 
0 0 0 0 0 0 
##$DATE= 1784020403
##$DBL= (0..7)
120 120 120 11 120 120 24 19 
##$DBP= (0..7)
150 150 150 150 150 150 150 150 
##$DBP07= 0
##$DBPNAM0= <>
##$DBPNAM1= <>
$$ [...]
##$SUBNAM3= <"">
##$SUBNAM4= <"">
##$SUBNAM5= <"">
##$SUBNAM6= <"">
##$SUBNAM7= <"">
##$SUBNAM8= <"">
##$SUBNAM9= <"">
##$SW= 400.765351723535
##$SWIBOX= (0..15)
0 1 3 0 0 0 0 0 0 0 0 0 0 0 0 0 
##$SW_h= 32467.5324675325
##$TD= 32768
##$TD0= 1
##$TE= 0
##$TE2= 300
##$TE3= 300
##$TEG= 300
##$TL= (0..7)
0 120 53 12 22 120 120 120 
##$TP= (0..7)
150 150 150 150 150 150 150 150 
##$TP07= 0
##$TPNAME0= <>
##$TPNAME1= <>
##$TPNAME2= <>
##$TPNAME3= <>
##$TPNAME4= <>
##$TPNAME5= <>
##$TPNAME6= <>
##$TPNAME7= <>
##$TPOAL= (0..7)
0.5 0.5 0.5 0.5 0.5 0.5 0.5 0.5 
##$TPOFFS= (0..7)
0 0 0 0 0 0 0 0 
##$TUNHIN= 0
##$TUNHOUT= 0
##$TUNXOUT= 0
##$USERA1= <user>
##$USERA2= <user>
##$USERA3= <user>
##$USERA4= <user>
##$USERA5= <user>
##$V9= 5
##$VALIST= <valist>
##$VCLIST= <CCCCCCCCCCCCCCC>
##$VD= 0
##$VDLIST= <DDDDDDDDDDDDDDD>
##$VPLIST= <PPPPPPPPPPPPPPP>
##$VTLIST= <TTTTTTTTTTTTTTT>
##$WBST= 1024
##$WBSW= 4
##$XGAIN= (0..3)
0 0 0 0 
##$XL= 0
##$YL= 0
##$YMAX_a= 89432
##$YMIN_a= -74857
##$ZGOPTNS= <>
##$ZL1= 120
##$ZL2= 120
##$ZL3= 120
##$ZL4= 120
##$ABSF1= 197.3918
##$ABSF2= -203.3724
##$ABSG= 5
##$ABSL= 3
##$ALPHA= 0
##$AQORDER= 0
##$ASSFAC= 0
##$ASSFACI= 0
##$ASSFACX= 0
##$ASSWID= 0
##$AUNMP= <proc_1d>
##$AZFE= 0.1
##$AZFW= 0.5
##$BCFW= 0
##$BC_mod= 2
##$BYTORDP= 0
##$COROFFS= 0
##$CY= -3
##$DATMOD= 1
##$DC= 0
##$DFILT= <>
##$DTYPP= 0
##$F1P= 0
##$F2P= 0
##$FCOR= 1
##$FTSIZE= 65536
##$FT_mod= 6
##$GAMMA= 0
##$GB= 0
##$INTBC= 1
##$INTSCL= 9.790993e-09
##$ISEN= 30
##$LB= 1.5
##$LEV0= 0
##$LPBIN= 0
##$MAXI= 10000
##$MC2= 0
##$MEAN= 0
##$ME_mod= 0
##$MI= 50
##$NCOEF= 0
##$NC_proc= -5
##$NLEV= 6
##$NOISF1= 182.463
##$NOISF2= 159.3651
##$NSP= 0
##$NTH_PI= 0
##$NZP= 0
##$OFFSET= 197.3918
##$PC= 4
##$PHC0= 1942.214
##$PHC1= 143.6991
##$PH_mod= 1
##$PKNL= yes
##$PPARMOD= 0
##$PSCAL= 0
##$PSIGN= 0
##$REVERSE= no
##$SF= 81.014063255964
##$SI= 65536
##$SIGF1= 159.3651
##$SIGF2= -187.1042
##$SINO= 113.3802
##$SIOLD= 16384
##$SREGLST= <1H.CDCl3>
##$SSB= 0
##$STSI= 65536
##$STSR= 0
##$SW_p= 32467.5324675325
##$SYMM= 0
##$S_DEV= 0
##$TDeff= 32768
##$TDoff= 0
##$TI= <>
##$TILT= no
##$TM1= 0
##$TM2= 0
##$TOPLEV= 0
##$USERP1= <user>
##$USERP2= <user>
##$USERP3= <user>
##$USERP4= <user>
##$USERP5= <user>
##$WDW= 1
##$XDIM= 65536
##$YMAX_p= 360804608
##$YMIN_p= -33160696
$$ End of Bruker specific parameters
$$ ---------------------------------
##NTUPLES= NMR SPECTRUM
##VAR_NAME=  FREQUENCY,     SPECTRUM/REAL,   SPECTRUM/IMAG
##SYMBOL=    X,             R,               I
##VAR_TYPE=  INDEPENDENT,   DEPENDENT,       DEPENDENT
##VAR_FORM=  AFFN,          ASDF,            ASDF
##VAR_DIM=   65536,         65536,           65536
##UNITS=     HZ,            ARBITRARY UNITS, ARBITRARY UNITS
##FACTOR=    0.49542278885378, 1,            1
##FIRST=     15991.5117654749, 0,            0
##LAST=      -16476.0207020576, 0,           0
##MIN=       -16476.0207020576, -33160696,   0
##MAX=       15991.5117654749, 360804608,    0
$$ Real data points
##PAGE= N=1
##DATA TABLE= (X++(R..R)), XYDATA
$$ [...]
44677b61395K0906q7430N3653Q235j92182j33021J58464K05908n2160j08922K27778
$$ -261395 -240489 -327919 -274266 -266031 -458213 -591234 -432770 -226862 -279022 -387944 -160166
44666a60166M70090K40809j69814l64071m03342m40608l08014O7691K77093k0245
$$ -160166 309924 550733 380919 16848 -386494 -827102 -1135116 -1067425 -790332 -810577
44656h10577m67012m38789J07237O51512P96130N46749J11641k06093j17912K82664
$$ -810577 -1277589 -1716378 -1609141 -957629 -161499 385250 496891 290798 172886 455550
44646D55550M71747J58043k74529l62561k57566l24906l90841m9472M93112O04283
$$ 455550 927297 1085340 810811 448250 190684 -134222 -525063 -574535 -81423 522860
44636E22860J83503k50204m08265m78738n02617k51031J37375J41360k66651m26091
$$ 522860 706363 456159 47894 -430844 -933461 -1184492 -1047117 -905757 -1172408 -1598499
44626a598499J58M82542N01945L33658M29640N79271L34710j35495l14964k11506
$$ -1598499 -1598341 -1115799 -613854 -280196 149444 728715 1063425 927930 612966 401460
44616D01460k74699n55596o02344k22591K10573L35818K44336J84936J66464L9850
$$ 401460 126761 -428835 -1031179 -1253770 -1043197 -707379 -463043 -278107 -111643 -71793
44606g1793k21678m59913m69093j96858J21937J51753r5218j89223J23759M86828
$$ -71793 -293471 -753384 -1222477 -1419335 -1297398 -1145645 -1240863 -1430086 -1306327 -819499
44596h19499M22000N5058r0290R3539K06553O9708k484J83327L12611Q3311k69068
$$ -819499 -397499 -342441 -432731 -339192 -132639 -62931 -65415 117912 430523 513834 244766
44585B44766l17631o1206J44251J03625p3810k28001k63081r7573K28693M49298
$$ 244766 -72865 -134071 10180 113805 39995 -188006 -451087 -548660 -319967 129331
44575A29331L27618J490j55861j3282K01935K73077K37509J93039R2813j13361
$$ 129331 456949 458439 302578 289296 491231 764308 1001817 1194856 1287669 1174308
44565A174308k85784k32156J2752K00553J69593J9658m9946L028M2194l3860j43360
$$ 1174308 888524 656368 669120 869673 1039266 1058924 1008978 1012006 1054200 1020340 876980
44554H76980j46788p6365j22829l51230n43346m44674j10757J45245J46796L3270
$$ 876980 730192 653827 530998 179768 -363578 -808252 -919009 -773764 -626968 -593698
44544e93698J793M1795M2946K8371J02552K29278K45013J00033n6524o0421J00059
$$ -593698 -591905 -550110 -507164 -478793 -376241 -146963 98050 198083 141559 81138 181197
44533A81197L08424M14701L15499N6005j54342j56059n9073r5379k64475l27973
$$ 181197 489621 904322 1219821 1275826 1121484 965425 906352 810973 546498 218525
44523B18525j81394M633Q5240J23850J48148O522l12426m74132k20298J81343
$$ 218525 37131 41764 127004 250854 399002 405524 93098 -381034 -601332 -419989
44513d19989K54720j7218j92250m033L31073M63348K88801m4669k73339j77243
$$ -419989 -165269 -182487 -374737 -378770 -47697 415651 704452 659783 386444 209201
44503B09201J53362K81179m1403l97823j99181L98325O22666K19715j69028l8276
$$ 209201 362563 643742 602339 204516 5335 403660 1026326 1246041 1077013 1038737
44493A038737J94516o9678n84234o35043j59742K17971J79061M8044P8267M5238
$$ 1038737 1233253 1163575 579341 -55702 -215444 2527 181588 229632 307899 353137
44483C53137k14689l96718k12571R7266J31326l7875k918L20512N60737M23600
$$ 353137 138448 -258270 -470841 -373575 -242249 -280124 -283042 37470 598207 1021807
44473A021807M6464k53658l32333k07661P0754L51627L50288m2628m77773m63706
$$ 1021807 1068271 814613 482280 274619 345373 697000 1047288 1004660 526887 63181
44463F3181r319L39884K29696m6775o6486M1071j54587o00608p34153k91948K99153
$$ 63181 53862 393746 623442 576667 510181 551252 396665 -203943 -938096 -1230044 -930891
44452i30891M99372K66816q4814l12202l16867q2418K27464L28875J61738l9788
$$ -930891 -431519 -164703 -249517 -561719 -878586 -961004 -733540 -404665 -242927 -282715
44442b82715j33691k15274k49366R730M77345N87693Q9797m25131l03975K07714
$$ -282715 -416406 -631680 -881046 -871316 -393971 193722 283519 -141612 -445587 -237873
44432b37873L77518R3540j08331J5797J49064R0232M5376J30877J49916J8803
$$ -237873 139645 233185 124854 140651 289715 379947 425323 556200 706116 724919
44422G24919o9124m8986j02516k41226k20189n428J19905O3581P9815K39450K14673
$$ 724919 655795 606809 504293 263067 42878 37450 157355 220936 300751 540201 754874
44411G54874j59334n27719n03555j68016J67350L73297M41363L21539N8591j68587
$$ 754874 595540 67821 -435734 -603750 -436400 -63103 378260 699799 758390 589803
44401E89803l05397m42916n02911k88175N9934J28180j00621j77865K3347O7985
$$ 589803 284406 -158510 -661421 -949596 -889662 -761482 -862103 -1039968 -1016621 -948636
44391i48636k01105k68333J47494M63782J49635l12157j54906M22232N93182K12785
$$ -948636 -1149741 -1418074 -1270580 -806798 -657163 -969320 -1124226 -701994 -108812 103973
44381A03973r8488n1366P31j30055j55955L4530J05860j27848l95513m49578l60958
$$ 103973 5485 -45881 -45150 -175205 -331160 -296630 -190770 -318618 -714131 -1163709 -1524667
44370a524667j87638J49627M96633M71101N7427k44805r8472K31160L35300K05892
$$ -1524667 -1712305 -1562678 -1066045 -594944 -537517 -782322 -880794 -649634 -314334 -108442
44360a08442R5221J31286K74494M11507L63550N5109k58089k35352K5607P5013
$$ -108442 -13221 118065 392559 804066 1167616 1222725 964636 729284 754891 829904
44350H29904k13854m67008m14492k36741j48736p9182K6639J2073j29131r3040
$$ 829904 616050 149042 -265450 -502191 -650927 -730109 -703470 -691397 -820528 -913568
44340i13568K52345N79548N66166L08380K9915k36999m12812k47983K03369M04703
$$ -913568 -661223 -81675 484491 792871 822786 585787 172975 -75008 128361 533064
44330E33064O2938l41532k31963J97541L41639J34274J6836J11728P6457k15210
$$ 533064 596002 254470 22507 220048 561687 695961 712797 824525 900982 685772
44320F85772m25456k96692L407J97242K01760M1103k19490l94778l32793j73419
$$ 685772 260316 -36376 -32969 164273 366033 407136 187646 -207132 -539925 -713344
44310g13344j64467k43010j43641R8394J63657P660l4991J73376L19709J61810
$$ -713344 -877811 -1120821 -1264462 -1166068 -1002411 -994751 -1029742 -856366 -536657 -374847
44300c74847p7424r6653K0467K7416m1844K7201K30932L39588K21662l6379k73160
$$ -374847 -452271 -548924 -528457 -501041 -542885 -515684 -284752 54836 276498 240119 -33041
44289c3041l49417j89022J02316K34969L1664l17805m53734k62134M7433K37765
$$ -33041 -382458 -571480 -469164 -234195 -202531 -520336 -974070 -1236204 -1188771 -951006
44279i51006K59351J81852P8500L2549J35344L74571N55902M24213q1846o95677
$$ -951006 -691655 -509803 -431303 -398754 -263410 111161 667063 1091276 1009430 313753
44269C13753r95772p76486k46425J86892L16463K57964J98383J51863L0408j36683
$$ 313753 -682019 -1458505 -1704930 -1518038 -1201575 -943611 -745228 -593365 -562957 -699640
44259f99640j80049N32K78045M06030K82201N9755m1232L085K7325o3748j68061
$$ -699640 -879689 -879157 -601112 -195082 87119 146874 105642 108727 136052 72304 -95757
44248i5757j61028n7744R1929L20769N95854O85427M15329J223j49359O655O1890
$$ -95757 -256785 -314529 -222600 98169 694023 1379450 1794779 1796002 1646643 1653298 1715188
44237A715188k63448p00394p78076m28246j5414J62043J64091J76873J95133P8771
$$ 1715188 1451740 751346 -26730 -454976 -470390 -308347 -144256 32617 227750 306521
44227C06521j56373k80222j42038R0559J30518j8114l9793K23769M76199L36105
$$ 306521 150148 -130074 -272112 -181553 -51035 -69149 -108942 114827 591026 927131
44217I27131j09550l86676k65284m0336p3064k65551k00826K60569P17738O40430
$$ 927131 817581 430905 165621 125285 52221 -213330 -414156 -153587 564151 1204581
44207A204581r104o57940p03834j89003K52999J74286j64563k23639N7017K46252
$$ 1204581 1195477 537537 -166297 -355300 -102301 71985 -92578 -316217 -259200 -12948
44197a2948R2048j76031k74884k44110k33348k02393n1251J53351K90028L65150
$$ -12948 79100 -96931 -371815 -615925 -849273 -1051666 -1102917 -949566 -659538 -294388
44187b94388M04773L24489R5066j10900j32063m3992R391N3235J44712J69370
$$ -294388 110385 434874 529940 419040 286977 242985 252376 305611 450323 619693
44177F19693L1384j03598n0067M2311q8027l33502l47687j19295J1152m9742J3509
$$ 619693 651077 547479 497412 539723 451696 118194 -229493 -348788 -337636 -387378 -373869
44166c73869L36843N62413L75018j3085k39025l40280n30342o59666l90999J59228
$$ -373869 -37026 525387 900405 887320 648295 308015 -222327 -881993 -1272992 -1113764
44156a113764M40079K10604j26818r6076K52895N06947M24816R7537k73239n43508
$$ -1113764 -673685 -463081 -589899 -685975 -433080 73867 498683 596220 322981 -220527
44146b20527o37443n51802l48676r8463J16570J62256j0835j65104L6543N13707
$$ -220527 -857970 -1409772 -1758448 -1856911 -1740341 -1578085 -1588920 -1754024 -1717481 -1203774
44136a203774P10112K90362l38246n23757k13842R1597J26666J24739K66690L47326
$$ -1203774 -493662 -203300 -541546 -1065303 -1279145 -1187548 -1060882 -936143 -669453 -322127
44126c22127J71640j10255k86682l65557l53855j17553K58713L44114k7538l53147
$$ -322127 -150487 -260742 -547424 -912981 -1266836 -1384389 -1125676 -781562 -809100 -1162247
44116a162247j28526L62836M74271J85560K0610R2577k1583l85591m51049L0407
$$ -1162247 -1290773 -927937 -453666 -268106 -247496 -154919 -176502 -562093 -1013142 -982735
44106i82735N28683N61194L87532L90972L29505j48627o64790n54899M5336L26254
$$ -982735 -454052 107142 494674 885646 1215151 1066524 401734 -153165 -107829 218425
44096B18425r60l44366j91126K03560L37987J70392j3388p6370n7148L5957J83925
$$ 218425 217465 -126901 -318027 -114467 223520 393912 380524 304154 247006 282963 466888
44085D66888K66942K04827N9262r8113k40244k56508l5986K35299J82110j99498
$$ 466888 733830 938657 997919 899806 659562 403054 367068 602367 784477 584979
44075E84979m25145j91332J69595K03757m812p6641J1482j3880j54699j35143
$$ 584979 159834 -31498 138097 341854 337042 260401 271883 258003 103304 -31839
44065c1839O2799J42530K8885o570J12864O9752k58959m40183r3377M43454N20956
$$ -31839 30960 173490 202375 195805 308669 378421 119462 -320721 -414098 29356 550312
44054E50312J03601j96967k1216K64737J62165k54592n07799l82363j13013J8125
$$ 550312 653913 456946 435730 700467 862632 608040 100241 -282122 -395135 -377010
44044c77010j1650p8994r6098L891K71179N93149O76401L46822j84116n07053
$$ -377010 -388660 -467654 -563752 -559861 -288682 304467 980868 1327690 1143574 636521
44034F36521m59905k55700j63883k05387k18058j13494K1269L7088j11822k91416
$$ 636521 176616 -79084 -242967 -448354 -666412 -779906 -758637 -721549 -833371 -1124787
44024a124787k80569p300L15504L98367K30882Q7314J32039K02536J10941k2531
$$ -1124787 -1405356 -1412656 -1097152 -698785 -467903 -380589 -248550 -46014 64927 42396
44014D2396L1660J91657J43788j46053l03076n8772L43633M72148K80236R6028
$$ 42396 74056 265713 409501 263448 -39628 -98400 245233 717381 997617 1093645
44004A093645R3383O5752j89492n07540n80119m11564k98062l62874l71294j20340
$$ 1093645 1187028 1252780 1063288 555748 -24371 -435935 -733997 -1096871 -1468165 -1588505
43994a588505K01212K57028M9214r7542j0549J41142J80983J73027J93501J04312
$$ -1588505 -1387293 -1130265 -1081051 -1178593 -1189142 -1048000 -867017 -693990 -500489 -396177
43984c96177k04755n11085m78739j17413K33391L49271L01246J98647K8317j78646
$$ -396177 -600932 -1112017 -1590756 -1708169 -1474778 -1125507 -824261 -625614 -597297 -775943
43974g75943k65848j68349l8547l2034r9100q9906N1271K74757M81608N26062
$$ -775943 -1041791 -1210140 -1248687 -1280721 -1379821 -1469727 -1418456 -1143699 -662091 -136029
43964a36029L14435j7565j88109j22740m9255j29194j99179n2896K04961L14819
$$ -136029 178406 160841 -27268 -150008 -199263 -328457 -527636 -580532 -375571 -60752
43954f0752K44937J79999J98803J81413J4440k62487m81309m38348q9928K62796
$$ -60752 184185 364184 562987 744400 758840 496353 15044 -423304 -513232 -250436
43944b50436K13014j76022l39111j7090K63629k9631n01459l38922L87759P20077
$$ -250436 -37422 -213444 -552555 -569645 -306016 -335647 -837106 -1176028 -788269 -68192
43934f8192K08229m54251m93208o2401K56623L63685M61357M23821L3727m04362
$$ -68192 140037 -314214 -807422 -869823 -613200 -249515 211842 635663 669390 265028
43924B65028l68041N6381K57530J301k98980k64882j07K49482M21796M63437K31254
$$ 265028 -103013 -46632 210898 212199 -86781 -351663 -351770 -102288 319508 782945 1014199
43913A014199k17484n38978n06493k71424q2345J7465P3360M7107n4498o9078
$$ 1014199 796715 257737 -248756 -520180 -602525 -585060 -511700 -464593 -519091 -588169
43903e88169J09499L25237L22560N3327k67137l67319j65228J38071K51620J49250
$$ -588169 -478670 -153433 169127 222454 -44683 -412002 -577230 -439159 -187539 -38289
43893c8289J05378K49324K98558R153l21840k29953J61301K70633n5026l22783
$$ -38289 67089 316413 614971 624124 302284 72331 233632 504265 449239 126456
43883A26456j77926J06846J28235j11148l84039n43308m44548o395M37110L40872
$$ 126456 -51470 55376 183611 72463 -311576 -854884 -1299432 -1305827 -868717 -527845
43873e27845k19445m56201K9648O21691O35058L14627K52071L25748L8381m36343
$$ -527845 -747290 -1203491 -1173843 -552152 82906 397533 649604 975352 1013733 577390
43863E77390m55078j4799K27047N6847j4009K85282N14011K75217k01007n11339
$$ 577390 122312 107513 334560 391407 377398 662680 1176691 1451908 1250901 739562
43853G39562n76682m47097j30418J58958J02085j52498o9042L85981N50843R3980
$$ 739562 162880 -284217 -414635 -255677 -153592 -306090 -375132 10849 561692 655672
43843F55672m14126m14756k14635l06884l94213J03998R06630J108213M87843
$$ 655672 241546 -173210 -387845 -694729 -1088942 -984944 -78314 1029899 1517742
43834A517742k00274l24194q8557K2738o7122j80948k90163m37577n25667m59095
$$ 1517742 1317468 993274 904717 927455 860333 679385 389222 -48355 -574022 -1033117
43824a033117l35974k93705k81982j45690J42377M33799N40507L84183P5877j48029
$$ -1033117 -1369091 -1662796 -1944778 -2090468 -1948091 -1514292 -973785 -589602 -513725 -661754
43814f61754j41363J4980J50150K04493K00419J20349l3299j49048j53084j54063
$$ -661754 -803117 -788137 -637987 -433494 -233075 -112726 -146025 -295073 -448157 -602220
43804f02220k42427k50814J7195L87028M68850K26486M6623J37727J97273j03167
$$ -602220 -844647 -1095461 -1078266 -691238 -222388 4098 50721 188448 385721 282554
43794B82554n59322o65977k94390J57208K93475J55892L6104L6662j203j76452
$$ 282554 -276768 -942745 -1237135 -1079927 -786452 -630560 -594456 -557794 -558997 -735449
43784g35449l20852k03172J54765M92647O10984N29317L55011J50852k1124p6321
$$ -735449 -1056301 -1259473 -1104708 -612061 -1077 528240 883251 1034103 1012979 936658
43774I36658k2594J0824n4595j45743j78282j72227j44278l4341J37764J86731
$$ 936658 914064 924888 870293 724550 546268 374041 229763 195422 333186 519917
43764E19917o543k84612l91185k73810p8409N5444O3622n7097j89363j46084P8364
$$ 519917 513374 228762 -162423 -436233 -514642 -459198 -395576 -452673 -642036 -788120 -709756
43753g09756K53683K46361K02476K21110J13891k20723m46619k19170K22799L58101
$$ -709756 -456073 -209712 -7236 213874 327765 107042 -339577 -558747 -335948 22153
43743B2153J54390J9862L2897j83399p01868r85812o25483O3093M99200N48550
$$ 22153 176543 196405 229302 45903 -655965 -1641777 -2267260 -2204167 -1704967 -1156417
43733a156417M43590K96098P5519j12258r7629P3423K07402K44898K47961J91710
$$ -1156417 -712827 -416729 -341210 -453468 -551097 -477674 -270272 -25374 222587 414297
43723D14297J0972j92522k19192m6907J41838K11782K00279J76870J17781j6720
$$ 414297 425269 232747 13555 -33352 108486 320268 520547 697417 815198 798478
43713G98478j47617r5552K25941O34902P83972N35901J76285J04540L40986N18115
$$ 798478 650861 555309 781250 1416152 2200124 2736025 2912310 3016850 3357836 3875951
43703C875951L68812L5210j50379k0330L38653O83250P52043M67499M6240k30823
$$ 3875951 4244763 4279973 4129594 4109264 4447917 5131167 5883210 6350709 6396949 6166126
43693F166126l49006m81163o29929o32931n27658n66504p73365q20367n05740
$$ 6166126 5817120 5335957 4706028 4073097 3545439 2978935 2205570 1385203 879463
43684H79463o1761J88243K12400J42320M0449j7577R5802L11032L40832J13556
$$ 879463 817702 1005945 1218345 1360665 1401114 1383537 1479339 1790371 2131203 2244759
43674B244759n6364M7182J93275R8715j43133l25320m90757o74671o10835j42853
$$ 2244759 2188395 2235577 2428852 2527567 2384434 2059114 1568357 893686 282851 139998
43664A39998L32957L26320l6646k50335k05066j93307k62901j52884J27243K17926
$$ 139998 472955 799275 762629 512294 307228 113921 -148980 -301864 -174621 43305
43654D3305L095k00627j68446n5555l8428n6623l5223j4253L8809K01180L17682
$$ 43305 46400 -154227 -322673 -378228 -416656 -473279 -508502 -522755 -483946 -282766 34916
43643C4916J33806k25908l33509j11991L8879p6772j24859J57987M88290M88499
$$ 34916 168722 -57186 -390695 -502686 -463807 -540579 -665438 -507451 -19161 469338
43633D69338K42370M5803p5207k22328k75433r4436J23576R1084r4653j03193
$$ 469338 711708 757511 682304 459976 184543 90107 213683 304767 210114 106921
43623A06921Q6928J72648L4716q8283L076J73550J65928o2972l18915l88113k14984
$$ 106921 193849 366497 401213 312930 316006 489556 655484 592512 273597 -114516 -329500
43612c29500Q4908L43744M66020M33714K47707m3781k97145l87919l56913l03795
$$ -329500 -244592 99152 565172 998886 1246593 1202812 905667 517748 160835 -142960
43602a42960j84879P8450L30425K98940R160k07216j76010o4986l7602m4749n6263
$$ -142960 -327839 -249389 81036 379976 389136 181920 5910 -59076 -96678 -141427 -197690
43591a97690j42613j90058O9907N42234O92346K80682k12613k49897L3719J62691
$$ -197690 -340303 -530361 -460454 81780 774126 1054808 842195 592298 626017 788708
43581G88708M2584j22560l29575o33039p22210k68400L89186N28069M9738l63325
$$ 788708 831292 708732 379157 -253882 -976092 -1244492 -855306 -327237 -277499 -640824
43571f40824k05600K47186M55349K90592r500k01145j52827J03758K95799J58720
$$ -640824 -846424 -599238 -143889 146703 137203 -63942 -216769 -113011 182788 341508
43561C41508j42927j62438J67344L91443K06634j04844j52339r993j2147k18087
$$ 341508 198581 36143 203487 594930 801564 696720 544381 534388 522241 304154
43551C04154l83020l19189n9993K16122K79834L3014k85208k88550M1168K94216
$$ 304154 -78866 -398055 -458048 -241926 37908 70922 -214286 -502836 -461668 -167452
43541a67452K28745R7341J67484K84268K29859J62058K67537K89471o2671m55947
$$ -167452 61293 158634 326118 610386 840245 1002303 1269840 1559311 1496640 1040693
43531A040693l21152J85764K94518k24827o99544n90175k42433j88072k57673
$$ 1040693 719541 905305 1199823 974996 275452 -314723 -557156 -745228 -1002901
43522a002901J0654M62705N37782K19262M5237J49780L4645m62281o71419p0043
$$ -1002901 -992247 -529542 8240 227502 272739 422519 457164 -5117 -676536 -746579
43512g46579P52183P84290O673o00041m35598L3135J51594j1825m8821M448j35131
$$ -746579 5604 789894 796567 196526 -239072 -205937 -54343 -66168 -114989 -110541 -245672
43501b45672k83022O2388Q46753J322490R88598K47921j47788j8948J77639K8950
$$ -245672 -528694 -466306 380447 1702937 2691535 2939456 2791668 2772720 2950359 2979309
43491B979309l97281p42727p40576l97746K6346J94064j9301l63555m44067j64340
$$ 2979309 2582028 1839301 1098725 700979 727325 921389 902088 538533 94466 -69874
43481f9874J44641J10637k17034l98172j16955M25101P16067M93043r579l65720
$$ -69874 74767 185404 -31630 -429802 -546757 -121656 594411 1087454 1077875 712155
43471G12155l90508k28947j26121j84222k81043j95004J05559L11989R7654l80257
$$ 712155 321647 92700 -33421 -217643 -498686 -693690 -588131 -276142 -178488 -558745
43461e58745n64128k05126L02134N10874N32709O98099Q77389O52658N5797m07669
$$ -558745 -1122873 -1327999 -1025865 -514991 17718 715817 1593206 2245864 2301661 1893992
43451A893992m89452m35031m09827k33330J16001K53683k3577l20108j85969K45428
$$ 1893992 1404540 969509 559682 326352 442353 696036 672459 352351 166382 411810
43441D11810N38916N94162O03114O01711M85612L23590K64605K46508J55804J52421
$$ 411810 950726 1544888 2148002 2749713 3235325 3558915 3823520 4070028 4225832 4378253
43431D378253M50118Q73773J051320J004103J132268J606529K177036K626580
$$ 4378253 4828371 5702144 6753464 7757567 8889835 10496364 12673400 15299980
43423A5299980K994750L223799K962492J951983L86670j261131k586951l340872
$$ 15299980 18294730 21518529 24481021 26433004 26819674 25558543 22971592 19630720
43415A9630720l428149l000894k394413j843808j374302r97031q00451p67142
$$ 19630720 16202571 13201677 10807264 8963456 7589154 6592123 5791672 5024530
43407E024530p16153n46998l61727k45029j25360J8019K2104j95470m00735l00582
$$ 5024530 4308377 3761379 3399652 3154623 3029263 3047282 3069386 2873916 2473181 2172599
43397B172599L6467K24233L2995l17165l90332k2528M70005O27198L99071K26783
$$ 2172599 2209066 2433299 2466294 2149129 1758797 1736269 2206274 2833472 3232543 3459326
43387C459326M56260Q42434Q98460O25916N24599Q66383J370787J732285K052445
$$ 3459326 3915586 4758020 5656480 6282396 6806995 7673378 9044165 10776450 12828895
43378A2828895K469623K695573K306272J317839J27445r87574j959726k615850
$$ 12828895 15298518 17994091 20300363 21618202 21745647 20758073 18798347 16182497
43370A6182497k692567k248967j746022j555711j571744j429173r71596l82468
$$ 16182497 13489930 11240963 9494941 7939230 6367486 4938313 3966717 3584249
43362C584249N3377J97442R6697j19946l25181l95167k36702P6974K54904O0237
$$ 3584249 3637626 3835068 3931765 3811819 3486638 3091471 2854769 2931743 3186647 3246884
43352C246884l44914n32146l53764j21982j11399j54318J7804K65479K36028n9312
$$ 3246884 2901970 2369824 2016060 1894078 1782679 1628361 1646165 1911644 2147672 2088360
43342B088360k59847k17852j45790j49861k6313L06177N28177L45711m8476k32945
$$ 2088360 1828513 1610661 1464871 1315010 1288697 1594874 2123051 2468762 2420286 2187341
43332B187341j19083L3769N9529L4792J5477o7727j85361j51492O4974J82011
$$ 2187341 2068258 2102027 2161556 2196348 2211825 2144098 1958737 1807245 1872219 2054230
43322B054230l3925l80591m50935k17046r8959l52176o40321m57077J55160O00901
$$ 2054230 2020305 1639714 1188779 971733 872774 520598 -119723 -576800 -421640 179261
43312A79261M55497o5965m49854m62438k25872R8762M52408P42970P89520M85656
$$ 179261 634758 568793 118939 -343499 -569371 -470609 -18201 724769 1514289 1999945
43302A999945m3784m88294n79132l39174r2828j01440k01946k9830L60777M38556
$$ 1999945 1956161 1467867 888735 549561 456733 355293 153347 123517 484294 922850
43292I22850l7754n38234m32556J08443L85522K18127J21095L80976N79278L11653
$$ 922850 885096 346862 -85694 22749 408271 626398 747493 1128469 1707747 2019400
43282B019400j39358k70184j23596j06180k65376k58850K4070K76255K59086J00950
$$ 2019400 1880042 1609858 1486262 1380082 1114706 855856 879926 1156181 1415267 1516217
43272A516217O509k9677p8684p8500N0566K24209K68206J17801j22200k70188
$$ 1516217 1522726 1493049 1414365 1335865 1386431 1610640 1878846 1996647 1874447 1604259
43262A604259k09469PJ69411K12236K62618M37559N67397L84590l5729k83207
$$ 1604259 1394790 1394797 1564208 1776444 2039062 2476621 3044018 3428608 3392879 3109672
43252C109672j35617J57328K47119J46833J27184K77898L94143K84195K5254j27902
$$ 3109672 2974055 3131383 3378502 3525335 3652519 3930417 4324560 4608755 4634009 4506107
43242D506107j2310K88342N30473N60336M73391M68945N60596N59187L83111K23794
$$ 4506107 4493797 4782139 5312612 5872948 6346339 6815284 7375880 7935067 8318178 8541972
43232H541972K78600M50290M93205L85255L49342N14388P55607R14726R93564
$$ 8541972 8820572 9270862 9764067 10149322 10498664 11013052 11768659 12683385 13676949
43223A3676949J038882J004354Q88230R08692J341324K171026L055251L684895
$$ 13676949 14715831 15720185 16608415 17517107 18858431 21029457 24084708 27769603
43215B7769603M071445M409943M761108M983462M910584M433522L422052J786060
$$ 27769603 31841048 36250991 41012099 45995561 50906145 55339667 58761719 60547779
43207F0547779k56153k134521l372129m020934m444592m709021m497359l729912
$$ 60547779 60291626 58157105 54784976 50764042 46319450 41610429 37113070 33383158
43199C3383158k941527k740081l047700l211323k824794k121361j522496j136737
$$ 33383158 30441631 27701550 24653850 21442527 18617733 16496372 14973876 13837139
43191A3837139q63693p20847q07201j062850j277851j287344j037263n76151j31248
$$ 13837139 12973446 12252599 11445398 10382548 9104697 7817353 6780090 6203939 6072691
43182F072691l7734l59203o88908n95824j88688O7411L2120m689Q3391L3720k55606
$$ 6072691 6034957 5675754 4986846 4391022 4202334 4269745 4301865 4297176 4380567 4414287 4158681
43171D158681m15905j86499R2121J6868j71134o16L21947J42670n00375p47998
$$ 4158681 3742776 3556277 3648398 3665266 3494132 3493516 3815463 3958133 3457758 2709760
43161B709760j89575M49937L59912k03308m33299k09859p6390k17414k55177m3708
$$ 2709760 2520185 2970122 3330034 3126726 2693427 2483568 2407178 2189764 1934587 1890879
43151A890879R5215N6552J63044M58393M71535M1854k65194n3336J84487j23481
$$ 1890879 1986094 2042646 2205690 2664083 3135618 3177472 2912278 2858942 3043429 2919948
43141B919948n95543m77538O3613J51291l68861o55715k13968L63258L86388P0462
$$ 2919948 2324405 1846867 1910480 2061771 1692910 1037195 823227 1186485 1572873 1643335
43131A643335L005J75978J79826j2739r8655o2575j44388k99325k37517L0937
$$ 1643335 1646340 1822318 2002144 1989405 1890750 1828175 1683787 1384462 1146945 1177882
43121A177882J77662Q8809k0046l6025p3676j31679l8743J86702L02478K36297
$$ 1177882 1355544 1444353 1424307 1388282 1314606 1182927 1144184 1330886 1633364 1869661
43111A869661J45677M4829k07059m82131m31023q7074Q6269m7830m7560K95448
$$ 1869661 2015338 2060167 1853108 1370977 939954 852880 939149 891319 843759 1139207
43101A139207M75804Q8971l98570l41320J9241m6086n06599n74060L1722O36671
$$ 1139207 1615011 1703982 1305412 964092 983333 937247 430648 -143412 -111690 524981
43091E24981O47904L24827J71215J64458N3120m8202Q8585K48170K6994m68053
$$ 524981 1172885 1497712 1668927 1833385 1886505 1838303 1926888 2175058 2202052 1733999
43081A733999o67852k99775K81280N72778M38381Q7171j95979k12276M2260L17322
$$ 1733999 1066147 766372 1047652 1620430 2058811 2145982 1950003 1737727 1779987 2097309
43071B097309L06337j774k86924k90070j14076k0956m0587L0011K46493L51031
$$ 2097309 2403646 2401872 2114948 1824878 1710802 1689846 1649259 1679270 1925763 2276794
43061B276794J30712j89996j68421K31682N17313L33077M203J10171O60068J080404
$$ 2276794 2407506 2217510 2049089 2280771 2798084 3131161 3135364 3245535 3905603 4986007
43051D986007J012223P10078N34460M43798K38187m05l8972J08848K12343J46749
$$ 4986007 5998230 6708308 7242768 7686566 7924753 7924348 7885376 7994224 8206567 8353316
43041H353316n1347l39863o48471q07947p36888n96590n38936m46958j99095k1105
$$ 8353316 8301969 7962106 7313635 6505688 5768800 5172210 4633274 4186316 3987221 3966116
43031C966116j90687m91990m20587N1106L73038K01072j48853k36441j06871p9605
$$ 3966116 3775429 3283439 2862852 2913958 3286996 3488068 3339215 3102774 2995903 2916298
43021B916298k21408l55354m00931l92129k83571k5895K44141L39664K96005K98882
$$ 2916298 2694890 2339536 1938605 1546476 1262905 1237010 1481151 1820815 2116820 2415702
43011B415702M07360N45897O80320P70529O39955J88944k84320k95447K20289
$$ 2415702 2823062 3368959 4049279 4819808 5459763 5648707 5364387 5068940 5289229
43002E289229P84451R69987Q74323Q35830Q91404P69556L47326j19063k59488
$$ 5289229 6073680 7043667 7917990 8753820 9645224 10414780 10762106 10643043 10383555
42993A0383555L8885N68047J035054J312239J461739J548739J517947J347144
$$ 10383555 10422440 10990487 12025541 13337780 14799519 16348258 17866205 19213349
42985A9213349J261189J584804K304669K972640L227787L287245L670489M469371
$$ 19213349 20474538 22059342 24364011 27336651 30564438 33851683 37522172 41991543
42977D1991543N155002N164254M433394L237989J763686Q6455j576375k914077
$$ 41991543 47146545 52310799 56744193 59982182 61745868 61832323 60255948 57341871
42969E7341871l822998m418579m729332m624882m120997l516790l080413k768520
$$ 57341871 53518873 49100294 44370962 39746080 35625083 32108293 29027880 26259360
42961B6259360k406777j995776j663942j438578j250774j077283q97106o02118
$$ 26259360 23852583 21856807 20192865 18754287 17503513 16426230 15529124 14927006
42953A4927006j64598J81334J80050m6257j09941R4552K35641N5655k14046j61754
$$ 14927006 14762408 14943742 15123792 15077535 14967594 15062146 15297787 15353442 15139396 14977642
42943A4977642K25704N31052M30896O6072j69342j08598J1020j47268o13077j090359
$$ 14977642 15203346 15734398 16165294 16231366 16062024 15953426 15964446 15817178 15204101 14113742
42933A4113742j318128j300089j132399q11952l87597j16131j85575l85083l72196
$$ 14113742 12795614 11495525 10363126 9551174 9163577 9047446 8861871 8476788 8104592
42924H104592k19516l17373o98946q88863n99163j90042j48793m02514m96478
$$ 8104592 7885076 7567703 6868757 5979894 5380731 5190689 5041896 4639382 4142904
42915D142904k66948K7855J59318J64976J27234O730k11152l80867l21595l5287
$$ 4142904 3875956 3903811 4063129 4228105 4355339 4362069 4150917 3770050 3448455 3413168
42905C413168K41004K32378o0617k83279j07229L26613N53149L82984R5485j1207
$$ 3413168 3654172 3886550 3825933 3542654 3435425 3762038 4315187 4698171 4793656 4782449
42895D782449N8372K16536M45246N51678K00474n17573r63234p64984l53511k49562
$$ 4782449 4840821 5057357 5502603 6054281 6254755 5737182 4773948 4008964 3655453 3405891
42885C405891k64973j247K77367N4612m23284m37576r453J13581k48503l92609
$$ 3405891 3140918 3139671 3417038 3471650 3048366 2610790 2601337 2714918 2466415 2073806
42875B073806L4691M23494K53322q7838j00178l0895k52731m27316q5084M31412
$$ 2073806 2108497 2531991 2785313 2697475 2597297 2566402 2313671 1886355 1801271 2232683
42865B232683M30743m1095l74057m07951m59616n00328j74209L57849M34179p9470
$$ 2232683 2663426 2622331 2248274 1840323 1380707 880379 706170 1064019 1498198 1418728
42855A418728n10597l81220m7605k1204k04861k01228K9475K23643K55748J92346
$$ 1418728 908131 526911 479306 458102 253241 52013 81488 305131 560879 753225
42845G53225J01599O0480J66182L34539K83631p9595m40287m44150j30754J83986
$$ 753225 854824 915304 1081486 1416025 1699656 1620061 1179774 735624 604870 788856
42835G88856L19628L41922L50237L10144R0804l50520p81529p99112l04657K29948
$$ 788856 1108484 1450406 1800643 2110787 2201591 1851071 1069542 270430 -34227 195721
42825A95721K60657j27759l73516k54982r9284j10587j8978L61359O97516O16659
$$ 195721 456378 328619 -44897 -299879 -399163 -509750 -528728 -167369 530147 1146806
42815A146806K59875m790j05186j20284P5862N53037R22252P09258N7221l93450
$$ 1146806 1406681 1401891 1296705 1176421 1252283 1805320 2727572 3436830 3494051 3100601
42805C100601l11325K8961K48542K82102K44904K08250J95882J87215J00908m9761
$$ 3100601 2789276 2818237 3066779 3348881 3593785 3802035 3997917 4185132 4286040 4236279
42795D236279o0695J80144M34945M30989K96049L11443L65470J38643k20908j89364
$$ 4236279 4175584 4355728 4790673 5221662 5517711 5829154 6194624 6333267 6112359 5922995
42785E922995K66810N10247J73902k57518k01280J24425O4044m70046q84326p32759
$$ 5922995 6189805 6700052 6873954 6616436 6415156 6539581 6603625 6133579 5249253 4516494
42775D516494k32800Q5354m4336m43511o99862n46244j35522J31939J22960J13313
$$ 4516494 4283694 4369048 4324712 3881201 3181339 2635095 2499573 2631512 2754472 2867785
42765B867785K75616L22181k5852m63390m51769l4838J92508l8932l08487j73833
$$ 2867785 3143401 3465582 3439730 2976340 2524571 2489733 2682241 2643309 2334822 2160989
42755B160989K08669L79505J92676j26737l30575l13042r4045J43491J38691j28031
$$ 2160989 2369658 2749163 2941839 2815102 2484527 2171485 2077440 2220931 2359622 2231591
42745B231591l37913k42336p313O8921O657J9849Q1999r674j85881j37739J31869
$$ 2231591 1893678 1651342 1644029 1712950 1719607 1739456 1821455 1811781 1625900 1488161 1620030
42734A620030K01572j27745m46729l02347J16764K54872J1841j51857M1431K60906
$$ 1620030 1821602 1693857 1247128 944781 1061545 1316417 1328258 1176401 1217832 1478738
42724A478738Q0375l84749o36191m40429n0856J67377J14792l7922n1292J83926
$$ 1478738 1559113 1174364 538173 97744 46888 214265 329057 291135 239843 423769
42714D23769N08361N71552K09313k73523l98273j00802K13246K53807J92787K68615
$$ 423769 932130 1503682 1712995 1439472 1041199 940397 1153643 1407450 1600237 1868852
42704A868852L50278J98155o0442j09085P950n5961l28458l94924m3710L49324
$$ 1868852 2219130 2417285 2356843 2247758 2255708 2199747 1871289 1476365 1432655 1781979
42694A781979L29195k5074k64295j39677K46394O77869R42777Q61853M80392J28854
$$ 1781979 2111174 2086100 1821805 1682128 1928522 2606391 3549168 4411021 4891413 5020267
42684E020267M5799O1452r3269l27789l65808k24906j25762l4761K39615N47708
$$ 5020267 5066066 5127518 5034249 4706460 4340652 4115746 3989984 3955223 4194838 4742546
42674D742546N28445K81815L43286Q34303J215343J139835R66195J038738J045089
$$ 4742546 5270991 5552806 5896092 6730395 7945738 9085573 10051768 11090506 12135595
42665A2135595O55949L18658O85497J540313K062769K031970J991730K215566
$$ 12135595 12791544 13110202 13795699 15336012 17398781 19430751 21422481 23638047
42657B3638047K311463K061259J913134K230405K589471K290524J222741j65277
$$ 23638047 25949510 28010769 29923903 32154308 34743779 37034303 38257044 38091767
42649C8091767j456531k444352k968878k989452k728347k464528k266419k085233
$$ 38091767 36635236 34190884 31222006 28232554 25504207 23039679 20773260 18688027
42641A8688027j919081j707440j315261q49025p06389j012106j280184j012639
$$ 18688027 16768946 15061506 13746245 12897220 12190831 11178725 9898541 8885902
42633H885902m05190l7314n3804j34652j40144k23185l09353n7282M97554P68629
$$ 8885902 8480712 8443398 8389594 8254942 8114798 7891613 7582260 7524978 8022532 8791161
42623H791161L65237l63513q24469r10277r04646r00518p18587l41178o4548j23811
$$ 8791161 9156398 8792885 7968416 7058139 6153493 5252975 4534388 4193210 4128662 4004851
42613D004851l74958m77578l06712o8743l943o8220k1234J84216K85870R9559
$$ 4004851 3629893 3152315 2845603 2776860 2772917 2704697 2683463 2867679 3153549 3253108
42603C253108j53313j33144J15896K45730J48747Q5156K13902L52158L64320M54750
$$ 3253108 3099795 2966651 3082547 3328277 3477024 3562180 3776082 4128240 4492560 4947310
42593D947310P85319J044497P78968P2786m80217n39001m25001n90808r23456
$$ 4947310 5732629 6777126 7556094 7628880 7148663 6609662 6184661 5593853 4670397
42584D670397r00365l99760K766k40376q51696j026146n00828R2274J20588j95288
$$ 4670397 3770032 3370272 3373038 3132662 2280966 1254820 753992 846266 966854 771566
42574G71566j96597K19032N32994M48388K45142J99702J62956m2628k25416j57808
$$ 771566 574969 794001 1326995 1775383 2020525 2220227 2383183 2340555 2115139 1957331
42564A957331m398n2327k14010j69297R8233K54903J02063j66142k44359q5930
$$ 1957331 1952933 1900606 1686596 1517299 1615532 1870435 1972498 1806356 1561997 1476067
42554A476067O5751m2858l52977m68407r8716M66351N94066J39862k68892l0179
$$ 1476067 1541818 1498960 1145983 677576 578860 1045211 1639277 1779139 1510247 1480068
42544A480068O31144J014550Q82033N96309M20516J88247k42089o42984p39399
$$ 1480068 2111212 3125762 4007795 4604104 5024620 5212867 4970778 4327794 3588395
42535C588395n77918l62663j52414N6895J29783o0239l46311l78668n9349L04139
$$ 3588395 3010477 2647814 2495400 2552295 2682078 2621839 2275528 1896860 1837511 2141650
42525B141650L75602K19377K03708M79507P37862O26521K78476J73623M88547
$$ 2141650 2517252 2736629 2940337 3419844 4157706 4784227 5062703 5236326 5724873
42516E724873Q67113R18316O59159L06635r0092n56562r42671j055502r19816
$$ 5724873 6591986 7510302 8169461 8476096 8386004 7829442 6886771 5831269 4911453
42507D911453o78836l88359j30728j11096l31312l90246m798M55034M17782l4916
$$ 4911453 4232617 3844258 3713530 3602434 3271122 2880876 2876078 3331112 3748894 3713978
42497C713978k97179j65517m5528j75845k60360p8009R6023j5841k27664k44030
$$ 3713978 3416799 3251282 3205754 3029909 2769549 2691540 2787563 2771722 2544058 2300028
42487B300028j08511O832J08850J79845K7554l24273m46304r0330L49026L72865
$$ 2300028 2191517 2198349 2307199 2487044 2514598 2190325 1744021 1653691 2002717 2375582
42477B375582Q9056o2727k6218n3706j24010q990J79206Q7259k32706l24226m7675
$$ 2375582 2464638 2401911 2375693 2321987 2197977 2188987 2368193 2455452 2222746 1898520 1850845
42466A850845K12207J91289J14156K15826L34794K67283J83478L63602P44284
$$ 1850845 2063052 2254341 2368497 2584323 2919117 3186400 3369878 3733480 4477764
42457D477764J037693J171440J343100J685677K052248K100027J513515K70337
$$ 4477764 5515457 6686897 8029997 9715674 11767922 13867949 15381464 15651801
42449A5651801j184706k138978k159741j442691n42761K01677Q89242J700879
$$ 15651801 14467095 12328117 10168376 8725685 8182924 8384601 9273843 10974722
42441A0974722K406634K367648J188581o47165k051163k394182k078031j838971
$$ 10974722 13381356 15749004 16937585 16290420 14239257 11845075 9767044 7928073
42433G928073j771014j451071q18206l20629j65169l6868K28454K64557j68958
$$ 7928073 6157059 4705988 3887782 3567153 3401984 3365116 3593570 3858127 3689169
42424C689169o26340n58594j31952O0037j04054k09589n9080N8983p8196k75599
$$ 3689169 3062829 2504235 2372283 2432320 2328266 2118677 2059597 2118580 2040384 1764785
42414A764785k82816j50605l5127P9170K59275M17656M06546J97888j36290m88434
$$ 1764785 1481969 1331364 1296237 1375407 1634682 2052338 2458884 2656772 2520482 2032048
42404B032048o81532n43190j32571K49249L86877L51663K80665J40161j22370
$$ 2032048 1350516 807326 674755 924004 1310881 1662544 1943209 2083370 1961000
42395A961000l45359k96694J4410L50661N19285M74629K33472j02401k90664j57701
$$ 1961000 1615641 1318947 1333357 1684018 2203303 2677932 2911404 2809003 2518339 2360638
42385B360638J28376K20925N8340o9263M1241K74390M97596P77398J091888J134824
$$ 2360638 2489014 2709939 2768279 2699016 2740257 3014647 3512243 4289641 5381529 6516353
42375F516353P33386K33531P2299J19575r2411n54243p33861m21751o8735n6373
$$ 6516353 7249739 7483270 7555569 7675144 7582733 7028490 6294629 5872878 5804143 5747770
42365E747770j53608n7616pl04009o90044o33662k27250n7930k88965m82596l75687
$$ 5747770 5594162 5536546 5536539 5232530 4542486 3908824 3681574 3623644 3334679 2852083 2476396
42354B476396k17270j93408j10123J10384J69442n1615j80526J2513J43418j45776
$$ 2476396 2259126 2065718 1955595 2065979 2235421 2183806 2003280 2015793 2159211 2013435
42344B013435m91259l28272K03866N07692M60717M21443M26547J43269l28061
$$ 2013435 1522176 1193904 1397770 1905462 2366179 2787622 3214169 3357438 3029377
42335C029377l81200J21429N04484K96098l4397J22918N02055M21357p2709k85041
$$ 3029377 2648177 2769606 3274090 3570188 3535791 3658709 4160764 4582121 4509412 4224371
42325D224371R547K90338K40319K50344O37822R49795N82743k44064p30066n91940
$$ 4224371 4233918 4524256 4764575 5014919 5652741 6602536 7185279 6941215 6211149 5619209
42315E619209l45333m18852n22402j86677M42022P60755N13350N2292j77184p9892
$$ 5619209 5273876 4855024 4332622 4145945 4587967 5348722 5862072 5914364 5737180 5657288
42305E657288K00301N05198O44820M45430L1358j55903J24133N28445N53951K45804
$$ 5657288 5857589 6362787 7007607 7453037 7484395 7328492 7452625 7981070 8535021 8780825
42295H780825J53077N79646J207013J553225J516168J302955J071968Q85753Q62912
$$ 8780825 8933902 9513548 10720561 12273786 13789954 15092909 16164877 17050630 17913542
42286A7913542J100629J478159J758869J907582K126774K524878K910172L045892
$$ 17913542 19014171 20492330 22251199 24158781 26285555 28810433 31720605 34766497
42278C4766497L043334L335794M176932N247460N962623O295133P122677R359712
$$ 34766497 37809831 41145625 45322557 50570017 56532640 62827773 69950450 79310162
42270G9310162J2508394J4280761J2131543N504790l371281j0978822j4916347
$$ 79310162 91818556 106099317 118230860 123735650 120364369 109385547 94469200
42263I4469200j5114729j3133442j0619447q406133o644052n280215m252574l467361
$$ 94469200 79354471 66221029 55601582 47195449 40551397 35271182 31018608 27551247
42255B7551247k854817k433648k192552j967347j601167j196197j012597j090373
$$ 27551247 24696430 22262782 20070230 18102883 16501716 15305519 14292922 13202549
42247A3202549j154287r60844n80806k53344j01640q2556p5796P8190M67660Q85268
$$ 13202549 12048262 11087418 10506612 10253268 10151628 10069072 9993276 10071466 10539126 11424394
42237A1424394Q68336J93874p30966j206977r90040n23510l91894o99838j056290
$$ 11424394 12292730 12486604 11755638 10548661 9558621 9035111 8643217 7943379 6887089
42228F887089j048284o30747r6885K53028L80953M44266N04398M21559R7884k94044
$$ 6887089 5838805 5208058 5111173 5364201 5745154 6189420 6693818 7115377 7213261 6919217
42218F919217m57472k88219O4902L81636M84421K71651j60117m74953m01144p4123
$$ 6919217 6461745 6173526 6238428 6620064 7104485 7376136 7216019 6741066 6339922 6265799
42208F265799J35401J31126J73965M20560O80336P65354Q00448R67962J165230
$$ 6265799 6401200 6532326 6706291 7126851 7807187 8572541 9372989 10340951 11506181
42199A1506181J183586J082799J103618J272387J344444J119487O11823n1397
$$ 11506181 12689767 13772566 14876184 16148571 17493015 18612502 19224325 19172928
42191A9172928o86310j038710r51536n62174j32786L08360R25814J680645K277288
$$ 19172928 18486618 17447908 16496372 15934198 15801412 16109772 17035586 18716231 20993519
42182B0993519K611585L003004L810164N032586O501785Q278478J0526066J2931717
$$ 20993519 23605104 26608108 30418272 35450858 41952643 50231121 60757187 73688904
42174G3688904J4458619J3939609J1186961P615874N400760N398748N823388L612023
$$ 73688904 88147523 102087132 113274093 120889967 126290727 131689475 137512863 141124886
42166A41124886k406795r989477j5490385j7110851j5785307j3380518j0962740
$$ 141124886 138718091 128728614 113238229 96127378 80342071 66961553 55998813
42159E5998813q798981o999390n546926m194968k874276j931895j599679j529917
$$ 55998813 47199832 40200442 34653516 30458548 27584272 25652377 24052698 22522781
42151B2522781j241982p45694l19239M2888M72173P45522N33130M3136j20550
$$ 22522781 21280799 20535105 20215866 20258754 20730927 21476449 22009579 22052715 21932165
42142B1932165K62869Q93887J612700K689542M369095O558037Q953288J0884805
$$ 21932165 22195034 23088921 24701621 27391163 31760258 38318295 47271583 58156388
42134E8156388J0979136P856517J773976m877925r333968j0583376r523081p514346
$$ 58156388 69135524 76992041 78766017 73888092 64554124 53970748 44447667 36933321
42126C6933321n403601l634490k458311j810570j393328j013830o19801r8328
$$ 36933321 31529720 27895230 25436919 23626349 22233021 21219191 20599390 20501062
42118B0501062O27521J443370K402062M024726O535618Q749096Q539869M942364
$$ 20501062 21128583 22571953 24974015 28998741 35534359 44283455 52823324 57765688
42110E7765688n90897n407205p849692q010323o824630n078385l203259j457233
$$ 57765688 57174791 51767586 43917894 35907571 29082941 24004556 20801297 19344064
42102A9344064n2058P86064Q99932M40464j49722n98465j075160j746237k273742
$$ 19344064 19292006 20078070 20978002 21418466 21268744 20670279 19595119 17848882 15575140
42093A5575140k160445j492403q80913o44516m99445j72775J44682K21252K63777
$$ 15575140 13414695 11922292 11041379 10396863 9897418 9724643 9869325 10090577 10354354
42084A0354354N74402R76898J050319Q50160R24448J543571K376994L194773M480580
$$ 10354354 10928756 11905654 12955973 13806133 14730581 16274152 18651146 21845919 26326499
42075B6326499O761630R316001J0120888P590438K347888l028066o121603o436252
$$ 26326499 33088129 42404130 52525018 60115456 62463344 59435278 53313675 46877423
42067D6877423n141706l537683k138728j039860n07094q07315j694685k504760
$$ 46877423 41735717 38198034 36059306 35019446 34512352 33705037 32010352 29505592
42059B9505592k814312k753466k612287k414086k045156j586256j244735j047263
$$ 29505592 26691280 23937814 21325527 18911441 16866285 15280029 14035294 12988031
42051A2988031q62613o95347o73250p13200n18435n9112K27675k6855n77506q46166
$$ 12988031 12125418 11430071 10756821 10043621 9525186 9466074 9693749 9666894 9089388 8243222
42041H243222o39574k92253j50738k21064l34640l67754k32453R1489M26631N21974
$$ 8243222 7603648 7311395 7160657 6939593 6604953 6237199 6004746 6096235 6522866 7044840
42031G044840L89771L10306M35844O18229O93248O66127N24145J81691k28908
$$ 7044840 7434611 7744917 8180761 8798990 9492238 10158365 10682510 10864201 10635293
42022A0635293l40051n6354K25552J84708N7196J91998M20997L65885J94716M88798
$$ 10635293 10295242 10238888 10464440 10649148 10706344 10898342 11319339 11685224 11879940 12368738
42012A2368738J330630K048923K034837J413968P13969J91051k72163q08959j344321
$$ 12368738 13699368 15748291 17783128 19197096 19911065 20102116 19829953 19020994 17676673
42003A7676673j663952j614287j287920r86457q86297q28563o25372m35594n22808
$$ 17676673 16012721 14398434 13110514 12124057 11237760 10409197 9783825 9348231 8825423
41994H825423p42727o88462l34874p9667p3631j996K95848M83174K91027n606
$$ 8825423 8082696 7394234 7059360 6979693 6906062 6904066 7199914 7683088 7974115 7968509
41984G968509l7886Q7450O7513l6485N8597L62684O56439Q55350R54331P96451
$$ 7968509 7930623 8018073 8085586 8049101 8107698 8470382 9126821 9982171 10936502 11732953
41974A1732953L24676o9967R0244P01557J184026J252407J211258J464621K065613
$$ 11732953 12057629 11987662 12077906 12779463 13963489 15215896 16427154 17891775 19957388
41965A9957388K771458L232430L102881K262453R88511k72828j254306j821458
$$ 19957388 22728846 25961276 29064157 31326610 32315121 32042293 30787987 28966529
41957B8966529j806029j237757n56316j57394J36726P06232J421947J882375K205215
$$ 28966529 27160500 25922743 25366427 25209033 25345759 26051991 27473938 29356313 31561528
41948C1561528K874131L883941M883908O192587Q685431J2530445J7233840K3234835
$$ 31561528 34435659 38319600 43203508 49396095 58081526 70611971 87845811 111080646
41940A11080646L1590074M0500260M3511040L3988448J2242342j3119251l1717937
$$ 111080646 142670720 183170980 226682020 260670468 272912810 259793559 228075622
41933B28075622l8786792l6433076k9640135k2418405j6727483j2922299j0400052
$$ 228075622 189288830 152855754 123215619 100797214 84069731 71147432 60747380
41926F0747380q419328o766035n562204m648936l672520k718003k251919k297585
$$ 60747380 52328052 45562017 39999813 35350877 31678357 28960354 26708435 24410850
41918B4410850k211904j555684p32897l86584n01360n64476l99960l09555m27572
$$ 24410850 22198946 20643262 19910365 19523781 19022421 18457945 18057985 17748430 17320858
41909A7320858m79335l25251k66026n10511p09711m25387J68090N04808M55372
$$ 17320858 16841523 16516272 16250246 15739735 15030024 14604637 14772727 15277535 15732907
41900A5732907M74682Q98746J532912K068982K512624K963456L271113L179444
$$ 15732907 16207589 17106335 18639247 20708229 23220853 26184309 29455422 32634866
41892C2634866K625043J702699N55842m99220j003080p97076k40598K97804R51613
$$ 32634866 35259909 36962608 37518450 37019230 36016150 35219074 34978476 35276280 36227893
41883C6227893K011619L281824M283103N089723O477659R056489J2598732J6578720
$$ 36227893 38239512 41521336 45804439 50894162 57371821 66428310 79027042 95605762
41875I5605762K1349057K8365143L8434419M8979701N3470533M5577531K5746394
$$ 95605762 116954819 145319962 183754381 232734082 286204615 331782146 357528540
41868C57528540L276068j0221347j0772458n232850m257069j2558996k6033577
$$ 357528540 360804608 350583261 339810803 334577953 330320884 317761888 291728311
41861B91728311l6931450m0470272l7081576l0289579k3538657j8454477j4961487
$$ 291728311 254796861 214326589 177245013 146955434 123416777 104962300 90000813
41854I0000813j2362561j0169897q191019o374440m858906l875127l320011k721613
$$ 90000813 77638252 67468355 59277336 52902896 48043990 44168863 40848852 38127239
41846C8127239j913080j350129j328220j306919o51088K99133P28335P37013J252635
$$ 38127239 36214159 34864030 33535810 32228891 31577803 31876936 32605271 33342284 34594919
41837C4594919K486315L549117M000611M759041O776052R738754J3157238J7967392
$$ 34594919 37081234 40630351 44630962 49390003 56166055 65904809 79062047 97029439
41829I7029439K5219058L2749989L4725488K6138886Q024584j2372593k6875039
$$ 97029439 122248497 154998486 189723974 215862860 223887444 211514851 184639812
41822A84639812l1884195k9350446k3576024j7813952j3334604j0238682q169456
$$ 184639812 152755617 123405171 99829147 82015195 68680591 58441909 50272453
41815E0272453o561186n051093l847314l317974l234696k918358k198458j657699
$$ 50272453 43711267 38660174 34812860 31494886 28260190 25341832 23143374 21485675
41807B1485675j687300j837328j497880p96098l35636l41467n46402p03850p25901
$$ 21485675 19798375 17961047 16463167 15667069 15331433 14989966 14443564 13739714 13013813
41798A3013813m84120J6236L61416J31806m54374p61999n72994k33879r960J67517
$$ 13013813 12529693 12545929 12907345 13039151 12584777 11822778 11249784 11015905 11005945 11173462
41788A1173462K76048J08796k40873l45438j01926Q9438L1293N7586L41714M63570
$$ 11173462 11449510 11558306 11317433 10971995 10870069 10959507 10990800 11048386 11390100 11853670
41778A1853670J42507j26723K07435Q05308R26064O00578N22659Q64423J036110
$$ 11853670 11996177 11869454 12076889 12882197 13808261 14408839 14931498 15795921 16832031
41769A6832031P56644N85740J058294J914362K618249L146804L763578M381521
$$ 16832031 17588675 18174415 19232709 21147071 23765320 26912124 30675702 35057223
41761C5057223M710285M813829M933024M816396L818379J817402m01388j887348
$$ 35057223 39767508 44581337 49514361 54330757 58149136 59966538 59565150 57677802
41753E7677802k291890j682132o7574K268488M096811L709647N86710l684590
$$ 57677802 55385912 53703780 53636206 55904694 60001505 63711152 64297862 60613272
41745F0613272o658656p180372n969596m257303k527443q00977N83278J204470
$$ 60613272 53954616 46774244 40804648 36547345 34019902 33218925 33802203 35006673
41737C5006673J318463J664315K471918L198819L319358K837148J870994L21784
$$ 35006673 36325136 37989451 40461369 43660188 46979546 49816694 51687688 52009472
41729E2009472j675688l407944m183771m085447l737068l486634l195177k724235
$$ 52009472 50333784 46925840 42742069 38656622 34919554 31432920 28237743 25513508
41721B5513508k228822j935297j894002j971783j916245j503006q23731l18515
$$ 25513508 23284686 21349389 19455387 17483604 15567359 14064353 13240622 12922107
41713A2922107k72538m02268k55953Q4743J23536k26378m01930M4986Q26625J381999
$$ 12922107 12649569 12247301 11991348 12076091 12199627 11973249 11571319 11616305 12442930 13824929
41703A3824929J751594K619631M408590O460700P237150N497939J504347k914739
$$ 13824929 15576523 18196154 22604744 29065444 36302594 41800533 43304880 40390141
41695D0390141n683504o024422m755195l236732k256324j829036j638956j419070
$$ 40390141 34706637 28682215 23927020 20690288 18433964 16604928 14965972 13546902
41687A3546902j088886p55917n59323m65684l29279j63605j45358k77115k80850
$$ 13546902 12458016 11702099 11142776 10677092 10347813 10184208 10038850 9761735 9480885
41678I480885K1534M15457N66803M45607K93310K81498L94386N75035P92972R77302
$$ 9480885 9502419 9917876 10484679 10930286 11223596 11505094 11899480 12474515 13267487 14244789
41668A4244789J037039R90722J007312J273465J798964K353320K686101K891310
$$ 14244789 15281828 16272550 17279862 18553327 20352291 22705611 25391712 28283022
41660B8283022L427208M578666N960081O747924O336271M578260J620389k013645
$$ 28283022 31710230 36288896 42248977 48996901 55333172 59911432 61531821 59518176
41652E9518176n245947o985513p087791o368088n526625m563629l420915k504010
$$ 59518176 54272229 47286716 40198925 33830837 28304212 23740583 20319668 17815658
41644A7815658k088971j776636j147444n31602m72020p69166p88758m89668l83465
$$ 17815658 15726687 13950051 12802607 12271005 11798985 11029819 10241061 9751393 9367928
41635I367928n81455o48140m14573k14522k12687j57717N5019J84315J66580K65138
$$ 9367928 8786473 8138333 7723760 7509238 7296551 7138834 7193853 7378168 7544748 7809886
41625G809886N33082O87145O83948Q49616J240597J446978J247331Q91034N33111
$$ 7809886 8342968 9030113 9714061 10563677 11804274 13251252 14498583 15389617 15922728
41616A5922728L7389m05926k08820O54990J338055J308454J193740J807367K947472
$$ 15922728 15960117 15554191 15345371 16000361 17338416 18646870 19840610 21647977 24595449
41607B4595449L913550M679582N648881O570087O617759N431832L307653N17827
$$ 24595449 28508999 33188581 38837462 45407549 52025308 57457140 60764793 61282620
41599F1282620k696588n515862o864978o595388n666620m933609m352390l579659
$$ 61282620 58586032 53070170 46205192 39609804 33943184 29009575 24657185 21077526
41591B1077526k715723k083827j716337j421070j098010p73841n35398n13536
$$ 21077526 18361803 16277976 14561639 13140569 12042559 11268718 10733320 10219784
41583A0219784o94236p68231m96828j61340k16321n54562o52996m44451m14024
$$ 10219784 9525548 8757317 8260489 8099149 7882828 7328266 6675270 6230819 5816795
41574E816795p20884q91407o22752k53824j13708j2164K15002K39899j50196m68387
$$ 5816795 5095911 4204504 3581752 3327928 3214220 3202056 3417058 3656957 3506761 3038374
41564C038374j68407M65848O91438L61350K7209R4868L98710N89200N11344J94425
$$ 3038374 2869967 3335815 4027253 4388603 4415812 4510680 4909390 5498590 6009934 6204359
41554F204359j91923l81432k82001j39458j91217k97469k05195j2500m092j38303
$$ 6204359 6012436 5631004 5349003 5209545 5018328 4720859 4515664 4503164 4499072 4360769
41544D360769r5993J92345M33258M01519J84394k4109j24233j09337p3252j65566
$$ 4360769 4264776 4457121 4890379 5291898 5476292 5452183 5327950 5218613 5145361 4979795
41534D979795l42537k97027R7339M36854K56914k53102m41507r7937K77538K11396
$$ 4979795 4637258 4340231 4437570 4874424 5131338 4878236 4436729 4338792 4616330 4827726
41524D827726j31672k67722m0633K70211L40088J40758m5686Q3832M90254P80166
$$ 4827726 4696054 4428332 4387699 4657910 4997998 5138756 5093070 5176902 5667156 6447322
41514F447322O65071L10284N9335j4946l0622L0531J97261K24106q2181l39514
$$ 6447322 7112393 7422677 7482012 7467066 7436444 7466975 7664236 7888342 7806161 7466647
41504G466647K3975Q13057J120857N57340j73378k88171J1703Q177l95402o42860
$$ 7466647 7490622 8303679 9424536 9981876 9808498 9520327 9532030 9540207 9144805 8501945
41494H501945m68594k34343k64085l72388k68667n9071n1418k51696l47167j60596
$$ 8501945 8033351 7799008 7534923 7162535 6893868 6834797 6783379 6531683 6184516 6023920
41484F023920J02125J33326p7999k61158k35919j06890l7405M71J03929K01714
$$ 6023920 6126045 6259371 6181372 5920214 5684295 5577405 5540000 5540471 5644400 5846114
41474E846114J58117M3330M4101J18775K7544k30692l01408M3207N19648O34089
$$ 5846114 6004231 6047561 6091662 6210437 6237981 6007289 5705881 5749088 6268736 6902825
41464F902825K51069l00895o07718n21401k03545N8457R7449j7254j26001k02430
$$ 6902825 7153894 6852999 6245281 5723880 5520335 5578792 5676241 5658987 5532986 5330556
41454E330556l23364m53947m45905k74174r6013k5412j2707P732K0850K7266O2880
$$ 5330556 5007192 4553245 4107340 3833166 3737153 3711741 3699034 3706766 3727616 3754882 3817762
41443C817762Q2597N592r8168p5373L4957L9831n8927m2802J24861J93914M5356
$$ 3817762 3900359 3905951 3807783 3732410 3767367 3807198 3748271 3705469 3830330 4024244 4069600
41432D069600r6707l0102J45932K83600M05470M77151L00057j10136l59057j99947
$$ 4069600 3972893 3942791 4088723 4372323 4777793 5254944 5555001 5444865 5085808 4885861
41422D885861N0427n1033m62363q04608q82060p20937l35255J67485M59551L62005
$$ 4885861 4936288 4885255 4422892 3618284 2736224 2015287 1680032 1847517 2307068 2669073
41412B669073J56521J62394K28562O1059j90582j79007J3127N5177K4220K52865
$$ 2669073 2825594 2987988 3216550 3277609 3087027 2908020 2921147 2976324 3000544 3253409
41402C253409N98948N43179N5452k98123k32392q1319p8262M1789M18401O60376
$$ 3253409 3852357 4395536 4450988 4152865 3920473 3839154 3760892 3802681 4221082 4881458
41392D881458M90953K97481N42143R87772J017531M98849j25474m67167n23483
$$ 4881458 5372411 5669892 6212035 7199807 8217338 8716187 8590713 8123546 7600063
41383G600063m60460l87463l26578k14154J3148K44556K71570J21271N8964J33145
$$ 7600063 7139603 6752140 6425562 6211408 6224556 6469112 6740682 6861953 6920917 7054062
41373G054062M1229l34066n89172l29483K14626M59957J96214k81679o24486o95236
$$ 7054062 7095291 6761225 6172053 5842570 6057196 6517153 6713367 6431688 5807202 5111966
41363E111966m96235j46017J09519R7905r7497k83910l59247k50207J15749N81773
$$ 5111966 4615731 4469714 4579233 4677138 4579641 4295731 3936484 3686277 3802026 4383799
41353D383799P59440N13220K09369K05874L57264L58163K99061M46035O89495
$$ 4383799 5143239 5656459 5865828 6071702 6428966 6787129 7086190 7532225 8221720
41344H221720P13897N85798O55617R21134R90482O96803K85026o1693m34302q50965
$$ 8221720 8935617 9521415 10177032 11098166 12088648 12785451 13070477 13008784 12574482 11723517
41334A1723517j115362j142970j070616r41600o33728j97072R5033J48791J64463
$$ 11723517 10608155 9465185 8394569 7452969 6819241 6622169 6717202 6865993 7030456
41325G030456K38911K03959r737j98122k26933k16896k30198j10957J79523L98095
$$ 7030456 7269367 7473326 7463589 7265467 7038534 6821638 6591440 6480483 6660006 7058101
41315G058101L95156L45987L97724L94114J91784k9369k0982K09250N30935Q67676
$$ 7058101 7453257 7799244 8196968 8591082 8782866 8753497 8732515 8941765 9472700 10340376
41305A0340376J027054O90728j14442q21970r50820o97779n72322o70003o85296
$$ 10340376 11367430 12058158 11943716 11121746 10170926 9473147 8900825 8230822 7545526
41296G545526m64119j49153J06680K18928Q5906k27434l52921m8160L49947L15109
$$ 7545526 7081407 6932254 7038934 7257862 7343768 7116334 6763413 6715253 7065200 7380309
41286G380309r6864l10174n8256K93604L26524O2332k44239m50553n03831l71482
$$ 7380309 7283445 6973271 6915015 7208619 7535143 7597475 7353236 6902683 6398852 6027370
41276F027370j67712j20307k61056l39110j59898J66280M07525M69440L92129
$$ 6027370 5859658 5739351 5478295 5139185 4979287 5145567 5553092 6022532 6414661
41267F414661K55407J53731J12841M995k76683n60713n47046k42489O732k1765
$$ 6414661 6670068 6823799 6936640 6941635 6664952 6104239 5557193 5314704 5321436 5299671
41257E299671j79594k37487j68268m5733R1875J68249Q8881o9536j23986j07300
$$ 5299671 5120077 4882590 4714322 4668589 4760464 4928713 5017594 4948058 4824072 4716772
41247D716772k32358m47098l92631J3464L33116K30975k029P8421L42141K72543
$$ 4716772 4484414 4037316 3644685 3658149 3991265 4222240 4220211 4298632 4640773 4913316
41237D913316k50358p68714q13883l43374L27197P37387N24725k00532p75741
$$ 4913316 4662958 3894244 3080361 2736987 3064184 3801571 4326296 4125764 3350023
41228C350023o32225l720L56345J51323j63344j19823J56386K80037J97882J53765
$$ 3350023 2717798 2714078 3070423 3221746 3058402 2938579 3094965 3375002 3572884 3726649
41218C726649K58560L72097L40333J64271l0665r5472O980J06984k2648l48518
$$ 3726649 3985209 4357306 4697639 4861910 4831245 4735773 4742753 4849737 4827089 4478571
41208D478571n32085l10642J69909N09743M76503J81972j03245k11412j64922
$$ 4478571 3946486 3635844 3805753 4315496 4791999 4973971 4870726 4659314 4494392
41199D494392p4924j34O8765J13870Q6151K9871O5353J56419P6223k25497m19654
$$ 4494392 4419468 4419334 4488099 4601969 4688120 4717991 4783344 4939763 5015986 4790489 4370835
41188D370835k32327R0566J13703j15798j75104l50J5037k52798l85877j19530
$$ 4370835 4138508 4229074 4342777 4226979 4051875 4051525 4066562 3813764 3427887 3308357
41178C308357J91459J44999r9525j88740j76979k91847m04014k58471k5493p0823
$$ 3308357 3499816 3644815 3545290 3356550 3179571 2887724 2483710 2225239 2199746 2128923
41168B128923k93028k35888J75661N34479O00287N38932M48294J65626k80887
$$ 2128923 1835895 1600007 1775668 2310147 2910434 3449366 3897660 4063286 3782399
41159C782399m89205k12244K54693M50404K73805l1305j93563r6359J34183J54708
$$ 3782399 3293194 3080950 3335643 3786047 4059852 4028547 3834984 3738625 3872808 4027516
41149D027516k25445o71374o54013j96926J17882j4867k55834k69890k26551l34468
$$ 4027516 3802071 3130697 2476684 2279758 2397640 2382773 2126939 1857049 1630498 1296030
41139A296030l60984o3547K75510K46072j8067n0474K49039N68348O73156N33056
$$ 1296030 935046 871499 1147009 1393081 1375014 1324540 1573579 2141927 2815083 3348139
41129C348139J41985l53637n32610j79895K66823K43071j28319k92893j78318
$$ 3348139 3490124 3136487 2603877 2423982 2690805 2933876 2805557 2512664 2334346
41120B334346j94004l78257k89229J43224L77192J12353k55058l23035k28615
$$ 2334346 2140342 1762085 1472856 1616080 1993272 2105625 1850567 1527532 1298917
41111A298917j65009M6420M65462O65405L81315N0052J17529K33886j62789p74292
$$ 1298917 1133908 1180328 1645790 2311195 2692510 2742562 2860091 3093977 2931188 2156896
41101B156896p65476o3702M72666L02893r5440o0523K95859L88342O1646k54893
$$ 2156896 1391420 1327718 1800384 2103277 2007837 1947314 2243173 2631515 2693161 2438268
41091B438268j79842J68745L81143K47812k3400p7765J20224K15336m4652m09910
$$ 2438268 2258426 2427171 2808314 3056126 3032726 2954961 3075185 3290521 3245869 2835959
41081B835959m59376k10748o7421j83084k61057q2281J36421J25306L571L7896
$$ 2835959 2376583 2165835 2098414 1915330 1654273 1571992 1708413 1833719 1837290 1875186
41071A875186J52726L7838l03178m60246j78474K47068L48950J19937p123J88329
$$ 1875186 2027912 2065750 1762572 1302326 1123852 1370920 1719870 1839807 1832684 2021013
41061B021013L88172K36782r0349j57080L5543P1184j51954k26456M0175K19463
$$ 2021013 2409185 2645967 2555618 2398538 2434081 2505265 2353311 2126855 2167030 2386493
41051B386493n2305m28510m01620j48043j97768m84587m43316J254K82411J33356
$$ 2386493 2334188 1905678 1504058 1356015 1158247 673660 230344 231598 514009 647365
41041F47365k2266J49952L70506L18587J48432O6089n9447k37869o1591N83203
$$ 647365 625099 775051 1145557 1464144 1612576 1678665 1619218 1381349 1319758 1902961
41031A902961R95517N23088l98565p86812m59147r3360p5220r4422O7539J40174
$$ 1902961 2898478 3421566 3023001 2236189 1777042 1683682 1608462 1514040 1581579 1721753
41021A721753k2532j15600J4369K5293k92956n63287m22554j33848j05963j66778
$$ 1721753 1699221 1583621 1597990 1623283 1330327 767040 344486 210638 104675 -62103
41011f2103J07645N66870O11735J05887l98937m35852j52571Q1813J87562K58684
$$ -62103 45542 612412 1224147 1330034 931097 495245 342674 424487 612049 870733
41001H70733K59336J33618K5779J04810K71684K87812J29015k2258r6432j95941
$$ 870733 1130069 1263687 1289466 1394276 1665960 1953772 2082787 2060529 1964097 1768156
40991A768156l22504l11254j31222r307r1909j90452q8553O6553j7815k59868
$$ 1768156 1445652 1134398 1003176 993869 901960 711508 622955 689508 671693 411825
40981D11825k61622Q5158M10585M10972K44730J73976J24495p8171k71009j56596
$$ 411825 150203 235361 645946 1056918 1301648 1475624 1600119 1521948 1250939 1094343
40971A094343J66620K92067J15637l8486K8761R6645n3727k54431k27158l884
$$ 1094343 1260963 1553030 1668667 1630181 1658942 1755587 1701860 1447429 1220271 1216387
40961A216387J87143K79756L46020L39499J55274r6912j63441k8522J7841k08728
$$ 1216387 1403530 1683286 2029306 2368805 2524079 2427167 2263726 2235204 2253045 2044317
40951B044317n01330n37477l11890j04392o2136k8738J44053L08497K34899J5651
$$ 2044317 1542987 1005510 693620 589228 527092 498354 642407 950904 1185803 1201454
40941A201454q954K34075L75798J10037l33661m70664k01372J03314J24298o0883
$$ 1201454 1192500 1426575 1802373 1912410 1578749 1108085 906713 1010027 1134325 1073442
40931A073442j82401r7931J46662L88221M35426K56517Q1183J19304K15909P3567
$$ 1073442 891041 793110 939772 1327993 1763419 2019936 2101119 2220423 2436332 2509899
40921B509899j99833j69730K01356L69519R007m33982l93596n0225k2451l92121
$$ 2509899 2310066 2140336 2341692 2711211 2720218 2286236 1892640 1842415 1819964 1427843
40911A427843o17214l89367k1778J29089J41883K23109L16628K83768J81426R9170
$$ 1427843 810629 421262 399484 528573 670456 893565 1210193 1493961 1675387 1774557
40901A774557m6895l00669m50663l05245k4770J08070J22424K41622M04319K82270
$$ 1774557 1727662 1426993 976330 671085 646315 754385 876809 1118431 1522750 1805020
40891A805020j57201m53927k21833L11755N78668L64966j3992j98133j87186j85193
$$ 1805020 1647819 1193892 972059 1283814 1862482 2227448 2213456 2015323 1828137 1642944
40881A642944k51135k81789k44674k29581k65355k49329j15566N1193J50881K22299
$$ 1642944 1391809 1110020 865346 635765 370410 121081 5515 56708 207589 429888
40871D29888L59660N31614N87502M28108J03339k32019m02089l05820k8142J72281
$$ 429888 789548 1321162 1908664 2336772 2440111 2208092 1806003 1500183 1472041 1644322
40861A644322R4479j75843l46941k38174M7423K63636K62989R4121p5902j18134
$$ 1644322 1738801 1562958 1216017 977843 1025266 1288902 1551891 1646012 1570110 1451976
40851A451976n3096J117L003L8724J43367J76155J4958j92238j67544R8417K92293
$$ 1451976 1398880 1399997 1403000 1441724 1585091 1761246 1776204 1583966 1416422 1514839 1807132
40840A807132J96291k8287j13969q3856j52657k99459k19991K00091N92186N11802
$$ 1807132 2003423 1975136 1861167 1777311 1624654 1325195 1105204 1305295 1897481 2409283
40830B409283M1033k92209k25149r3418k78601n86174n11964n196M37327M59654
$$ 2409283 2450316 2158107 1932958 1839540 1560939 974765 462801 457605 894932 1354586
40820A354586K37319P1490j4177o6461K9933K68440L20178j0751l86772l95529
$$ 1354586 1591905 1663395 1649218 1582757 1612690 1881130 2201308 2190557 1803785 1408256
40810A408256j79531j44404k34626n6622L72066N96741M58693K58924J19053j91469
$$ 1408256 1228725 1084321 849695 793073 1165139 1761880 2220573 2479497 2598550 2407081
40800B407081o22866o91907k64271J11942M6391q1182J70558N02842L88299j4521
$$ 2407081 1784215 1092308 828037 939979 986370 905188 1075746 1578588 1966887 1952366
40790A952366j28160J21121L16131L28923M35397P09702R04012R18813Q44505
$$ 1952366 1824206 1945327 2261458 2590381 3025778 3735480 4639492 5558305 6402810
40781F402810N66253q5776p83336r22421m97075j52623k30189l71594k76175k03209
$$ 6402810 6969063 6883287 6099951 5177530 4680455 4527832 4297643 3926049 3649874 3446665
40771C446665l77487m84466k21269J15462R7987j32705j47216N8478J35675r707
$$ 3446665 3069178 2584712 2363443 2478905 2576892 2444187 2296971 2355449 2491124 2481417
40761B481417j56825k06118k50693k80395j84289N80J44384K41501L01577J85044
$$ 2481417 2324592 2118474 1867781 1587386 1403097 1403677 1548061 1789562 2091139 2276183
40751B276183j28946l00319o2417K61679J55377k81388m54290j87139O6177J4971
$$ 2276183 2147237 1846918 1784501 2046180 2201557 1920169 1465879 1278740 1344917 1359888
40741A359888n4593J05926K23564J2037k56959j50080K21797L56801R8596j95415
$$ 1359888 1305295 1411221 1634785 1646822 1389863 1239783 1461580 1818381 1916977 1721562
40731A721562k02731j0564J09217N0848q1887j39747q2079k8295j23791k98688
$$ 1721562 1518831 1508267 1617484 1668332 1586445 1446698 1364619 1336324 1212533 913845
40721I13845k72650P3117M44353M44441P1430k98213l91585k86861j63552m0054
$$ 913845 641195 714312 1158665 1603106 1674536 1376323 984738 697877 534325 494271
40711D94271J26833K51166J99486Q152j16439j8353K63155N63103P28566O83194
$$ 494271 621104 872270 1071756 1079908 963469 945116 1208271 1771374 2499940 3183134
40701C183134M56498K21572K28305N58025R36496R39294M65143j11165l68599
$$ 3183134 3639632 3861204 4089509 4647534 5584030 6523324 6988467 6877302 6508703
40692F508703l15318k83756m44592o38368o65694n27542l51294k63453l49494
$$ 6508703 6193385 5909629 5465037 4826669 4160975 3633433 3282139 3018686 2669192
40683B669192n40980n44709j48059L70415M60536M8031k86854r3353L29162M15864
$$ 2669192 2128212 1583503 1435444 1805859 2266395 2314426 2027572 1934219 2263381 2679245
40673B679245J48315m1523J0556N6127n0350j46824j16375n7777l1204K7969P1422
$$ 2679245 2827560 2786037 2796593 2852720 2802370 2655546 2539171 2481394 2450190 2478159 2549581
40662B549581n7429l01196l89676k44705o8680K8393J20896J19526k05856o86002
$$ 2549581 2492152 2190956 1801280 1556575 1487895 1516288 1637184 1756710 1550854 864852
40652H64852p31884j51156M72530N83641L92758L57988L76330J11603k12742j00333
$$ 864852 132968 -18188 454342 1037983 1430741 1788729 2165059 2276662 2063920 1963587
40642A963587K96731L20229j33458m54450l29375j53459k04183j57218J84020
$$ 1963587 2260318 2580547 2447089 1992639 1663264 1509805 1305622 1148404 1332424
40633A332424L72787P9257k13581O2604N70699N42200k5145m01358k42777O3093
$$ 1332424 1705211 1784468 1570887 1633491 2204190 2746390 2721245 2319887 2077110 2140203
40623B140203J84877K61205L75928K78768q9664l38461k28897q3002k21877l93953
$$ 2140203 2325080 2586285 2962213 3240981 3151317 2812856 2583959 2500957 2279080 1885127
40613A885127k02210J95022K94924J285k95058l26150k19464j48076q6537l547
$$ 1885127 1682917 1877939 2172863 2174148 1879090 1552940 1333476 1185400 1098863 1095316
40603A095316J3859l7903R37J70969K23633o0592m83747n84911k13684K19055
$$ 1095316 1109175 1071272 1072209 1243178 1466811 1406219 922472 337561 123877 342932
40593C42932J98845k42454n24532k46738K67867L92056O1791j34543J85498O29934
$$ 342932 541777 299323 -225209 -471947 -204080 187976 249767 115224 300722 930656
40583I30656O01671J66374n1749K46672O59235O60046K50093j22876j23350J34473
$$ 930656 1532327 1698701 1646952 1893624 2552859 3212905 3462998 3340122 3216772 3351245
40573C351245K52218j757m02147n04779k20095M0791m1327j94963R708M14241
$$ 3351245 3603463 3601706 3199559 2694780 2474685 2515476 2474149 2279186 2288894 2703135
40563B703135M54627O3607j73752P5972L77930K36731j40700k36983m2386M1170
$$ 2703135 3157762 3221369 3047617 3123589 3501519 3738250 3597550 3360567 3318181 3359351
40553C359351p5915q6552J08807K08968J2080k76924l71207k53081q9688k2429
$$ 3359351 3283436 3196884 3305691 3514659 3526739 3249815 2878608 2625527 2535839 2513410
40543B513410j15006l07717l84946j97249P8304J44584M0519P3325K66587K65764
$$ 2513410 2398404 2090687 1705741 1508492 1586796 1731380 1771899 1845224 2111811 2377575
40533B377575o8164l64161k88394m4348m66r9710m5348J10248L2882k69973l53175
$$ 2377575 2309411 1945250 1656856 1612508 1612042 1512332 1466984 1577232 1610114 1340141 986966
40522I86966P609M20604L78665n5549l33664j33739K44414K76898j19254m85184
$$ 986966 994575 1415179 1793844 1738295 1404631 1270892 1515306 1792204 1672950 1187766
40512A187766m05966k6700J84385Q3656j9251R8690K37959J58069P498Q1967L42644
$$ 1187766 781800 755100 939485 1023141 1003890 1102580 1340539 1498608 1506106 1588073 1930717
40501A930717M97570M41437K84083L7820l38541o13810m38613P4622L24396l1090
$$ 1930717 2428287 2869724 3153807 3191627 2853086 2239276 1800663 1875285 2199681 2168591
40491B168591o11793q21295n49586j37637J21925J77052Q9216n159P5626L24184
$$ 2168591 1556798 735503 185917 48280 170205 347257 436473 431314 506940 831124
40481H31124M54956K80151L0418K1175J38454J5621l45622n35172l52565p6358
$$ 831124 1286080 1566231 1596649 1617824 1756278 1771899 1426277 891105 538540 462182
40471D62182K859l8839l4683o2247k35988l97795l13722m3190J57714K03773J98993
$$ 462182 465041 426202 391519 329272 93284 -304511 -618233 -661423 -503709 -299936 -100943
40460a00943J72232O5602n4387m7577L7887K1830n8201O6656M61250P89793P13802
$$ -100943 71289 136891 82504 34927 72814 94644 36443 103099 564349 1354142 2067944
40449B067944L05903q5545k30591j33105Q4750K35793J44600j30180k62420n4472
$$ 2067944 2373847 2288302 2057711 1924606 2009356 2245149 2389749 2259569 1997149 1942677
40439A942677K36318K02828j59765m74532n12310m02300l01191j71327J5685J44591
$$ 1942677 2178995 2381823 2222058 1747526 1235216 832916 531725 360398 376083 520674
40429E20674J75133K46278L88366L60521n597m76691o65075m83067j50032J23569
$$ 520674 695807 942085 1330451 1690972 1685375 1208684 543609 60542 -89490 34079
40419C4079K43109J51165r5775k42554q0190K51550M14862K88858M3504j28716
$$ 34079 277188 428353 332578 90024 9834 261384 676246 965104 1008608 879892
40409H79892j40832L9013L08381L82062J15500j95310j71240O1087N4514k01190
$$ 879892 739060 778073 1086454 1468516 1584016 1388706 1217466 1278553 1333067 1131877
40399A131877k20772J56647M31249K17285j23812n2500L02194L75410M8297k25458
$$ 1131877 911105 1067752 1499001 1716286 1592474 1539974 1842168 2217578 2265875 2040417
40389B040417j40733O5058K8442k48805m50517l13946J16902N07257N26181K09204
$$ 2040417 1899684 1964742 1993184 1744379 1293862 979916 1096818 1604075 2130256 2339460
40379B339460p6296j22779j41872l50394n38337l68785N8698L22506K77725J66444
$$ 2339460 2263164 2140385 1998513 1648119 1109782 740997 799695 1122201 1399926 1566370
40369A566370J55908J34336k717j87620l42473m19627k82415J32161N29593N02079
$$ 1566370 1722278 1856614 1853897 1666277 1323804 904177 621762 753923 1283516 1785595
40359A785595J03368j86876j33276J5052M0502O4484J62005J21630j27303k44543
$$ 1785595 1888963 1702087 1568811 1583863 1624365 1688849 1850854 1972484 1845181 1600638
40349A600638J2131L25385K47738j46800m17979l80320j99819j6531J56814K43210
$$ 1600638 1612769 1938154 2185892 2039092 1621113 1240793 1040974 1024443 1181257 1424467
40339A424467J49192k9622j15184j01027p4662n621J31268J64339l3922k46284
$$ 1424467 1573659 1544037 1428853 1327826 1253164 1247543 1378811 1543150 1509228 1262944
40329A262944j98409k3770l5680j32250P0842N02786N87136J08690l72481k89686
$$ 1262944 1064535 1040765 1005085 872835 943677 1446463 2033599 2142289 1769808 1480122
40319A480122J44489L18693J07989q3224l5696L220j88880m22053l87632j04989
$$ 1480122 1624611 1943304 2051293 1968069 1932373 1935593 1746713 1324660 937028 832039
40309H32039J44483K12532J96460J81721Q4406j57847l77978l27517j0137K70121
$$ 832039 976522 1189054 1385514 1567235 1651641 1493794 1115816 788299 778162 1048283
40299A048283K30980r6683m18377m48113j36826K80883M76700L60633J80060J54358
$$ 1048283 1279263 1182580 764203 316090 179264 460147 936847 1297480 1477540 1631898
40289A631898J13767k22394o62310o53706r3126M09748L38540m3332j68179J6615
$$ 1631898 1745665 1523271 860961 207255 114129 523877 862417 819085 650906 667521
40279F67521J62740J88385K83776L91198K57455j0635L78L22968M85640K22216
$$ 667521 830261 1018646 1302422 1693620 1951075 1940440 1940818 2263786 2749426 2971642
40269B971642j53153k63362j54029n7965l5283n7402j30977j53168M0830L21109
$$ 2971642 2818489 2555127 2401098 2343133 2307850 2250448 2119471 1966303 2007133 2328242
40259B328242L05721m7968k67775k7836L73931M81919K84680L7765j83655l91238
$$ 2328242 2633963 2585995 2318220 2290384 2664315 3146234 3430914 3468679 3285024 2893786
40249B893786m33073k34523n7068j23873j95895P0204N16121O58754L59642p0538
$$ 2893786 2460713 2226190 2169122 2045249 1849354 1919558 2435679 3094433 3454075 3383537
40239C383537l36886l66000j61369J66177L19099J38216r0500k5784J66149P5089
$$ 3383537 3046651 2680651 2519282 2685459 3004558 3142774 3052274 3026490 3192639 3267728
40229C267728k46682l56925j62006l6001j48889k12010l3875J57375J43946N5450
$$ 3267728 3021046 2664121 2502115 2466114 2317225 2105215 2071340 2228715 2372661 2428111
40219B428111O9361J31637J61360K04262K28992J08017o7856l0494J76742J78438
$$ 2428111 2497472 2629109 2790469 2994731 3223723 3331740 3263884 3233390 3410132 3588570
40209C588570q9209j86522J21864M45541L90875J42942J6291j26972m94255p77449
$$ 3588570 3499361 3312839 3434703 3880244 4271119 4414061 4430352 4303380 3809125 3031676
40199C031676n56800l5141K40228K01229J82335J73467j41674o20986o75476j91450
$$ 3031676 2474876 2439735 2679963 2881192 3063527 3236994 3095320 2474334 1798858 1607408
40189A607408K28365J79739j2732Q653K7021j96225k92677J64899Q18395Q97875
$$ 1607408 1835773 2015512 2002780 2011433 2038454 1842229 1549552 1714451 2532846 3430721
40179C430721L03759l05933m86350m57788m88654m23772j17119J42013N8985j11054
$$ 3430721 3734480 3428547 2942197 2484409 1995755 1571983 1454864 1596877 1655862 1544808
40169A544808Q8807N49120O56608J66303m08996m64373n6328K61279J69777j21307
$$ 1544808 1633615 2182735 2839343 3005646 2596650 2132277 2075949 2337228 2507005 2385698
40159B385698k39584n9449K53337M12377K16124k38494n35824l32399J87489M53490
$$ 2385698 2146114 2086665 2340002 2752379 2968503 2730009 2194185 1861786 2049275 2502765
40149B502765J89488k58533m01067j91818O5259J98823K64066K53155M8104l01341
$$ 2502765 2692253 2433720 2032653 1840835 1906094 2104917 2368983 2622138 2670242 2368901
40139B368901n22370m36112j52855J02492J88234M8117k58936m74806l44065q923
$$ 2368901 1846531 1410419 1257564 1360056 1548290 1596407 1337471 862665 518600 509677
40129E09677P3536k17633l99321n9467M69652N41617J36785j57190r2478q1362
$$ 509677 583213 365580 -33741 -93208 376444 918061 1054846 897656 805178 723816
40119G23816l61769m45572J14011Q29964Q24242J04952l98716j53330K93313K32469
$$ 723816 362047 -83525 30486 860450 1684692 1789644 1390928 1237598 1530911 1763380
40109A763380j75283k85018k208J72732p185k30383k15412j00425p9657n5342
$$ 1763380 1588097 1303079 1300871 1473603 1466418 1236035 1020623 920198 840541 785199
40099G85199J14176L19721M01666M12446M36452L57051Q2406j60848q2942K04746
$$ 785199 899375 1219096 1620762 2033208 2469660 2826711 2909117 2748269 2665327 2870073
40089B870073L16984J81362J55336M54591P68753O63205J69737k84551m49399
$$ 2870073 3187057 3368419 3523755 3978346 4747099 5410304 5580041 5295490 4846091
40080D846091m76012n54766o10337n17042m09602n07758p09691o70695l26905
$$ 4846091 4370079 3815313 3204976 2687934 2278332 1770574 1060883 390188 63283
40071F3283k4316J5146L0866K57468M24321J55365l14165l66017O9700L81521
$$ 63283 38967 54113 84979 342447 766768 922133 607968 241951 311651 693172
40061F93172K05893p9177n9765O2965m4716j85329j6717K32585Q7045l18365l86957
$$ 693172 899065 819888 760123 823088 778372 593043 576326 808911 895956 577591 190634
40050A90634k7120K13627P7721o764K89334O04243M59389j6220l50852l91681
$$ 190634 163514 377141 454862 448098 737432 1341675 1801064 1784844 1433992 1042311
40040A042311k94853j20807J32701K77139J38939q1368m3045K06678L14486J99048
$$ 1042311 747458 626651 759352 1036491 1175430 1094062 1051017 1257695 1572181 1771229
40030A771229J50791L03083L86454J64441j90891l70237l57269l54484m14262
$$ 1771229 1922020 2225103 2611557 2775998 2585107 2214870 1857601 1503117 1088855
40021A088855l85894j87411P8913K96254M41877M77445L05241l9188k81231j92899
$$ 1088855 702961 515550 594463 890717 1332594 1810039 2115280 2076092 1794861 1601962
40011A601962O4121J11723j03928k07386N0448M02011M61154K78402J71101J76870
$$ 1601962 1666083 1777806 1673878 1466492 1516940 1918951 2380105 2658507 2829608 3006478
40001C006478R5676j4335J22622M31172M71842J44187j05771k4152J6878l03508
$$ 3006478 3102154 3087819 3210441 3641613 4113455 4257642 4151871 4127719 4144597 3841089
39991C841089o17551m26233O4781K64602J16032N1173J49840L4350l48060n04387
$$ 3841089 3223538 2797305 2862086 3126688 3242720 3293893 3443733 3478083 3130023 2625636
39981B625636j68789K58098L33597J83440J49432J93473N4524k16813k68769O3515
$$ 2625636 2456847 2714945 3048542 3231982 3381414 3574887 3629411 3412598 3143829 3207344
39971C207344N36187P51765N13284j4166m21453m28695j73909k662L90L6423J62965
$$ 3207344 3743531 4495296 5008580 4994414 4572961 4144266 3970357 3967695 3968085 4004508 4167473
39960D167473J76749J0381j08472n4765k1806j34266j87087l3028R8847n151j34333
$$ 4167473 4344222 4354603 4246131 4191366 4169560 4035294 3848207 3815179 3914026 3908875 3774542
39949C774542j3936J89051J53899j0447L8705K22739J14681l26182n92802l28874
$$ 3774542 3760606 3949657 4103556 4093109 4131814 4354553 4469234 4143052 3550250 3221376
39939C221376K04755N21342M64574K25405M4281L1776J13822Q2423j51175l60814
$$ 3221376 3426131 3947473 4412047 4637452 4681733 4713509 4827331 4909754 4758579 4397765
39929D397765k55188J10800M06692M59753L41625Q5778l19278o61209o32836k96016
$$ 4397765 4142577 4253377 4660069 5119822 5461447 5547225 5227947 4566738 3933902 3637886
39919C637886k8239O3969K38281N09797M74144L681l77109k15419J71385J93366
$$ 3637886 3609647 3673616 3911897 4421694 4895838 4899519 4522410 4306991 4478376 4671742
39909D671742j24747k76529r0753J26752J72049J36507L3747k50799n51582m43563
$$ 4671742 4546995 4270466 4179713 4306465 4478514 4615021 4648768 4397969 3846387 3402824
39899C402824J33823O51432O31005K30606n8801q1230q9463k57556m11448k98887
$$ 3402824 3536647 4188079 4819084 5049690 4990889 4909659 4820196 4562640 4151192 3852305
39889C852305L9179K79630J75683j67120m22169m21479l05710k66775k66629j23848
$$ 3852305 3891484 4171114 4346797 4179677 3757508 3336029 3030319 2763544 2496915 2373067
39879B373067J92867M84231N22914K76870m2268j47893J5181J48199m7705m06163
$$ 2373067 2565934 3050165 3573079 3849949 3807681 3659788 3674969 3823168 3775463 3369300
39869C369300m68275j83684n3064l53749o33837l76094J69460L46381P6360j11777
$$ 3369300 2901025 2717341 2664277 2310528 1676691 1300597 1470057 1816438 1892798 1781021
39859A781021L9370K23202K05863J62574K15399J66758p2831k46926j91862j01924
$$ 1781021 1820391 2043593 2249456 2412030 2627429 2794187 2721356 2474430 2282568 2180644
39849B180644j11999l4600K05319L00156Q1639q0085J66843N22250M47234r900
$$ 2180644 2068645 2034045 2239364 2539520 2621159 2541074 2707917 3230167 3677401 3667501
39839C667501l07748k16688m3987p1243j98596k19685j20635k020P8370J06079
$$ 3667501 3359753 3143065 3099078 3027835 2829239 2609554 2488919 2486899 2565269 2671348
39829B671348Q4548L4393m4533j49560j83823n6096P8790n4297l72278m17788
$$ 2671348 2755896 2790289 2745756 2596196 2412373 2356277 2435067 2380770 2008492 1590704
39819A590704k1069L97473M75282M47487O21641P18867L27267k70651m02810j7652
$$ 1590704 1569635 1967108 2442390 2889877 3511518 4230385 4557652 4287001 3884191 3866539
39809C866539K71695J26756j65482l16030l92415m51193l79696k35370k22851
$$ 3866539 4138234 4264990 4099508 3783478 3391063 2939870 2560174 2324804 2101953
39800B101953k31814N1295M66847M44818o0087l40441M7690O29239P35950L50904
$$ 2101953 1870139 1921434 2388281 2833099 2773012 2432571 2480261 3109500 3845450 4196354
39790D196354j57803o14923q98960p28346j26753K93493N9440m61446n86619k39078
$$ 4196354 4038551 3423628 2524668 1796322 1669569 1963062 2022502 1561056 974437 735359
39780G35359J51497L51384L88371K04558j76490l70358j05064K31642J12717k63506
$$ 735359 886856 1238240 1626611 1831169 1654679 1284321 1179257 1410899 1523616 1260110
39770A260110k85802N0129J66735r3496k44090k5162K01935J20863q5247j66834
$$ 1260110 974308 1024437 1191172 1097676 853586 828424 1030359 1151222 1065975 899141
39760H99141j63990j14297R9091L89326M19793J24941j63953k79178m05542n28157
$$ 899141 735151 620854 719945 1109271 1529064 1654005 1490052 1210874 805332 277175
39750B77175k77463L59164P36782M02370k15382m32851k31745o1155o9105p7549
$$ 277175 -288 358876 1095658 1498028 1282646 849795 618050 556895 487790 410241
39740D10241p4280j75191k40930m0614K84619L72782J90392J6377n1921j51821
$$ 410241 335961 160770 -80160 -120774 163845 536627 727019 743396 691475 539654
39730E39654k58263j70701Q1584K18497J47616P3160J15076J55968J27104J14530
$$ 539654 281391 110690 192274 410771 558387 631547 746623 902591 1029695 1144225
39720A144225J03103n2040k88088k95654J9135L21644L01133J01037O6214K32195
$$ 1144225 1247328 1195288 907200 611546 630681 952325 1253458 1354495 1420709 1652904
39710A652904L15674J32089j95080m25091m33364k35123R5174M49509O68434N87468
$$ 1652904 1968578 2100667 1905587 1480496 1047132 812009 907183 1356692 2025126 2612594
39700B612594J82990l24643o05706n21539k37718o205O6404j0676k09251m20436
$$ 2612594 2795584 2470941 1865235 1343696 1105978 1099773 1166177 1155501 946250 525814
39690E25814m47244k39009j2009N2243Q6138K68562M28562K67437r3585k01553
$$ 525814 78570 -160439 -172448 -120205 -34067 234495 663057 930494 836909 635356
39680F35356M5050K12979j1806l56562l90013j23294J11309J71048J72091J71787
$$ 635356 680406 893385 881579 525017 135004 11710 123019 294067 466158 637945
39670F37945J04910J4083O4783K73271M12728K76216o6893l32262k92718J2176
$$ 637945 742855 756938 821721 1094992 1507720 1783936 1717043 1384781 1092063 1104239
39660A104239K95047K72852n0882l83801m59695l01040j22479n2920m6882k4261
$$ 1104239 1399286 1672138 1621256 1237455 777760 476720 354241 301321 254439 230178
39650B30178J3769K1762n877k4649k576L2346L9898N4316J35935K01641N1536
$$ 230178 243947 265709 259832 235183 232607 264953 304851 359167 495102 696743 748279
39639G48279k98260m63967j35440M10876N70248J94885k30866k83501q2310R9517
$$ 748279 450019 -13948 -149388 261488 831736 1026621 795755 512254 429944 529461
39629E29461K90480N50124N90138J40988m86955o97862m02714o5783K0832L3064
$$ 529461 819941 1370065 1960203 2101191 1614236 916374 513660 447877 468709 501773
39619E01773J17226Q6707j65920l46608j50400K76495N40204M89766K74699O8672
$$ 501773 618999 705706 539786 193178 42778 319273 859477 1349243 1623942 1692614
39609A692614m1774j5288R3030J25028R833j49577k84540m60146o12130m37676
$$ 1692614 1650840 1635552 1728582 1853610 1863443 1713866 1429326 969180 357050 -80626
39599h0626J69880P73476Q32105L86967l8233j55403j53439k29178k86864k16852
$$ -80626 89254 862730 1694835 2081802 2043569 1888166 1734727 1505549 1218685 1001833
39589A001833j23877j06989q5103m224L2988N866Q2202K88476L34445K9071l45282
$$ 1001833 877956 770967 685864 681640 714628 720494 802696 1091172 1425617 1454688 1109406
39578A109406l80754j10386R3695P8027K1003L8350L0287m5229o7999r638j7931
$$ 1109406 728652 618266 711961 789988 810991 849341 879628 834399 766400 756762 738831
39567G38831j40553k07196j09778J9159M4831M4338J23880K02131J60172O4204
$$ 738831 598278 391082 281304 300463 345294 389632 513512 715643 875815 940019
39557I40019M1614M1393p4614k59933l03915j21860J31095K55876K08770Q9125
$$ 940019 981633 1023026 948412 688479 384564 262704 393799 649675 858445 947570
39547I47570J4169K9526R8334J60131J88416J59921J5273k38965m23678l61611
$$ 947570 961739 991265 1089599 1249730 1438146 1598067 1613340 1374375 950697 589086
39537E89086j63808j11071j98031r3170K94226N35325K66106k15799l35911n7584
$$ 589086 425278 314207 116176 23006 317232 852557 1118663 902864 566953 509369
39527E09369J36040P324j65495j35309m9911j07393k17959k11467r2272R1897
$$ 509369 645409 652733 487238 351929 302018 194625 -23334 -234801 -327073 -235176
39517b35176L56923N81913M98259J00502k13561j72442l3152j46749l69601l00013
$$ -235176 121747 703660 1201919 1302421 1088860 916418 883266 736517 366916 66903
39507F6903N3229K70085J55040k2936R488J55097J59761j8849j91831j77858R518
$$ 66903 120132 390217 545257 522321 531809 686906 846667 827818 635987 458129 467647
39496D67647J59778O9618j94915l37500k29531j14819k43341m65622m43834j38947
$$ 467647 627425 697043 502128 164628 -64903 -179722 -423063 -888685 -1332519 -1471466
39486a471466J99238M21521N38188M79971J79833j34476j27687J33198K41413
$$ -1471466 -1272228 -850707 -312519 167452 347285 212809 85122 218320 459733
39477D59733O6604r8032o8928K210N3313K53760N04247L32328l47996q56506o07571
$$ 459733 526337 428305 359377 361587 414900 668660 1172907 1505235 1157239 300733 -306838
39466c06838L6555L12365J34345M929O5886m0192l78069m90138j37689K88556
$$ -306838 -270283 42082 176427 181356 247242 207050 -171019 -661157 -798846 -510290
39456e10290L56117J60241M5177J08036K45183M03003N13719M09244O0952k56608
$$ -510290 -154173 6068 51245 159281 404464 807467 1321186 1730430 1791382 1534774
39446A534774k67434m3779J13204K8489k36836m91420n08183j65742L66425P11832
$$ 1534774 1267340 1223561 1336765 1365254 1128418 636998 128815 -36927 329498 1041330
39436A041330O71382M02050J40946o6787k62774m00816m29361l89243k99035j04846
$$ 1041330 1712712 2114762 2255708 2188921 1926147 1525331 1095970 706727 407692 302846
39426C02846J44098K63073J97088J06714O8844m2598k18832j83595J45018L82949
$$ 302846 446944 710017 907105 1013819 1082663 1040065 821233 637638 782656 1165605
39416A165605K21329m8164J8267K79828K47127q1353k08163K4514J69975q1784
$$ 1165605 1386934 1338770 1357037 1636865 1883992 1802639 1594476 1618990 1788965 1707181
39406A707181m00196l29673N4253L05409J90220j38957l88425l59025q5765J29684
$$ 1707181 1306985 977312 1031565 1336974 1527194 1388237 999812 640787 555022 684706
39396F84706j4055m24386o73628n24520j69101J27511L26201M29613L33974R0489
$$ 684706 670651 246265 -427363 -951883 -1120984 -993473 -667272 -237659 96315 186804
39386A86804J3431K40521M39843K77174m9436j20205L3235J4029k35711k94915
$$ 186804 200235 440756 880599 1157773 1108337 988132 1021367 1035396 799685 504770
39376E04770N6318M16014K75535k68981o00677l25584K76155N96782L86623k4125
$$ 504770 561088 977102 1252637 983656 382979 57395 333550 930332 1316955 1292830
39366A292830j87124o7436L2467k4820o3921J6539K7880j57811l10130j72060
$$ 1292830 1105706 1038270 1070737 1045917 981996 998535 1026415 868604 558474 386414
39356C86414R5473J28256p5265j44784R7626L71650L30664o00k99231l23571j23360
$$ 386414 481887 610143 534878 390094 487720 859370 1190034 1189434 890203 566632 443272
39345D43272N8931L6539j53637l28905l85394l52976k35965P526K56867K41167
$$ 443272 502203 538742 385105 56200 -329194 -682170 -918135 -910609 -653742 -412575
39335d12575o5831k83791r6861K96530M70744L42763J55101L7224p3192j69605
$$ -412575 -478406 -762197 -859058 -562528 -91784 250979 406080 443304 370112 200507
39325B00507j82893j78959k24581j54117J64937M44320K96724j17721k57302l928
$$ 200507 17614 -161345 -385926 -540043 -375106 69214 365938 248217 -9085 -13013
39315a3013K17217J62561N2567K1849j10771l14464k01944K63691N02363J86726
$$ -13013 204204 366765 419332 441181 330410 15946 -185998 77693 580056 766782
39305G66782j56830M6126M64621L57014k85687p66829o98259l36572M5778M82435
$$ 766782 609952 656078 1120699 1477713 1192026 425197 -273062 -609634 -563856 -81421
39295h1421Q97912R27017M13771k44646n03912k61260J05662J88041m7290k65450
$$ -81421 816491 1743508 2157279 1912633 1408721 1147461 1253123 1441164 1393874 1128424
39285A128424j68010J59296M34858O31129R05498J099702Q34451K71183J45821
$$ 1128424 960414 1119710 1554568 2185697 3091195 4190897 5025348 5296531 5442352
39276E442352O38792Q56161Q5769r93172j219048o56792l72802p11899r41769
$$ 5442352 6081144 6937305 7023074 6029902 4810854 4154062 3781260 3069361 2127592
39267B127592o61619l91719m46071l24148K36534N81970K19429k51761j03366
$$ 2127592 1465973 1074254 628183 304035 540569 1122539 1341968 1090207 986841
39258I86841L01337J61747l83225n07380m6424L45519K82231L8453j31869k93562
$$ 986841 1288178 1449925 1066700 559320 512896 858415 1140646 1179099 1047230 753668
39248G53668l91189k23857M4321Q893k33185j35058L48470N49464R9220m90520
$$ 753668 362479 138622 182943 191836 -41349 -176407 172063 721527 820747 330227
39238C30227o23236m17155k71615j54719J29762L57402J79986k07099k71517P4402
$$ 330227 -293009 -710164 -981779 -1136498 -1006736 -649334 -469348 -676447 -947964 -873562
39228h73562M05838M58990L91496L46422K18909k1199j62080q3438L8281L5299
$$ -873562 -467724 -8734 382762 729184 948093 926894 764814 681376 719657 754956
39218G54956R321J01651K21408K14918J32686R5591K4372k33046n57072o10246
$$ 754956 764277 865928 1087336 1302254 1434940 1530531 1554903 1321857 764785 154539
39208A54539k82949J25577K66782J34473r914J0149J41406K51564K85950K56788
$$ 154539 -128410 -2833 263949 398422 388508 398657 540063 791627 1077577 1334365
39198A334365J68765J5090j63762k53999j51327Q9579K30659P8216k55927m37263
$$ 1334365 1503130 1518220 1354458 1100459 949132 1038711 1269370 1347586 1091659 654396
39188F54396k96618j3213J57035J85241J75034J20288l1744j76681j66206q3901
$$ 654396 357778 344565 501600 686841 861875 982163 950419 773738 607532 523631
39178E23631j38773k79281k06732J52211M70339M53141K04053L022m9716M028
$$ 523631 384858 105577 -101155 51056 521395 974536 1178589 1181611 1131895 1135923
39168A135923J37858K42688R8831k81554m85344k01389K60632L33054j5765k68832
$$ 1135923 1273781 1516469 1615300 1333746 848402 647013 907645 1240699 1224934 956102
39158I56102j40397P5047N1230r0885r5705l7004j38239l17551k59766J00465
$$ 956102 815705 890752 941982 851097 755392 718388 580149 262598 2832 103297
39148A03297M47255M71870K01284j11445k77218k76940j80944o9179j2104m7185
$$ 103297 550552 1022422 1223706 1112261 835043 558103 377159 307980 295876 248691
39138B48691j36746j85981j50722j03187j20947j34112j2867J69797J46728j46476
$$ 248691 111945 -74036 -224758 -327945 -448892 -583004 -595871 -426074 -279346 -425822
39128d25822l52498r6494M71355P90840N59308O7048j84812k3073L05532M36118
$$ -425822 -778320 -874814 -403459 387381 946689 1013737 828925 805852 1111384 1547502
39118A547502K11811j85140l81485j67054K99732P03117R04011R45448Q68783
$$ 1547502 1759313 1574173 1192688 1025634 1325366 2028483 2932494 3877942 4746725
39109D746725P58463Q43585J213110J473926J086164R3313q57444j303260j373459
$$ 4746725 5505188 6348773 7561883 9035809 10121973 10215286 9357842 8054582 6681123
39100F681123j308432j072823p07041n67252p91078r14919n22743K6763Q3373
$$ 6681123 5372691 4299868 3592827 3025575 2234497 1319578 796835 823598 906971
39091I06971k91174m22352n6552L27615L12507P7580l3603k50N6123J46970K59155
$$ 906971 615797 193445 136893 464508 777015 854595 820992 820742 876865 1023835 1282990
39080A282990K37708O1968m0363K5108R375k50269m55903k32782K77779N41794
$$ 1282990 1520698 1582666 1542303 1567411 1576786 1326517 870614 637832 915611 1457405
39070A457405K95297j73906l99793k14201J49349L12754J20354k12273l66349
$$ 1457405 1752702 1578796 1179003 964802 1114151 1426905 1547259 1334986 968637
39061I68637l00911k07068j29654O6797L10196K73212j09465m34725m00000k33621
$$ 968637 667726 460658 331004 397801 707997 981209 871744 437019 37019 -196602
39051a96602k26430j85875J74042N71044M65672q1053m48060l45118r3173M2429
$$ -196602 -423032 -608907 -434865 136179 601851 520798 72738 -272380 -365553 -323124
39041c23124J96911M05390L48205p4071m00444k48422R6280J62115L2199J07596
$$ -323124 -126213 279177 627382 553311 152867 -95555 725 162840 195039 302635
39031C02635L68093M14977J57032o2257l4579O6538P3772O0300P8623J2134j79487
$$ 302635 670728 1085705 1242737 1180480 1145901 1212439 1286211 1346511 1425134 1437268 1257781
39020A257781l53324m34114m98386n15572l18554L3713J99761O5311j9619K03695
$$ 1257781 904457 470343 -28043 -543615 -862169 -828456 -628695 -563384 -583003 -379308
39010c79308M14572J75519l20849m39998o78M68509M62393J16226q9872L4570
$$ -379308 35264 210783 -110066 -550064 -550742 -82233 380160 496386 406514 441084
39000D41084K77661L81317K94643J39831P0523J29450J82217O8823j41484j87342
$$ 441084 718745 1100062 1394705 1534536 1605059 1734509 1916726 1985549 1844065 1656723
$$ [...]
##END NTUPLES=NMR SPECTRUM
##END=
