##TITLE=31Pdec_DE-164rm_2h
 DMSO-d6+CCl4, 64 sc
 13.7.2026
##JCAMPDX= 6.0         $$ Bruker NMR JCAMP-DX V2.0
##DATA TYPE= NMR SPECTRUM
##DATA CLASS= NTUPLES
##ORIGIN= UXNMR, Bruker Analytische Messtechnik GmbH
##OWNER= root
$$ XWIN-NMR		Version 3.5
$$ Mon Jul 13 14:00:33 2026 Russian Standard Time (UT+4h)  she@DPX200
##.OBSERVE FREQUENCY= 81.013821
##.OBSERVE NUCLEUS= ^31P
##.ACQUISITION MODE= SIMULTANEOUS
##.ACQUISITION SCHEME= undefined
##.AVERAGES= 64
##.DIGITISER RES= 17
##SPECTROMETER/DATA SYSTEM= spect
##.PULSE SEQUENCE= zgpg30
##.SOLVENT NAME= DMSO
##.SHIFT REFERENCE= (INTERNAL, DMSO, 0, 197.392)
##AUDIT TRAIL= $$ (NUMBER, WHEN, WHO, WHERE, WHAT)
$$ ##TITLE= Audit trail, XWIN-NMR		Version 3.5
$$ ##JCAMPDX= 5.01
$$ ##ORIGIN= Bruker BioSpin GmbH
$$ ##OWNER= she
$$ F:/spectra/data/she/nmr/P31/2/pdata/1/auditp.txt
$$ ##AUDIT TRAIL=  $$ (NUMBER, WHEN, WHO, WHERE, WHAT)
(   1,<2026-07-13 13:58:16.71 +0400>,<she>,<DPX200>,
      <created by zg, POWCHK disabled, PULCHK disabled
       configuration hash MD5:
       00 E9 B6 7A A2 85 ED C7 34 08 36 98 17 FE 4E 26
       data hash MD5: 32K
       13 D1 32 D4 EB AB C1 55 76 50 EA 21 2B 1E 23 D3>)
(   2,<2026-07-13 13:58:19.06 +0400>,<she>,<DPX200>,
      <Start of raw data processing
       efp BC_mod = 2 LB = 1.5 FT_mod = 6 PKNL = 1 PHC0 = 2009.969 PHC1 = -39.10083 SI = 64K 
       data hash MD5: 64K
       AA EA 7A 59 ED E3 61 89 AA 77 4F BE E4 F2 9B A8>)
(   3,<2026-07-13 13:58:54.78 +0400>,<she>,<DPX200>,
      <pk PHC0 = -84.03008 PHC1 = 212.1999 
       data hash MD5: 64K
       30 DA F2 05 A8 E0 10 8E 03 6A D0 D1 CC D2 B3 1F>)
(   4,<2026-07-13 13:59:22.34 +0400>,<she>,<DPX200>,
      <pk PHC0 = 25.32239 PHC1 = -47.80001 
       data hash MD5: 64K
       B0 DD 6B C9 99 1B C1 EE F3 FD 40 92 8E CB 97 08>)
(   5,<2026-07-13 13:59:56.79 +0400>,<she>,<DPX200>,
      <pk PHC0 = -7.399996 PHC1 = 0 
       data hash MD5: 64K
       B7 71 F1 29 D5 3A 7D 72 E1 49 D2 4E 26 3F B6 ED>)
$$ ##END=
$$ 
$$ hash MD5
$$ A8 55 11 B6 D5 AD 86 B5 68 78 2B 00 27 C0 87 26
##$RELAX= 
##$RELAX= 
##$RELAX= 
##$RELAX= 
##$RELAX= 
##$RELAX= 
##$RELAX= 
##$RELAX= 
$$ Bruker specific parameters
$$ --------------------------
##$DU= <F:/spectra>
##$EXPNO= 2
##$NAME= <P31>
##$PROCNO= 1
##$TYPE= <nmr>
##$USER= <she>
##$AMP= (0..31)
100 100 100 100 100 100 100 100 100 100 100 100 100 100 100 100 100 100 
100 100 100 100 100 100 100 100 100 100 100 100 100 100 
##$AQSEQ= 0
##$AQ_mod= 1
##$AUNM= <au_zg>
##$AUTOPOS= <>
##$BF1= 81.014009
##$BF2= 200.13
##$BF3= 200.13
##$BF4= 200.13
##$BF5= 200.13
##$BF6= 200.13
##$BF7= 200.13
##$BF8= 200.13
##$BYTORDA= 1
##$CFDGTYP= 0
##$CFRGTYP= 5
##$CHEMSTR= <none>
##$CNST= (0..31)
1 1 145 1 1 1 1 1 1 1 1 1 1 1 1 1 1 1 1 1 1 1 1 1 1 1 1 1 1 1 1 1 
##$CPDPRG= <waltz16>
##$CPDPRG1= <>
##$CPDPRG2= <waltz16>
##$CPDPRG3= <>
##$CPDPRG4= <mlev>
##$CPDPRG5= <mlev>
##$CPDPRG6= <mlev>
##$CPDPRG7= <mlev>
##$CPDPRG8= <mlev>
##$CPDPRGB= <>
##$CPDPRGT= <>
##$D= (0..31)
$$ [...]
##$SUBNAM2= <"">
##$SUBNAM3= <"">
##$SUBNAM4= <"">
##$SUBNAM5= <"">
##$SUBNAM6= <"">
##$SUBNAM7= <"">
##$SUBNAM8= <"">
##$SUBNAM9= <"">
##$SW= 400.765351723535
##$SWIBOX= (0..15)
0 1 3 0 0 0 0 0 0 0 0 0 0 0 0 0 
##$SW_h= 32467.5324675325
##$TD= 32768
##$TD0= 1
##$TE= 0
##$TE2= 300
##$TE3= 300
##$TEG= 300
##$TL= (0..7)
0 120 53 12 22 120 120 120 
##$TP= (0..7)
150 150 150 150 150 150 150 150 
##$TP07= 0
##$TPNAME0= <>
##$TPNAME1= <>
##$TPNAME2= <>
##$TPNAME3= <>
##$TPNAME4= <>
##$TPNAME5= <>
##$TPNAME6= <>
##$TPNAME7= <>
##$TPOAL= (0..7)
0.5 0.5 0.5 0.5 0.5 0.5 0.5 0.5 
##$TPOFFS= (0..7)
0 0 0 0 0 0 0 0 
##$TUNHIN= 0
##$TUNHOUT= 0
##$TUNXOUT= 0
##$USERA1= <user>
##$USERA2= <user>
##$USERA3= <user>
##$USERA4= <user>
##$USERA5= <user>
##$V9= 5
##$VALIST= <valist>
##$VCLIST= <CCCCCCCCCCCCCCC>
##$VD= 0
##$VDLIST= <DDDDDDDDDDDDDDD>
##$VPLIST= <PPPPPPPPPPPPPPP>
##$VTLIST= <TTTTTTTTTTTTTTT>
##$WBST= 1024
##$WBSW= 4
##$XGAIN= (0..3)
0 0 0 0 
##$XL= 0
##$YL= 0
##$YMAX_a= 55313
##$YMIN_a= -40575
##$ZGOPTNS= <>
##$ZL1= 120
##$ZL2= 120
##$ZL3= 120
##$ZL4= 120
##$ABSF1= 0
##$ABSF2= 0
##$ABSG= 0
##$ABSL= 0
##$ALPHA= 0
##$AQORDER= 0
##$ASSFAC= 0
##$ASSFACI= 0
##$ASSFACX= 0
##$ASSWID= 0
##$AUNMP= <proc_1d>
##$AZFE= 0.1
##$AZFW= 0.5
##$BCFW= 0
##$BC_mod= 2
##$BYTORDP= 0
##$COROFFS= 0
##$CY= -3
##$DATMOD= 1
##$DC= 0
##$DFILT= <>
##$DTYPP= 0
##$F1P= 0
##$F2P= 0
##$FCOR= 1
##$FTSIZE= 65536
##$FT_mod= 6
##$GAMMA= 0
##$GB= 0
##$INTBC= 1
##$INTSCL= 9.790993e-09
##$ISEN= 30
##$LB= 1.5
##$LEV0= 0
##$LPBIN= 0
##$MAXI= 10000
##$MC2= 0
##$MEAN= 0
##$ME_mod= 0
##$MI= 50
##$NCOEF= 0
##$NC_proc= -6
##$NLEV= 6
##$NOISF1= 182.463
##$NOISF2= 159.3651
##$NSP= 0
##$NTH_PI= 0
##$NZP= 0
##$OFFSET= 197.3918
##$PC= 4
##$PHC0= 1943.861
##$PHC1= 125.2991
##$PH_mod= 1
##$PKNL= yes
##$PPARMOD= 0
##$PSCAL= 0
##$PSIGN= 0
##$REVERSE= no
##$SF= 81.014063255964
##$SI= 65536
##$SIGF1= 159.3651
##$SIGF2= -187.1042
##$SINO= 113.3802
##$SIOLD= 16384
##$SREGLST= <1H.CDCl3>
##$SSB= 0
##$STSI= 65536
##$STSR= 0
##$SW_p= 32467.5324675325
##$SYMM= 0
##$S_DEV= 0
##$TDeff= 32768
##$TDoff= 0
##$TI= <>
##$TILT= no
##$TM1= 0
##$TM2= 0
##$TOPLEV= 0
##$USERP1= <user>
##$USERP2= <user>
##$USERP3= <user>
##$USERP4= <user>
##$USERP5= <user>
##$WDW= 1
##$XDIM= 65536
##$YMAX_p= 264509394
##$YMIN_p= -86225153
$$ End of Bruker specific parameters
$$ ---------------------------------
##NTUPLES= NMR SPECTRUM
##VAR_NAME=  FREQUENCY,     SPECTRUM/REAL,   SPECTRUM/IMAG
##SYMBOL=    X,             R,               I
##VAR_TYPE=  INDEPENDENT,   DEPENDENT,       DEPENDENT
##VAR_FORM=  AFFN,          ASDF,            ASDF
##VAR_DIM=   65536,         65536,           65536
##UNITS=     HZ,            ARBITRARY UNITS, ARBITRARY UNITS
##FACTOR=    0.49542278885378, 1,            1
##FIRST=     15991.5117654749, 0,            0
##LAST=      -16476.0207020576, 0,           0
##MIN=       -16476.0207020576, -86225153,   0
##MAX=       15991.5117654749, 264509394,    0
$$ Real data points
##PAGE= N=1
##DATA TABLE= (X++(R..R)), XYDATA
$$ [...]
44251B662764J38681k09419o68985o78621L340P23426O99172O4645m01927l85000
$$ 2662764 2801445 2592026 1923041 1244420 1247760 1971186 2670358 2735003 2333076 1948076
44241A948076k55916k67424j79787J56155L84319J28550m21101p11004m67917
$$ 1948076 1692160 1424736 1244949 1401104 1785423 1913973 1492872 781868 313951
44232C13951N9285M11103L42675m341k93547l78229m22506n45591n19215j01290
$$ 313951 373236 784339 1127014 1122673 829126 450897 28391 -517200 -1036415 -1137705
44222a137705M38001N40078J61069q5353J97882N61532L31335l73026p07522j98742
$$ -1137705 -699704 -159626 1443 -83910 113972 675504 1006839 633813 -73709 -272451
44212b72451O19102Q33984J99320o65962j025097p40518k00896K51637N83464
$$ -272451 346651 1180635 1379955 713993 -311104 -1051622 -1252518 -1000881 -417417
44203d17417P98342P17349K41289l33639n50805l24644J330J29527Q4333k5908
$$ -417417 380925 1098274 1339563 1005924 455119 130475 131805 261332 345665 319757
44193C19757k14878m23110l81908N6131N85851P22694L80332l0184q4876K18025
$$ 319757 104879 -318231 -700139 -644008 -58157 664537 1044869 1014685 929809 1147834
44183A147834N14610M64726R8145j74761J937L96692K80586p07781j908893k187303
$$ 1147834 1662444 2127170 2225315 2050554 2052491 2449183 2729769 2021988 113095 -2074208
44173b074208j147376M74540J643829J910609J392196L49461q39665j552754j273984
$$ -2074208 -3221584 -2747044 -1103215 807394 2199590 2549051 1709386 156632 -1117352
44164a117352j50423J034003J482803R16420l17747j398821j484489m50523Q14949
$$ -1117352 -1267775 -233772 1249031 2165451 1847704 448883 -1035606 -1486129 -671180
44155f71180J241317P45612K01699K17458M52848L47250j0078j46826L7502K58709
$$ -671180 570137 1315749 1517448 1734906 2187754 2535004 2524926 2378100 2415602 2674311
44145B674311L46360L08559R8284k40701l77279j11234J84699O0545k35737j03648
$$ 2674311 3020671 3329230 3427514 3186813 2809534 2698300 2882999 2943544 2707807 2604159
44135B604159L70475M38200j73278q63756j082414r46522o85340k09718L57910
$$ 2604159 2974634 3412834 3239556 2375800 1293386 346864 -338476 -548194 -190284
44126a90284M52490n2091l49818K15864J071357J168914M43525k75183n15452
$$ -190284 262206 210115 -139703 76161 1147518 2316432 2759957 2484774 1969322
44117A969322m87269l35377M1729M34221M08978M5676j42007p7548j47744k90552
$$ 1969322 1482053 1146676 1188405 1622626 2031604 2077280 1935273 1857725 1709981 1419429
44107A419429M4106P70964R26488L4286j054041j259221n90228K06665P07498
$$ 1419429 1463535 2234499 3160987 3195273 2141232 882011 291783 498448 1205946
44098A205946Q66184N57245j54770o42889l81726K23094L37080j57129o41054
$$ 1205946 2072130 2629375 2474605 1831716 1449990 1673084 2010164 1853035 1211981
44089A211981o89116l75948J38678O30545N99115j67255r03077o09324M72657
$$ 1211981 522865 146917 285595 916140 1515255 1348000 444923 -164401 308256
44080C08256J025064M68126k99680l24264J19413K18170j32693m52294n19885
$$ 308256 1333320 1801446 1501766 1177502 1296915 1515085 1382392 930098 410213
44071D10213m28614j90887Q9517J9871m71561o85105l4809Q96921J015299K85466
$$ 410213 -18401 -209288 -119771 -99900 -571461 -1256566 -1291375 -394454 620845 906311
44061I06311k45746m9923J96488j45181n89016l11002N07343Q63167L04467m97003
$$ 906311 660565 610642 807130 661949 72933 -238069 269274 1132441 1436908 939905
44051I39905o30236j122O82796P89911M12149J10717J59018K63867R9406j71432
$$ 939905 309669 308547 991343 1781254 2193403 2304120 2463138 2727005 2826411 2654979
44041B654979j95670m3602r9323m12570o21760n41514l55923j65574J35670M05120
$$ 2654979 2459309 2415707 2316384 1903814 1282054 740540 384617 219043 354713 759833
44031G59833K61948j99878l17254J66106O49254O56466N79798P71736O15775m67585
$$ 759833 1021781 821903 504649 670755 1320009 1976475 2556273 3328009 3943784 3476199
44021C476199j594306j310937J91003J106761M91131n99632r22723p24736p54860
$$ 3476199 1881893 570956 761959 1868720 2359851 1760219 837496 112760 -642100
44012f42100p14162P8677J147808J326826N29888j47973j01695J03536r3446l82720
$$ -642100 -1356262 -1277585 -129777 1197049 1726937 1578964 1477269 1580805 1487359 1104639
44002A104639k80431P9477L24454M57187O39349P71795O84766M39786J49609j96961
$$ 1104639 824208 903685 1228139 1685326 2324675 3096470 3781236 4221022 4370631 4173670
43992D173670m97602m90267k15494j37650m54896o48994j75094O50351R59615
$$ 4173670 3676068 3185801 2970307 2832657 2377761 1728767 1553673 2204024 3163639
43983C163639M52538k53930m60923k21588j49239n41216r24060o14538L11722
$$ 3163639 3616177 3362247 2901324 2679736 2530497 1989281 1065221 450683 762405
43974G62405R22660N48836k86570n47309j13583J74099p6525k22821K40384P53640
$$ 762405 1685065 2233901 1947331 1400022 1286439 1460538 1384013 1161192 1401576 2155216
43964B155216N76057n4087m03825l81021l44448k02153L12991P14608K08137r18072
$$ 2155216 2731273 2677186 2273361 1892340 1547892 1345739 1658730 2373338 2581475 1663403
43954A663403j407760p60953J23124L55940J84186K24728M31899M88505N46512
$$ 1663403 255643 -505310 -382186 -26246 157940 382668 814567 1303072 1849584
43945A849584Q20429R22258L79661m62402p70030l26456K62220L92391L9767m07081
$$ 1849584 2670013 3592271 3971932 3509530 2739500 2413044 2675264 3067655 3107422 2700341
43935B700341n20878j55339L23619L33998j37091m00105o6596K77331m5168o74714
$$ 2700341 2179463 2024124 2347743 2681741 2544650 2144545 2077949 2355280 2310112 1635398
43925A635398p17121j00426L88334L11946R679j93103l91274n79411m74065q7352
$$ 1635398 918277 817851 1206185 1518131 1527810 1334707 943433 364022 -110043 -197395
43915a97395J60166J18113R6267J94944J09995j54963r6218M06758P00217L16150
$$ -197395 -37229 80884 177151 372095 482090 327127 230909 637667 1337884 1654034
43905A654034k88562m69821k99277j50974O2869N36471Q87048O17596J440k58639
$$ 1654034 1365472 895651 596374 445400 508269 1044740 1931788 2549384 2550824 2292185
43895B292185r2020l3501k20927j95061K20365N49272M07377P4289M2593L63852
$$ 2292185 2200165 2166664 1945737 1750676 1971041 2520313 2927690 3001979 3044572 3408424
43885C408424O74847O25343J45370n05340q98274q34609n58985l92555k96827
$$ 3408424 4083271 4708614 4853984 4348644 3450370 2615761 2056776 1664221 1367394
43876A367394p9544J63859K22726K26745M44987P29328O81174L21552M4432p5126
$$ 1367394 1287850 1451709 1674435 1901180 2346167 3075495 3756669 4078221 4122653 4047527
43866D047527l18497o32657n72209r6617K23866O0856k05988j82171n7871j53462
$$ 4047527 3729030 3096373 2524164 2427547 2651413 2712269 2506281 2324110 2266239 2112777
43856B112777l71579m89595n47075n69322l55701P8071L15249J98688J72064M98835
$$ 2112777 1741198 1251603 704528 135206 -220495 -142424 172825 371513 543577 1042412
43846A042412O95477L49403l5735K03347O98785N29084l25046r36847q09428l95850
$$ 1042412 1737889 2087292 2051557 2254904 2953689 3482773 3157727 2220880 1411452 1015602
43836A015602j53692L8511K74896K51662q9633k19529J85592O19790M37500j95076
$$ 1015602 861910 900421 1175317 1426979 1337346 1117817 1303409 1923199 2360699 2165623
43826B165623n36380k24886M24666R04373R15950M22294l41437r30967j008671
$$ 2165623 1629243 1404357 1829023 2733396 3649346 4071640 3730203 2799236 1790565
43817A790565o08193j6368M82299O91759N77816L82885M07607N25576K36228n55656
$$ 1790565 1182372 1166004 1648303 2340062 2917878 3300763 3708370 4233946 4470174 3914518
43807C914518j163852r26638j43179K79279K370m20362m10623o5003J75636J63843
$$ 3914518 2750666 1824028 1680849 1960128 1962498 1542136 1131513 1066510 1242146 1405989
43797A405989R3127J43989L20334N03463N08919K25598j69089k97492m2759K52393
$$ 1405989 1499116 1643105 1963439 2466902 2975821 3201419 3032330 2734838 2692079 2944472
43787B944472K46326P4464Q2013K35844K08951K6868J52735P50016J279988J169353
$$ 2944472 3190798 3265262 3347275 3583119 3792070 3818938 3971673 4721689 6001677 7171030
43777G171030N95752K21720L25537N94114O54163L77136k59371j096274j559080
$$ 7171030 7766782 7988502 8314039 8908153 9562316 9939452 9680081 8583807 7024727
43768G024727j093167m3325M63518j08526r17633q29207P0953O67769L53986k83417
$$ 7024727 5931560 5888235 6351753 6243227 5325594 4496387 4567340 5235109 5589095 5305678
43758E305678l81317J55499P61075R74394Q00040M86474K00911p2473l89077o44068
$$ 5305678 4924361 5079860 5840935 6815329 7615369 8101843 8302754 8230281 7841204 7197136
43748G197136o32749l79679k23424l81809o00041n01925j67441m2561l32720p91516
$$ 7197136 6564387 6184708 5961284 5579475 4979434 4477509 4310068 4267507 3934787 3143271
43738C143271j073531j004753n68125L5196L58654J45936j98025p919O88352J077876
$$ 3143271 2069740 1064987 496862 532058 890712 1036648 838623 830704 1519056 2596932
43728B596932O27842j68790m27962K8335N61973N67300J05550l16255l79199k38144
$$ 2596932 3224774 3055984 2628022 2656357 3218330 3785630 3891180 3574925 3195726 2957582
43718B957582j95560k30454p3976K29321K04968l37476q19392n99435N1428K60792
$$ 2957582 2762022 2531568 2457592 2686913 2891881 2554405 1735013 1135578 1187006 1447798
43708A447798k37889q14948q82149n11047k9928L67591M62007J13906k44959Q1019
$$ 1447798 1209909 394961 -487188 -998235 -1028163 -660572 -198565 -84659 -329618 -248599
43698b48599R29755J200537L77145n91935o15212k3616P8171l99350m40977M32330
$$ -248599 681156 1881693 2258838 1666903 1051691 1028075 1106246 706896 265919 698249
43688F98249J398974J450991N73416m82124j068635r78655l34733M69145R15412
$$ 698249 2097223 3548214 4121630 3639506 2570871 1592216 1257483 1726628 2642040
43679B642040P55635K23896k46701m46611m68679m52656l51153p071N06998P52160
$$ 2642040 3397675 3621571 3374870 2928259 2459580 2006924 1655771 1648700 2155698 2907858
43669B907858L65897l76903p74108n52203j47539J5491P4872K47500K52483k47939
$$ 2907858 3273755 2896852 2122744 1570541 1423002 1438493 1513365 1760865 2013348 1765409
43659A765409q99383r48688k48020N12467O23669P3357n79960p87240m62906l4665
$$ 1765409 866026 -82662 -330682 181785 805454 878811 298851 -488389 -951295 -985960
43649i85960L3752j34019O1217P81534J339771J073626K82512k07016j47874K5799
$$ -985960 -952208 -1086227 -1025010 -243476 1096295 2169921 2452433 2245417 2097543 2123342
43639B123342M1579J12235L94283O35026M90137q5441p67833j011273m71568M64826
$$ 2123342 2164921 2277156 2671439 3306465 3796602 3711161 2943328 1932055 1460487 1925313
43629A925313Q87494M39818j95342l09530j51059k56984l67889L6397N23978K25441
$$ 1925313 2812807 3252625 3057283 2747753 2596694 2339710 1971821 2008218 2532196 2757637
43619B757637n62006n66003M82433J299583R20478P136l54455k13797k95191o69770
$$ 2757637 2195631 1629628 2112061 3411644 4332122 4339258 3984803 3771006 3475815 2806045
43609B806045p79154m28902j4069R9971p2160k84533k74695j8392J10665k21341
$$ 2806045 2026891 1597989 1583920 1683891 1611731 1327198 1052503 1034111 1144776 923435
43599I23435o73634n87576n1249J46234j64324j72080M91541R26278L23483o59014
$$ 923435 249801 -337775 -389024 -242790 -407114 -579194 -87653 838625 1162108 503094
43589E03094q40519k21934L01158M73576P64574J126039Q78470k5145o49788l37394
$$ 503094 -337425 -559359 -258201 215375 979949 2105988 2984458 2959313 2309525 1972131
43579A972131M33200P87679M80308j13498n29993m69514N7574N85351N56588M2375
$$ 1972131 2405331 3193010 3673318 3559820 3029827 2560313 2617887 3203238 3759826 3802201
43569C802201k54442Q3528O31159P38311L69447k1178k17300m10231o82366p49885
$$ 3802201 3547759 3631287 4262446 5000757 5370204 5349026 5131726 4721495 4039129 3289244
43559C289244m16115J961M9109j58894l9272N21688Q12305K61542o23433q70497
$$ 3289244 2873129 2875090 2924199 2765305 2726033 3247721 4060026 4321568 3698135 2827638
43549B827638l56648J88503L67308M63585N60967K68047l64366n85730j29584
$$ 2827638 2470990 2659493 3026801 3490386 4051353 4319400 3955034 3369304 3239720
43540C239720J96691k27438p76942o10332o0764m735l72807m04446o0760K788
$$ 3239720 3436411 3208973 2432031 1821699 1760935 1756200 1383393 978947 918187 920975
43530I20975k13141P4216R85563J451228O16149r05556j677987j001607M59860
$$ 920975 707834 782050 1767613 3218841 3834990 2929434 1251447 249840 709700
43521G09700J386240J029661j01888q56271q09926o17161p57001o75112J32290
$$ 709700 2095940 3125601 3023713 2167442 1357516 740355 -16646 -691758 -559468
43512e59468R15124O67480j53461k45518M16483N60722j87752o42806m2429P53810
$$ -559468 355656 1023136 869675 624157 1040640 1601362 1413610 770804 728375 1482185
43502A482185P97887N00450N74415O14537q0904j028458j160066m98193p2734
$$ 1482185 2280072 2780522 3354937 3969474 3888570 2860112 1700046 1201853 1129119
43493A129119l33630o63216m70938P9423N46217P49569O99713M86353L47696M76602
$$ 1129119 795489 132273 -338665 -259242 286975 1036544 1736257 2222610 2570306 3046908
43483C046908P13686P25276M41606M1153l82009q02331j013059p52638q6573N70440
$$ 3046908 3760594 4485870 4927476 4968629 4586620 3784289 2771230 2018592 1932019 2502459
43473B502459Q00607M45327l16991j013435j202580r09806n11023j04797N81773
$$ 2502459 3303066 3748393 3431402 2417967 1215387 305581 -205442 -310239 271534
43464B71534J460210J793147J109701J0276n14407l26835j39336m19542q79461
$$ 271534 1731744 3524891 4634592 4644868 4130461 3803626 3664290 3244748 2365287
43455B365287j039694p82418k55137L55522P97651P90982K81872m18143q08945
$$ 2365287 1325593 543175 288038 643560 1441211 2232193 2514065 2095922 1286977
43446A286977n48493K21560Q46976P04105p1129o29516l76788L23814O24611J67474
$$ 1286977 738484 960044 1807020 2511125 2439996 1810480 1433692 1757506 2382117 2549591
43436B549591o09597r51354m40531N73802J108189M75328p75133j306692o05642
$$ 2549591 1939994 988640 548109 1121911 2230100 2705428 1930295 623603 17961
43427A7961L98491O49475K81675Q6136K44482L53734L25453M23668N86420M89890
$$ 17961 416452 1065927 1347602 1433738 1678220 2031954 2357407 2781075 3367495 3857385
43417C857385K12943J20357J31827j63713o48617o87903j47977L08337K18619
$$ 3857385 4070328 4190685 4322512 4158799 3510182 2822279 2674302 2982639 3201258
43408C201258q070J99586O71566P62275K58091m03787p47771p61904o97689n55152
$$ 3201258 3193188 3392774 4064340 4826615 5084706 4680919 3933148 3171244 2473555 1918403
43398A918403m4851Q06892J306336Q32913j48821n03098o974K92136k71065q73454
$$ 1918403 1873552 2680444 3986780 4819693 4670872 4167774 4160800 4452936 4181871 3308417
43388C308417n59623J02099j01141r93778j226068l84249M64082M58379q0307
$$ 3308417 2748794 2850893 2749752 1755974 529906 145657 609739 1068118 987811
43379I87811o20342j119185j321009n77909R42053J896926J421804L26202j18485
$$ 987811 367469 -751716 -2072725 -2650634 -1708581 188345 1610149 1936351 1817866
43370A817866J63172L90233K18268j67367o63760j097385r78748k53779K22806
$$ 1817866 1981038 2371271 2589539 2422172 1758412 661027 -317721 -571500 -348694
43361c48694j40756n73758o4766R04789J015256K27467j62180L64704P95337L34618
$$ -348694 -489450 -1063208 -1127974 -223185 792071 1019538 857358 1222062 2017399 2352017
43351B352017l74461m50882j52563j97580m64458l10294K46782N36960K51060
$$ 2352017 1977556 1526674 1374111 1176531 712073 401779 648561 1185521 1436581
43342A436581k49749n51425n55993k88069J79465N99401P18905N77962L89024
$$ 1436581 1186832 635407 79414 -208655 -29190 570211 1289116 1867078 2256102
43333B256102K23297P7066P5380K73155M11379K37819q4516k82220m79962q73468
$$ 2256102 2479399 2556465 2631845 2905000 3316379 3554198 3469682 3187462 2707500 1834032
43323A834032j065212m60222O21954J028051K87781o45794o62078Q0198O04465
$$ 1834032 768820 308598 930552 1958603 2246384 1600590 938512 1018710 1623175
43314A623175N31479K99541K40403K21854J44380P3426j48386p38871j345860
$$ 1623175 2154654 2454195 2694598 2916452 3060832 3134258 2985872 2247001 901141
43305I01141j267015m67940K81571M96696N02863N85771M06180k08285n91227
$$ 901141 -365874 -833814 -552243 -55547 447316 1033087 1439267 1230982 639755
43296F39755q7435R01016J439707J261488P49699J14075n95424r44160n25166
$$ 639755 552320 1453336 2893043 4154531 4904230 5018305 4422881 3478721 2953555
43287B953555J61532J54602n72652j006317n39995K62742N92039L54603p6230
$$ 2953555 3115087 3269689 2697037 1690720 1150725 1413467 2005506 2360109 2283879
43278B283879m20314m88077k00454J06759l8448m39790l65622K54830N48099L8604
$$ 2283879 1863565 1375488 1175034 1281793 1243345 803555 437933 692763 1240862 1279466
43268A279466n26179l29848K39293K73432k25710m88475k16304J89858M52405
$$ 1279466 753287 423439 662732 936164 710454 221979 5675 195533 647938
43259F47938O40838O56639K92541j60502r8748M71306Q30548N46662K1740j76048
$$ 647938 1288776 1945415 2237956 2077454 1978706 2450012 3280560 3827222 3848962 3672914
43249C672914n1417J3160j55924l84510l94997n9388M26207O12716K63283k84567
$$ 3672914 3621497 3634657 3478733 3094223 2699226 2639838 3066045 3678761 3942044 3657477
43239C657477m70155j53871L59518P83930R40715N62577l86889j209233r84249
$$ 3657477 3187322 3033451 3392969 4176899 5117614 5680191 5293302 4084069 3099820
43230C099820J83801J051554P42622j50782m58299j0674L04152j07647p94350
$$ 3099820 3283621 4335175 5077797 4927015 4468716 4458042 4762194 4654547 3860197
43221C860197r74654n15990P6068L66348L58722K27610k168l42259n56022k78402
$$ 3860197 2885543 2369553 2445621 2811969 3170691 3398301 3396133 3053874 2497852 2219450
43211B219450M65597J063719R00426J14652m77766l13534K60483M43696L681m16974
$$ 2219450 2685047 3748766 4649192 4763844 4286078 3972544 4233027 4676723 4680404 4263430
43201D263430j33340O23232Q93420J97330p95685j115762p38652m38352m85481
$$ 4263430 4130090 4753322 5646742 5844072 5048387 3932625 3193973 2755621 2270140
43192B270140k49181O22697J359176J039850n6167q23440p86358m03642p1324
$$ 2270140 2020959 2643656 4002832 5042682 4986515 4163075 3376717 2973075 2901751
43183B901751K86877N60535L05250l91042o73379o9935P24569P83584J71845l81175
$$ 2901751 3188628 3749163 4054413 3663371 2989992 2920057 3644626 4428210 4600055 4218880
43173D218880o00405p23558p22342l01013L51172N78887J93774k45395k95337
$$ 4218880 3618475 2894917 2172575 1871562 2222734 2801621 2995395 2750000 2454663
43164B454663j78924j84473r4139L28082P26162O07960J57584J645K59629L98054
$$ 2454663 2275739 2091266 1997127 2325209 3051371 3659331 3816915 3818560 4078189 4476243
43154D476243Q3929l18638k70784K96169J020773J478057J373337P22218K3127
$$ 4476243 4560172 4241534 3970750 4266919 5287692 6765749 8139086 8861304 8884431
43145H884431r8062L48397O35861K54816m41200q33487q43635o67355j55460P98822
$$ 8884431 8786369 9134766 9770627 10025443 9584243 8750756 7907121 7239766 7084306 7883128
43135G883128J521011J121189j52221r93208p19364q0625r209l25069k89287J47647
$$ 7883128 9404139 10525328 10373107 9379899 8660535 8579910 8570701 8245632 7956345 8103992
43125H103992M08922K79350R4780N7360m760j71957k22820K4455M87145R59820
$$ 8103992 8512914 8792264 8887044 8944404 8939644 8767687 8544867 8569322 9056467 10016287
43115A0016287J228357J095515N59533q2796n37289q23761j074150j179125r22119
$$ 10016287 11244644 12340159 12899692 12816896 12279607 11455846 10381696 9202571 8280452
43106H280452l57036K11985N39152N31574K04959k29684m18625k39301M9940J92278
$$ 8280452 7923416 8135401 8674553 9206127 9411086 9181402 8762777 8523476 8573416 8765694
43096H765694J90490M5703l18624o34969l68205L72216O25881r4623q88179o97234
$$ 8765694 8956184 9001887 8683263 8048294 7680089 8052305 8678186 8583563 7695384 6998150
43086F998150R1547L18814p8159j26301L71655M50289l34089j069602q59139k2275
$$ 6998150 7089697 7408511 7330352 7204051 7575706 8025995 7691906 6622304 5763165 5740890
43076E740890O55445R99532J126920Q37406J06305l91103n9063O63167Q43999
$$ 5740890 6396335 7395867 8522787 9360193 9466498 9075395 9016332 9679499 10523498
43067A0523498L41935q2106J69000Q58893J295854J038888K45048m86567o70381
$$ 10523498 10865433 10783327 10952327 11811220 13107074 14145962 14391010 13904443 13234062
43058A3234062m03112j49880j22621j57435j06455R9993O89933J720056K499856
$$ 13234062 12830950 12681070 12558449 12401014 12294559 12394552 13084485 14804541 17304397
43049A7304397K102423O47939o43300r32257n74465k07551R9623L49605J66520
$$ 17304397 19406820 20054759 19411459 18479202 17904737 17697186 17796809 18146414 18312934
43040A8312934m89162q97094n90665j55727k95267p16421p24368l38488J7299
$$ 18312934 17823772 16926678 16336013 16180286 15885019 15168598 14444230 14105742 14123041
43031A4123041L84378R17433J153021O25194j54532l31680l3548o3764n28137
$$ 14123041 14507419 15424852 16577873 17203067 17048535 16716855 16683307 16619543 16091406
43022A6091406q16766p86254q63061j022238p69540k06207k1213k45959q9119
$$ 16091406 15274640 14488386 13625325 12603087 11833547 11627340 11606127 11360168 11271049
43013A1271049O66924J108919N10665o07531j253040j156053p28717l72600k61098
$$ 11271049 11937973 13046892 13557557 12950026 11696986 10540933 9812216 9439616 9178518
43004I178518l99446n70852n37547m15677m62114n23463k76815L4371j12745m52264
$$ 9178518 8779072 8208220 7670673 7254996 6792882 6269419 5992604 6026975 5914230 5461966
42994E461966r4414R82111J591625R98536K2394j76795L38657P05051O30657M94767
$$ 5461966 5367552 6349663 7941288 8939824 8962218 8785423 9124080 9829131 10459788 10954555
42984A0954555M78844M38661M28876O17505P87358N49407j0384m22269m92063
$$ 10954555 11433399 11872060 12300936 12918441 13705799 14255206 14244822 13822553 13330490
42975A3330490l86893j62760K67622P06451P20401K45407k19203j76610L23446
$$ 13330490 12943597 12780837 13048459 13754910 14475311 14720718 14501515 14324905 14648351
42966A4648351Q14306R49588Q27840Q16133J070566J294213J075038L84675m48450
$$ 14648351 15462657 16412245 17240085 18056218 19126784 20420997 21496035 21880710 21432260
42957B1432260j151993j588758j545402r33537k13375m7646l81195m47253N3681
$$ 21432260 20280267 18691509 17146107 16212570 15999195 15951549 15570354 15123101 15176782
42948A5176782L98297j01502j019889j377327r29124l11997j22182l86825q29661
$$ 15176782 15575079 15473577 14453688 13076361 12147237 11835240 11713058 11326233 10496572
42939A0496572j184557j282782j165361j035273q71496l25695O81529J539744
$$ 10496572 9312015 8029233 6863872 5828599 4957103 4631408 5312937 6852681
42931F852681J570992R06475L05439K10693L94489M50244K10381l00521r31598
$$ 6852681 8423673 9330148 9635587 9846280 10240769 10691013 10901394 10600873 9669275
42922I669275j368812j328043q66811l49845j06194k01435m31860m52297r0252
$$ 9669275 8300463 6972420 6105609 5755764 5649570 5448135 5016275 4563978 4473726
42913D473726L78315N10576L17046K24338L17642J65843l28788n41800r6754L57505
$$ 4473726 4852041 5362617 5679663 5904001 6221643 6387486 6058698 5516898 5420144 5777649
42903E777649M6631o95307r11788m46585J2308J64799M16643Q91825J047567N70347
$$ 5777649 5824280 5128973 4217185 3770600 3782908 3947707 4364350 5256175 6303742 6874089
42893F874089r2251m65408o95037j043931j236960p90194K69120J346850J767813
$$ 6874089 6781838 6316430 5621393 4577462 3340502 2550308 2819428 4166278 5934091
42884E934091J187272j40892j312070j369717k90553Q57698J030569L17284k87040
$$ 5934091 7121363 6980471 5668401 4298684 4008131 4865829 5896398 6213682 5926642
42875E926642o0054P37754J266199J037452M04115J09376L59424N46167Q4560
$$ 5926642 5866588 6604342 7870541 8907993 9312108 9421484 9780908 10327075 10411635
42866A0411635p10349r84244m63797K73697O54818P03359O46822M69771J69899
$$ 10411635 9701286 8717042 8253245 8526942 9181760 9885119 10531941 11001712 11171611
42857A1171611L9973K89124O26916N99285K06774j24211j16943P2020J41077K1683
$$ 11171611 11211584 11500708 12127624 12726909 12933683 12809472 12692529 12764549 12905626 12927309
42847A2927309j02985j04596j56275n41666j158815j426192r25771P345O48815
$$ 12927309 12824324 12719728 12563453 12021787 10862972 9436780 8511009 8518354 9167169
42838I167169P24538N16577K39025j81097o66990q85271p65662o49867o78397
$$ 9167169 9891707 10408284 10647309 10466212 9799222 8913951 8148289 7498422 6820025
42829F820025m89956J30077P03774O02333j10322p80399r51698o97416k97105
$$ 6820025 6330069 6460146 7163920 7766253 7655931 6875532 5923834 5226418 4929313
42820D929313O0010K83421L64118L56160K45512o2147m95223p37237n93459k71431
$$ 4929313 4989323 5272744 5636862 5993022 6238534 6176387 5681164 4943927 4350468 4079037
42810D079037p0448M1034K53578M52594K91813k42857o58669n08124M0272L66128
$$ 4079037 4008589 4049623 4303201 4755795 5047608 4804751 4146082 3637958 3678230 4044358
42800D044358J26406l19915l47189J19121M72223K62285j03745J19434R15112
$$ 4044358 4170764 3850849 3503660 3622781 4095004 4357289 4253544 4372978 5288090
42791E288090J407623R50542j07671q97529q95344j68920Q12002J364015J013209
$$ 5288090 6695713 7646255 7538584 6641055 5745711 5576791 6388793 7752808 8766017
42782H766017Q3356m84026k59243Q7091k29744r04668r68388k19360N13000N83809
$$ 8766017 8849373 8365347 8106104 8193195 7963451 7058783 6090395 5871035 6384035 6967844
42772F967844K99620K10428K60014J36736P1834O32186J741003K470025K083576
$$ 6967844 7267464 7477892 7737906 7874642 7946476 8578662 10319665 12789690 14873266
42763A4873266R91613L09051N59290J178555J362136J006378N48401K21919l3203
$$ 14873266 15864879 16173930 16733220 17911775 19273911 20280289 20828690 21050609 21017406
42754B1017406r0685K93032Q28637P32589k48668j323348j591814j154255q18483
$$ 21017406 20926721 21219753 22048390 22780979 22532311 21208963 19617149 18462894 17644411
42745A7644411r69922j262921j306381j125380r26553q36076r23526j131685j150505
$$ 17644411 16674489 15411568 14105187 12979807 12053254 11217178 10293652 9161967 8011462
42736H011462p05465m414M49185N18830N20402N76961L62241k63436p71820n33242
$$ 8011462 7305997 7301583 7750768 8269598 8790000 9366961 9729202 9465766 8693946 8160704
42726H160704L36660J082189J169963P07426O1688n35669r10215q58140m28775
$$ 8160704 8497364 9579553 10749516 11456942 11518630 10982961 10072746 9214606 8785831
42717H785831q2763k26595o56084p96488n04863k56168l95225o01893m19669R44
$$ 8785831 8703068 8476473 7820389 7023901 6519038 6262870 5867645 5265752 4846083 4847027
42707D847027J45920n8195k10341j49833j35824k33993j15214K91264M85791J17873
$$ 4847027 4992947 4934752 4724411 4574578 4438754 4204761 4089547 4380811 4866602 4984475
42697D984475m22072n76327m19465l64452l54147J9914O77545R68307N66687n0083
$$ 4984475 4562403 3986076 3566611 3202159 2848012 2867926 3545471 4513778 5080465 5030382
42687E030382k65901j15189r6536l79257n31804r8391P42614J283298J069032
$$ 5030382 4764481 4649292 4552756 4173499 3641695 3543304 4285918 5569216 6638248
42678F638248M00021j15168l57328p13359j309965j660683j289833m00761L42286
$$ 6638248 7038269 6923101 6565773 5852414 4542449 2881766 1591933 1191172 1533458
42669A533458N04948J66224k69136l59602L0397M92631M46674p4255l55472L4166
$$ 1533458 2038406 2204630 1935494 1575892 1606289 2098920 2545594 2471339 2115867 2150033
42659B150033N99267O01703L8475m90384n90752k86685L06243R80434J267744
$$ 2150033 2749300 3351003 3389478 2899094 2308342 2021657 2327900 3308334 4576078
42650D576078Q16370p0465o57304n15119K09658J081961J628442J516464Q28398
$$ 4576078 5392448 5321983 4664679 4149560 4359218 5441179 7069621 8586085 9414483
42641I414483j001p10337j332525j638721j125550J2429O47123J60760n59896
$$ 9414483 9413482 8703145 7370620 5731899 4606349 4618778 5265901 5426661 4866765
42632D866765m30599K17574M08301K65942O57074J549419K222986K781261L710010
$$ 4866765 4436166 4653740 5062041 5327983 5985057 7534476 9757462 12538723 16248733
42623A6248733M041709K035448j826127m505727m055016j970189q13067r78238
$$ 16248733 20290442 22325890 20499763 15994036 11939020 9968831 9155764 8177526
42615H177526j181877q94832o36233n87174m48724l01207l93643m27460o4276
$$ 8177526 6995649 6100817 5464584 4877410 4428686 4127479 3733836 3306376 3242100
42606C242100K91190J68011n6498R3042J63427l84090r61410p70066l21754n86630
$$ 3242100 3533290 3701301 3644803 3737845 3901272 3517182 2555772 1785706 1463952 877322
42596H77322j134401p77294K47259N38441o8079k22871N64705J116927O98609
$$ 877322 -257079 -1034373 -787114 -248673 -316752 -539623 25082 1142009 1840618
42587A840618K05808M31143O92717K19565m07941l48669L4554k3587k93535j35139
$$ 1840618 2046426 2477569 3170286 3389851 2981910 2633241 2667795 2644208 2350673 2215534
42577B215534K21214J51602j46844o5432K01485k4506o34232q43963m54073l5226
$$ 2215534 2436748 2588350 2441506 2376074 2577559 2553053 1918821 1074858 620785 585559
42567E85559Q6323J47855K54726J85321k4864j109L60383P52377R44749R03120
$$ 585559 671882 819737 1074463 1259784 1234920 1233811 1594194 2346571 3291320 4194440
42557D194440N10071k40708q58343q15540l53206j53030k55166r5048L29664K61784
$$ 4194440 4704511 4463803 3605460 2789920 2436714 2283684 2028518 1933470 2263134 2524918
42547B524918n15426j063529n84776L29809N15756r2667m35187J06210Q72644
$$ 2524918 2009492 945963 361187 690996 1206752 1114085 678898 785108 1657752
42538A657752Q96259J82644l82005j96199M01773P12958N93442M83411O14376
$$ 1657752 2554011 2736655 2354650 2158451 2560224 3273182 3866624 4350035 4964411
42529D964411O10378Q7945o67823j008334p52484l07553k3963J18554J35872j51403
$$ 4964411 5574789 5662734 4994911 3986577 3234093 2926540 2902577 3021131 3157003 3005600
42519C005600o90053r63449n52375K70878Q30288Q19448N17295L07163K49072
$$ 3005600 2315547 1352098 799723 1070601 1900889 2720337 3237632 3544795 3793867
42510C793867J42262j77972o48113r94152r71838o61718m25685m51444m71913
$$ 3793867 3936129 3758157 3110044 2115892 1144054 482336 56651 -394793 -866706
42501h66706j34913M60434Q69439Q86662O88090L70751k13379r40861j155975
$$ -866706 -1001619 -541185 328254 1214916 1903006 2273757 2060378 1119517 -36458
42492c6458m07427P44469J206666O65525q2076k45237K6964J34969j3561n1198
$$ -36458 -443885 300584 1507250 2172775 2090699 1845462 1872426 2007395 1993834 1942636
42482A942636J09171J67854K1090p2320L0077J51770J78484K45159M08650M93277
$$ 1942636 2051807 2219661 2240751 2168431 2198508 2350278 2528762 2773921 3182571 3675848
42472C675848M08619K91053K02265L5858j58716j71792j07817l72891r23667j056614
$$ 3675848 4084467 4375520 4577785 4613643 4454927 4283135 4175318 3802427 2878760 1822146
42462A822146l72356N15519P62800L88616j7156l18713p94237j253737j063770
$$ 1822146 1449790 1965309 2728109 3116725 3099569 2780856 1986619 732882 -330888
42453c30888j60610O81516Q06296L28902l19234q75489j043727m80137N68307
$$ -330888 -491498 190018 996314 1325216 1005982 130493 -913234 -1393371 -825064
42444h25064J135546O08057l91666p19650j06920O51455P86962L52866q8056j64296
$$ -825064 310482 918539 526873 -192777 -299697 351758 1138720 1491586 1403530 1239234
42434A239234N7607K92038L38632K16447N1534j13931k95717l87321k26513J10881
$$ 1239234 1296841 1588879 1927511 2143958 2195492 2081561 1785844 1398523 1172010 1282891
42424A282891L34449L51555L72812M54656K65903l98197j117455j228787o13854
$$ 1282891 1617340 1968895 2341707 2796363 3062266 2664069 1546614 317827 -296027
42415b96027J76423N30753L22126n4828l2094N95064J331853J402385O71538j43008
$$ -296027 -119604 411149 733275 678447 646353 1241417 2573270 3975655 4647193 4504185
42405D504185l94593k56546k11594k46489j05291L8916j17867k96447l5159L35076
$$ 4504185 4109592 3853046 3641452 3394963 3289672 3328588 3210721 2914274 2879115 3214191
42395C214191N1792p09298q59621p9647N61233K20855m27637l23933L41361O17318
$$ 3214191 3265983 2556685 1697064 1617417 2178650 2399505 1971868 1647935 1989296 2606614
42385B606614L86797L50882O64820P09561K48497j97359l02441l49529m33454
$$ 2606614 2993411 3344293 4009113 4718674 4967171 4769812 4467371 4117842 3684388
42376C684388j58953M40855N38381k91610j181888j058796j57123L96085K44852
$$ 3684388 3525435 3966290 4504671 4213061 3031173 1972377 1815254 2211339 2456191
42367B456191J25555N02680P90326L21290n63548r85872p55626m87174n32603
$$ 2456191 2581746 3084426 3874752 4196042 3632494 2646622 1890996 1403822 871219
42358H71219m26614K98674J174975J238554L38693n72069o56435j87248Q3856
$$ 871219 444605 743279 1918254 3156808 3495501 2923432 2266997 2079749 2163605
42349B163605J08105M24429J074626J426312J157109O83128L80745P9051l26082
$$ 2163605 2271710 2696139 3770765 5197077 6354186 7037314 7418059 7497110 7171028
42340G171028m42669q2208K18540P457k79640o9544K49686j10259r53140j280363
$$ 7171028 6728359 6646151 6864691 6872148 6592508 6522964 6772650 6662391 5709251 4428888
42330D428888q09077l05331k67127k62746Q6252L89104K88858K03865N85469J022684
$$ 4428888 3619811 3314480 3047353 2784607 2870859 3259963 3548821 3752686 4338155 5360839
42320E360839Q58331L32963L23390J046889J694578J433752L30961q14492j268354
$$ 5360839 6219170 6552133 6875523 7922412 9616990 11050742 11381703 10567211 9298857
42311I298857r34543l09072R9102K86418N46726Q63991R98695J234557K300690
$$ 9298857 8364314 8055242 8154344 8440762 8987488 9851479 10850174 12084731 14385421
42302A4385421M070417M970774L498696Q6075l240775m901675m823416l707458
$$ 14385421 18455838 23426612 26925308 27011383 23770608 18868933 14045517 10338059
42294A0338059k172784p64888K1103J60032P9375l4703m41477j113269j359614
$$ 10338059 8165275 7400387 7421490 7581522 7660897 7626194 7184717 6071448 4711834
42285D711834o55383N06591J087298O69588k31389r05492j109990j001349p50859
$$ 4711834 4056451 4563042 5650340 6319928 6088539 5183047 4073057 3071708 2320849
42276B320849m05789k4677K23777K16332J19961K79527P06798Q98615M88440q7788
$$ 2320849 1915060 1890383 2114160 2330492 2450453 2729980 3436778 4335393 4823833 4736045
42266D736045p8768M34271M95513l54906j246057j056733J5077O49682J40154
$$ 4736045 4657277 5091548 5587061 5232155 3986098 2929365 2944442 3594124 3734278
42257C734278p26087p80327J5820O46444M30051k14237n04810l34207j80191k40656
$$ 3734278 3008191 2227864 2243684 2890128 3320179 3105942 2601132 2266925 2086734 1846078
42247A846078k07819O9275K39203J6947l27850l99533k51405j33594K4471L93368
$$ 1846078 1638259 1707534 1946737 1963684 1635834 1236301 984896 851302 875773 1269141
42237A269141P43689P15282M36770L24063L90226L55173L16039N72258Q02752
$$ 1269141 2012830 2728112 3164882 3488945 3879171 4234344 4550383 5122641 5925393
42228E925393K76963r09394j642547j221102k66522K38435J58236n9266k24137
$$ 5925393 6202356 5292962 3650415 2429313 2162791 2401226 2559462 2500196 2276059
42219B276059l47880k45075J44625M15730K86720J48279L89272N72797N1824q55703
$$ 2276059 1928179 1683104 1827729 2243459 2530179 2678458 3067730 3640527 3692351 2836648
42209B836648j116572l28994Q57620J597600J515314O64395m81847j085392p06520
$$ 2836648 1720076 1391082 2248702 3846302 5361616 6026011 5544164 4458772 3752252
42200C752252J6293J34414k56036k58127K57317L63040l69197j041747p44098
$$ 3752252 3768545 3902959 3646923 3388796 3646113 4009153 3639956 2598209 1854111
42191A854111J07347M74615J78089j15621m7507P8711N419r3792m8817k2741j81693
$$ 1854111 1961458 2436073 2614162 2498541 2451034 2529745 2535164 2441372 2392555 2369814 2188121
42180B188121l10345l6168N74221Q57890K47867q58558j294171m81528P30631
$$ 2188121 1877776 1841608 2415829 3273719 3521586 2663028 1368857 887329 1617960
42171A617960J086481N24391P7225K93287O17700M91339J75275P0112r436l09907
$$ 1617960 2704441 3228832 3306057 3599344 4217044 4708383 4883658 4953770 4944334 4634427
42161D634427n18031l05245N962k1850j63540J1573K52458l3193p27622j029012
$$ 4634427 4116396 3811151 3817113 3795263 3631723 3643296 3895754 3862561 3134939 2105927
42151B105927n16771L78948R57122Q39021R3284p52309r55948l17642M39520N22278
$$ 2105927 1589156 1968104 2925226 3764247 3857531 3105222 2149274 1831632 2271152 2793430
42141B793430R4467j02835J01417K66922K75006M51668P58294P16924K82299j3462
$$ 2793430 2887897 2785062 2886479 3153401 3428407 3880075 4638369 5355293 5637592 5624130
42131E624130K1198l1085l05810l29384N5205K52190j12117n36500n33140m37624
$$ 5624130 5645328 5614243 5308433 4979049 5034254 5286444 5174327 4637827 4104687 3667063
42121C667063o44043p09093p3600Q33102J137629Q29208N90353N60748K64476
$$ 3667063 3023020 2313927 2240327 3073429 4211058 5040266 5630619 6191367 6455843
42112F455843k94871m80867j16087J96774J37271K08303P77355J304125J118500
$$ 6455843 6160972 5680105 5564018 5760792 5898063 6106366 6883721 8187846 9306346
42103I306346M59209R9532K30660L08506j08118q53558j472976j678251j455865
$$ 9306346 9765555 9865087 10095747 10404253 10296135 9442577 7969601 6291350 4835485
42094D835485r80432m84860r9334J83752L64560L87843K95699K38152K31984J29231
$$ 4835485 3855053 3370193 3270859 3454611 3819171 4207014 4502713 4740865 4972849 5102080
42084E102080l5926O1315N42865R49002P13000n9192o19599m27235K77579Q17904
$$ 5102080 5066154 5127469 5670334 6619336 7332336 7273144 6653545 6226310 6503889 7321793
42074G321793Q23518N30361M08936N71567O12259J21315o90274j108766p44202
$$ 7321793 8145311 8675672 9084608 9656175 10268434 10389749 9699475 8590709 7846507
42065G846507r088L89404K22300k00734n19984n71863l01452K09426O57122P61337
$$ 7846507 7837419 8226823 8449123 8248389 7728405 7156542 6855090 7064516 7721638 8482975
42055H482975O06643N15554O21447P96365R27088R97117R78316R34323J119485
$$ 8482975 9089618 9605172 10226619 11022984 11950072 12947189 13925505 14859828 15979313
42046A5979313J621770K055870K105522K268273L401043N452145P353221Q373537
$$ 15979313 17601083 19656953 21762475 24030748 27431791 32883936 40237157 48610694
42038D8610694Q766053Q608748O889043K740040k792168p252252r093737q770523
$$ 48610694 57376747 65985495 72874538 75614578 72822410 65570158 56476421 47705898
42030D7705898p545047o082725m502809l042210k045957j574198j413665j327687
$$ 47705898 40160851 34078126 29575317 26533107 24487150 22912952 21499287 20171600
42022B0171600j121742p33715m42329o63778j302674j638587j179305l35718J40155
$$ 20171600 19049858 18316143 17873814 17210036 15907362 14268775 13089470 12753752 12893907
42013A2893907J52197K20827N66064P78016N15573P5324l5215J59124J38558l54310
$$ 12893907 13046104 13266931 13832995 14611011 15126584 15201908 15166693 15325817 15464375 15110065
42003A5110065q76880p64054N3341Q94550J044729M81201k44089p17523j002517
$$ 15110065 14233185 13469131 13522472 14417022 15461751 15942952 15698863 14981340 13978823
41994A3978823j281417j480109j413911j079932n82797P3097Q64492J518966J693247
$$ 13978823 12697406 11217297 9803386 8723454 8140657 8213754 9078246 10597212 12290459
41985A2290459J403229J052461R79191J161959J439515J814948K355322K869304
$$ 12290459 13693688 14746149 15725340 16887299 18326814 20141762 22497084 25366388
41977B5366388K895201K118461P86409l42978n36203L33187J674626K696644L139618
$$ 25366388 28261589 30380050 31166459 30823481 30287278 30620465 32295091 34991735 38131353
41968C8131353L536119M663150O635605Q543550R048681P356579L662948j086295
$$ 38131353 41667472 46330622 52966227 61509777 70558458 77915037 81577985 80491690
41960H0491690n598946q595894r386798q415064o925379n779252m825503l660186
$$ 80491690 74892744 66296850 56910052 48494988 41569609 35790357 30964854 27304668
41952B7304668k544380k001514j830235j317328m01425J91413J62989K08492R53125
$$ 27304668 24760288 22758774 20928539 19611211 19209786 19401199 19564188 19772680 20725805
41943B0725805J970444K416118K177231J820114J758997K077972K894285M200601
$$ 20725805 22696249 25112367 27289598 29109712 30868709 32946681 35840966 40041567
41935D0041567N395394N571267M389563K328021Q5046j903198l403577m269577
$$ 40041567 45436961 51008228 55397791 57725812 57810858 55907660 52504083 48234506
41927D8234506m484995m098393l127251j710662k19156J049793K150640L209087
$$ 48234506 43749511 39651118 36523867 34813205 34594049 35643842 37794482 41003569
41919D1003569M043006M326722L891448K597655L20527k480191m623360n320775
$$ 41003569 45046575 49373297 53264745 55862400 56182927 53702736 49079376 43758601
41911D3758601n107880m936351m705422l667686k044067r90214q48961o78366
$$ 43758601 38650721 33714370 29008948 25341262 23297195 22306981 21458020 20779654
41903B0779654J32196R92571J408407J914619K813692L025383J399893j436327
$$ 20779654 20911850 21904421 23312828 25227447 28041139 31066522 32466415 31030088
41895C1030088l685613m426696m046912l071127j759096o73031m08956o52249
$$ 31030088 27344475 22917779 18870867 15799740 14040644 13367613 12958657 12306408
41887A2306408n23895O275N3794o39915j144124p29257R2666M52786K79000k3702
$$ 12306408 11782513 11788788 11842582 11202667 10058543 9329286 9421952 9874738 10153738 10130036
41877A0130036l61900p37290p85094k77831K76988K71052l3915R4166O42526Q30117
$$ 10130036 9768136 9030846 8245752 7967921 8244909 8515961 8482046 8576212 9218738 10048855
41867A0048855L60986m7306L01589J071797J372075R46145M08849L43780N76337
$$ 10048855 10409841 10362535 10664124 11735921 13107996 14054141 14462990 14806770 15383107
41858A5383107N22075K0010n01193o88627p49194j008715j222702q01568K39288
$$ 15383107 15905182 15925192 15423999 14735372 13986178 12977463 11754761 10953193 11192481
41849A1192481J030795Q22009j14935q66654r31269n41747j21655J44511K18720
$$ 11192481 12223276 13045285 12930350 12063696 11132427 10590680 10469025 10613536 10832256
41840A0832256R4294j02534j53317m866J82740K89297L46462L60066K43250K2906
$$ 10832256 10926550 10824016 10670699 10665833 10848573 11137870 11484332 11844398 12087648 12110554
41830A2110554p3707J31211N38290Q77775R62582Q14264O47205P10907R96710
$$ 12110554 12036847 12168058 12706348 13584123 14546705 15360969 16008174 16719081 17715791
41821A7715791J169532J059581J151186K088435L518201L963364K353180n94746
$$ 17715791 18885323 19944904 21096090 23184525 26702726 30666090 33019270 32424524
41813C2424524l041323l910727l575405k827274j972945j163844q42818j232189
$$ 32424524 29383201 25472474 21897069 19069795 17096850 15933006 15090188 13857999
41805A3857999j759526j630683q48225j39262O5586N3406J73563K82568J05565
$$ 13857999 12098473 10467790 9619565 9480303 9545889 9599295 9772858 10055426 10160991
41796A0160991j96987j81070K68846P44291P52028K28148m13452o96306n06296
$$ 10160991 9964004 9782934 10051780 10796071 11548099 11776247 11362795 10666489 10160193
41787A0160193q4636L32790O97918R47092Q87156M98813J37798J10647J76290
$$ 10160193 10075557 10408347 11106265 12053357 12940513 13439326 13577124 13687771 13864061
41778A3864061j57492q83912j440423j451303j148766r29342q28217o24722k24772
$$ 13864061 13706569 12822657 11382234 9930931 8782165 7852823 7024606 6399884 6175112
41769F175112K44992N63117N37321J72796k46084m43521m97277o11788o08075
$$ 6175112 6420104 6983221 7520542 7693338 7447254 7003733 6506456 5894668 5286593
41760E286593r0138Q20540J420251J280477P10642J59261l29670p50123p66458
$$ 5286593 5196455 6016995 7437246 8717723 9428365 9587626 9257956 8507833 7741375
41751G741375k16100M02110M79718J01567j59994l5566K77016N13540M94855J08373
$$ 7741375 7525275 7927385 8407103 8508670 8348676 8313110 8590126 9103666 9598521 9706894
41741I706894m48046o41717k34687L23441N31658N21305O41929P90994P63302
$$ 9706894 9258848 8617131 8382444 8705885 9237543 9758848 10400777 11191771 11955073
41732A1955073Q27942J180957J215340L01354r39028j208065l41150N29840O81935
$$ 11955073 12783015 13963972 15179312 15480666 14541638 13333573 12992423 13522263 14204198
41723A4204198N36529M87359K28365k48076j56782P78805J477837R08977l44662
$$ 14204198 14740727 15228086 15456451 15208375 15051593 15830398 17308235 18217212 17872550
41714A7872550r20825n88568k99846n96747r79312q83231m53270j35849p0185
$$ 17872550 16951725 16363157 16063311 15466564 14487252 13604021 13150751 13014902 12944717
41705A2944717j20271j75663k43969l81915n54581n32161j18177M43378O07838
$$ 12944717 12824446 12648783 12404814 12022899 11468318 10936157 10817980 11261358 11869196
41696A1869196K41622j64763k04711o6699p1656j56139j70258k34167l83103l13051
$$ 11869196 12110818 11946055 11741344 11674645 11602989 11446850 11276592 11042425 10659322 10346271
41686A0346271N9692K67667N2246o6877L47501P29301L11110n26596p05178q6330
$$ 10346271 10405963 10673630 10725876 10658999 11006500 11735801 12046911 11520315 10815137 10728807
41676A0728807L65910J12543k56028r8429L50862N44028M60159M23466N09983
$$ 10728807 11094717 11207260 10951232 10852803 11203665 11747693 12207852 12631318 13141301
41667A3141301N35570L93974J75620J17887M54363J052422J301993Q00446Q5852
$$ 13141301 13676871 14070845 14246465 14364352 14818715 15871137 17173130 17973576 18059428
41658A8059428J39212J094223J983729J928532J121412M58086N61425J282118
$$ 18059428 18198640 19292863 21276592 23205124 24326536 24784622 25346047 26628165
41650B6628165J830761J392788k116j265821j359264n30166J07561J10374O4013
$$ 26628165 28458926 29851714 29849598 28583777 27224513 26694347 26801908 26912282 26976295
41641B6976295L96096P36587P53248P90881J194241J649240J726580J572413J568074
$$ 26976295 27372391 28108978 28862226 29653107 30847348 32496588 34223168 35795581 37363655
41632C7363655J749540K034900K616175L629720M749760N567390O170368P029990
$$ 37363655 39113195 41148095 43764270 47393990 52143750 57711140 63881508 70911498
41624G0911498Q520872J0766793J3745296J7456403K2138923K7821108L2692795
$$ 70911498 79432370 90199163 103944459 121400862 143539785 171360893 204053688
41617B04053688L2280911K2289026L610052j6450913k9480947l2520072k8919358
$$ 204053688 236334599 258623625 262233677 245782764 216301817 183781745 154862387
41610A54862387k3673023j9291324j5750818j2472241r363665o694037m779115
$$ 154862387 131189364 111898040 96147222 83674981 74311316 67617279 62838164
41603F2838164l729987l308024l130924k960189k609605j825462o14975N55904
$$ 62838164 59108177 55800153 52669229 49709040 47099435 45273973 44658998 45214902
41595D5214902J306698J839699K498830L188132L730308M412149N564199O981263
$$ 45214902 46521600 48361299 50860129 54048261 57778569 62190718 67754917 74736180
41587G4736180Q434920J0363054J3323475J7233060K1886310K7275034L1823723
$$ 74736180 83171100 93534154 106857629 124090689 145976999 173252033 205075756
41580B05075756L1056218K0697906K104639j7098431k9103601l1881854k8691655
$$ 205075756 236131974 256829880 258934519 241836088 212732487 180850633 152158978
41573A52158978k3462687j8255143j4013251j1319201r895903q713405p222209
$$ 152158978 128696291 110441148 96427897 85108696 75212793 66499388 59277179
41566E9277179n855890n087523m651529m009590l097913k279062j821731j668569
$$ 59277179 53421289 48333766 43682237 39672647 36574734 34295672 32473941 30805372
41558C0805372j589582j422952j170191q57208l93007K20120O09175L97562o4736
$$ 30805372 29215790 27792838 26622647 25765439 25372432 25592552 26201727 26599289 26534553
41549B6534553J10515J121475J956047J588077L09727o67168o48368O2748Q88064
$$ 26534553 26645068 27766543 29722590 31310667 31620394 30953226 30304858 30367606 31255670
41540C1255670J543020J934224K049333K040940K086774K176641K291229K626262
$$ 31255670 32798690 34732914 36782247 38823187 40909961 43086602 45377831 48004093
41532D8004093L298035M029503M568954N265674O742424R064326J1670517J4073414
$$ 48004093 51302128 55331631 59900585 65166259 71908683 80973009 92643526 106716940
41524A06716940J6247642J8442719K0926155K3527045K4856354K2556132J5664101
$$ 106716940 122964582 141407301 162333456 185860501 210716855 233272987 248937088
41517B48937088O901128J222882J058771L480462K909063l518188j3629795k2639767
$$ 248937088 255838216 257061098 258119869 261600331 264509394 260991206 247361411 224721644
41509B24721644k7012710k6272874k2331240j7768382j4244903j1752925r254320
$$ 224721644 197708934 171436060 149104820 131336438 117091535 105338610 96084290
41502I6084290o301513l939182l600606n116514o438232n774924l599673j910038
$$ 96084290 89782777 85843595 82242989 77126475 70688243 64913319 61313646 59403608
41494E9403608j739739k236050k236633j777901j555951j686152j721462j382779
$$ 59403608 57663869 55427819 53191186 51413285 49857334 48171182 46449720 45066941
41486D5066941n92703P00320J966020J916655o1771k626653l765651l225194k489379
$$ 45066941 44474238 45174558 47140578 49057233 48995462 46368809 42603158 39377964 36888585
41477C6888585k418816k303321j480213m02469M85336J478621K304796J492901
$$ 36888585 34469769 32166448 30686235 30283766 30769102 32247723 34552519 36045420
41469C6045420j507985m558432m910639k689045o68256o12136j415829j255018
$$ 36045420 34537435 29979003 25068364 22379319 21711063 21098927 19683098 18428080
41461A8428080j13657P43557Q99669J246973K476625L873614L864615J625599
$$ 18428080 18314423 19057980 19957649 21204622 23681247 27554861 31419476 33045075
41453C3045075j887500m554608m901571l318277j419602m20557l80396p18651
$$ 33045075 31157575 26602967 21701396 18383119 16963517 16542960 16162564 15443913
41445A5443913r08616p28630l64577l15731p93755j270604j099335m85952k06217
$$ 15443913 14535297 13806667 13442090 13126359 12332604 11062000 9962665 9476713 9270496
41436I270496l61779j98631O17426J339228J236950P30882P76632J490772K051063
$$ 9270496 8908717 8710086 9327512 10666740 11903690 12634572 13411204 14901976 16953039
41427A6953039J826537J046217L38066L4440L2253O2245m9279l09550o74903j140177
$$ 16953039 18779576 19825793 20163859 20198299 20230552 20292797 20243518 19933968 19259065 18118888
41417A8118888j582377j626783r98523l3069N48743N21716M37244P89311J253613
$$ 18118888 16536511 14909728 13911205 13878136 14426879 14948595 15385839 16175150 17428763
41408A7428763J111039K03376q98348j568369j658381j402120j054518o93664
$$ 17428763 18539802 18743178 17844830 16276461 14618080 13215960 12161442 11467778
41400A1467778k97900L3468O5312k17163m08210j84948J06710j22004o95527p28984
$$ 11467778 11169878 11203346 11268658 11051495 10643285 10458337 10565047 10443043 9747516 9018532
41390I018532J16390J063333J240024P00404M2916l88850m33414J41471J151918
$$ 9018532 9134922 10198255 11438279 12138683 12181599 11792749 11359335 11500806 12652724
41381A2652724J784778J637301J507555K252803L226558K929424J131148o90166
$$ 12652724 14437502 16074803 17582358 19835161 23061719 25991143 27122291 26432125
41373B6432125j116506r1617J585618L014504L222880J623521q99222k217117
$$ 26432125 25315619 25224002 26809620 29824124 33047004 34670525 33771303 31554186
41365C1554186j065844J531718L445887L524572K141905M94026n276J471175L870566
$$ 31554186 30488342 32020060 35465947 38990519 41132424 41626450 41621174 43092349 46962915
41356D6962915M398126J335768l419828n990133m884403k475676j658830k340157
$$ 46962915 51361041 52696809 49276981 43286848 38402445 35926769 34267939 31927782
41348C1927782k312925p45194P27239L85240j377765k818397l031953k603057
$$ 31927782 29614857 28869663 29596902 29982142 28604377 25785980 22754027 20150970
41340B0150970k361880k262446j682671m14521R38044J450956P06296p04983j489180
$$ 20150970 17789090 15526644 13843973 13429452 14367496 15818452 16524748 15819765 14330585
41331A4330585p78734Q54820J805267J149298k76668r01708l06515M84137N41129
$$ 14330585 13551851 14406671 16211938 17361236 17084568 16182860 15876345 16360482 16901611
41322A6901611J35650J0298J94845J76417p2500L5594P55719J504577J566308
$$ 16901611 17037261 17047559 17242404 17418821 17346321 17381915 18137634 19642211 21208519
41313B1208519R80613M33737M02272O59467O37034J17271n25853p58403m92324
$$ 21208519 22189132 22622869 23025141 23684608 24321642 24438913 23913060 23154657 22662333
41304B2662333j69270j94060l83555j69164N97200J245994R67803j32076j002911
$$ 22662333 22493063 22299003 21915448 21746284 22343484 23589478 24557281 24425205 23422294
41295B3422294q84316k74230k42921r59147j522579j334151r12302r54565j239028
$$ 23422294 22537978 22263748 22020827 21061680 19539101 18204950 17292648 16338083 15099055
41286A5099055j126605o96651n52302p21798o32256j57204J61465O3549n7483
$$ 15099055 13972450 13275799 12723497 12001699 11369443 11212239 11373704 11437253 11379770
41277A1379770M1229K7372l11162o15565n41494k04698K18019O83146Q73431M39220
$$ 11379770 11420999 11448371 11137209 10521644 9980150 9775452 9993471 10676617 11550048 11989268
41267A1989268n3299N64398K311996L805228M514073N861370Q631729J0494654
$$ 11989268 11935969 12500367 14812363 18617591 23131664 28993034 37624763 48119417
41259D8119417Q272364K325578l451283o195814o666761o789811o687980n409612
$$ 48119417 56391781 58717359 55266076 49070262 42403501 35613690 28925710 23516098
41251B3516098l097924q34009Q59675J929738J791988q1305k720726m145737l526762
$$ 23516098 20418174 19584165 20443840 22373578 24165566 24084261 21363535 17217798 13691036
41242A3691036j949225q53405n61256o00293o63438p21514o74523m32305j62197
$$ 13691036 11741811 10888406 10327150 9726857 9063419 8341905 7667382 7235077 7072880
41233G072880j14371k99268n35165o91041p15412n56348k46403J1671M6408m162
$$ 7072880 6958509 6659241 6124076 5433035 4717623 4161275 3914872 3926543 3972951 3968789
41223C968789J77888N89830P28070J65322p43645j094762n38036J93765K08703
$$ 3968789 4146677 4736507 5464577 5629899 4886254 3791492 3253456 3447221 3655924
41214C655924l66808o68575m21288k66797n93577p70843q1885J070769J591823
$$ 3655924 3289116 2620541 2199253 1932456 1338879 568036 486151 1556920 3148743
41205C148743J126851L86804M3507l0500k03646l59547j95083J00603L2720m02615
$$ 3148743 4275594 4662398 4705905 4675405 4471759 4112212 3917129 4017732 4050452 3647837
41195C647837o31794l35033Q7002J42152m2203n1539O0721p3848l40374j66473
$$ 3647837 3016043 2681010 2768012 2910164 2867961 2816422 2877143 2803295 2462921 2296448
41185B296448N42469J147666J210964J035701Q95572M25037n82809j370958j073630
$$ 2296448 2838917 3986583 5197547 6233248 7128820 7553857 6971048 5600090 4526460
41176D526460k2111O76222O19544K79831r4905o88719j242794j088650k85034
$$ 4526460 4504349 5180571 5800115 6079946 5985041 5296322 4053528 2964878 2679844
41167B679844K86798K64564K51106N56799N65525n8013n39349j70405N15376O23958
$$ 2679844 2966642 3231206 3482312 4039111 4604636 4546623 4007274 3836869 4352245 4976203
41157D976203K82922K33594N86161Q87952R86080R43271N17245l54102r17878
$$ 4976203 5259125 5492719 6078880 6966832 7952912 8896183 9413428 9059326 8141448
41148H141448m46786N31268Q28461K63504k43310j44767J75722L44349M76021
$$ 8141448 7694662 8225930 9054391 9317895 9074585 8929818 9105540 9449889 9925910
41139I925910N28394J25689o37444j014287o34001q6992r3713n78125r09002o87616
$$ 9925910 10454304 10579993 9942549 8928262 8294261 8207269 8113556 7535431 6626429 5938813
41129E938813m3094N64401P13530M50474K93078N04601O32881L03628R9710P48679
$$ 5938813 5895719 6460120 7173650 7624124 7917202 8421803 9054684 9358312 9458022 10206701
41119A0206701J640167J343499k26994j399768j035434j10156j59732j034077
$$ 10206701 11846868 13190367 12963373 11563605 10528171 10418015 10258283 9224206
41111I224206j339251o35701M6451q9949m74966k10562M55113M56096m13897r13977
$$ 9224206 7884955 7249254 7295705 7205756 6730790 6520228 6975341 7431437 7017540 6103563
41101F103563P3841J788354K253195Q19046q71910j035325k2195N16189P6873
$$ 6103563 6177404 7965758 10218953 11037999 10166089 9130764 9108569 9624758 9701631
41092I701631m20830m96514o71840j020847p16251M24528J305247J201683Q22296
$$ 9701631 9280801 8784287 8112447 7091600 6375349 6799877 8105124 9306807 10129103
41083A0129103Q71655P60892j47689j072223r32575j69422k8777n59964p64369
$$ 10129103 11000758 11761650 11613961 10541738 9609163 9439741 9410964 8851000 8086631
41074H086631m21258l14088p03840r26597o19447j54655K82066Q95117J392179
$$ 8086631 7665373 7351285 6647445 5720848 5101401 4946746 5228812 6123929 7516108
41065G516108J082787J72897k09911K52275M41827m39015j519818j533432o25031
$$ 7516108 8598895 8771792 8561881 8814156 9255983 8816968 7297150 5763718 5138687
41056E138687R4731K42149L57763O83489P63400L25991k23531m03575k09260J32451
$$ 5138687 5233418 5475567 5833330 6516819 7280219 7606210 7382679 6979104 6769844 6902295
41046F902295N26933Q89978R76879O28845O0324l39661m64986n47411p01439o43313
$$ 6902295 7429228 8319206 9296085 9924930 9985254 9645593 9180607 8633196 7931757 7288444
41036G288444j27694M44731L16131n42780j076138l27419J266311K299620K027826
$$ 7288444 7160750 7605481 7921612 7378832 6302694 5975275 7241586 9541206 11569032
41027A1569032J039291L20023K36110N69568R73481J079952O01084k99518r98380
$$ 11569032 12608323 12928346 13164456 13734024 14707505 15787457 16388541 16089023 15090643
41018A5090643j046386n82133M3644O85349J187522J163283M35797n27509j062081
$$ 15090643 14044257 13462124 13505768 14191117 15378639 16541922 16977719 16450210 15388129
41009A5388129j077585j013974j123222j189095r75269o10112m06123m86984o93727
$$ 15388129 14310544 13296570 12173348 10984253 10008984 9398872 8992749 8505765 7812038
41000G812038p76475o46873m76472n04833p17016q01665m87696J58175P89946
$$ 7812038 7035563 6388690 5912218 5407385 4690369 3888704 3401008 3559183 4349129
40991D349129J028250O85973k9207n38059m10062Q3624K70426M551j48855J60612
$$ 4349129 5377379 6063352 6034145 5496086 5086024 5169648 5440074 5444625 5295770 5456382
40981E456382N04616M34524K63626M47481N92448m3317j174061j541999n52403
$$ 5456382 5960998 6395522 6659148 7106629 7699077 7655760 6481699 4939700 4387297
40972D387297R31386J766732J806643J534620J076291K82730n75322r52622p73480
$$ 4387297 5318683 7085415 8892058 10426678 11502969 11785699 11210377 10257755 9484275
40963I484275m34925j22761L04595P47674P74290K50659m09061p93239q74583
$$ 9484275 9049350 8926589 9231184 9978858 10753148 11003807 10594746 9801507 8926924
40954H926924p06389k37489L13241L97117j37688o46648m94208L3985J54671k72465
$$ 8926924 8220535 7983046 8296287 8693404 8555716 7909068 7414860 7448845 7603516 7331051
40944G331051o14872m38765m9514M4917k33791n83825o65393k91135M10683R56023
$$ 7331051 6716179 6277414 6227900 6272817 6039026 5455201 4789808 4498673 4909356 5865379
40934E865379R55844O47766O02867Q74297R21135M82222n2967l96831q62320j631694
$$ 5865379 6821223 7468989 8071856 8946153 9867288 10349510 10296543 9899712 9037392 7405698
40924G405698k062114j416044j2672J047678J225768R90278R35918J081702J180289
$$ 7405698 5343584 3927540 3914868 4962546 6188314 7178592 8114510 9196212 10376501
40915A0376501J155741R51383L70973n64372j348519j433517q66404k42890l6029
$$ 10376501 11532242 12483625 12854598 12290226 10941707 9508190 8641786 8398896 8362867
40906H362867j27949m7027L97305P99006N69040l19790j159460j215168m98497
$$ 8362867 8234918 8187891 8585196 9384202 9953242 9633452 8473992 7258824 6760327
40897F760327L15613O20156L35251k17598o10841n49840j26327J80066N1663j40667
$$ 6760327 7075940 7696096 8031347 7813749 7202908 6653068 6526741 6706807 6758470 6617803
40887F617803K54965J188322J817096J659615J370956J831044K691680K542808
$$ 6617803 6872768 8061090 9878186 11537801 12908757 14739801 17431481 19974289
40879A9974289P06061j701466k918133k417683j142300q3462O78689J447731K153208
$$ 19974289 20680350 18978884 16060751 13643068 12500768 12417306 13095995 14543726 16696934
40870A6696934K525843K488768J886109L49067j881321l460760l238628j871587
$$ 16696934 19222777 21711545 23597654 23946721 22065400 18604640 15366012 13494425
40862A3494425j107516j444044j627254p31484M78427Q84912O44952N94565Q50476
$$ 13494425 12386909 10942865 9315611 8584127 9062554 9947466 10592418 11186983 12037459
40853A2037459R87689J003212J134045J209989J113191J363114K235196K828082
$$ 12037459 13025148 14028360 15162405 16372394 17485585 18848699 21083895 23911977
40845B3911977K203745J013846N88009O61981l49210k662315m350183l858177
$$ 23911977 26115722 27129568 27717577 28379558 28030348 25368033 21017850 17159673
40837A7159673j976718n54000l19166p83417j370023j715802j494331q05201l24189
$$ 17159673 15182955 14628955 14309789 13526372 12156349 10440547 8946216 8141015 7816826
40828G816826m15856n27679n2281O68889Q40283L57161j37963r9780M75744J213043
$$ 7816826 7400970 6873291 6821010 7489899 8330182 8687343 8549380 8449600 8925344 10138387
40818A0138387J627361J539164J498087K409226M430364O578129P612901O924892
$$ 10138387 11765748 13304912 14802999 17212225 21642589 28220718 35833619 42758511
40810D2758511M582020J298493j464577k348523j583900q68276j297565k255552
$$ 42758511 47340531 48639024 47174447 44825924 43242024 42373748 41076183 38820631
40802C8820631k821703l174255l752136m058602l451238k379497j676027j234864
$$ 38820631 35998928 32824673 29072537 25013935 21562697 19183200 17507173 16272309
40794A6272309n55489J26k09618p34989o10647K6814K89340K62558Q66585K004106
$$ 16272309 15716820 15716946 15507328 14772339 14161692 14188506 14477846 14740404 15606989 17611095
40784A7611095K371460J382013m9546r42412j216670r42534J6520J099662J069814
$$ 17611095 19982555 21364568 21315022 20372610 19155940 18213406 18229926 19329588 20399402
40775B0399402l41336j832659k233902j839915j423341r64674j91330N27816P43879
$$ 20399402 20058066 18225407 15991505 14151590 12728249 11763575 11572245 12100061 12843940
40766A2843940O68704N35932l5547j166103j957064j641612q70102p38509j060281
$$ 12843940 13512644 14048576 14013029 12846926 10889862 9248250 8378148 7639639 6579358
40757F579358q33559o0814K62919r5194k16291L80515R64307Q34333L21969L1788
$$ 6579358 5745799 5684985 5947904 5852710 5636419 6016934 6981241 7815574 8137543 8169331
40747H169331m3872o1164K34852Q77666J125669M05549n87992o36784L20168J130949
$$ 8169331 8125459 8064295 8299147 9176813 10302482 10708031 10120039 9483255 9803423 10934372
40737A0934372J115741R94792J829544L626474N353055N909517M771229K141256
$$ 10934372 12050113 13044905 14874449 18500923 23853978 29763495 34534724 36675980
40729C6675980j029855l453411m456677m463496m238190l921597l241650k344063
$$ 36675980 35646125 32192714 27736037 23272541 19034351 15112754 11871104 9527041
40721I527041j707842j348066q59022k81563j22757l37114j61468O27325J136404
$$ 9527041 7819199 6471133 5612111 5330548 5207791 4870677 4709209 5336534 6472938
40712F472938O91794L9896L50068J462796K057109J393724P2791r21229j233387
$$ 6472938 7164732 7204628 7554696 9017492 11074601 12468325 12541116 11619887 10386500
40703A0386500j134173j045233j158662j214021p67523M6982M00713j21334p47919
$$ 10386500 9252327 8207094 7048432 5834411 5066888 5113870 5514583 5393249 4645330
40694D645330n32178K87622P70944P33315O84036N61734k09361j333387j592017
$$ 4645330 4113152 4400774 5171718 5905033 6589069 7150803 6941442 5608055 4016038
40685D016038n84773N45253O51739k9057n75048o77416o37216o62481p19503o66411
$$ 4016038 3431265 3976518 4628257 4599200 4024152 3346736 2709520 2047039 1327536 661125
40675F61125k38715N89466J102725M85191q14119j311825m96181M19878L53531
$$ 661125 422410 1011876 2114601 2599792 1785673 473848 -22333 397545 751076
40666G51076j04363J23050Q36914J125040R50585R06835Q67636K20312p57197
$$ 751076 646713 769763 1606677 2731717 3682302 4589137 5456773 5677085 4919888
40657D919888j056727n30217j41610m11787o90517l81196M8791j06752o17487
$$ 4919888 3863161 3332944 3191334 2779547 2089030 1707834 1756625 1649873 1032386
40648A032386o66364n3478N62125N56122L4925m27057m53751j08369L68169P77654
$$ 1032386 366022 312544 874669 1430791 1465716 1038659 584908 476539 844708 1622362
40638A622362Q92812N20682q0861j79559N14337J133606O08587o86017j154700
$$ 1622362 2515174 3035856 2954995 2775436 3289773 4423379 5031966 4345949 3191249
40629C191249j35203J086056R80386k76280j296488j306651o46123J18531O97900
$$ 3191249 3056046 4142102 5122488 4846208 3549720 2243069 1596946 1715477 2413377
40620B413377R17961Q20301Q00517J039175J007721J79781r79268j427882q44818
$$ 2413377 3331338 4151639 4952156 5991331 6999052 7178833 6199565 4771683 3926865
40611C926865R7146O31877N09598j14846p88675r01479l20246K53257J22686m13395
$$ 3926865 4024011 4655888 5165486 5050640 4261965 3360486 3040240 3293497 3416183 3002788
40601C002788n25597o0729M28245O47313P63987P79942N32197K76220M50797Q57048
$$ 3002788 2477191 2416462 2844707 3492020 4256007 5035949 5568146 5844366 6295163 7152211
40591G152211Q76250N17364L86004N36903L03701m72990r66481n62781K24472
$$ 7152211 8028461 8545825 8931829 9468732 9772433 9299443 8332962 7770181 7994653
40582G994653N91931O06506Q96546J561715K085046K317777K963248M595881O233464
$$ 7994653 8586584 9193090 10089636 11651351 13736397 16054174 19017422 23613303 29846767
40573B9846767N612483J802466k632501l576193k82042K950501J540660l747261
$$ 29846767 35459250 37261716 34629215 31053022 30770980 33721481 35262141 31514880
40565C1514880p808558p463393m541340k435978j910477j588259q53944l77903
$$ 31514880 23706322 16242929 11701589 9265611 7355134 5766875 4912931 4535028
40557D535028m63526n21049j40152L73337N97407M98623L61486N51070J107693
$$ 4535028 4071502 3550453 3410301 3783638 4381045 4879668 5241154 5792224 6899917
40548F899917J397377P42217k99447j12895J840418L806760L589672J157275j520282
$$ 6899917 8297294 9039511 8740064 8627169 10467587 14274347 17864019 19021294 17501012
40539A7501012k876162k969647k487449j694755p13038m977K359n21177r72708
$$ 17501012 14624850 11655203 9167754 7472999 6759961 6754984 6757343 6236166 5263458
40530E263458r25726m52266K7931J35533j51150n20557o47171m18366Q5854O25833
$$ 5263458 4337732 3885466 3913397 4048930 3897780 3377223 2730052 2311686 2397540 3023373
40520C023373Q40723N43451J3733k85935k93355l13111m28952m05595k10793j02302
$$ 3023373 3864096 4407547 4421280 4135345 3841990 3528879 3099927 2694332 2483539 2381237
40510B381237o7304K59000Q80084J187470P76830J15401N7013R46502K371512
$$ 2381237 2313933 2572933 3453017 4640487 5417317 5532718 5589731 6536233 8907745
40501H907745L511976L664525K764451J415408J35256j130235k261791k358302
$$ 8907745 12419721 16084246 18848697 20264105 20399361 19269126 17007335 14649033
40493A4649033r46780P42073J325892J809602M310023P825667Q004157K874726
$$ 14649033 13702253 14444326 15770218 17579820 21889843 29715510 37719667 40594393
40485D0594393l350496m811704j227279K099089J127976k690228n389935n307755
$$ 40594393 37243897 32432193 31204914 33304003 34431979 31741751 26351816 21044061
40477B1044061l786773k643495k366499k304059j719614o82898m8287l42143r65480
$$ 21044061 17257288 14613793 12247294 9943235 8223621 7540723 7492436 7150293 6184813
40468F184813j088170r32781j219377j641196j156110J86857J031026O46795j00263
$$ 6184813 5096643 4163862 2944485 1303289 147179 334036 1365062 2011857 1911594
40459A911594j92635J94748L98202L90762M92028O47861O75754P03851Q08438
$$ 1911594 1718959 1913707 2311909 2702671 3194699 3842560 4518314 5222165 6030603
40450F030603O95987K33299j79244k17042j38132k33053k55181Q8164M94092M67059
$$ 6030603 6726590 6959889 6780645 6563603 6425471 6192418 5937237 6025401 6519493 6986552
40440F986552P7577j85673j33778k5409j20557m15375p46681r49044r64517q64639
$$ 6986552 7064129 6878456 6744678 6719269 6598712 6183337 5436656 4487612 3523095 2658456
40430B658456o74013k69999L11043O55870M83111K00526L88421Q46308Q54674
$$ 2658456 1984443 1714444 2025487 2681357 3164468 3364994 3753415 4599723 5454397
40421E454397L57312O3680K55409L68227M0561l06075l61695n32219j051775j293420
$$ 5454397 5811709 5875389 6130798 6499025 6539586 6233511 5871816 5339597 4287822 2994402
40411B994402p42479o967L8943l52134k40717M28640P24233K28978k94751n6153
$$ 2994402 2251923 2244956 2283899 1931765 1691048 2119688 2843921 3072899 2778148 2721995
40401B721995O62850J038400Q77068O67901O15493K54009p07031j591701j419290
$$ 2721995 3384845 4423245 5300313 5968214 6583707 6837716 6130685 4538984 3119694
40392C119694l12874M47985R0805n99610n05558J40189K47919k95415m81106R7957
$$ 3119694 2806820 3254805 3345610 2746000 2240442 2380631 2628550 2333135 1852029 1949986
40382A949986O04971M12656P5322K31122N06237L15026k7029J00353M85231M82418
$$ 1949986 2554957 2967613 3042935 3274057 3780294 4095320 4068291 4168644 4653875 5136293
40372E136293J64476J46844M80326O07761L79845L07466O66173R69040N80213
$$ 5136293 5300769 5447613 5927939 6535700 6915545 7223011 7889184 8858224 9438437
40363I438437m74785j473050j654989r74114k57584l93162j250335j747469j147543
$$ 9438437 8963652 7490602 5835613 4861499 4603915 4210753 2960418 1212949 65406
40354F5406J24244J132638J376989Q39384k47367j232768j301467m95231Q5866
$$ 65406 189650 1322288 2699277 3538661 3291294 2058526 757059 261828 347694
40345C47694k52830p23145k13544J032771J844407J806670J472154J140928N44357
$$ 347694 94864 -628281 -841825 190946 2035353 3842023 5314177 6455105 6999462
40336F999462k72122p88039q74416r45939j098780r22709l55743O5385N5047k2094
$$ 6999462 6727340 5939301 5064885 4118946 3020166 2097457 1741714 1807099 1862146 1840052
40326A840052J52119L92721M76603M55917L12535q0831m65137l18849K84225O01509
$$ 1840052 1992171 2384892 2861495 3317412 3629947 3549116 3083979 2765130 3049355 3650864
40316C650864K93322r0407m2679J38339j9490l44163l83629j66972n6475j24287
$$ 3650864 3944186 3853779 3811100 3949439 3929949 3585786 3202157 3035185 2978710 2854423
40306B854423j60043j16308j58093l79448p03281r23511p58457j49852M15596
$$ 2854423 2694380 2578072 2419979 2040531 1337250 413739 -344718 -494570 -78974
40297g8974L07907l60000p24417l04396L44777M66472J29725n3305R9292J73231
$$ -78974 228933 -131067 -855484 -1159880 -815103 -348631 -218906 -272211 -172919 312
40287C12j67832p27255r41013l39083R47486K020068J922945P44592l75210n82374
$$ 312 -167520 -894775 -1835788 -2174871 -1227385 792683 2715628 3460220 3085010 2502636
40277B502636j96165M2997L8037J11531K14505P2583j64754j24310J11050J72092
$$ 2502636 2306471 2349468 2387505 2499036 2713541 2786124 2621370 2497060 2608110 2780202
40267B780202R6229J74449K41137j05527n85939l87645N72949J321020J102240
$$ 2780202 2876431 3050880 3292017 3186490 2600551 2212906 2785855 4106875 5209115
40258E209115L10681k90200o31908j022145j261997q74898n6791L50044l7545
$$ 5209115 5519796 5229596 4597688 3575543 2313546 1438648 1381857 1731901 1694356
40249A694356o04946n59100O4241N31756M03118N7039J20526N69328P07005J37303
$$ 1694356 1089410 530310 594551 1126307 1529425 1586464 1706990 2276318 2983323 3120626
40239C120626n50194m40836M84575J289045J295074P92910K90825k94351j112727
$$ 3120626 2570432 2129596 2614171 3903216 5198290 5991200 6282025 5987674 4874947
40230D874947j564342r15358M01813J050052N35162j53982k6480N78240P46749
$$ 4874947 3310605 2395247 2797060 3847112 4382274 4228292 4201812 4780052 5526801
40221E526801M38236L45516O56104Q20167M89100n3238m34046n27571k06633N87338
$$ 5526801 5965037 6310553 6966657 7786824 8275924 8222686 7788640 7261069 7054436 7641774
40211G641774J414209J621229J230031Q98415Q08813L49651p23459j588403j452352
$$ 7641774 9055983 10677212 11907243 12805658 13614471 13964122 13240663 11652260 10199908
40202A0199908p41957m49098p22884r12260p14718m36201k35053N8629L39151
$$ 10199908 9457951 9008853 8285969 7373709 6658991 6222790 5987737 6046366 6385517
40193F385517K01700l39316p54876p66868o04214l74895J32721P80421R06403
$$ 6385517 6587217 6247901 5493025 4726157 4121943 3747048 3879769 4660190 5566593
40184E566593K44131n29009o22216p4055N64879J030517J284203J060086J86714
$$ 5566593 5810724 5281715 4659499 4585444 5150323 6180840 7465043 8525129 8711843
40175H711843q07611j122011p57064n50511r81603j483369j256933l71770L58787
$$ 8711843 7904232 6782221 6025157 5474646 4493043 3009674 1752741 1380971 1739758
40166A739758L96691m1250m67077o62818o05158k14121M75711J049823J033527
$$ 1739758 2136449 2095199 1628122 965304 360146 146025 621736 1671559 2705086
40157B705086N18062R1725J5080j19235o03889r13442l60429P30331J190534M64984
$$ 2705086 3223148 3314873 3329953 3210718 2606829 1693387 1332958 2063289 3253823 3718807
40147C718807o74544j117692o50131J03457N50981N38305J87185k05320k57699
$$ 3718807 3044263 1926571 1276440 1379897 1930878 2469183 2656368 2451048 2193349
40138B193349Q4658L19988k6791o52809p57976j24508N40050N25955j5139m42675
$$ 2193349 2278007 2597995 2571204 1918395 1160419 1035911 1575961 2101916 2086777 1644102
40128A644102n38777n77500o22817l31361L82631R58694Q39932K43421j38333
$$ 1644102 1105325 527825 -94992 -426353 -43722 914972 1754904 1998325 1859992
40119A859992o4702P8462l660j28327r6387o9102k12796l29260j64838J63692
$$ 1859992 1795290 1873752 1870092 1741765 1645378 1576276 1363480 1034220 869382 1033074
40109A033074L40704K42113n3865l70633l63855K31414R89465R48213j29758j148195
$$ 1033074 1373778 1615891 1562026 1191393 827538 1058952 2048417 2996630 2866872 1718677
40099A718677r98983o2621M36156K22443R5619M08768N93285L64915K58264N24266
$$ 1718677 719694 657073 1093229 1315672 1411291 1820059 2413344 2778259 3036523 3560789
40089C560789N17059j88257r13754q60026l14646j09138l77381o24622o34890
$$ 3560789 4077848 3889591 2975837 2115811 1801165 1692027 1314646 690024 55134
40080E5134n33859k32919M18310J068928J148428O63080J51835q4706j96771l03623
$$ 55134 -478725 -711644 -293334 775594 1924022 2587102 2738937 2654231 2457460 2153837
40070B153837l03559j43085J21848M61053P46766P14354M26368M46622J015125
$$ 2153837 1850278 1707193 1829041 2290094 3036860 3751214 4177582 4624204 5639329
40061E639329J396322P87436l51942p54896j05010N60222L63141l56191q08568
$$ 5639329 7035651 7823087 7471145 6716249 6611239 7171461 7534602 7178411 6369843
40052F369843p90861n01827j2069N15708O27204K27245K0909O59524J752216K388181
$$ 6369843 5578982 5077155 5065086 5580794 6207998 6435243 6456152 7115676 8867892 11256073
40042A1256073K394809K305361K163600J259088o59437k632537l470659l056291
$$ 11256073 13650882 15956243 18119843 19378931 18719494 16086957 12616298 9560007
40034I560007k173918j392639p17706j60491N1879n7412j10267M4787J06771q8915
$$ 9560007 7386089 5993450 5275744 5115253 5167132 5109720 4999453 5044240 5151011 5062096
40024E062096k31891j14124o7180l60816o05427l60893K2905p3416m18751k19932
$$ 5062096 4830205 4716081 4648901 4288085 3682658 3321765 3344670 3271254 2852503 2632571
40014B632571N14252Q47235L30044l66453n58999m16912k63667J25323Q67884
$$ 2632571 3146823 3994058 4324102 3957649 3398650 2981738 2718071 2843394 3711278
40005C711278J342962R97726K53015j58556k82733n80763r12974p73992k56498
$$ 3711278 5054240 6051966 6304981 6146425 5863692 5282929 4369955 3595963 3339465
39996C339465R0729J63244K29303J77987k49920o34691k81349N59671Q84727M64888
$$ 3339465 3430194 3593438 3822741 4000728 3750808 3116117 2834768 3394439 4279166 4744054
39986D744054J83557O09644J199120J284441R81413O89137N09195O06914J294849
$$ 4744054 4927611 5537255 6736375 8020816 9002229 9691366 10200561 10807475 12102324
39977A2102324K182932K082286N15664j353002k104787j787391j383888j144715
$$ 12102324 14285256 16367542 16883206 15530204 13425417 11638026 10254138 9109423
39969I109423n73366K59651O84755P81374J508025L037241M004038L157314J049532
$$ 9109423 8536057 8795708 9480463 10261837 11769862 14807103 18811141 21968455 23017987
39960B3017987p51862j653413k280767k946955k991522j987321p29131l18367
$$ 23017987 22266125 20612712 18331945 15384990 12393468 10406147 9677016 9358649
39952I358649p25874j014013p76559n53499p42426q78737l95742M35673Q38687
$$ 9358649 8632775 7618762 6842203 6288704 5546278 4667541 4271799 4707472 5546159
39943E546159N20706j05699n19424n50536l74226l23113n67205q00903n14127
$$ 5546159 6066865 5961166 5441742 4891206 4516980 4193867 3626662 2825759 2311632
39934B311632K29732O89146M38221Q023O7978M21222M34186P5041k18158m12182
$$ 2311632 2541364 3230510 3668731 3676754 3744732 4165954 4600140 4675181 4457023 4044841
39924D044841p93159j173578j043986m79112q0880j6017R7889L54337M50058M34343
$$ 4044841 3251682 2078104 1034118 555006 474126 458109 555998 910335 1360393 1794736
39914A794736O59828R13622N72057k29104o09994l53709j85713l19055M4731J192682
$$ 1794736 2454564 3368186 3940243 3711139 3101145 2747436 2561723 2242668 2287399 3480081
39904C480081K114158K046656J664164J731044J630843M73335j155278j904407
$$ 3480081 5594239 7640895 9305059 11036103 12666946 13140281 11985003 10080596
39896A0080596j579316j063313p63877m49810l06497p50348j279322q58591M28050
$$ 10080596 8501280 7437967 6674090 6224280 5917783 5167435 3888113 3029522 3457572
39887C457572J300713J032449J96332m86767r24039j029530m86623M10313P02749
$$ 3457572 4758285 5790734 5987066 5500299 4576260 3546730 3060107 3470420 4173169
39878D173169J25482l56464L3951P21400P07967J0480n66926o34404m88337m61090
$$ 4173169 4298651 3942187 3976138 4697538 5405505 5415985 4849059 4214655 3726318 3265228
39868C265228n74157o72374n19098L5960P09186R04425M55294q7519j76024R5183
$$ 3265228 2691071 2018697 1499599 1535559 2244745 3149170 3604464 3516945 3340921 3436104
39858C436104L27074L67992K27310j02399l80010j47688N51376R64128O27039
$$ 3436104 3763178 4131170 4358480 4256081 3876071 3728383 4279759 5243887 5870926
39849E870926R9600J15651M61182M29600M3881l6169L17349M97093J89169j73483
$$ 5870926 5970526 6086177 6547359 6976959 7020840 6984671 7302020 7799113 7988282 7814799
39839G814799j83436l3154n6186k20869l51169m30384m58603l78744l05676m39425
$$ 7814799 7631363 7598209 7542023 7321154 6969985 6539601 6080998 5702254 5396578 4957153
39829D957153o31470n04673j47003j25985n72501q66620o09677k62055k60658
$$ 4957153 4325683 3821010 3674007 3548022 2975521 2108901 1499224 1237169 976511
39820I76511j40815O52466J556935J507927N59097j61499j28914J6356j94446
$$ 976511 835696 1488162 3045097 4553024 5112121 4950622 4821708 4838064 4643618
39811D643618k56834K46043P45359N97909J43967K9185R8835j10067k93659J37091
$$ 4643618 4386784 4632827 5378186 5976095 6120062 6149247 6248082 6138015 5844356 5981447
39801E981447Q18945Q03854M6838n73951p09847q60788j124495q83242j20673
$$ 5981447 6800392 7604246 7651084 7077133 6367286 5506498 4382003 3498761 3378088
39792C378088J95818l03959n84151J43786R78556O53821m82122j062691p29439
$$ 3378088 3573906 3269947 2685796 2829582 3808138 4461959 3979837 2917146 2187707
39783B187707k38352J07109O79452J220628P97320n58975j438709r12465J89465
$$ 2187707 1949355 2056464 2735916 3956544 4753864 4194889 2756180 1843715 2033180
39774B033180N63290J72178j18715r441R1812P6694L28909Q73040J106169O59327
$$ 2033180 2596470 2768648 2649933 2640492 2732304 2808998 3137907 4010947 5117116 5776443
39764E776443K8019l9798M32655O26347q245r34815j096858k79542N22619L84366
$$ 5776443 5804462 5764664 6197319 6823666 6815421 5880606 4783748 4504206 5026825 5411191
39754E411191k94141l87794K97799P70744L93252j52463M2735O89785P52777L6508
$$ 5411191 5117050 4729256 5027055 5797799 6191051 6038588 6081323 6771108 7523885 7560393
39744G560393n23132k24674M58944O22143J09803m80297p01436o79468o80754
$$ 7560393 7037261 6812587 7271531 7893674 8003477 7523180 6821744 6142276 5461522
39735E461522p03453o49421n83157n54559l44096K96905J182779J748657J613702
$$ 5461522 4758069 4108648 3525491 2970932 2626836 2923741 4106520 5855177 7468879
39726G468879Q81363j17313j086005j706006j670166j003490j39781M96594P89193
$$ 7468879 8350242 8232929 7146924 5440918 3770752 2767262 2627481 3124075 3913268
39717C913268P27510K81852k85859l88366K03635R24172J077370P07250L88260
$$ 3913268 4640778 4922630 4636771 4248405 4452040 5376212 6453582 7160832 7549092
39708G549092M07623O43251R94186J322055J150274J45704j116997j587664j041709
$$ 7549092 7956715 8599966 9594152 10916207 12066481 12212185 11095188 9507524 8465815
39699H465815k91107L8454K32293P11559J217992J241196P71665J48318m82251
$$ 8465815 8174708 8213162 8445455 9157014 10375006 11616202 12387867 12536185 12053934
39690A2053934j095584j464237j371771j007073p73557p92838q64494q07051n96714
$$ 12053934 10958350 9494113 8122342 7115269 6341712 5548874 4684380 3877329 3280615
39681C280615k67205J03899L56600L48377P9508l04709n66798m95686j39786J60474
$$ 3280615 3013410 3117309 3473909 3822286 3901794 3597085 3030287 2534601 2394815 2555289
39671B555289J91565J82811L92894N64209K65502l46872o98815o73134o31358
$$ 2555289 2746854 2929665 3322559 3886768 4152270 3805398 3106583 2433449 1802091
39662A802091n66133r5138N11650L00167q41001j546348p00595Q87035J520347
$$ 1802091 1235958 1140820 1652470 1952637 1111636 -434712 -1135307 -248272 1272075
39653A272075Q77713J59663J69655L86014J28150l49418m31440j51896k4744j83479
$$ 1272075 2149788 2309451 2479106 2865120 2993270 2643852 2212412 2060516 2035772 1852293
39643A852293k38872N3347L83385K86257k28498o45559n64653j73007P8263J32251
$$ 1852293 1613421 1666768 2050153 2336410 2107912 1462353 897700 724693 802956 935207
39633I35207L21170P05652Q49363M49514j74550n19196n39512n19582n25020l79749
$$ 935207 1256377 1962029 2811392 3260906 3086356 2567160 2027648 1508066 983046 603297
39623F03297r6624L8490j35109l90525l37787J35131O64424P32932K92744q8311
$$ 603297 506673 545163 410054 19529 -318258 -183127 481297 1214229 1506973 1418662
39613A418662N5028M23659M40117K04455K99067O85738O47163L6859l09882J26231
$$ 1418662 1473690 1897349 2337466 2541921 2840988 3526726 4173889 4210748 3900866 4027097
39603D027097O76189N57032P4580n3961N0086j85510n94188n25930q2022n2769
$$ 4027097 4703286 5260318 5334898 5280937 5331023 5145513 4551325 4025395 3943373 3890604
39593C890604o17420j036552p73630j37381L41712M61497J36418o32689j345858
$$ 3890604 3273184 2236632 1463002 1325621 1667333 2128830 2265248 1632559 286701
39584B86701j247760l27636M73138M12658j34403k61768L29944J138982J548899
$$ 286701 -961059 -1288695 -815557 -402899 -537302 -799070 -469126 669856 2218755
39575B218755J362956P79926J24230l68744o02906n43757k22505J38554K19593
$$ 2218755 3581711 4361637 4485867 4117123 3514217 2970460 2747955 2886509 3106102
39566C106102j4228k23018j65196k2777m4182j47793j43692m9959Q0670K84487
$$ 3106102 3091874 2868856 2703660 2680883 2636701 2488908 2345216 2295257 2375927 2660414
39556B660414L54543j13808r36929j196111m77481L35969K86656k15584j48907
$$ 2660414 3014957 2901149 1964220 768109 290628 626597 913253 697669 548762
39547E48762M11435N33248R2884j22753N7745p2844o22986o93066R0770Q20513
$$ 548762 960197 1493445 1586329 1463576 1521321 1448477 825491 132425 223195 1043708
39537A043708P10072K37636J77205L72483K82090N1978J80673N43021N15589j21888
$$ 1043708 1753780 1991416 2168621 2541104 2823194 2875172 3055845 3598866 4114455 3992567
39527C992567r26835j290817r40114j93643J74923k61937q99110p91655k2598
$$ 3992567 3065732 1774915 834801 641158 816081 554144 -344966 -1136621 -1159219
39518a159219M31080K74390L06549R52766J498633J351942R92477R07252N99843
$$ -1159219 -728139 -453749 -147200 805566 2304199 3656141 4648618 5555870 6155713
39509F155713l68944j227957j024349j77960J46245k26259n01050l64878k93237
$$ 6155713 5786769 4558812 3534463 3356503 3502748 3276489 2775439 2410561 2117324
39500B117324n08423o05059k47451M70803J287159J804004J528822N27248l12033
$$ 2117324 1608901 1003842 756391 1227194 2514353 4318357 5847179 6374427 6062394
39491F062394l74865k53102p45401j416745j227703k44444M84661N71595N53690
$$ 6062394 5687529 5434427 4689026 3272281 2044578 1800134 2284795 2856390 3410080
39482C410080N78520J65440n52138o60907P3509P58199Q43659R21680J481145
$$ 3410080 3988600 4154040 3601902 2940995 3014504 3772703 4616362 5538042 7019187
39473G019187J928637J591111Q19331L19382J38582R3259M77542J415537K043664
$$ 7019187 8947824 10538935 11358266 11677648 11816230 11909489 12387031 13802568 15846232
39464A5846232J346155m25447j988899k518838k189840j449813n77418M6505R411
$$ 15846232 17192387 16766940 14778041 12259203 10069363 8619550 8042132 8088637 8098048
39455H098048n60053r98135q88136m76000j91924j32880j95779m00910p89814
$$ 8098048 7537995 6539860 5651724 5175724 4983800 4850920 4655141 4254231 3464417
39446C464417j112819q92131O1560J231103J687924J018844j00592n38107O0842
$$ 3464417 2351598 1459467 1521027 2752130 4440054 5458898 5358306 4820199 4881041
39437D881041R63438J311521R88957L84225k07599n57884l09216N85555J405036
$$ 4881041 5844479 7156000 8144957 8529182 8321583 7763699 7454483 8040038 9445074
39428I445074J267328K47761o14659n53543J16505O01296O09430M14352K54541
$$ 9445074 10712402 10960163 10345504 9791961 9908466 10509762 11119192 11533544 11788085
39419A1788085J28870J06185L90093R27301J249180R65078L05104o2092K59699
$$ 11788085 11916955 12023140 12413233 13340534 14589714 15554792 15859896 15797804 16057503
39410A6057503J037373J719522J852210J180651k70641j967370l025746l008003
$$ 16057503 17094876 18814398 20666608 21847259 21576618 19609248 16583502 13575499
39402A3575499k408717j964076j663549j006232j29611J38151m07028q27890m44463
$$ 13575499 11166782 9202706 7539157 6532925 6403314 6541465 6134437 5306547 4862084
39393D862084k0330o08646j679869j634661j78763J093200R18349Q156l10531
$$ 4862084 4841754 4233108 2553239 918578 739815 1833015 2751364 2759520 2448989
39384B448989r2320k48325o93233m59627M94007J008455M90411k89801n66285
$$ 2448989 2356669 2108344 1415111 955484 1449491 2457946 2948357 2658556 2092271
39375B092271n56807n18216m4878Q33939J007451p5755j056896l96300J211201
$$ 2092271 1535464 1017248 972370 1806309 2813760 2738005 1681109 1284809 2496010
39366B496010J747447P84891k57851o32646j089106j861495j790719l44028J109031
$$ 2496010 4243457 5028348 4770497 4137851 3048745 1187250 -603469 -947497 161534
39357A61534J186643L87731q3759k36570o78404j023179m58568O24062J024624
$$ 161534 1348177 1735908 1652149 1415579 737175 -286004 -744572 -120510 904114
39348I04114N15554l222N2647M45357Q54722J088077P66798j71525q89280o00705
$$ 904114 1419668 1416446 1469093 1914450 2769172 3857249 4624047 4452522 3563242 2962537
39338B962537J62606L23783m3255o1201K21155j8532n88409l59448O23249Q35064
$$ 2962537 3125143 3448926 3405671 3344470 3565625 3547093 2958684 2599236 3222485 4057549
39328D057549l22365j394832j013091K13853R44719J053970J187801J331552J064964
$$ 4057549 3735184 2340352 1327261 1541114 2485833 3539803 4727604 6059156 7124120
39319G124120O06717M57325M65903K83057L18056J165813K309562K425449J009485
$$ 7124120 7730837 8188162 8654065 8937122 9255178 10420991 12730553 15156002 16165487
39310A6165487j037625k453073k663491j898887q70377l41702n45021r81578j062000
$$ 16165487 15127862 12674789 10011298 8112411 7242034 6900332 6355311 5373733 4311733
39301D311733q02566o22822o84155p58484n84501j14580M13252N58143J67295
$$ 4311733 3509167 2886345 2202190 1443706 859205 744625 1157877 1716020 1883315
39292A883315j74170K84008J325834J877395J449652P04481K79935n0647n46783
$$ 1883315 1709145 1993153 3318987 5196382 6646034 7350515 7630450 7579803 7033020
39283G033020p60204l39529K60995O55016J242306K130775K248986P79616j211696
$$ 7033020 6272816 5933287 6194282 6849298 8091604 10222379 12471365 13250981 12039285
39274A2039285j980794j487126j127195j381903j316595m80368K41117R2988m64219
$$ 12039285 10058491 8571365 7444170 6062267 4745672 4265304 4506421 4599409 4135190
39265D135190o62269m58470j88376J2786M7936j72691l13839J18452Q70296J073178
$$ 4135190 3472921 3014451 2826075 2838861 2886797 2714106 2400267 2518719 3389015 4462193
39255D462193N17115k9324n1051K8015k16725m34135j94697K35646L85710L02959
$$ 4462193 4979308 4949984 4898933 4926948 4710223 4276088 4081391 4317037 4702747 5005706
39245E005706L03782M63828P22737J015210J024041L82192o03608j089602q61612
$$ 5005706 5309488 5773316 6496053 7511263 8535304 8917496 8313888 7224286 6362674
39236F362674o27455p77322p13706l770O36302L37427n49923r54527n56032L9843
$$ 6362674 5735219 4957897 4244191 4240421 4876723 5214150 4664227 3709700 3153668 3193511
39226C193511L00486K21444J3160n7554K44941O87096N76692k57044r64407q08474
$$ 3193511 3493997 3715441 3728601 3671047 3915988 4603084 5179776 4922732 3958325 3149851
39216C149851k85683k94206o58513n03812K01846O16588M69371M17608Q34875
$$ 3149851 2864168 2569962 1911449 1407637 1609483 2226071 2695442 3113050 3947925
39207C947925J272425J365998J316728J157351M82453o45210j376162j204138
$$ 3947925 5220350 6586348 7903076 9060427 9542880 8897670 7521508 6317370
39199F317370o86442n03966n26305m09578l81290o63802p78741l35637M6384l30650
$$ 6317370 5630928 5126962 4600657 4191079 3809789 3145987 2367246 2031609 2077993 1747343
39189A747343q28047k78620R42025J121714k13178j367669q76359L94483O71384
$$ 1747343 919296 640676 1582701 2704415 2491237 1123568 247209 641692 1313076
39180A313076r8870m70261R2157N75218K81815j11121J09213M70283K44960k52769
$$ 1313076 1214206 743945 836102 1411320 1693135 1582014 1691227 2161510 2406470 2153701
39170B153701k56406J20163J29808l08141n06406j52717K80889L46184J30870
$$ 2153701 1897295 2017458 2147266 1839125 1332719 1180002 1460891 1807075 1937945
39161A937945j39363l68832l61637K3328L52166m9165r94988j376063n81975O26465
$$ 1937945 1798582 1429750 1068113 1091441 1443607 1394442 399454 -976609 -1558584 -932119
39151i32119J118301P20041N9369l74376m14000N9355Q33776J123410L96211o91417
$$ -932119 186182 906223 965592 591216 177216 236571 1070347 2193757 2589968 1898551
39141A898551r46138k07062M74709L31384j73174j92533L01393O38349M44194
$$ 1898551 952413 745351 1220060 1551444 1378270 1185737 1487130 2125479 2569673
39132B569673N0545k3573K89948N45207L03204k95592n98063k19102M09564N68176
$$ 2569673 2620218 2596645 2886593 3431800 3735004 3439412 2841349 2622247 3031811 3599987
39122C599987K10257j6172K95748Q04777R64590O55360R5014m82459q19775o84461
$$ 3599987 3810244 3794072 4089820 4894597 5859187 6514547 6609561 6127102 5307327 4622866
39112D622866k42992p3484m45853q54110o67304k8504L56080J85788j80785l91375
$$ 4622866 4379874 4306390 3860537 3006427 2339123 2310619 2666699 2852487 2671702 2280327
39102B280327m68180m21565n8756N39498Q09978L93312k58953m10939j8171K70107
$$ 2280327 1812147 1390582 1331826 1871324 2681302 3074614 2815661 2404722 2386551 2656658
39092B656658L0582m56456p12118o38281m28954k31607j24655j92304l75134m15473
$$ 2656658 2687240 2230784 1518666 880385 451431 219824 95169 -97135 -472269 -887742
39082h87742j87722N8847L7692j07970L0676N19933R16861P80743J73711m16161
$$ -887742 -1075464 -1016617 -978925 -1086895 -1056219 -536286 380575 1161318 1335029 918868
39072I18868n45938j93764K52639M02243K99728L33153O18344P24121K74678l99226
$$ 918868 372930 179166 431805 834048 1133776 1466929 2085273 2809394 3084072 2684846
39062B684846o24307k84498J15795K47677K61040K13503j62682q14219j066385
$$ 2684846 2060539 1776041 1891836 2139513 2400553 2614056 2451374 1637155 570770
39053E70770m73404M27430P57281M16013J6086p1900P495J34683L41342L96058
$$ 570770 97366 524796 1282077 1698090 1714176 1642276 1649771 1784454 2125796 2521854
39043B521854j7787n53304l58259O60052J389454Q90586k82826q26230m12790
$$ 2521854 2504067 1950763 1592504 2252556 3642010 4532596 4249770 3423540 3010750
39034C010750J09616J17653p2827o1652r0422m21365o23699j78975N52198P34432
$$ 3010750 3120366 3238019 3165192 3103540 3013118 2591753 1968054 1789079 2341277 3075709
39024C075709L34181K23886Q48836J492254J304450N72741L51161R91447J640449
$$ 3075709 3409890 3633776 4482612 5974866 7279316 7852057 8203218 9194665 10835114
39015A0835114J338222K27479o10936m10260M31384Q42301L31488m67700o60842
$$ 10835114 12173336 12400815 11789879 11379619 11811003 12653304 12984792 12517092 11856250
39006A1856250k89813k31788q70206j424195r98739Q5170O15568M8008q64053
$$ 11856250 11566437 11334649 10464443 9040248 8041509 8126679 8742247 8790255 7926202
38997G926202j133887p20889l06986k32508j59710K09142N57752M49315J67176
$$ 7926202 6792315 6071426 5764440 5531932 5372222 5581364 6139116 6588431 6755607
38988F755607M90166J495090K245095K242126K574741M469248O876921P059874
$$ 6755607 7245773 8740863 10985958 13228084 15802825 20272073 27148994 34208868
38980C4208868M151189O44136q39289r95764k309844m912755o269684n053770
$$ 34208868 38360057 39004193 38164904 37169140 34859296 29946541 23676857 18623087
38972A8623087l046694k340178k553061k164812j164956o99520r27448r31026
$$ 18623087 15576393 13236215 10683154 8518342 7353386 6653866 5726418 4795392
38964D795392m39563j44774l20277m20004k26612k81495q12159j128141n89392
$$ 4795392 4355829 4211055 3890778 3470774 3244162 2962667 2150508 1022367 432975
38955D32975M07680R03662N35222j34469l29764Q2207M80166K81894k38108k83020
$$ 432975 840655 1744317 2279539 2145070 1815306 1897513 2377679 2659573 2421465 2138445
38945B138445K73087O30269L11096l7860K77522P61281M92593k93092m95821R5410
$$ 2138445 2411532 3041801 3352897 3315037 3592559 4353840 4846433 4553341 4057520 4152930
38935D152930M81052O9044m23237j34611O73874J104948Q73449N05740N29430
$$ 4152930 4633982 4703026 4279789 4145178 4819052 5924000 6797449 7303189 7832619
38926G832619Q76686J037637O34449j36651o89050p56465o87482q20907r43634
$$ 7832619 8709305 9746942 10381391 10244740 9555690 8799225 8111743 7290836 6347202
38917F347202p83684o21896p81367q71077l37604M81096P48714M24760K07842
$$ 6347202 5563518 4941622 4160255 3289178 2951574 3432670 4181384 4606144 4813986
38908D813986K76091J54448j37303J3687N60634O71104K30431K30075J114019
$$ 4813986 5090077 5244525 5107222 5120909 5681543 6352647 6583078 6813153 7927172
38899G927172K021358K446691L323598N260185O794131N957119K991000j725j811614
$$ 7927172 9948530 12395221 15718819 20979004 27773135 33730254 36721254 36719529 34907915
38890C4907915l037434m291310n022898m624354l571640k746879k283914j725259
$$ 34907915 31870481 27579171 22556273 17931919 14360279 11613400 9329486 7604227
38882G604227r46752l72476l66460p40143r24904n93700q1844l6750n83364j095354
$$ 7604227 6657475 6284999 5918539 5178396 4253492 3659792 3577948 3541198 2957834 1862480
38872A862480r63710l01281L40038O22976N23633J53697j71145p1996L02516K62287
$$ 1862480 898770 597489 937527 1560503 2084136 2237833 2066688 1994692 2297208 2559495
38862B559495m02896r06657n75860N2417N3217l98203l49723L40686P99593N29779
$$ 2559495 2156599 1249942 674082 726499 779716 381513 31790 372476 1172069 1701848
38852A701848J0591k54691l79349n11812m31171q2555J54255Q4269K4767K26654
$$ 1701848 1712439 1457748 1078399 566587 135416 52861 207116 291385 316152 542806
38842E42806M98252O46069P62883Q72998Q33425P47439Q75680J014851O99933
$$ 542806 1041058 1687127 2450010 3323008 4156433 4903872 5779552 6794403 7494336
38833G494336J80992K77440R20813Q93369l27501j476865j230518k17603q6331
$$ 7494336 7675328 7952768 8873581 9766950 9439449 7962584 6732066 6514463 6428132
38824F428132j052524j719699j224403k68170J97063J83215J21785J0484k94304
$$ 6428132 5375608 3655909 2431506 2163336 2360399 2543614 2665399 2675883 2381579
38815B381579n45673m61134k17777j09848m5907J51081K35204j46838p71365r70520
$$ 2381579 1835906 1374772 1156995 1047147 1001240 1152321 1387525 1240687 469322 -501198
38805e01198m75341K39902N28786K32641k81205n16258k17167M61363J056323
$$ -501198 -976539 -736637 -207851 24790 -256415 -772673 -989840 -528477 527846
$$ [...]
##END NTUPLES=NMR SPECTRUM
##END=
