##TITLE=31Pdec_DE-164rm_1H
 DMSO-d6+CCl4, 64 sc
 13.7.2026
##JCAMPDX= 6.0         $$ Bruker NMR JCAMP-DX V2.0
##DATA TYPE= NMR SPECTRUM
##DATA CLASS= NTUPLES
##ORIGIN= UXNMR, Bruker Analytische Messtechnik GmbH
##OWNER= root
$$ XWIN-NMR		Version 3.5
$$ Mon Jul 13 13:16:20 2026 Russian Standard Time (UT+4h)  she@DPX200
##.OBSERVE FREQUENCY= 81.013821
##.OBSERVE NUCLEUS= ^31P
##.ACQUISITION MODE= SIMULTANEOUS
##.ACQUISITION SCHEME= undefined
##.AVERAGES= 64
##.DIGITISER RES= 17
##SPECTROMETER/DATA SYSTEM= spect
##.PULSE SEQUENCE= zgpg30
##.SOLVENT NAME= DMSO
##.SHIFT REFERENCE= (INTERNAL, DMSO, 0, 197.392)
##AUDIT TRAIL= $$ (NUMBER, WHEN, WHO, WHERE, WHAT)
$$ ##TITLE= Audit trail, XWIN-NMR		Version 3.5
$$ ##JCAMPDX= 5.01
$$ ##ORIGIN= Bruker BioSpin GmbH
$$ ##OWNER= she
$$ F:/spectra/data/she/nmr/P31/2/pdata/1/auditp.txt
$$ ##AUDIT TRAIL=  $$ (NUMBER, WHEN, WHO, WHERE, WHAT)
(   1,<2026-07-13 13:14:33.64 +0400>,<she>,<DPX200>,
      <created by zg, POWCHK disabled, PULCHK disabled
       configuration hash MD5:
       00 E9 B6 7A A2 85 ED C7 34 08 36 98 17 FE 4E 26
       data hash MD5: 32K
       61 5A 7F FE 61 1A 81 0D 12 4D 1A 66 8A EB DB 6F>)
(   2,<2026-07-13 13:14:36.00 +0400>,<she>,<DPX200>,
      <Start of raw data processing
       efp BC_mod = 2 LB = 1.5 FT_mod = 6 PKNL = 1 PHC0 = 1664.817 PHC1 = 886.4995 SI = 64K 
       data hash MD5: 64K
       41 FC 7D 9B C6 E5 36 A2 37 22 E0 CB 2B E8 08 2C>)
(   3,<2026-07-13 13:14:54.12 +0400>,<she>,<DPX200>,
      <pk PHC0 = -4.851779 PHC1 = 0 
       data hash MD5: 64K
       9A B5 7C 2F 04 5D AF 29 57 F0 F9 06 27 9A B7 6E>)
(   4,<2026-07-13 13:14:57.54 +0400>,<she>,<DPX200>,
      <abs ABSG = 5 
       data hash MD5: 64K
       3B 38 D7 FB A3 B5 69 1E DF 99 18 B5 60 F2 C3 4F>)
(   5,<2026-07-13 13:15:32.93 +0400>,<she>,<DPX200>,
      <pk PHC0 = 350.0036 PHC1 = -925.6003 
       data hash MD5: 64K
       F9 5B EE 05 0B 04 23 A3 01 ED DB 94 A6 E0 5D C2>)
(   6,<2026-07-13 13:15:45.62 +0400>,<she>,<DPX200>,
      <abs ABSG = 5 
       data hash MD5: 64K
       CD 0E CA 7A 11 68 16 93 9B A2 EF 02 F7 BE 9A 6D>)
$$ ##END=
$$ 
$$ hash MD5
$$ 01 45 E0 1E 17 E5 D6 11 29 DA B3 BD 7D 8D 06 E2
##$RELAX= 
##$RELAX= 
##$RELAX= 
##$RELAX= 
##$RELAX= 
##$RELAX= 
##$RELAX= 
##$RELAX= 
$$ Bruker specific parameters
$$ --------------------------
##$DU= <F:/spectra>
##$EXPNO= 2
##$NAME= <P31>
##$PROCNO= 1
##$TYPE= <nmr>
##$USER= <she>
##$AMP= (0..31)
100 100 100 100 100 100 100 100 100 100 100 100 100 100 100 100 100 100 
100 100 100 100 100 100 100 100 100 100 100 100 100 100 
##$AQSEQ= 0
##$AQ_mod= 1
##$AUNM= <au_zg>
##$AUTOPOS= <>
##$BF1= 81.014009
##$BF2= 200.13
##$BF3= 200.13
##$BF4= 200.13
##$BF5= 200.13
##$BF6= 200.13
##$BF7= 200.13
##$BF8= 200.13
##$BYTORDA= 1
##$CFDGTYP= 0
##$CFRGTYP= 5
##$CHEMSTR= <none>
##$CNST= (0..31)
1 1 145 1 1 1 1 1 1 1 1 1 1 1 1 1 1 1 1 1 1 1 1 1 1 1 1 1 1 1 1 1 
##$CPDPRG= <waltz16>
##$CPDPRG1= <>
##$CPDPRG2= <waltz16>
##$CPDPRG3= <>
##$CPDPRG4= <mlev>
##$CPDPRG5= <mlev>
$$ [...]
##$SUBNAM3= <"">
##$SUBNAM4= <"">
##$SUBNAM5= <"">
##$SUBNAM6= <"">
##$SUBNAM7= <"">
##$SUBNAM8= <"">
##$SUBNAM9= <"">
##$SW= 400.765351723535
##$SWIBOX= (0..15)
0 1 3 0 0 0 0 0 0 0 0 0 0 0 0 0 
##$SW_h= 32467.5324675325
##$TD= 32768
##$TD0= 1
##$TE= 0
##$TE2= 300
##$TE3= 300
##$TEG= 300
##$TL= (0..7)
0 120 53 12 22 120 120 120 
##$TP= (0..7)
150 150 150 150 150 150 150 150 
##$TP07= 0
##$TPNAME0= <>
##$TPNAME1= <>
##$TPNAME2= <>
##$TPNAME3= <>
##$TPNAME4= <>
##$TPNAME5= <>
##$TPNAME6= <>
##$TPNAME7= <>
##$TPOAL= (0..7)
0.5 0.5 0.5 0.5 0.5 0.5 0.5 0.5 
##$TPOFFS= (0..7)
0 0 0 0 0 0 0 0 
##$TUNHIN= 0
##$TUNHOUT= 0
##$TUNXOUT= 0
##$USERA1= <user>
##$USERA2= <user>
##$USERA3= <user>
##$USERA4= <user>
##$USERA5= <user>
##$V9= 5
##$VALIST= <valist>
##$VCLIST= <CCCCCCCCCCCCCCC>
##$VD= 0
##$VDLIST= <DDDDDDDDDDDDDDD>
##$VPLIST= <PPPPPPPPPPPPPPP>
##$VTLIST= <TTTTTTTTTTTTTTT>
##$WBST= 1024
##$WBSW= 4
##$XGAIN= (0..3)
0 0 0 0 
##$XL= 0
##$YL= 0
##$YMAX_a= 54626
##$YMIN_a= -40077
##$ZGOPTNS= <>
##$ZL1= 120
##$ZL2= 120
##$ZL3= 120
##$ZL4= 120
##$ABSF1= 197.3918
##$ABSF2= -203.3724
##$ABSG= 5
##$ABSL= 3
##$ALPHA= 0
##$AQORDER= 0
##$ASSFAC= 0
##$ASSFACI= 0
##$ASSFACX= 0
##$ASSWID= 0
##$AUNMP= <proc_1d>
##$AZFE= 0.1
##$AZFW= 0.5
##$BCFW= 0
##$BC_mod= 2
##$BYTORDP= 0
##$COROFFS= 0
##$CY= -3
##$DATMOD= 1
##$DC= 0
##$DFILT= <>
##$DTYPP= 0
##$F1P= 0
##$F2P= 0
##$FCOR= 1
##$FTSIZE= 65536
##$FT_mod= 6
##$GAMMA= 0
##$GB= 0
##$INTBC= 1
##$INTSCL= 9.790993e-09
##$ISEN= 30
##$LB= 1.5
##$LEV0= 0
##$LPBIN= 0
##$MAXI= 10000
##$MC2= 0
##$MEAN= 0
##$ME_mod= 0
##$MI= 50
##$NCOEF= 0
##$NC_proc= -6
##$NLEV= 6
##$NOISF1= 182.463
##$NOISF2= 159.3651
##$NSP= 0
##$NTH_PI= 0
##$NZP= 0
##$OFFSET= 197.3918
##$PC= 4
##$PHC0= 2009.969
##$PHC1= -39.10077
##$PH_mod= 1
##$PKNL= yes
##$PPARMOD= 0
##$PSCAL= 0
##$PSIGN= 0
##$REVERSE= no
##$SF= 81.014063255964
##$SI= 65536
##$SIGF1= 159.3651
##$SIGF2= -187.1042
##$SINO= 113.3802
##$SIOLD= 16384
##$SREGLST= <1H.CDCl3>
##$SSB= 0
##$STSI= 65536
##$STSR= 0
##$SW_p= 32467.5324675325
##$SYMM= 0
##$S_DEV= 0
##$TDeff= 32768
##$TDoff= 0
##$TI= <>
##$TILT= no
##$TM1= 0
##$TM2= 0
##$TOPLEV= 0
##$USERP1= <user>
##$USERP2= <user>
##$USERP3= <user>
##$USERP4= <user>
##$USERP5= <user>
##$WDW= 1
##$XDIM= 65536
##$YMAX_p= 268835480
##$YMIN_p= -85964354
$$ End of Bruker specific parameters
$$ ---------------------------------
##NTUPLES= NMR SPECTRUM
##VAR_NAME=  FREQUENCY,     SPECTRUM/REAL,   SPECTRUM/IMAG
##SYMBOL=    X,             R,               I
##VAR_TYPE=  INDEPENDENT,   DEPENDENT,       DEPENDENT
##VAR_FORM=  AFFN,          ASDF,            ASDF
##VAR_DIM=   65536,         65536,           65536
##UNITS=     HZ,            ARBITRARY UNITS, ARBITRARY UNITS
##FACTOR=    0.49542278885378, 1,            1
##FIRST=     15991.5117654749, 0,            0
##LAST=      -16476.0207020576, 0,           0
##MIN=       -16476.0207020576, -85964354,   0
##MAX=       15991.5117654749, 268835480,    0
$$ Real data points
##PAGE= N=1
##DATA TABLE= (X++(R..R)), XYDATA
$$ [...]
44226b685224K09802J304098J298702q9160j240838r09481K6179O6386n90474
44217b610010n82054K97359Q31924L98771j91594k06870r1208m24068p72494m10850
44207c761094M51792R85183Q98392N59923K11655k32042o77248p65234l99065
44198b727738N1110J95577M7914o7709Q4878L46066K55326l71221r77638p68168
44188c931603K00274R03785O37098p4476l26119j31281j61379m81483m26323K29454
44178c562053Q05024P09041K63630J22983L11569L00081j77438p59032q59546
44169b845741k68513N92944R77174N33506k60584o10711l40847j2276p6583l01027
44159b612658k16382J94953N30864N08649K47383P9915J65599K35950j68328j001473
$$ plain form
44226 -2685224 -2475422 -1171324 127378 38218 -1202620 -2112101 -2085922 -2019536 -2610010
44217 -2610010 -3192064 -2894705 -2062781 -1664010 -1855604 -2062474 -2153682 -2577750 -3350244 -3761094
44207 -3761094 -3309302 -2324119 -1425727 -865804 -654149 -886191 -1563439 -2328673 -2727738
44198 -2727738 -2676628 -2481051 -2433137 -2500846 -2415968 -2069902 -1814576 -2185797 -3163435 -3931603
44188 -3931603 -3731329 -2827544 -2190446 -2264922 -2591041 -2722322 -2883701 -3365184 -3791507 -3562053
44178 -3562053 -2757029 -2047988 -1784358 -1661375 -1349806 -1049725 -1227163 -1986195 -2845741
44169 -2845741 -3114254 -2521310 -1544136 -1010630 -1271214 -1881925 -2222772 -2235048 -2311631 -2612658
44159 -2612658 -2829040 -2634087 -2103223 -1594574 -1347191 -1267276 -1101677 -865727 -1034055 -2035528
44149b035528j452069q33604L63843R33740N29076N1484J94244M03867p7746p93970
44139b716663o44886L80642J040485N49573l66613n37526R1127N21563J06087
44130a576211o59853q43132k16076N71949Q26981M85304r0822o24178r50520q28676
44120c905234k00922M50013N06789J9173l58349k81227o4289k1403k4561P3754
44110c806256J37907J33060K64177M61198L38412j6911N3997O31995P96158N4450
44100i51813o14505j42514Q59225R28040n3299q16062p26630m69380n49503m58592
44090b995033J69406O90409M33390k50550n85682m05096j3915M17758P53149O68929
44080a117235J14860l82488l83596j66102k34212n36269o35276l66807J05666
$$ plain form
44149 -2035528 -3487597 -4321201 -3957358 -3023618 -2494542 -2443058 -2248814 -1844947 -1922693 -2716663
44139 -2716663 -3361549 -2980907 -1940422 -1390849 -1757462 -2294988 -2203861 -1682298 -1576211
44130 -1576211 -2236064 -3079196 -3295272 -2723323 -1896342 -1411038 -1501860 -2126038 -3076558 -3905234
44120 -3905234 -4106156 -3656143 -3149354 -3130181 -3488530 -3769757 -3834046 -3855449 -3880010 -3806256
44110 -3806256 -3668349 -3535289 -3271112 -2809914 -2471502 -2488413 -2434416 -1802421 -1006263 -951813
44100 -951813 -1566318 -1708832 -849607 78433 25134 -790928 -1517558 -1986938 -2536441 -2995033
44090 -2995033 -2825627 -2135218 -1701828 -1952378 -2538060 -2943156 -2957071 -2539313 -1786164 -1117235
44080 -1117235 -1002375 -1384863 -1768459 -1934561 -2168773 -2705042 -3340318 -3707125 -3601459
44071c601459O05351Q89147N86726l05768j078772r68615r5412O58016O66245
44062b644541J40623k78530k34731O6032J53789j32706l98845j71441M42949Q76320
44052b181081Q45051N80881L09647P46k67859k61335j07863k84458p92302r41413
44042c099986l57690L61699M92530J76967J6479J11382J22578l4855j59734j89457
44032b560087j42208J19975N98286R03214P46175L68628N6624l28220q20585r01838
44022a960036k84784L65033L37396L6410K38968O08233J69332r10622j349522
44013b749592o65970K12643N45289P11289J036815R11846p8984j073221r58772
44004b108657Q2808R20467R43135M24353k08121o77434o56147k0134P20672Q24181
$$ plain form
44071 -3601459 -2996108 -2106961 -1520235 -1826003 -2904775 -3873390 -3968802 -3310786 -2644541
44062 -2644541 -2503918 -2782448 -3017179 -2951147 -2797358 -2930064 -3328909 -3500350 -3057401 -2181081
44052 -2181081 -1336030 -755149 -445502 -444756 -712615 -973950 -1081813 -1366271 -2158573 -3099986
44042 -3099986 -3457676 -3095977 -2603447 -2426480 -2410001 -2298619 -2176041 -2210896 -2370630 -2560087
44032 -2560087 -2702295 -2582320 -1984034 -1080820 -334645 33983 90607 -237613 -1058198 -1960036
44022 -1960036 -2244820 -1879787 -1542391 -1505981 -1267013 -658780 -489448 -1400070 -2749592
44013 -2749592 -3415562 -3202919 -2657630 -1946341 -909526 2320 -76664 -1149885 -2108657
44004 -2108657 -2025849 -1105382 -162247 262106 53985 -623449 -1279596 -1299730 -579058 245123
43994B45123J94080n19291o71311j98450M51486P05302L08043m04711q14524o97535
43984a401788l36664N9828N45289R04689O26391k05726o76612k82890K11056j03884
43974f60311q57596j008699m64037m7751o5555j4137K59587K17975k93230o15746
43964c549500l22981J41291L02160L57317N43268N26874M4871m49520m35298j25187
43954b966705L4951J98521P00650J178309R54980J32901n13516o83271p92276
43945a755456j016670r12453k71695L32178L05063j15894k30454J75886O62512
43936b826983P78936N37397K48200J04023J6203j58032k98083j16007L37354N34709
43926h42283J28263m93788p12762n34067m14199m14625k25632K8675j28480m91904
$$ plain form
43994 245123 439203 -80088 -751399 -949849 -498363 206939 514982 110271 -704253 -1401788
43984 -1401788 -1738452 -1678624 -1133335 -228646 397745 192019 -484593 -767483 -556427 -660311
43974 -660311 -1517907 -2526606 -2990643 -3038394 -3103949 -3118086 -2858499 -2640524 -2933754 -3549500
43964 -3549500 -3872481 -3731190 -3429030 -3071713 -2528445 -2001571 -1956700 -2406220 -2841518 -2966705
43954 -2966705 -2931754 -2733233 -2032583 -854274 100706 233607 -279909 -963180 -1755456
43945 -1755456 -2772126 -3684579 -3956274 -3624096 -3319033 -3434927 -3665381 -3489495 -2826983
43936 -2826983 -2048047 -1510650 -1262450 -1158427 -1142224 -1300256 -1598339 -1714346 -1376992 -842283
43926 -842283 -714020 -1207808 -1920570 -2454637 -2868836 -3283461 -3509093 -3480418 -3608898 -4100802
43916d100802j79381Q95854J496284P35490m95163p18982O4254N80773K28250
43907a493423l26372m55374l60065l15794j03187L51686N08133n1064q46835r69088
43897d061383j34852R93999J453496Q95809K018j75064M74254Q03569r1228j470801
43887a310183j862147j077372k76826j17518o4635K79584M59030K50433K55727
43878c463907P45844J020283O77316M25801P23137P04580l65730j546576j504785
43869b584037o01822k00677m32354k58700N20386R65606P14633M68367N61719
43860h46879M47595p3790l82993j84421K2322k0983O1582K68520l4594q93047
43850a636688j386403r94258k99582J51968N63112R04789M95225o25334j125273
$$ plain form
43916 -4100802 -4280183 -3384329 -1888045 -1152555 -1647718 -2366700 -2302446 -1721673 -1493423
43907 -1493423 -1819795 -2275169 -2635234 -2951028 -3054215 -2702529 -2194396 -2245460 -3092295 -4061383
43897 -4061383 -4196235 -3202236 -1748740 -852931 -850913 -1025977 -551723 251846 160618 -1310183
43887 -1310183 -3172330 -4249702 -4526528 -4644046 -4708681 -4429097 -3970067 -3719634 -3463907
43878 -3463907 -2718063 -1697780 -1020464 -594663 128474 833054 467324 -1079252 -2584037
43869 -2584037 -3185859 -3386536 -3818890 -4077590 -3557204 -2591598 -1876965 -1408598 -846879
43860 -846879 -399284 -473074 -856067 -1040488 -1018166 -1039149 -977567 -709047 -743641 -1636688
43850 -1636688 -3023091 -4017349 -4316931 -4164963 -3601851 -2697062 -2201837 -2827171 -3952444
43841c952444k53248P80604N12635n77860r32150k85438K79041K32991R6409J67880
43831c931580J27468j5139K13865P22139P26749m1177q60823j032660o30273k2526
43821d743957O06791R73309O36757l40557j174627j187865n23197K11021O50518
43812d891807P80889O64386L80684J02982J6695J68113M12615M89809K55707r6176
43802a716103k27510j36890j48093l08284k43876J47023L94993K47587J85283
43793a805870N84148R27165O05347K8643L2378N21032P08922N03874N51026R13994
43783C570659Q50121J23612n06890n06201l50918n91495q97429o55139J0129L95599
43773A442048J13348n58763r87770o63708L28767J214752J259548O22033O2564
$$ plain form
43841 -3952444 -4205692 -3425088 -2912453 -3490313 -4422463 -4707901 -4428860 -4195869 -4099460 -3931580
43831 -3931580 -3804112 -3819251 -3605386 -2883247 -2156498 -2197675 -3058498 -4091158 -4721431 -4743957
43821 -4743957 -4137166 -3163857 -2527100 -2867657 -4042284 -5230149 -5753346 -5542325 -4891807
43812 -4891807 -4110918 -3446532 -3065848 -2962866 -2946171 -2778058 -2365443 -1875634 -1619927 -1716103
43802 -1716103 -1943613 -2080503 -2228596 -2536880 -2780756 -2633733 -2238740 -1991153 -1805870
43793 -1805870 -1221722 -294557 310790 339433 371811 892843 1601765 2105639 2656665 3570659
43783 3570659 4420780 4544392 4037502 3531301 3180383 2588888 1691459 1036320 1046449 1442048
43773 1442048 1555396 996633 8863 -654845 -326078 888674 2148222 2770255 2832819
43764B832819j24624k88503n69707o22757l08750N8667L09708N33843M87381k40518
43754B067559j243120j431971n59690L03473K96577j40500k76768k50929m54883
43745a690252n94970k82492Q3562n9981m47248m67708j61057J02228M23530R46470
43735b147918J096014K78206r55425j448032r76391l55178j74994l10565n19555
43726e513838o39976l19215N68748J338652J199291M35399n294L2855j21039o07554
43716c631971p63733l35703J16491K83391N55044J049437J144317M53674m98065
43707a627118j005326r21128l84602M29876R95457P07074j31808m25627J75754
43698b187448P20632M47522r9698j60881p0417n17217j162407j086293k63748
$$ plain form
43764 2832819 2708195 2419692 1849985 1227228 918478 977145 1286853 1820696 2308077 2067559
43754 2067559 824439 -607532 -1167222 -863749 -567172 -707672 -984440 -1235369 -1690252
43745 -1690252 -2285222 -2567714 -2484152 -2544133 -2991381 -3459089 -3620146 -3517918 -3094388 -2147918
43735 -2147918 -1051904 -773698 -1729123 -3177155 -4153546 -4508724 -4683718 -4994283 -5513838
43726 -5513838 -6153814 -6473029 -5904281 -4565629 -3366338 -2930939 -2936233 -2903378 -3024417 -3631971
43716 -3631971 -4395704 -4731407 -4614916 -4331525 -3776481 -2727044 -1582727 -1129053 -1627118
43707 -1627118 -2632444 -3553572 -3938174 -3508298 -2512841 -1805767 -1937575 -2363202 -2187448
43698 -2187448 -1466816 -1019294 -1118992 -1279873 -1350290 -1867507 -3029914 -4116207 -4379955
43689d379955M13999M37390J28404j39725l80221n93724n80767l00354J396J00075
43679e293482j7375j88030j03172M38760J063219J000160J25836o03141l05094
43670c882319N92019R11652K84673n18725o92989k21588L61795N29121J17884
43661b518477m64291n34421O358M11055J41826k43894N0764P18297P72095J00327
43651a560361m16287l18145o7117J0034K38861P07641Q18881K61467l53996m21189
43641a100211k38118l58180o19826n29026j79798m7058j11041Q7546N86435Q34467
43631a674810M89110p8616k68905K395K31603l0057n49787n93248J22407Q62443
43621a487465O61882m03592j261789j209938o32849j68377J62541N56221P54049
$$ plain form
43689 -4379955 -3965956 -3528566 -3400162 -3539887 -3920108 -4513832 -5094599 -5394953 -5393557 -5293482
43679 -5293482 -5310857 -5498887 -5602059 -5163299 -4100080 -3099920 -2974084 -3577225 -3882319
43670 -3882319 -3290300 -2378648 -2093975 -2612700 -3305689 -3527277 -3165482 -2636361 -2518477
43661 -2518477 -2982768 -3517189 -3510831 -3099776 -2957950 -3201844 -3151080 -2432783 -1660688 -1560361
43651 -1560361 -1976648 -2294793 -2361910 -2351876 -2113015 -1405374 -586493 -325026 -679022 -1100211
43641 -1100211 -1338329 -1696509 -2316335 -2845361 -3025159 -3072217 -3183258 -3095712 -2509277 -1674810
43631 -1674810 -1185700 -1264316 -1533221 -1530826 -1299223 -1329280 -1879067 -2472315 -2349908 -1487465
43621 -1487465 -825583 -1229175 -2490964 -3700902 -4333751 -4502128 -4339587 -3783366 -3029317
43612c029317M20619j50376l59112j65587o1483k48599l61459n1694N29242R08220
43602b569546P44227J22857m63300n37040j51307J92399J90772j7078l00538o99891
43592c488445r40115m63415N94140J133932N00153m13820l31363N72157J018992
43583a817784N56181j5827j52622l20803q97066j334697j024398k73447J89419
43574e091044K06995J60081K93259N22755O61726N08434m2672p16812r36440m21164
43564d854882M65765J072301R77052K42300m99911l77994P34770J682940J215509
43555F57850l12770j301837j043615m47244l54178l44441J27736N60979L43378
43546b114142o1875K4563K09788j87486o84888l32116N30862O44582j72656p89052
$$ plain form
43612 -3029317 -2608698 -2759074 -3118186 -3283773 -3345256 -3593855 -3955314 -4007008 -3477766 -2569546
43602 -2569546 -1825319 -1702462 -2165762 -2702802 -2854109 -2661710 -2470938 -2488016 -2788554 -3488445
43592 -3488445 -4428560 -4891975 -4297835 -3163903 -2663750 -3077570 -3408933 -2836776 -1817784
43583 -1817784 -1261603 -1277430 -1430052 -1750855 -2647921 -3982618 -5007016 -5280463 -5091044
43574 -5091044 -4884049 -4723968 -4430709 -3907954 -3246228 -2737794 -2780466 -3497278 -4433718 -4854882
43564 -4854882 -4389117 -3316816 -2339764 -2097464 -2597375 -2975369 -2240599 -557659 657850
43555 657850 345080 -956757 -2000372 -2447616 -2801794 -3146235 -3018499 -2457520 -2114142
43546 -2114142 -2176017 -2151454 -1941666 -2129152 -2814040 -3146156 -2615294 -1970712 -2143368 -2932420
43536b932420n67468o8718K28363N65645Q97715N53534m80692j073048n07813
43527c384902L75851M17724k30198n43302j42206M53763P41998O96175M97255
43518a117842K98835J22086k26261q22253j168496o84837K43192N52713Q4901
43509b717962j44252L16289N47968m8767n34665n5237M89164o8120r42579n37170
43499c695331P69138J042898j08118r60604n03824J73965O186l93030j91643J20655
43489c739708j43417m97935k95997j2590k23630l03508M47722J241600R21319
43480b606144j9625k05884K78714J12473q31964j130358j76363P84311O10195
43471c184645j56571m44107k19484k9271J08758M36014P19643O10737K78562N2838
$$ plain form
43536 -2932420 -3499888 -3568606 -3340243 -2774598 -1876883 -1323349 -1804041 -2877089 -3384902
43527 -3384902 -3009051 -2591327 -2821525 -3364827 -3507033 -3053270 -2311272 -1615097 -1117842
43518 -1117842 -819007 -696921 -923182 -1745435 -2913931 -3598768 -3355576 -2802863 -2717962
43509 -2717962 -2862214 -2545925 -1997957 -2046724 -2581389 -2636626 -2147462 -2215582 -3158161 -3695331
43499 -3695331 -2926193 -1883295 -1991413 -2952017 -3455841 -3281876 -3275690 -3668720 -3860363 -3739708
43489 -3739708 -3883125 -4381060 -4677057 -4689647 -4913277 -5216785 -4769063 -3527463 -2606144
43480 -2606144 -2625769 -2831653 -2552939 -2440466 -3272430 -4402788 -4579151 -3794840 -3184645
43471 -3184645 -3341216 -3785323 -4004807 -4034078 -3925320 -3489306 -2769663 -2158926 -1880364 -1827526
43461a827526j16168l17846l33431j56482k70538q11323j070024n36113J67416
43452e272035K18260r2123L7409M44101K98245l09540l18545O01583J405871J136271
43442a850503J65319n00027m75567o7133L57223N24965J90719n54290j118572
43433c327866r74928k68828M03416O58378N29277J97286j81991m46963m46576
43424c858795j24953M29592R56212J098865P03259L6454m74201o96625p90540
43415b720732q34075p51355n63662l73450j16006L13239O99545O96739M06969
43406c242788L13788N29065N69553Q1332o11740r18439o41765n6218M10657M64986
43396c101569J74029o2067k6910m6005m19302p34239m27178J42275R5664m98166
$$ plain form
43461 -1827526 -1943694 -2261540 -2594971 -2751453 -3021991 -3833314 -4903338 -5439451 -5272035
43452 -5272035 -5053775 -5145898 -5108489 -4664388 -4366143 -4675683 -4994228 -4392645 -2986774 -1850503
43442 -1850503 -1685184 -2185211 -2660778 -2727911 -2370688 -1845723 -1655004 -2209294 -3327866
43433 -3327866 -4302794 -4571622 -4168206 -3509828 -2980551 -2783265 -2965256 -3412219 -3858795
43424 -3858795 -3983748 -3554156 -2597944 -1499079 -795820 -759366 -1233567 -1930192 -2720732
43415 -2720732 -3554807 -4306162 -4869824 -5243274 -5359280 -5046041 -4346496 -3649757 -3242788
43406 -3242788 -2929000 -2399935 -1830382 -1749050 -2360790 -3279229 -3920994 -3977212 -3566555 -3101569
43396 -3101569 -2927540 -2989607 -3016517 -3062522 -3481824 -4216063 -4643241 -4500966 -4405302 -4903468
43386d903468o56059j74164l2981n95671p13471M42482J787730J779433O29463
43377b436706k45954l62850l66973n08133l68469Q896O4600j56178k2372M58538
43367c935601N64813J26059k30448k41130l20838n30791l40598K97694O89319
43358c921521N16758K12385l7163n38325j030707o38238N84168J290886P55441
43349b806316o000J33583P34674P50302K28999o4504j0145Q782M9184L36801N01771
43338a42869R4270n25742p50116p58651j036285j274978q20377P1598M93998K61708
43328d387444N0946K52856N70785O90490N68268J79797k96219l05373K93926O40639
43318a741329m411r46952r86805l08056j23167o10683o84452Q2513P81797P57871
$$ plain form
43386 -4903468 -5559527 -5733691 -5766672 -6362343 -7075814 -6633332 -4845602 -3066169 -2436706
43377 -2436706 -2682660 -3045510 -3412483 -3920616 -4289085 -4280189 -4215589 -4371767 -4394139 -3935601
43367 -3935601 -3370788 -3244729 -3475177 -3716307 -4037145 -4567936 -4908534 -4610840 -3921521
43358 -3921521 -3404763 -3192378 -3229541 -3767866 -4798573 -5436811 -4852643 -3561757 -2806316
43349 -2806316 -2812316 -2678733 -1944059 -1193757 -964758 -1029262 -1039407 -1030625 -981441 -644640 -142869
43338 -142869 -48599 -574341 -1324457 -2083108 -3119393 -4394371 -5214748 -5143150 -4649152 -4387444
43328 -4387444 -4336498 -4083642 -3512857 -2822367 -2254099 -2074302 -2370521 -2675894 -2381968 -1741329
43318 -1741329 -1745740 -2692692 -3679497 -3987553 -4110720 -4721403 -5405855 -5323342 -4541545 -3783674
43308c783674M99078M57939K70779k36701m62184j52707j4377m20875n73944J28472
43298d288194Q44304M90155n36657r58923m32176L06326P13014Q12179N42027
43289b507945k27291j038216j093921k92236O13172R48864P12903K55754j20584
43280b749500k39039j52495j65381m22052n90403k98934K87544P15551Q71145
43271b743564R29359Q65924N12909q187l78658n37434o25306n82772k72639N7303
43261b783065n9012o05149r60997o22112K20117R11231R81012N32021Q6542K0749
43251b278663J61930J35039L3521K70663O90066N19564l97322j033817n40645
43242b439664L92994M52000l89188r14161n22821O8450J73342J17921L83466O38941
$$ plain form
43308 -3783674 -3284596 -2826657 -2555878 -2792579 -3254763 -3407470 -3421847 -3842722 -4416666 -4288194
43298 -4288194 -3443890 -2953735 -3490392 -4449315 -4881491 -4575165 -3862151 -3049972 -2507945
43289 -2507945 -2735236 -3773452 -4867373 -5159609 -4546437 -3597573 -2884670 -2628916 -2749500
43280 -2749500 -2988539 -3141034 -3306415 -3728467 -4318870 -4617804 -4330260 -3614709 -2743564
43271 -2743564 -1814205 -948281 -435372 -443559 -822217 -1359651 -1984957 -2567729 -2840368 -2783065
43261 -2783065 -2842077 -3447226 -4408223 -5030335 -4810218 -3898987 -2917975 -2385954 -2299412 -2278663
43251 -2278663 -2116733 -1981694 -1948173 -1677510 -987444 -467880 -865202 -1899019 -2439664
43242 -2439664 -2046670 -1594670 -1983858 -2898019 -3420840 -3352390 -3179048 -3061127 -2677661 -2038720
43232b038720L46846k27081l74185l1101J83742o8823m44075n16658l00987j9398
43222c490440K61936N17418N51870K48226p6250N2228N41016O56934m2219r86955
43212a766236j247450p47921k68599k42621k31808J53786M95906K53023k89296
43203c891216m03487K5377M61116N66051M79915L32972P3601k06181k93981k45801
43193c101634k90837l36205n2042N02705Q32647O89797L52699J01770j33115m22739
43183a856954n48562l08537J71553O17442Q54490P67043L11697k66608n02858
43174g61294k01971L05630N41765L81204Q1776o5531l6564o4424l09968n51356
43164f80733m07672M9345K42288j14789n30631m25448M5392L46156M07037M99750
$$ plain form
43232 -2038720 -1691874 -1918955 -2293140 -2324241 -2140499 -2209322 -2653397 -3170055 -3471042 -3490440
43222 -3490440 -3228504 -2711086 -2159216 -1910990 -1987240 -1935012 -1393996 -737062 -779281 -1766236
43212 -1766236 -3013686 -3761607 -4030206 -4272827 -4504635 -4350849 -3854943 -3601920 -3891216
43203 -3891216 -4294703 -4269326 -3808210 -3242159 -2762244 -2429272 -2355671 -2561852 -2855833 -3101634
43193 -3101634 -3392471 -3728676 -3780718 -3278013 -2445366 -1755569 -1402870 -1301100 -1434215 -1856954
43183 -1856954 -2405516 -2714053 -2542500 -1925058 -1070568 -303525 8172 -258436 -761294
43174 -761294 -963265 -657635 -115870 265334 347110 281579 245015 180591 -129377 -680733
43164 -680733 -1088405 -1039060 -796772 -911561 -1442192 -1867640 -1822248 -1476092 -1069055 -569305
43154e69305N45785K99677P1050M35544J210618J517059R73144R6399n78656j001366
43144B999949j100577o60383K9528K63132O358K2843N04259N62602k63294r77653
43134A386764n60990L48183L75654m71670q88959l40320K10270j10597p85032
43125h36697p28821K05005J112229J172385N07150m2497J71310R21856J361999
43116C843919R68433N2833p47996j177301j310046j130215n85328J00521N78699
43107E93519P70014P95555O47896K83580p8000j46787j1318l1787k83674m35398
43097B103600k31814J46315K76971o2611o33702q74173m47991K87561O06422K88395
43087A458973j65699l18638l26030l95204k36422M26547J179389J361613R71382
$$ plain form
43154 -569305 -23520 276157 347207 782751 1993369 3510428 4483572 4579971 4001315 2999949
43144 2999949 1899372 1238989 1268517 1531649 1538007 1560850 2065109 2627711 2364417 1386764
43134 1386764 825774 1173957 1549611 1077941 188982 -151338 58932 -51665 -836697
43125 -836697 -1565518 -1360513 -248284 924101 1431251 1388754 1560064 2481920 3843919
43116 3843919 4812352 4865185 4117189 2939888 1629842 499627 -85701 14820 593519
43107 593519 1363533 2159088 2806984 3090564 3012564 2865777 2854459 2822672 2538998 2103600
43097 2103600 1871786 2018101 2295072 2232461 1598759 724586 276595 564156 1170578 1458973
43087 1458973 1293274 974636 648606 253402 16980 443527 1622916 2984529 3955911
43078C955911N62712M14574L65953L32358L79373L40925k7427m75619m02052L04668
43068E751376J026430J161663P41231J78846k61482n87701q64058r87880o74425
43059E484000J91631J151215J487133J162312R79046J395033J680224R16841n19369
43050A3928066j298903q51804K3243K93411k24884r98362j432547j298947r13477
43041G225796q47257j121122r92048n9471Q62913P96282J23814N371N10674O05959
43031G110911L917l57786O956L28681K0695l09416l8219L60364K50598l0918R8387
43020G444170L84681L21451J24127J54922Q596p70083j559412j372498l96927
43011D339027K26203j6100n91333r24087r03406n22721Q3404L36009j74254q57940
$$ plain form
43078 3955911 4518623 4933197 5299150 5631508 6010881 6351806 6324379 5848760 5446708 5751376
43068 5751376 6777806 7939469 8680700 8859546 8598064 8010363 7146305 6158425 5484000
43059 5484000 5675631 6826846 8313979 9476291 10455337 11850370 13530594 14447435 13928066
43050 13928066 12629163 11777359 11800602 12094013 11869129 10870767 9438220 8139273 7225796
43041 7225796 6378539 5257417 4265369 4205898 5068811 5865093 5988907 5994278 6504952 7110911
43031 7110911 7114828 6757042 6763998 7092679 7113374 6803958 6765739 7126103 7376701 7345783 7444170
43020 7444170 7828851 8150302 8274429 8429351 8437947 7667864 6108452 4735954 4339027
43011 4339027 4565230 4549130 3957797 3033710 2130304 1607583 1690987 2026996 1852742 994802
43001I94802q08729k13803o5887m70674m02798N74209J469134J305886N06205
42992B888345J40097M52976Q49923Q87550N97415J11110m15127o43751l37228
42983D531310K40197N56345M05046J2802l47296n78510o55851n41225k18658K88562
42973C692722Q70460J236734J063245M31631l1384K27819R28382J145090M42574
42964A0007273m57661n27055J75855N37733p867n76084j20250Q98935J091779
42955A1022658J91956o17830o03361m80967r57084j424978j080041m25140m56108
42946E169105r47670q56627j10847L20579O1581k23534j12412J5795p3096l1035
42936C211839K59880L91630K47082K22514L89660L59902J90543L66568O09970
$$ plain form
43001 994802 186073 -27730 -93617 -564291 -967089 -392880 1076254 2382140 2888345
42992 2888345 3028442 3481418 4331341 5218891 5816306 5927416 5512289 4868538 4531310
42983 4531310 4771507 5327852 5732898 5745700 5398404 4819894 4164043 3622818 3404160 3692722
42973 3692722 4563182 5799916 6863161 7294792 7263408 7491227 8419609 9564699 10007273
42964 10007273 9549612 9022557 9198412 9736145 9728278 9152194 9031944 9930879 11022658
42955 11022658 11214614 10596784 9993423 9512456 8555372 7130394 6050353 5625213 5169105
42946 5169105 4221435 3364808 3253961 3574540 3636121 3412587 3300175 3315970 3242874 3211839
42936 3211839 3471719 3863349 4110431 4332945 4722605 5082507 5273050 5639618 6249588
42927F249588n6045j557683k377135j676195n98155m74986q70984o33862O7582
42918a927875K16948j72123j75875L36334N49178J98528m8570K04448N92286Q00967
42908E74246Q92361P43423J25923n68275o45100k59479k62187p46930q11517p4579
42898a032114O22281N18334J2722j44997N6823K47245M21147O47082N98696R4233
42888B041452l19631j8427P44329J133921P84481N7052n43915p47188m93988Q408
42878B646494L18092J89230j22939k05391M7702M71646Q23011P50796K831j034457
42868C887015j440892q09731J94886P23175P33513O19139L65792j81055n79233
42859C512609k18009O08806R00669L04447m60173o80690m74862k83220j42684
$$ plain form
42927 6249588 6193543 4635860 2258725 582530 -15625 -490611 -1361595 -1995457 -1927875
42918 -1927875 -1710927 -1883050 -2058925 -1722591 -1173413 -974885 -1023455 -819007 -226721 574246
42908 574246 1466607 2210030 2335953 1767678 1122578 863099 600912 -146018 -957535 -1032114
42898 -1032114 -409833 108501 121223 -23774 33049 280294 701441 1348523 1947219 2041452
42888 2041452 1721821 1703394 2447723 3581644 4366125 4423177 3879262 3132074 2638086 2646494
42878 2646494 2964586 3153816 3030877 2825486 2873188 3344834 4167845 4918641 4921472 3887015
42868 3887015 2446123 1636392 1831278 2554453 3287966 3907105 4272897 4091842 3512609
42859 3512609 3294600 3903406 4804075 5108522 4648349 3967659 3492797 3209577 3066893
42850C066893J64157O41141J083835J274130R85041J23706r44899j564160j489946
42841C339898j115876q22814m96872L8418N12513N44852K31211k9322j26076k50848
42831A825084m39167n17408m62908l99872k25399K99895R47719R87711J30526
42822B146181q17608p74214K18220R62040O26504k23550n10657j35932O2509l08625
42812A244868o45620l92213P7812J27519j15152p5917K15014J63470l30394n97155
42802c27768j76814N26245Q59120P14571L85889M5576k37619k77694L482L26161
42792A841149M14108M46511P61038J234187J396504J135878Q31572O89383L75375
42783I125705m13322j295582j513099q72594q3742k285o51283j180014q33379
$$ plain form
42850 3066893 3231050 3872191 4956026 6230156 7215197 7338903 6394004 4829844 3339898
42841 3339898 2224022 1401208 904336 942754 1455267 2000119 2231330 2202008 2075932 1825084
42831 1825084 1385917 868509 405601 5729 -219670 80225 1027944 2015655 2146181
42822 2146181 1328573 554359 772579 1734619 2361123 2137573 1626916 1490984 1553493 1244868
42812 1244868 599248 207035 284847 412366 297214 221297 436311 599781 269387 -327768
42802 -327768 -504582 21663 880783 1595354 1981243 2026819 1789200 1511506 1514988 1841149
42792 1841149 2255257 2701768 3462806 4696993 6093497 7229375 8060947 8750330 9125705
42783 9125705 8712383 7416801 5903702 5031108 4947366 4945081 4293798 3113784 2280405
42774B280405J78081R17628P79154J07442l08591j81309N0766p1554l18115K7611
42764C461518J224169K504823K706203J535102k763o35166j52862N31412N43338
42755A1715774q3616p17767r20665p28818m15465k44503l52832o71664r91028
42746F589416j169397j189960j009433n78868r4228N0550k48799n92981n77945
42737A178355l13592j95399l30195m77313m44772k50925M0514L68653N90134N87525
42727G52985M36515K62321J3598l63231o14495m00073J55280M88008L04323k6106
42717A009125K3169M43708P39243N66479J11511j81402j09266J26541J87529o0303
42707B856334m77737q33720r76982q87541o75717n04714m05601k29065P5059K50604
$$ plain form
42774 2280405 2458486 3376114 4155268 4262710 3954119 3772810 3823576 3752022 3433907 3461518
42764 3461518 4685687 7190510 9896713 11431815 11429052 10793886 10641024 11172436 11715774
42755 11715774 11632158 10914391 9993726 9264908 8849443 8604940 8252108 7580444 6589416
42746 6589416 5420019 4230059 3220626 2641758 2547530 2598080 2349281 1756300 1178355
42737 1178355 864763 669364 339169 -138144 -582916 -833841 -793327 -424674 165460 752985
42727 752985 1189500 1451821 1465419 1102188 487693 87620 242900 730908 1035231 1009125
42717 1009125 1032294 1476002 2215245 2781724 2893235 2711833 2602567 2729108 2916637 2856334
42707 2856334 2378597 1544877 567895 -319646 -995363 -1500077 -1905678 -2134743 -2059684 -1809080
42697a809080P6660j79707m0465M67525Q27205Q06434O74641N22313N0674o29161
42687G67039p33467M6925P79865M87257l69134n37103J90116Q05208O53583J49423
42677B239712j48814k20637j63740J7736l09n96506j299354j124100j47191L22390
42667a120813l20676r69633n35773L37258L82548k65827m53409P2015M70323L58976
42657b045011K41106L19029J13328m36336n82785L7656P20395P51538L98551K26527
42647b56002Q0345m86840j205575j351041q58854m05417l24626j59144M34605
42638d532549R46525P30221J31107J86280J153828K032925J927486J319225J307995
42629E203043J920388K068682J193723l278p79680j375263k189044k716886k241277
$$ plain form
42697 -1809080 -1732420 -1912127 -1952592 -1485067 -657862 148572 823213 1345526 1396200 767039
42687 767039 33572 80497 860362 1347619 978485 441382 631498 1436706 2090289 2239712
42677 2239712 2090898 1870261 1706521 1724257 1723948 1127442 -171912 -1296012 -1443203 -1120813
42667 -1120813 -1441489 -2411122 -2946895 -2609637 -2227089 -2492916 -2946325 -2874310 -2403987 -2045011
42657 -2045011 -1803905 -1484876 -1371548 -1807884 -2390669 -2353013 -1632618 -881080 -482529 -256002
42647 -256002 -175657 -662497 -1868072 -3219113 -4077967 -4483384 -4808010 -4967154 -4532549
42638 -4532549 -3586024 -2855803 -2724696 -2538416 -1384588 648337 2575823 3895048 5203043
42629 5203043 7123431 9192113 10385836 10382558 9602878 8227615 6038571 3321685 1080408
42620A080408j140256n20231o87490q81122n41804j8556J61822L8887m3471L7921
42610b513892J55121J09981k22657o47740o56229p8990M51836K46876m04354o14115
42600d174163j91083K34858L43270M67655O82948N09532j37735n86993m37348
42591c289059j48297j25233k8400M05060O22513R7714o96384r41254o15683k41256
42581d960279M2809L55947M53048R3810k77591r2059L53435L42830m3798j19845
42571c851693J53487J80532J6421M59491J543564K064682J233038j06617o72673
42562A020232m53096l20122m55756k46868L66626N25709k32055j106715j077608
42553a979653l16916J44317m5330j54381L35693P95613L81462n83243r55444l58307
$$ plain form
42620 1080408 -59848 -580079 -1267569 -2148691 -2690495 -2709051 -2547229 -2508342 -2551813 -2513892
42610 -2513892 -2358771 -2248790 -2471447 -3119187 -3775416 -3854406 -3402570 -3155694 -3560048 -4174163
42600 -4174163 -4365246 -4130388 -3787118 -3319463 -2636515 -2126983 -2264718 -2851711 -3289059
42591 -3289059 -3437356 -3562589 -3590989 -3185929 -2563416 -2465702 -3162086 -4103340 -4719023 -4960279
42581 -4960279 -4917470 -4561523 -4108475 -4014665 -4292256 -4384315 -4030880 -3688050 -3731848 -3851693
42571 -3851693 -3698206 -3517674 -3501253 -3041762 -1498198 566484 1799522 1692905 1020232
42562 1020232 567136 247014 -208742 -455610 -88984 436725 204670 -902045 -1979653
42553 -1979653 -2296569 -2152252 -2197582 -2351963 -2016270 -1220657 -839195 -1422438 -2377882 -2736189
42543b736189M08324O43275N92302O70188O17644M9855p20837j101575j051072
42534b628085q32079l51987M59576R82159O00180r2987J24979J224032J720525
42525A206313P36480p34325j233780p01936j49836o4515o9779P5946N7559l16080
42515a193953o75853o02704j85022J83418L29503L86745M51774L84698M3856l86899
42505a264437n06648j94937J90318K59080L6913k43150n43718q53231q40590k19829
42495d180229O11609Q82714M51275o1593k17834k17055k41706o1278L45369M42620
42485b246108n2920n61694m54302l1293j195l08989k53126L64803R45800R77901
42475a621123N92688J45843k15202m19639l69880j58878n7607j46481k31828k00575
$$ plain form
42543 -2736189 -2327865 -1684590 -1092288 -422100 195544 245399 -475438 -1577013 -2628085
42534 -2628085 -3460164 -3812151 -3352575 -2370416 -1770236 -1863223 -1738244 -514212 1206313
42525 1206313 1942793 1208468 -25312 -727248 -877084 -941599 -1011378 -935432 -877873 -1193953
42515 -1193953 -1869806 -2472510 -2657532 -2474114 -2144611 -1757866 -1306092 -921394 -877538 -1264437
42505 -1264437 -1771085 -1966022 -1775704 -1516624 -1479711 -1722861 -2266579 -3119810 -3960400 -4180229
42495 -4180229 -3568620 -2685906 -2234631 -2296224 -2514058 -2731113 -2972819 -3034097 -2688728 -2246108
42485 -2246108 -2299028 -2860722 -3315024 -3346317 -3347512 -3656501 -3909627 -3544824 -2599024 -1621123
42475 -1621123 -1028435 -882592 -1097794 -1517433 -1887313 -2046191 -2103798 -2250279 -2482107 -2682682
42465b682682j74396k54165l92446n57027p22840o74059j70485N82585R62894
42456d082621O08345j58475p12268p27717l05116K66954P07271Q52535P38402
42447b812690N44958M32618M48688M94168L08347k95856r83229r82691l6117R76826
42437a904978R51449O952o52448l76338J92357K68832K1912j0524Q1283p0161
42427a491664k20530J25457O50078M55524n19791j147291n47971O95481J233162
42418g67545N22615o99173j326120r30272J528O27498N66500K24780K01818M24441
42408a153930K42002n10753j045930o21305L62035Q35339M64453o0719j56034
42399a644842q7704l04714n86880l70384L49780R45469R09015K97940n17332j155044
$$ plain form
42465 -2682682 -2857078 -3111243 -3503689 -4060716 -4783556 -5457615 -5628100 -5045515 -4082621
42456 -4082621 -3474276 -3632751 -4345019 -5072736 -5377852 -5110898 -4403627 -3551092 -2812690
42447 -2812690 -2267732 -1835114 -1386426 -892258 -583911 -879767 -1862996 -2845687 -2881804 -1904978
42437 -1904978 -953529 -946577 -1599025 -1975363 -1783006 -1514174 -1492262 -1502786 -1421503 -1491664
42427 -1491664 -1712194 -1586737 -936659 -481135 -1000926 -2148217 -2696188 -2000707 -767545
42418 -767545 -244930 -944103 -2270223 -3200495 -3198967 -2571469 -2004969 -1780189 -1578371 -1153930
42408 -1153930 -911928 -1422681 -2468611 -3089916 -2727881 -1892542 -1428089 -1488808 -1644842
42399 -1644842 -1732546 -2037260 -2624140 -2994524 -2644744 -1699275 -790260 -492320 -1009652 -2164696
42389b164696j257856o64440K48111P01365K93513m93102q22168m83573q5363
42380d728209k23471p00767p78936j30322P19543J029250P54567N52281Q57136
42371b648928J257183J020728R1762p41572o93047K18306J255590J670401J249697
42362B680120L39280m99227q77642p57593l58628J4120P1274l27187r72800j358566
42352b046849j132066m54333K32927O66585P90782N46166K8147k77409N0160O52916
42342i42974P16931J64023j09098M64927J185235J021780M4840p76313r13723
42333H55628o50291k48856L68638R62085Q26631k42125j395354j647446r86380
42324b157470j34024M45018P48210O97855R6900q03669j276404r42169k60106
$$ plain form
42389 -2164696 -3422552 -4086992 -3838881 -3137516 -2844003 -3337105 -4159273 -4642846 -4728209
42380 -4728209 -4951680 -5652447 -6431383 -6561705 -5842162 -4812912 -4058345 -3506064 -2648928
42371 -2648928 -1391745 -371017 -279255 -1020827 -1713874 -1495568 -239978 1430423 2680120
42362 2680120 3019400 2520173 1642531 884938 526310 540430 611704 284517 -688283 -2046849
42352 -2046849 -3178915 -3633248 -3400321 -2733736 -1942954 -1396788 -1368641 -1646050 -1595890 -942974
42342 -942974 -226043 -62020 -171118 293809 1479044 2500824 2545664 1769351 855628
42333 855628 205337 -43519 325119 1287204 2113835 1871710 476356 -1171090 -2157470
42324 -2157470 -2291494 -1846476 -1098266 -400411 -303511 -1107180 -2383584 -3325753 -3585859
42315c585859J13726J84114M38532R46603J142779O82486J34839M22971J666922
42306B147113K943410L241485K359720P92364q70900k139952k557230j980156
42298C935854r38705k76395k87310n04557m60868l08222m23978o93820o11022
42289e69023k9966N73000O99365M04753R3193o2845k34765n41347q24340q91579
42279a383554p50961m49774J09938R17197J526743J376942N20506l08326n62754
42270I95957n23383p60371j202295j217047n82573J28922L20197J18452L6488
42261b685653J68201J58571j21090l43884k84001j82861k80626l12317Q5915O37123
42251c160622O50214M4325m23842k21811J94816J31952k69255l42654m222K02476
$$ plain form
42315 -3585859 -3472133 -3288019 -2849487 -1902884 -760105 -77619 57220 480191 2147113
42306 2147113 5090523 8332008 10691728 11484092 10613192 8473240 5916010 3935854
42298 3935854 2997149 2720754 2433444 1928887 1468019 1159797 735819 41999 -569023
42289 -569023 -598989 -25989 673376 1078129 1171322 1108477 873712 332365 -491975 -1383554
42279 -1383554 -2134515 -2584289 -2474351 -1557154 -30411 1346531 1867037 1558711 995957
42270 995957 472574 -287797 -1490092 -2707139 -3289712 -3160790 -2840593 -2722141 -2685653
42261 -2685653 -2517452 -2358881 -2479971 -2823855 -3107856 -3290717 -3571343 -3883660 -3797745 -3160622
42251 -3160622 -2510408 -2466083 -2889925 -3111736 -2916920 -2784968 -3054223 -3396877 -3401099 -3198623
42241c198623R0922P9239L49627N15608L73082K86774M93924O61338N10610K67953
42231D30454J00474k29018o85280o80170p9355K68295k14843p92494n77923k3822
42221b483682o0778l58157Q9350R81819R58809j58223r81645o99233o6019J92044
42211b585715M33915Q79473P98684j23609q74413o36269j28072k87931o31980
42202c155917k16715O07503Q08320M16800K54247L66670J32727l66634m63588
42193a616587k18998k97126o13222m20040K40072M60545k2183m56081l74448j02449
42183c420517K00617P82453J332639J035609k5233p30664o39022n91665j041961
42174c097744j089994m8098J169040J272715L72237m82477q03980p36563k92972
$$ plain form
42241 -3198623 -3107701 -3028462 -2678835 -2163227 -1790145 -1503371 -1009447 -348109 162501 430454
42231 430454 530928 301910 -383370 -1063540 -1142895 -874600 -1089443 -1881937 -2459860 -2483682
42221 -2483682 -2544460 -2902617 -2813267 -1831448 -872639 -1030862 -2012507 -2711740 -2777759 -2585715
42211 -2585715 -2151800 -1272327 -473643 -597252 -1471665 -2107934 -2236006 -2523937 -3155917
42202 -3155917 -3372632 -2765129 -1956809 -1540009 -1285762 -919092 -786365 -1152999 -1616587
42193 -1616587 -1835585 -2132711 -2745933 -3165973 -2925901 -2465356 -2487539 -2943620 -3318068 -3420517
42183 -3420517 -3219900 -2437447 -1104808 -69199 -94432 -825096 -1464118 -2055783 -3097744
42174 -3097744 -4187738 -4235836 -3066796 -1794081 -1421844 -1904321 -2708301 -3444864 -3737836
42165c737836M38108Q31373M65615p4040j3353M33254N83381M88129O02638O84728
42155G01997J53256p08238j032936p28244m74634m55998k09594K45746K99579
42146b209066m6498m638O06312Q51916J18038q21555q52810l3544N90774L27188
42136a473883m89769r47538m48206O13346J078477L63513n74704l61386P71593
42127a468557J142207M0814j193365j143671k36653K83822L67141Q48400J693840
42118C33978J982398J508241J057462R16148L45064r83506k071698j872509p97700
42109D17878j23871k54605l98282O2159O16860L77769o04169j244626o98126N87101
42099a261912J373971J112764N17010M90651Q67352O96220l39741j356102j331293
$$ plain form
42165 -3737836 -3299728 -2468355 -2002740 -2076780 -2090133 -1656879 -1073498 -585369 17269 701997
42155 701997 855253 147015 -885921 -1614165 -2088799 -2544797 -2754391 -2508645 -2209066
42146 -2209066 -2255564 -2260202 -1653890 -801974 -683936 -1505491 -2358301 -2391845 -1801071 -1473883
42136 -1473883 -1963652 -2911190 -3359396 -2746050 -1667573 -1304060 -1878764 -2240150 -1468557
42127 -1468557 -326350 -285536 -1478901 -2622572 -2859225 -2575403 -2208262 -1359862 333978
42118 333978 2316376 3824617 4882079 5798227 6143291 5159785 3088087 1215578 417878
42109 417878 294007 39402 -358880 -296721 320139 697908 93739 -1150887 -1849013 -1261912
42099 -1261912 112059 1224823 1741833 2232484 3099836 3796056 3456315 2100213 768920
42090G68920l83711L57722P8807p90383j086522k79324Q65579J166468M58646
42081A156202k40588j14291L86975K93179m20046p91268k62536N66093Q01600
42072A375320L65869j03072j16384K54318O33288P13133M85888K95142N30303
42063D433805J143601J675805J900320K151980K770260L529422M048391M575653
42055B6229237N782059P631378Q899316Q185723N326399J591588j502045l425143
42047E8718512m667332n748963o505057o461136n649233m670829l965587l399354
42039A7651021k701941j949898j363815r21469n03003k07338j53265j13638K26046
42030I962700O75512O32556j24044j056206j435547j076178l76548J79966M06667
$$ plain form
42090 768920 385209 742931 821738 31355 -1055167 -1334491 -468912 697556 1156202
42081 1156202 915614 801323 1188298 1481477 1061431 270163 7627 573720 1375320
42072 1375320 1741189 1638117 1521733 1776051 2409339 3122472 3608360 3903502 4433805
42063 4433805 5577406 7253211 9153531 11305511 14075771 17605193 21653584 26229237
42055 26229237 32011296 39642674 48541990 56727713 62054112 63645700 62143655 58718512
42047 58718512 54051180 48302217 41797160 35336024 29686791 25015962 21050375 17651021
42039 17651021 14949080 12999182 11635367 10713898 10210895 10003557 9850292 9736654 9962700
42030 9962700 10638212 11270768 11146724 10090518 8654971 7578793 7202245 7382211 7788878
42021G788878L89929K42244k9080l48598l78629J69748R19843R50326q7445j321814
42011H295402j675992j264685j057597j280187j080785l76J152048J432128J054265
42002E574221Q87318J198315J619264J929223K063869J663841N26043o14085o95764
41993A4152245J74968P37280L42344j28762M27992J812613K918946L196368L087147
41984B6721141L294002M190997N749506P422106Q128815O948571M041213O00405
41976F7096756k212690m076606n272603o014211o225426n805635m883334l784370
41968B8821881k807481k042683j418155r08823o01733n04820m17938j36915K74978
41959B0258311N68233O38535O35287P38206R91938J447615K310530L679409N057968
$$ plain form
42021 7788878 8178807 8421051 8391971 8043373 7664744 7834492 8754335 9704661 9617216 8295402
42011 8295402 6619410 5354725 4297128 3016941 1936156 1935780 3087828 4519956 5574221
42002 5574221 6461539 7659854 9279118 11208341 13272210 14936051 15462094 14848009 14152245
41993 14152245 14327213 15064493 15406837 15278075 15706067 17518680 20437626 23633994 26721141
41984 26721141 30015143 34206140 39955646 47377752 55506567 62455138 66496351 67096756
41976 67096756 64884066 60807460 55534857 49520646 43295220 37489585 32606251 28821881
41968 28821881 26014400 23971717 22553562 21644739 21043006 20538186 20120248 19983333 20258311
41959 20258311 20826544 21465079 22100366 22838572 23830510 25278125 27588655 31268064 36326032
41950C6326032N391511L975141J372709r24275j959172k140433k370230k751793
41942C6919490k692707k004301j129397k77561Q68959K350609L547909L962786
41934D1545787L744619L053381J623302m50078k187508k820921k903632l428480
41926C8176470m253664m428216l788094l053072k430384j419352j85338K35036
41918A8853386l40671n37321O82176K358047K772921J661961J48565r94214j865544
41909B2739306k488155k524955k044566j635726j555347j487187j277207j161654
41901H564509j071422m87032O31905J426552J157798J99053m86865n40766l89988
41892I003744m60029p16201r60946j163428j357665j430784j174584n36810K23384
$$ plain form
41950 36326032 41717543 45692684 47065393 46141118 44181946 42041513 39671283 36919490
41942 36919490 34226783 32222482 31093085 30815524 31684483 34035092 37583001 41545787
41934 41545787 45290406 48343787 49967089 49517011 47329503 44508582 41604950 38176470
41926 38176470 33922806 29494590 25706496 22653424 20223040 18803688 18618350 18853386
41918 18853386 18512715 17975394 18657570 21015617 23788538 25450499 25599064 24604850 22739306
41909 22739306 20251151 17726196 15681630 14045904 12490557 11003370 9726163 8564509
41901 8564509 7493087 7006055 7637960 9064512 10222310 10421363 9934498 9393732 9003744
41892 9003744 8543715 7827514 6866568 5703140 4345475 2914691 1740107 1203297 1426681
41883A426681O94385O91827M26238K06604R5680L6200J58552O09411J119882J178441
41873F643901P50565M28159O44917J083433J153360P83391L72718J24932j47074
41864A1838302n45197p99390o57160l52507l88886q24562j047979n30936L31051
41855G022736N84732K4983m15190J5891O96198M86892n25243j095589o39526L3295
41845F189179J09225q7362P3743M10470M45790L84772O56756R53037O93002J37641
41835I966253N7824N16340J002577J591686K738894L868056L535975J468048p80807
41826B3964846j857954k187922k668400k903708k049170p10613m46194j485191
41818I655694k321471j810474n33285L24837M81947L75029K16291p6547m34324
$$ plain form
41883 1426681 2121066 2812893 3239131 3445735 3541415 3577615 3736167 4345578 5465460 6643901
41873 6643901 7394466 7822625 8467542 9550975 10704335 11487726 11860444 11985376 11838302
41864 11838302 11293105 10493715 9836555 9484048 9095162 8270600 7222621 6691685 7022736
41855 7022736 7607468 7632451 7217261 7233152 7929350 8416242 7890999 6795410 6155884 6189179
41845 6189179 6298404 6211042 6284785 6695255 7141045 7525817 8182573 9135610 9828612 9966253
41835 9966253 10024077 10540417 11542994 13134680 15873574 19741630 23277605 24745653 23964846
41826 23964846 22106892 19918970 17250570 14346862 12297692 11587079 11140885 9655694
41818 9655694 7334223 5523749 4990464 5315301 5797248 6172277 6388568 6312021 5877697
41809E877697p09819r43914j136597j026733n06190J7535J16963r610J49548O12417
41799B441297R03527Q19511P09333R01600J244435J369079J130043O43374J18084
41790A0280283k20061k39356p5241l8209k43070m81140n46895n10391n53539p23672
41780F648709r79557j261185j324446p71308L92546J382334J291729J91512q34397
41771D735937r07910k52163L40341N29771N02547L21590j65389p46990p82260
41762C575474k0096Q98484J131523O06151p4010n33571r71504j559842j944369
41753A108240j635261o89032K97908Q28827R03568P69776N38477K20852l476J54279
41743B494158O93830J195820J257299R40922O06872L94643J32320k51427n20984
$$ plain form
41809 5877697 5167878 4223964 3087367 2060634 1554444 1571979 1688942 1679332 1828880 2441297
41799 2441297 3344824 4164335 4873668 5775268 7019703 8388782 9518825 10162199 10280283
41790 10280283 10060222 9820866 9745625 9707416 9464346 8983206 8436311 7925920 7372381 6648709
41780 6648709 5669152 4407967 3083521 2312213 2704759 4087093 5378822 5570334 4735937
41771 4735937 3828027 3575864 3916205 4445976 4948523 5270113 5104724 4357734 3575474
41762 3575474 3555378 4453862 5585385 6191536 6117526 5583955 4612451 3052609 1108240
41753 1108240 -527021 -1216053 -918145 -89318 814250 1584026 2122503 2343355 2339879 2494158
41743 2494158 3187988 4383808 5641107 6582029 7188901 7583544 7715864 7464437 6943453
41734F943453m35062r215O29036J375986J984779K072869J578904R65925O45165
41725A5751840M33013k5780n44916o76609n71625q37191j430780j454281m43076
41716A0200595P61372R99828K38212n95363r20474r47512r23873p00711k45044
41707G867030Q630l13595r54056j277709r31510r1273P49386J082557O90680j33849
41697F696291p76684q68730o06257m30144m93973n45722k66110L35563Q28681
41688C872915P21320L5558n76329n25136j9275K21475l4286k43612Q2532P06130
41678D241292J065415R70931N86417O2093m15699m86065L537O20039P87540N26886
41668G962386L66489O03642J053817J449651J643591J465086Q89383M01680O59023
$$ plain form
41734 6943453 6508391 6499176 7128212 8504198 10488977 12561846 14140750 15106675 15751840
41725 15751840 16184853 16159073 15614157 14937548 14365923 13528732 12097952 10643671 10200595
41716 10200595 10961967 11961795 12200007 11604644 10684170 9736658 8812785 8112074 7867030
41707 7867030 7875660 7562065 6608009 5330300 4398790 4307517 5056903 6139460 6830140 6696291
41697 6696291 5919607 5050877 4444620 4014476 3520503 2974781 2708671 3044234 3872915
41688 3872915 4594235 4629793 4053464 3528328 3509053 3730528 3696242 3452630 3535162 4241292
41678 4241292 5306707 6277638 6864055 6926148 6510449 6024384 6027921 6647960 7435500 7962386
41668 7962386 8328875 8932517 9986334 11435985 13079576 14544662 15434045 15835725 16494748
41659A6494748J577052K174178J606305J02306j320904j853839j485609q46239
41651A6447998n73093o43465l62823O94314J864961K069289J307277P86781J329862
41642B2921101K358972K886856K849505K855994L163305L637458M372219N588134
41634E0633544P110458Q623972J0321807J2750548J6224808K0854574K6489218
41627A53008929L1515350L2142419K4714017R631777p815762k1264455k7649414
41620A94282861k7921807k4752599k0477186j6518064j3413902j1011323q979069
41613G1208911p208579n673532m281930l142265k588085k591896k520524j842139
41605D1359961p36297L31637J240611K056690K708257L272955M162474N567791
$$ plain form
41659 16494748 18071800 20245978 21852283 21954589 20633685 18779846 17294237 16447998
41651 16447998 15874905 15231440 14868617 15562931 17427892 19497181 20804458 21591239 22921101
41642 22921101 25280073 28166929 31016434 33872428 37035733 40673191 45045410 50633544
41634 50633544 57744002 66367974 76689781 89440329 105665137 126519711 153008929
41627 153008929 184524279 216666698 241380715 251012492 243196730 221932275 194282861
41620 194282861 166361054 141608455 121131269 104613205 91199303 80187980 71208911
41613 71208911 64000332 58326800 54044870 50902605 48314520 45722624 43202100 41359961
41605 41359961 40623664 40955301 42195912 44252602 46960859 50233814 54396288 59964079
41597E9964079P184624Q949162J1452674J5038063J9161689K3340993K7710938
41590A72802222L1236918L0201471K0827121M095725j3566420k5389708k9329439
41583A90877890k7816585k4017743j9631811j5456094j2239270j0381824r468928
41576G1865635q615830p282307n740710m712436m392313l981635k620529p08627
41568C3811248L38464k20893j623859k633192k733050k080527j055069k82670
41560B3520452l68869j039845j156652j34394J248402J994462K152025K262752
41552B8478333K252245J745284R35518K35014m46981j131408j015167N21460K496530
41543C4070828L242766K695664K499828L704807N579140P026042Q027670R176433
$$ plain form
41597 59964079 67148703 76097865 87550539 102588602 121750291 145091284 172802222
41590 172802222 204039140 234240611 255067732 259163457 245597037 220207329 190877890
41583 190877890 163061305 139043562 119411751 103955657 91716387 81334563 71865635
41576 71865635 63249805 55967498 50226788 45514352 41122039 37140404 34519875 33811248
41568 33811248 34149712 33928819 32304960 29671768 26938718 24858191 23803122 23520452
41560 23520452 23151583 22111738 20955086 20820692 22069094 24063556 26215581 28478333
41552 28478333 30730578 32475862 33411380 33646394 33199413 32068005 31052838 31574298 34070828
41543 34070828 37313594 40009258 42509086 46213893 51793033 58819075 66846745 76023178
41535G6023178J0759722J2976195J6328775K1014372K6085358K9490804K8926678
41528B21605082K3242807J4034680N581360J624189J597830J149532l044019j0036502
41520B55754959j6579442k0672318k1960004k0208445j5685117j0674565q364791
41513A41610277r537533j1675564j1962214j0116228p650868n429993l160385
41506H2077492r11542J58620q76904l226372m897102m731540l432631k345309
41498F1814712j785096j215490o49367p56250j496747j828167j217161l04519
41490E2561915N95149K322289M942362O152524L567481j765732o049658p060380
41482E5265950o082326n250360m832607m019591k808424j773515r53342j88717
$$ plain form
41535 76023178 86782900 99759095 116087870 137102242 163187600 192678404 221605082
41528 221605082 244847889 258882569 264463929 266088118 267685948 268835480 265791461 255754959
41520 255754959 239175517 218503199 196543195 176334750 160649633 149975068 141610277
41513 141610277 132072744 120397180 108434966 98318738 90667870 85237877 82077492
41506 82077492 81165950 81324570 80447666 77221294 72324192 67592652 64160021 61814712
41498 61814712 60029616 58814126 58164759 57408509 55911762 54083595 52866434 52561915
41490 52561915 53157064 55479353 60421715 66574239 70141720 68375988 62326330 55265950
41482 55265950 49183624 43933264 39100657 35081066 32272642 30499127 29545785 29357068
41474B9357068J68603m500J34109J167976K031785J207633r76157k604188k686090
41465B7796239k094358j840347j734681j265864p00750n46427o50845n86062m28451
41456A7948454m82749n97744l96859M2823L00989K37717J5572l41763q89308j333387
41446A4503745j208602n71414p3638j56696m77125l44925M39529J355310J682973
41437A5149157J175106K89007j97705J22906R47742J637859J858514J728298J438664
41428B4149548J001408M25635j17136m82563p57081j083864j372856j381309j068170
41419A9313612o91220n00243m52770l11552L8524M44836O35492M51380o8403p47484
41409A8112172j326324j484811j003312p4680O38724N47742j77885p22638o04459
$$ plain form
41474 29357068 29525671 29521171 29655280 30823256 32855041 34062674 33086517 30482329 27796239
41465 27796239 25701881 23861534 22126853 20860989 20160239 19613812 18962967 18376905 17948454
41456 17948454 17465705 16867961 16471102 16513925 16814914 17052631 17068203 16726440 15837132 14503745
41446 14503745 13295143 12723729 12650091 12493395 12016270 11671345 12110874 13466184 15149157
41437 15149157 16324263 16613270 16415565 16538471 17486213 19124072 20982586 22710884 24149548
41428 24149548 25150956 25576591 25459455 24976892 24219811 23135947 21763091 20381782 19313612
41419 19313612 18622392 18122149 17669379 17357827 17396351 17841187 18476679 18928059 18859656 18112172
41409 18112172 16785848 15301037 14297725 14223045 14861769 15409511 15231626 14508988 13904529
41400A3904529k85130m77004j054999j213438p26640l70218o96644r95852k43557
41391G841047J209652J892440J297553O95595J277243K367478K545566K022644
41383B1149218K464934M289908N540337M264330J082311j614748k387948j562927
41375C3225415J76043K470233M402574M455771K318615m7175j70167K248655M965432
41366E4045396N392845K981593j61340q42985K226270O423216P040006K202394
41358G9307395m536779p755021o066786l085771k470310l758377m035699k336939
41350D5261713p04036j190789l312528m906571m655833l134510j715454j061564
41342B4580428q14238m17444J54854N50730N66511K37706l46580r35432j036008
$$ plain form
41400 13904529 13619399 13142395 12087396 10873958 10147318 9777100 9080456 8084604 7841047
41391 7841047 9050699 10943139 12240692 12936287 14213530 16581008 19126574 21149218
41383 21149218 23614152 27904060 33444397 37708727 38791038 37176290 34788342 33225415
41375 33225415 33401458 35871691 40274265 44730036 47048651 47001476 46831309 49079964 54045396
41366 54045396 59438241 62419834 62258494 61415509 63641779 70064995 77105001 79307395
41358 79307395 74770616 67015595 60948809 57863038 55392728 51634351 47598652 45261713
41350 45261713 44557677 43366888 40054360 35147789 30491956 27357446 25641992 24580428
41342 24580428 23766190 23348746 23503600 24054330 24620841 24858547 24511967 23576535 22540527
41333B2540527m66627J29233n2962q04542j078865m45710L70922O49254N88222
41324B1429452O50228P20619N33697L72636O65137J246610J601360J511535R88368
41315B9719642m493j180890j720259j136197q6341L43104m4555n28361n10871
41306B4850779o714O46169R63663M71372o93438j594826j533425r76766q15819
41297B1310995j070486j123010q85066p86203q15997n80945k48065m48200j178498
41288A4174525j682655j515158r48636l17094K42673M24670p39n50405m70066
41279I357115J86353P08310Q20630P35604L66286l95476q19514m2823J460886
41270A2377371K457179K883376L730159N183872O695047Q711614J1904642J4334975
$$ plain form
41333 22540527 22073900 22203133 22150171 21345629 20266764 19821054 20191976 20841230 21429452
41324 21429452 22079680 22800299 23333996 23706632 24371769 25618379 27219739 28731274 29719642
41315 29719642 29715149 28534259 26814000 25677803 25591462 25934566 25890011 25361650 24850779
41306 24850779 24844065 25490234 26453897 26925269 26231831 24637005 23103580 22126814 21310995
41297 21310995 20240509 19117499 18232433 17446230 16630233 16049288 15801223 15353023 14174525
41288 14174525 12491870 10976712 10028076 9710982 9953655 10378325 10377586 9827181 9357115
41279 9357115 9543468 10251778 11072408 11808012 12174298 11778822 10959308 10916485 12377371
41270 12377371 14834550 17717926 21448085 26631957 33327004 42038618 53943260 68278235
41262F8278235J2274140N179765k628278o965647q238765r006817r433145p924234
41254D1535254m671510j507813Q81805K771162L112322M90921l737398o152863
41246C2721880n501657l796109k875097k369018j679461j470797k073875k430541
41238A0525325j826812j050646q11096n72774N6073L36413j50835n61944l82519
41229E561185m57866j214721j371995L4148J611207J360939l82613j491860r98265
41220B650159Q2121N81243L96513o3718m87304o56802o25502p76380j131296j036506
41210a067472k01540N53795M45918Q204K11699Q52871R72518M83984J65080K51801
41200B676858K41327J5203J0967K32340J42230l39017o71274o50509o33977o78598
$$ plain form
41262 68278235 80552375 85732140 83103862 76138215 67899450 58892633 49459488 41535254
41254 41535254 36863744 35355931 36237736 39008898 42121220 42612141 38874743 32721880
41246 32721880 27220223 23424114 20549017 18179999 16500538 15029741 12955866 10525325
41238 10525325 8698513 7647867 6836771 6263997 6320070 6656483 6505648 5943704 5561185
41229 5561185 5103319 3888598 2516603 2550751 4161958 5522897 5140284 3648424 2650159
41220 2650159 2732280 3313523 3710036 3646318 3159014 2502212 1876710 1100330 -30966 -1067472
41210 -1067472 -1269012 -715217 -269299 -261095 -49396 803475 1775993 2259977 2425057 2676858
41200 2676858 2918185 2933388 2944355 3176695 3318925 2979908 2308634 1658125 1024148 345550
41190C45550l46251M03300R33285Q38357M66110K69694K33692J83773J28541O0680
41180C516731j22280l14848k32064J27432M25661M75410M28552M35731M53904
41171E194229L90390J47563l70502r89385j210308q07159k35779k8949q6319l8335
41161A965446P6473J00711K98178Q52571J222118Q67743K71265K42149N39240
41152F435894L46936j11959J73156J113113J364970M20466n43568m84085R0872
41143H805795K42245N024j68029l74707p44781p91712k46621J72153k07035q42201
41133E850131q47552m56005n19988r93305j067951n61914k5763L97020J055575
41124B830248J724793J628489P67068J45855K85143M79714O4292n01793n38072
$$ plain form
41190 345550 -701 402599 1335884 2174241 2640351 2910045 3143737 3327510 3456051 3516731
41180 3516731 3394451 3079603 2847539 2974971 3400632 3876042 4304594 4740325 5194229
41171 5194229 5584619 5732182 5361680 4372295 3161987 2354828 2119049 2090100 2003781 1965446
41161 1965446 2041919 2142630 2440808 3293379 4515497 5383240 5654505 5896654 6435894
41152 6435894 6782830 6670871 6844027 7957140 9322110 9742576 9199008 8714923 8805795
41143 8805795 9048040 9053064 8885035 8510328 7765547 6973835 6727214 6899367 6692332 5850131
41133 5850131 5002579 4546574 4026586 3033281 1965330 1403416 1377653 1774673 2830248
41124 2830248 4555041 6183530 6950598 7096453 7381596 7861310 7925602 7423809 6885737
41115F885737l51089n99143r81201o59811K17549N90807K16078J40848R13196
41106F372971J414157N07766r11319r49755M22122J113593j05013j836451k151518
41097C876553j228698o20160p35855o23234J05866P23672Q21837Q58482R82304
41088D160767O28737k45559p19678k91955L42366M94424M14976L63699j22723
41079E025054j120436j543330o56508M88287M58942l54101l93351N92147J276726
41070C773430R31303L77595M51763P75724O02691n9341p38860j201038j335945
41061C577322r23206k3216P83384R59567N76318J08469o7111J18242L88816K75417
41051E774002l13436p26315l01090N80562Q60294L07020j48945J18839M57694
$$ plain form
41115 6885737 6534648 5935505 4954304 4294493 4512042 5102849 5318927 5459775 6372971
41106 6372971 7787128 8294894 7383575 6433820 6855942 7969535 7864522 6028071 3876553
41097 3876553 2647855 2027695 1291840 668606 774472 1498144 2319981 3178463 4160767
41088 4160767 4789504 4543945 3824267 3532312 3874678 4369102 4784078 5147777 5025054
41079 5025054 3904618 2361288 1704780 2193067 2652009 2297908 1904557 2496704 3773430
41070 3773430 4704733 5082328 5534091 6309815 6912506 6853165 6114305 4913267 3577322
41061 3577322 2654116 2630900 3414284 4373851 4950169 5058638 4991527 5109769 5498585 5774002
41051 5774002 5460566 4734251 4433161 5013723 5874017 6181037 6032092 6150931 6608625
41042F608625Q925q96185j200520o34824L7345K20925K16600N59330J141183J352785
41032G414189R17104K79747J08031N17827R31360P43653J8041o07387o33269j58741
41022I530555L21523L91403j522n39665p69307m64835J96960Q34766J136918R29401
41012A1566197K31643n96984j032094r44269p46693p63055p85154n66550l34888
41003F028153l43858l38789p8279L9325l33393n71696Q5938R82109O17897j045095
40993E042312k182128j532945m5638O79778N49744N50748R42229J080547O75985
40984E760632J27320k62129m85440l50143L20217J020640R64567K50831j65698
40975G180797J47323N06265J91291n68472j111425j271077j239072r01140K0515
$$ plain form
41042 6608625 6617550 5721365 4520845 3886021 3923366 4144291 4360891 4920221 6061404 7414189
41032 7414189 8331293 8611040 8719071 9236898 10168258 10911911 10929952 10322565 9689296 9530555
41022 9530555 9852078 10243481 10241959 9702294 8932987 8468152 8665112 9499878 10636796 11566197
41012 11566197 11797840 11200856 10168762 9224493 8477800 7714745 6929591 6363041 6028153
41003 6028153 5684295 5345506 5267227 5306552 4973159 4401463 4487401 5469510 6087407 5042312
40993 5042312 2860184 1327239 1281601 1961379 2511123 3061871 4004100 5084647 5760632
40984 5760632 5887952 5625823 5140383 4790240 5110457 6131097 7095664 7346495 7180797
40975 7180797 7328120 7834385 8025676 7457204 6345779 5074702 3835630 2934490 2955005
40966B955005J234982J875795J439985M32533j88036r9429J09248k04493q69528
40957F686062j154255p60660j79708J6367j45594k85874k71529k33249j91876
40948C479684m1983J71266K70839K10695Q0794q9843k97149l84704j39033M50872
40938C711438J176287J763568J917864J417265M19760m84024q16764p00543n46730
40929G858121m52215k64015q3978k34658p16787j106838j059752o02361P3684
40920C411201P57329J143574J019134O25083M63607O01592N22633j21584r27475
40911G495094j194290p73024j76236Q0332l466p9312L6501J59238N5780j68799
40901E431818j95413K3092J85983J54767J96715M64433N75217J44349m90745o15050
$$ plain form
40966 2955005 4189987 6065782 7505767 7938300 7750264 7650835 7760083 7555590 6686062
40957 6686062 5531807 4771147 4591439 4607806 4462212 4176338 3904809 3671560 3479684
40948 3479684 3437701 3608967 3879806 4090501 4171295 4081452 3784303 3399599 3260566 3711438
40938 3711438 4887725 6651293 8569157 9986422 10406182 9922158 9105394 8404851 7858121
40929 7858121 7405906 7141891 7057913 6823255 6106468 4999630 3939878 3337517 3411201
40920 3411201 4168530 5312104 6331238 6956321 7419928 8021520 8544153 8422569 7495094
40911 7495094 6300804 5527780 5351544 5431876 5428410 5349098 5385599 5544837 5600617 5431818
40901 5431818 5236405 5259497 5445480 5600247 5796962 6261395 6836612 6980961 6490216 5875166
40891E875166j33605L12114K83178J14110L83977J167187J953195K072206J205547
40882A3233075k16597j184902j089461m76749l26388o19418l27149J006390K413164
40873A2411965K654453J643106K12440j040358k053338k748729k861271k318858
40865E899410j377733l78326L73117N97859K42240l34100n77540j80863O62056
40856D926120J287806J004672m7717n71991O17229K841027L950521K924920J172935
40847A8105522M91686O09814n8292j775407l047822k791577j618410o81744l28800
40838H904970l12827m40362n23834l88090l06896p61659j454125j346297j26102
40829C244778J134288J333724O62852o147l35932m13163p3610P78937J623760
$$ plain form
40891 5875166 5741561 6053675 6336853 6450963 6834940 8002127 9955322 12027528 13233075
40882 13233075 13016478 11831576 10742115 10265366 9938978 9319560 8992411 9998801 12411965
40873 12411965 15066418 16709524 16921964 15881606 13828268 11079539 8218268 5899410
40865 5899410 4521677 4143351 4516468 5114327 5356567 5022467 4444927 4264064 4926120
40856 4926120 6213926 7218598 7170881 6598890 7216119 10057146 14007667 16932587 18105522
40847 18105522 18597208 19207022 19148730 17373323 14325501 11533924 9915514 9233770 8904970
40838 8904970 8592143 8151781 7627947 7239857 6932961 6171302 4717177 3370880 3244778
40829 3244778 4379066 5712790 6375642 6369495 6033563 5620400 5546790 6325727 7949487
40820G949487J973181K256066L198995M555644N286589M858905L618547K087888
40812C5785302P28990J69299N95148R10739l75314l110495n300500n396679l994577
40803B0011913k776969k493153k599514k371024j692393r52320n82413o01825
40795E942302n25247q208M91599K91611k95026j70397R22088J945542K123248
40786A0717512J881613J649019R24955m32791j144433k33202R96928N12588j295657
40777A3576532j963148n43140J125866J312567O71168N45961N95607l11141j816219
40768A3194053k409867j693197q08732o23665p58047o48189n07101p52344j176688
40759C816223j194123n84586K92063Q30369O63636M3523l11396k7850L88539K11378
$$ plain form
40820 7949487 9922668 12178734 15377729 19933373 25219962 30078867 33697414 35785302
40812 35785302 36514292 36683591 37278739 38189478 37814164 34703669 29403169 24006490 20011913
40803 20011913 17234944 14741791 12142277 9771253 8078860 7126540 6544127 5942302
40795 5942302 5417055 5408847 5900446 6192057 5897031 5726634 6648722 8594264 10717512
40786 10717512 12599125 14248144 15173099 14740308 13595875 13362673 14359601 14872189 13576532
40777 13576532 11613384 11070244 12196110 13508677 14179845 14725806 15321413 15010272 13194053
40768 13194053 10784186 9090989 8282257 7658592 6900545 6252356 5745255 4992911 3816223
40759 3816223 2622100 2037514 2329577 3159946 3823582 3867105 3555709 3527859 3916398 4127776
40749D127776m62900q37800n16308R4634N17451P49900R18814R44339Q25198Q29720
40739G190824J137722J654263K356039L326355M138678L761479J685263j128621
40731B4122002l037691l390074k915580k514100k247776j712149r00908k82018
40723G121706j82055m22196n64483l56927N1124K36032r9586p32022r84795l66095
40713C700703Q50837J823607J922905J176263j1829j243102k097637k124570j289742
40704B707435k59262K18578J54171J03509K13282J17898j41113J01573J005575
40695D221646J593495R58091l73668j089358q19766l71463l70463n87342o88447
40686B472725p65107q39603o31168j96173j03776n22976p79367l57421K50515
$$ plain form
40749 4127776 3664876 2827076 2310768 2405402 2922853 3672753 4591567 5535906 6361104 7190824
40739 7190824 8328546 9982809 12338848 15665203 19803881 23565360 25250623 24122002
40731 24122002 21084311 17694237 14778657 12264557 10016781 8304632 7403724 7121706
40723 7121706 6939651 6517455 5952972 5596045 5647169 5883201 5783615 5051593 4066798 3700703
40713 3700703 4551540 6375147 8298052 9474315 9462486 8219384 6121747 3997177 2707435
40704 2707435 2448173 2666751 2820922 2924431 3137713 3255611 3114498 3216071 4221646
40695 4221646 5815141 6773232 6399564 5310206 4490440 4118977 3748514 3161172 2472725
40686 2472725 1707618 868015 236847 40674 -63102 -586078 -1365445 -1722866 -1472351
40677a472351L38279R7421J45762L41970K3062o95252q42151k4163Q87172R18087
40667b82164K60630j12121K68473R53118J267596R93477L80334k10481n80397
40658B938465p26068o79135m05390J6034K16420j39658p91226r92829m06143M10667
40648e58863O95321M08106Q6027j7008j13239k53119j34081K65401M24984M9059
40638H52588l47402j43452M01356M86754m0364n03293m29263j08018N2994J00866
40628C22766J61323O3833k38387l47660Q292M70951N68798L53731N8520m07888
40618A014279j010529j118682l18044O48517P02320r93l38288L0989L23190J41310
40608G4069Q0662M27858M72614j93660p54531m23079K55243L42440L2789J46833
$$ plain form
40677 -1472351 -1134072 -1036651 -890889 -548919 -525857 -1221109 -2063260 -2087423 -1200251 -282164
40667 -282164 -21534 -133655 134818 1087936 2355532 3349009 3729343 3518862 2938465
40658 2938465 2212397 1533262 1127872 1143906 1360326 1220668 429442 -563387 -969530 -558863
40648 -558863 136458 544564 630591 613583 500344 247225 113144 378545 803529 852588
40638 852588 505186 361734 763090 1249844 1209480 706187 276924 168906 221900 322766
40628 322766 484089 547922 309535 -38125 -29833 441118 1009916 1363647 1422167 1014279
40618 1014279 3750 -1114932 -1432976 -784459 -82139 -83132 -421420 -390431 -67241 74069
40608 74069 154731 582589 1055203 861543 107012 -316067 -60824 281616 314405 461238
40598D61238O44419Q26417P04560R55349J558949J615492P07036m54671r74946
40589F043843o74747P8039P51145P85708P8826n71542k44548Q04239J492282J700541
40579A0243786K578893M471665N612146M044249L99818k412599k396432n28993
40571B2012533O25633k48148k216210l580382l717866l239944k765686k184356
40563D685574j258202l59939o5236k78640l67404r5869J48236Q2091r3188j62136
40553B235287j99365k10276L8277N95170J174366J636004K131080K501473K081752
40544A1983768N69678j278709k329815k258361j676966j281568j243297j305061
40536A179669j133193o37755j54419j58895o09934q18998k66306O53613J043222
$$ plain form
40598 461238 1105657 1932074 2636634 3591983 5150932 6766424 7473460 7018789 6043843
40589 6043843 5369096 5447135 6198280 6983988 7062814 6491272 6246724 7050963 8543245 10243786
40579 10243786 12822679 17294344 22906490 26950739 27350557 24937958 22541526 22012533
40571 22012533 22638166 22390018 20173808 16593426 12875560 9635616 6869930 4685574
40563 4685574 3427372 3067433 3002197 2723557 2356153 2260284 2408520 2490611 2397423 2235287
40553 2235287 2035922 1825646 1863923 2459093 3633459 5269463 7400543 9902016 11983768
40544 11983768 12553446 11274737 8944922 6686561 5009595 3728027 2484730 1179669
40536 1179669 46476 -591279 -745698 -904593 -1514527 -2333525 -2599831 -1946218 -902996
40527i02996N51483k90904p21814m69512J37198N37690L90408j82430p19864p94611
40517b465352k88284N58123J230493J256977P31323L87315P65729J421129J469110
40508E066563Q73926N35122R66308J589692J669802J304701J003507P90827L19671
40499A4120119m18681j019883j162797q38856k07615N99242J670036L194806M705757
40490B0642128M720474K243099j211135k491171n63614J774846J174788k133240
40482B4156175m929396n134717l662940k305743j573155j124537q91478q99845
40474C634364q43354n90662n43416r25228j223527q64115n0651N26206N40687
40465c39696K41271O716n6163j51613m61566p16131l78529M79367R46385M71162
$$ plain form
40527 -902996 -351513 -642417 -1364231 -1833743 -1696545 -1158855 -768447 -950877 -1670741 -2465352
40517 -2465352 -2753636 -2195513 -965020 291957 1023280 1410595 2176324 3597453 5066563
40508 5066563 5940489 6475611 7441919 9031611 10701413 12006114 13009621 13800448 14120119
40499 14120119 13701438 12681555 11518758 10679902 10472287 11071529 12741565 15936371 20642128
40490 20642128 25362602 27605701 26394566 23903395 23339781 25114627 26289415 24156175
40482 24156175 19226779 14092062 10429122 8123379 6550224 5425687 4534209 3634364
40474 3634364 2791010 2200348 1656932 731704 -491823 -1355938 -1406589 -880383 -339696
40465 -339696 -98425 -91709 -147872 -299485 -761051 -1477182 -1855711 -1376344 -429959 41203
40455D1203j84926o157O90767P90516K12814o5445K38600L35551q0044l20289
40445A652590j40294k59967q78330j079478m65855J1760k41488l46159L41830
40436a405391Q10073J01095q28185o30113J49924J95931j12962M75289J460635
40427B16296J223358M2847r5148J046571J301603l24980j884951j549214k81461
40418c05079J54718P815M24487R70404M52646o64329q26487O1574O36314M16679
40408A328742K55932M57262K92814l31768m72299J09801L84924j41244n62394
40399A321770k86182j49738p80990j194113l90661P03380N25319n70966p96666
40390a618847K71933J110489O55387l02767o92873p43005j083360j308246n78916
$$ plain form
40455 41203 -143723 -149880 540887 1331403 1544217 1478772 1717372 2052923 1972879 1652590
40445 1652590 1512296 1252329 373999 -705479 -1171334 -1159574 -1401062 -1747221 -1405391
40436 -1405391 -595318 -494223 -1322408 -1952521 -1802597 -1606666 -1719628 -1244339 216296
40427 216296 1439654 1482501 1387353 2433924 3735527 3410547 1525596 -23618 -305079
40418 -305079 -150361 -142546 281941 1252345 1704991 1040662 214175 275749 912063 1328742
40408 1328742 1584674 2041936 2334750 2002982 1530683 1640484 2025408 1884164 1321770
40399 1321770 1035588 885850 104860 -1089253 -1479914 -776534 -251215 -822181 -1618847
40390 -1618847 -1346914 -236425 418962 116195 -576678 -1319683 -2403043 -3711289 -4290205
40381d290205Q67178J879702J896882J427634J071378Q21304M90164K26608L08189
40372D698834P30187J208307J414841J131057L57766o25436j411772j716178j463605
40363D324001p94508j30526k0832n97724j268365j284925o19499L0868J20062
40354b41448j92481m26352l74718j30290K18013O34597R69636R90727O71435L59669
40344B478788M97779J059803J378559Q17185l65142j187662j140879p68829p47139
40335B022463q73647n59385N4273K57120r6320m26399m09153l15826k80951p0714
40325f98539K17940R8493l48242l61547K12703M86366K0526k54582M29404J133876
40315I36398N14176r16499j341973l04364O97587M78578l54765p01528n36489
$$ plain form
40381 -4290205 -3423027 -1543325 353557 1781191 2852569 3673873 4164037 4390645 4698834
40372 4698834 5429021 6637328 8052169 9183226 9540992 8915556 7503784 5787606 4324001
40363 4324001 3529493 3398967 3378135 2780411 1512046 227121 -392378 -361510 -241448
40354 -241448 -433929 -860281 -1234999 -1365289 -1147276 -512679 456957 1447684 2119119 2478788
40344 2478788 2976567 4036370 5414929 6232114 5866972 4679310 3538431 2769602 2022463
40335 2022463 1148816 589431 643704 900824 804504 378105 -31048 -346874 -627825 -698539
40325 -698539 -480599 -382106 -730348 -1091895 -879192 -392826 -372300 -626882 -197478 936398
40315 936398 1450574 534075 -807898 -1112262 -414675 63903 -290862 -992390 -1528879
40306a528879m14781l18301R0192O03074P09803M37720K75233L89409M34870Q2401
40296G60741n89161j139025j047101k12495O77980O84751k22448r79724p50185
40287b816667M5158M84447M49957M96120P30854O46481N5443n19871n77786k63671
40277a269535p5454k84295p62079j104068q94441j44357N60475O85586M49015
40268b839153M61722P37915O71054R2729l27205p9733L74247L04899k09977n08919
40258a322421l75737k00130k00565j10539K68006O98139Q63072P18498L48973
40249F87296j83210o79752q02071m22267K22208Q06608J096661Q49109Q99q88845
40239F86636r45625j14731N09413M5812q85225r55396L4592R58378R93787N59627
$$ plain form
40306 -1528879 -1943660 -2261961 -2171769 -1568695 -858892 -421172 -145939 243470 678340 760741
40296 760741 171580 -967445 -2014546 -2227041 -1549061 -864310 -1086758 -2066482 -2816667
40287 -2816667 -2771509 -2287062 -1837105 -1340985 -610131 36350 91793 -428078 -1005864 -1269535
40277 -1269535 -1344989 -1629284 -2391363 -3495431 -4389872 -4534229 -3973754 -3288168 -2839153
40268 -2839153 -2377431 -1639516 -968462 -875733 -1202938 -1282671 -908424 -603525 -813502 -1322421
40258 -1322421 -1698158 -1898288 -2098853 -2209392 -1941386 -1243247 -380175 338323 687296
40249 687296 504086 -175666 -977737 -1400004 -1177796 -371188 725473 1574582 1575481 686636
40239 686636 -258989 -373720 135693 181505 -703720 -1659116 -1624524 -666146 327641 887268
40229H87268L63187L35627O0612l14688k76292J99002N53499L58943k48373p89449
40219A129336q63080m57409j8835l4684m07663n17625o2459N37468Q08981Q46298
40209I60328Q86719P31828J48073m91827n87627j38916L50112N84379N50751J49522
40199C143342n66072r94560o10011J31147L30276L2050J23577P71868J047975
40190C409592M96341K5407N12628J339460J246709J75568o91807n73894L9856
40181E979860K13477l55379j225990j749505j538607o94728K32956O26848K91454
40172A780386l73901o91768l04290M33110P62644L72558k48664n21701n29887
40163F78487o39900p08393l60355J40381J62539j67242n2113O24274J034306P69059
$$ plain form
40229 887268 1250455 1586082 1646694 1332006 1055714 1254716 1808215 2167158 1918785 1129336
40219 1129336 266256 -191153 -209988 -244672 -652335 -1169960 -1232419 -694951 114030 960328
40209 960328 1847047 2578875 2726948 2235121 1647494 1508578 1858690 2443069 2993820 3143342
40199 3143342 2577270 1582710 972699 1103846 1434122 1466172 1589749 2361617 3409592
40190 3409592 3905933 3931340 4443968 5783428 7030137 7205705 6513898 5940004 5979860
40181 5979860 6193337 5837958 4611968 2862463 1323856 629128 862084 1488932 1780386
40172 1780386 1406485 714717 410427 843537 1606181 1978739 1730075 1208374 678487
40163 678487 38587 -669806 -1030161 -889780 -727241 -894483 -946596 -322322 711984 1481043
40153A481043L89351J83517m22133j476174j757181n58076Q11217P32676k67850
40144h83610m17800M18522O29808l32555r47043p2480J182419J103982j91332
40135D89911j148642r81676l50002n6627o1594O0040L32509L87248L7817l88988
40125a680004l72251J58677O71153P03594M93331N58406P91726N24376m27507
40116A421501j318005j342265n81645K13582N35278N14907N11408N50612L00809
40107H06182l58542r00918o58823J73523N83359J04177m56396k24199L98787M64081
40097f8769P8337J26700N86774M35023n64950j239789o96714L88742Q24825M28699
40087B98878j54892m63240l84834Q2656O01286N40731j52839o48878l55018K15636
$$ plain form
40153 1481043 1870394 2053911 1631778 155604 -1601577 -2159653 -1348436 -615760 -883610
40144 -883610 -1301410 -882888 -253080 -585635 -1532678 -1605158 -422739 681243 489911
40135 489911 -658731 -1640407 -1990409 -2047036 -2108630 -2048590 -1716081 -1328833 -1291016 -1680004
40125 -1680004 -2052255 -1893578 -1222425 -518831 -25500 532906 1324632 1849008 1421501
40116 1421501 103496 -1238769 -1820414 -1606832 -1071554 -556647 -45239 505373 806182
40107 806182 447640 -453278 -1112101 -938578 -355219 -251042 -707438 -931637 -532850 -68769
40097 -68769 9568 136268 723042 1158065 593115 -646674 -1343388 -954646 -129821 298878
40087 298878 143986 -319254 -704088 -621432 -20146 520585 367746 -281132 -636150 -420514
40077d20514L17721J18896K12653M97536M15211k0347k78120j96486n9109N0951
40067F38392K65850M41254L10185o670k44426n22664r63355j053856k44027R38137
40057d41180J279562M82844m29084m84111J67964P65184Q84413O34272M06987
40048C266851O35818J360799J932966J610986N00247o02723j281448j769071k119276
40039C535149j915979j079924k32656J24957J62281P6306l87453j207357j531666
40030b456342o62839P52383J326520O23866m32349q42847n94868l03289l11631
40021b901396m41804l60867O1980O55291J058630J006961N93768K13503J86008
40012G2074M34998N46583J76237n46131j032253p61269J62847J041920J214262
$$ plain form
40077 -420514 -102793 16103 228756 726292 1141503 1121156 843036 646550 587441 638392
40067 638392 904242 1345496 1655681 1649011 1404585 881921 -81434 -1135290 -1379317 -441180
40057 -441180 838382 1321226 892142 408031 575995 1341179 2225592 2859864 3266851
40048 3266851 3902669 5263468 7196434 8807420 9307667 8704944 7423496 5654425 3535149
40039 3535149 1619170 539246 306590 431547 593828 670134 282681 -924676 -2456342
40030 -2456342 -3119181 -2366798 -1040278 -416412 -848761 -1691608 -2286476 -2589765 -2901396
40021 -2901396 -3343200 -3704067 -3642087 -2986796 -1928166 -921205 -327437 -113934 72074
40012 72074 507072 1053655 1229892 683761 -348492 -1109761 -946914 95006 1309268
40003A309268O37559j33993n04618l91724k46011m51771p51442n25312K79727
39994g78317Q85499O57667R520j49448L61794R10298J066659J019353R38893O82864
39984E604782L79076N69873J308727J700276R41025n58233j656037j793766j281444
39975E214279n63834J29701N33511M44589J55326K29786P19026J063910Q85751
39966H812045L94982j25783p11673j307652j473074r54520k38066m2287m25711
39957C928261q28833q65724o15822k27733K20807M37974Q8473n41651o16348J37667
39947A117071Q74701O94645j31741o32563n26428l47065k95888Q2966Q70428J315249
39937C021375R03766J88344m0838J61445K78760K68126L37542K05189n14722j402666
$$ plain form
40003 1309268 1946827 1812834 1308216 916492 670481 218710 -532732 -1058044 -778317
39994 -778317 107182 764849 774369 624921 986715 1897013 2963672 3983025 4921918 5604782
39984 5604782 5983858 6553731 7862458 9562734 10503759 9945526 8289489 6495723 5214279
39975 5214279 4650445 4780146 5313657 5758246 5913572 6143358 6862384 7926294 8812045
39966 8812045 9207027 9081244 8369571 7061919 5588845 4634325 4396259 4353972 3928261
39957 3928261 3099428 2233704 1617882 1390149 1610956 2048930 2137403 1595752 979404 1117071
39947 1117071 1991772 2686417 2554676 1922113 1395685 1048620 752732 835698 1706126 3021375
39937 3021375 3925141 4113485 4072647 4234092 4512852 4780978 5118520 5323709 4808987 3406321
39927C406321j635057j235829j016267j214517j141399m19080L30239M55226J81724
39918b288639N8153J28936J81589K74399M74402N23027K93636J84683N46414J092442
39908A469042J380899J478399J585159J401188N52293o17635j366358j492507
39900D390480j328328j009681m90414j46493n01444j249607j360515m37975O86147
39891a447830J054026P04328K90331P7140j39426l93561l89298K6164N94313R34234
39881A310421R14353O66680L30783r9615o07512r16481o93627r9834J80678k39505
39871G46341q61952r33413m42504R702J38291J36186K0493l85303p40162l42361
39861b654682O85565J235529P57608J44893L60361R51957R20440M51854N15635
$$ plain form
39927 3406321 1771264 535435 -480832 -1695349 -2836748 -3255828 -2925589 -2470363 -2288639
39918 -2288639 -2230486 -2101550 -1919961 -1645562 -1171160 -648133 -354497 -169814 376600 1469042
39908 1469042 2849941 4328340 5913499 7314687 7866980 7249345 5882987 4390480
39900 4390480 3062152 2052471 1562057 1415564 914120 -335487 -1696002 -2133977 -1447830
39891 -1447830 -393804 310524 600855 677995 538569 145008 -244290 -218126 376187 1310421
39881 1310421 2224774 2891454 3222237 3122622 2515110 1598629 905002 805168 985846 746341
39871 746341 -115611 -1049024 -1491528 -1481826 -1343535 -1207349 -1186856 -1572159 -2312321 -2654682
39861 -2654682 -1969117 -733588 24020 168913 529274 1481231 2401671 2853525 3369160
39852C369160J023334Q25083l07661j092567o65957J15138J11748l75253l79221
39843B623804m741j29457p54392r41494l59335K72721M21643L41005J89619l39790
39833A319583j040563r23555K98124J337849R19688l95580j020385n42149L5240
39824a1748N9295P913L26215N87063K89196k99256o13334n31805k00730L52205
39814c4986R56456J126267O87829K36787M38430J106430J467248J157103M70871
39805G612435k52393r63708j588202j834149j525930q95547l56936r1054J898
39796A06414k1900l11490q67872j161879n72022O10656J150449L65776p72136
39787a474004q23925J14479O24956J56978k35600K64674R08212P18635J47284
$$ plain form
39852 3369160 4392494 5217577 4909916 3817349 3151392 3266530 3378278 3003025 2623804
39843 2623804 2619063 2489606 1735214 793720 434385 707106 1128749 1469754 1659373 1319583
39833 1319583 279020 -644535 -346411 991438 1911126 1515546 495161 -46988 -11748
39824 -11748 47547 55460 381675 968738 1257934 958678 345344 -186461 -387191 -34986
39814 -34986 921470 2047737 2735566 2972353 3410783 4517213 5984461 7141564 7612435
39805 7612435 7360042 6396334 4808132 2973983 1448053 552506 195570 104516 106414
39796 106414 84514 -226976 -1094848 -2256727 -2828749 -2218093 -1067644 -701868 -1474004
39787 -1474004 -2297929 -2183450 -1558494 -1401516 -1637116 -1372442 -464230 254405 401689
39778D01689K58236R21675J048107L11964m98094p39394n10183j9589O59719J127565
39768B961695Q47494p138o34988o70230m78699l43983j41150P6012J627k11556
39758A399084j0865N13273N06349l26656j104397r99802l39809J34612M18517
39749A90306Q98297J375872J281491O17620l2991l32690m42823n32339n36801
39740B485942l88966j18572K36755N53920N82431K30257k58060o03576p53155
39731A966976o88493l40250Q5342J45528j56543k38537R4961J59979m84531j017364
39721d72932m13423Q46918J265086M69637k96376q5654M77115M03173j09330j70785
39711A913429L47685P55816O48784K56524j83734o38324q44743m01785N01289
$$ plain form
39778 401689 659925 1581600 2629707 2941671 2443577 1704183 1194000 1174411 1834130 2961695
39768 2961695 3809189 3802051 3167063 2496833 2018134 1674151 1533001 1609013 1610640 1399084
39758 1399084 1388219 1901492 2407841 2081185 976788 -23014 -362823 -228211 190306
39749 190306 1088603 2464475 3745966 4363586 4330595 3997905 3555082 3022743 2485942
39740 2485942 2096976 1978404 2215159 2769079 3351510 3581767 3323707 2720131 1966976
39731 1966976 1278483 938233 1023575 1169103 1012560 774023 868984 1028963 544432 -472932
39721 -472932 -886355 -39437 1225649 1695286 1398910 1313256 1790371 2193544 2084214 1913429
39711 1913429 2261114 3016930 3665714 3922238 3738504 3100180 2255437 1853652 2354941
39702B354941J037941P23994m210m66676n49761n03391l88588k26762l31946q52570
39692G92972j196455o48986M59231R65943M18302l35245l93019Q7968M97502P91412
39682A439625J200645J437427J033095K09725l67869n62170p61938j046328j110986
39673A471226r63316r15744q89058n07460P4663K65034M9845N6754M38164O09626
39663c10266L66609K76583N20921L45999o60230j613547j479975n18834K39023
39654b833717M03349K93679Q1278k50969l97130o809O69862J043249R17961M95530
39644D16283k4301l77492k33675K10100J89610m70025q38489k88047L53199Q6496
39634i76341n60172m34423K27960K52003l38144l38947M68006Q90922L75591j55559
$$ plain form
39702 2354941 3392882 4116876 4112666 3645990 3096229 2592838 2204250 1977488 1645542 792972
39692 792972 -403483 -1052469 -593238 372705 791007 455762 62743 150711 648213 1439625
39682 1439625 2640270 4077697 5110792 5320517 4952648 4390478 3628540 2582212 1471226
39673 1471226 507910 -407834 -1296892 -1804352 -1729689 -1464655 -1414810 -1358056 -919892 -310266
39663 -310266 56343 332926 853847 1199846 539616 -1073931 -2553906 -3072740 -2833717
39654 -2833717 -2430368 -2136689 -2055411 -2306380 -2703510 -2710319 -2040457 -997208 -79247 416283
39644 416283 391982 14490 -219185 -9085 180525 -289500 -1127989 -1416036 -1062837 -976341
39634 -976341 -1536513 -1970936 -1742976 -1490973 -1829117 -2168064 -1700058 -809136 -433545 -589104
39624e89104m7048M0431m31191p82790l99029O4682k28537r46682j292730j200883
39614e812881q94515j23995J094335J763325J115315n1074m14206j2978J13333
39605c223341k46339l21202J48725N54926N77330N29172M45410m2276p17773p74788
39595c070156j40487K37111j12394l96749P8461O70171M16078l47093m36374L69236
39585b732196R94860O23894k65914p32352n87290l13384j90263r4353j3198j48135
39575c458331l97524k71329L75094R41184Q49872L94521K57912M14861K53606
39566f40134k35606k68322M38241R93590N45808m37132q09284k85398L79131N11219
39556A92113J35622l95793p33298n46813J67883Q01970P18477J30935j56903J05106
$$ plain form
39624 -589104 -636152 -595721 -1026912 -1809702 -2208731 -2144049 -2372586 -3319268 -4611998 -5812881
39614 -5812881 -6707396 -6831391 -5737056 -3973731 -2858416 -2909490 -3323696 -3336674 -3223341
39605 -3223341 -3469680 -3790882 -3642157 -3087231 -2509901 -1980729 -1535319 -1577595 -2295368 -3070156
39595 -3070156 -3210643 -2973532 -3085926 -3482675 -3404214 -2734043 -2317965 -2665058 -3101432 -2732196
39585 -2732196 -1737336 -1113442 -1379356 -2111708 -2698998 -3012382 -3202645 -3296998 -3310196 -3458331
39575 -3458331 -3855855 -4127184 -3752090 -2810906 -1961034 -1566513 -1308601 -893740 -640134
39566 -640134 -875740 -1144062 -705821 287769 833577 396445 -412839 -698237 -319106 192113
39556 192113 327735 -68058 -801356 -1348169 -1180286 -378316 340161 471096 314193 419299
39546D19299L36673Q1087l76980n49427l74017p4926J46927O6647m68117j141824
39536a934658j290667o97113Q7949M53080L91382K36497J57237K10179M75686
39527a910428P75599O46111J1558m86499l28748N5969q0215n94079o15578J09527
39517b416783Q06826Q05883M14966K86872M43498M45220J93703m00j5390o0575
39507I03820k16114k82464j74472o9419k8992J38994M25296M04358j65455p99772
39497A35780q04118k14112K50405J79379m0784J23479O09500R11727P29000K32425
39487B112681j49526p0923M18435P95461N62985l3028j25730O66632J592087J647164
39477G416238R07850M85364J157422K444628L126398K386861M10276j840861l301579
$$ plain form
39546 419299 755972 837059 460079 -89348 -463365 -538291 -391364 -324717 -792834 -1934658
39536 -1934658 -3225325 -3922438 -3834489 -3381409 -2990027 -2753530 -2596293 -2386114 -1910428
39527 -1910428 -1134829 -488718 -477160 -963659 -1292407 -1236438 -1316653 -1910732 -2526310 -2416783
39517 -2416783 -1609957 -804074 -389108 -102236 341262 786482 980185 979785 964395 903820
39507 903820 687706 405242 230770 161351 132359 271353 696649 1101007 935552 135780
39497 135780 -668338 -882450 -632045 -452666 -493450 -369971 239529 1151256 1880256 2112681
39487 2112681 1963155 1892232 2310667 3106128 3669113 3636085 3510355 4176987 5769074 7416238
39477 7416238 8324088 8809452 9966874 12411502 15537900 17924761 18335037 16494176 13192597
39468A3192597l501802k813223j991056j453640j076985o23413j46337J14848
39460A700989Q9421l5611p3179n5931r8369j20960M2532K10860r4286q58715j222924
39449e16173n12080O29682R45479L49581Q764M33865O46968j11677r48856o50886
39439B74667L68202P55781L72580L34270J027867J486422R73367J6810n17555
39430E092411m56057q4911K78867K14487m72444j108484p19158N22821J368221
39421D635753J275282J047280J328082J691934J809009K174592K756857K230268
39413A8949057j09081k677576l395213k463772j771473j992283k005930j118420
39405C415309j45008P0635j81179k94524k17954l2099L65988O97039L24873o70929
$$ plain form
39468 13192597 9690795 6877572 4886516 3432876 2355891 1732478 1586141 1700989
39460 1700989 1790410 1754799 1681620 1625689 1527320 1406360 1448892 1659752 1565466 706751 -516173
39449 -516173 -1028253 -398571 546908 896489 905253 1339118 1986086 1874409 925553 274667
39439 274667 642869 1398650 1771230 2105500 3133367 4619789 5593156 5609966 5092411
39430 5092411 4636354 4551443 4830310 5044797 4572353 3463869 2744711 3267532 4635753
39421 4635753 5911035 6958315 8286397 9978331 11787340 13961932 16718789 18949057
39413 18949057 18839976 16162400 12767187 10303415 8531942 6539659 4533729 3415309
39405 3415309 3270301 3340936 3159757 2865233 2647279 2615180 2981168 3678207 4003080 3332151
39395C332151j280205r18832k36983p6337l60947n67037n95821n67170l43241
39386a614422J20122M46768M28435M47506P64047R03185L80101m30630q13077
39377F32035o93605m46255j13241M48147R63378J053971R18572R49579Q89082
39368D601663J88097r21701j576755j492820j195306j005356o84862k45129j68228
39359b500397m59327l59114M46468J081382O48495m15736r33837n75571o1445
39350c129082M9280p086J68739N17584P40663P07445M37701k7498n54124q96705
39340a993083q76788n02331O6966N61009P15186N42634L89717N04087O85017O33360
39330G25774M67056M83816N44816K32074l66826o09031k01281L82177O55399P81724
$$ plain form
39395 3332151 2051946 1133114 896131 819794 458847 -108190 -704011 -1271181 -1614422
39386 -1614422 -1494300 -1047532 -619097 -171591 592456 1495641 1875742 1445112 632035
39377 632035 -61570 -507825 -621066 -172919 790459 1844430 2763002 3712581 4601663
39368 4601663 4789760 3868059 2291304 798484 -396822 -1402178 -2087040 -2332169 -2500397
39359 -2500397 -2959724 -3318838 -2872370 -1790988 -1142493 -1558229 -2492066 -3067637 -3129082
39350 -3129082 -3079802 -3086888 -2918149 -2400565 -1659902 -952457 -514756 -542254 -1096378 -1993083
39340 -1993083 -2869871 -3372202 -3305236 -2744227 -2029041 -1486407 -1096690 -592603 92414 725774
39330 725774 1192830 1676646 2221462 2453536 2086710 1477679 1276398 1658575 2313974 3095698
39320C095698J082705J326741J043382L00453l49618n80148n14117l49000j93423
39311D862673k17865n45478r82682j186814j068654p43868k43241L25198N10173
39302G09442r322p41168q09264j35776M44878L98972J38353J84162L87389M24563
39292I92229M33744N76690N07147k9809m80647j46430O81759J042790O56234J73695
39282D407402O8755N4497k15660n65754p24211p81669q80997q83635o74634m39419
39272f35325l24188j42045K62317O26992N84718J74919k38879m19716l96276k84619
39262g92102j67735n4671J39970M27136N36208J76915m13969n84181j18724M34426
39252d16727N80823N80425Q90629J306976J277756Q40769N38318M41369j333r50926
$$ plain form
39320 3095698 4178403 5505144 6548526 6848979 6499361 5919213 5405096 5056096 4862673
39311 4862673 4644808 4099330 3116648 1929834 861180 117312 -125929 199269 709442
39302 709442 700120 -41048 -850312 -986088 -541210 -142238 -3885 180277 567666 992229
39292 992229 1425973 2002663 2509810 2480001 1999354 1852924 2534683 3577473 4233707 4407402
39282 4407402 4476157 4530654 4314994 3749240 3025029 2243360 1362363 478728 -195906 -635325
39272 -635325 -959513 -1101558 -839241 -212249 372469 547388 308509 -111207 -507483 -792102
39262 -792102 -959837 -1014508 -874538 -447402 88806 265721 -148248 -732429 -851153 -416727
39252 -416727 164096 744521 1635150 2942126 4219882 5060651 5598969 6040338 6039005 5088079
39242E088079j686668j548734r17036p20750j177331j532379j077910m3306P01276
39233b914759O45642J58504J6521N09772J096504R93322P2021r39929j201122
39224a563524o16606J32555L79476J54793J0820K71528O63804P56660N61120M69371
39214A219997O87790R99962J090071Q33370K50305m97195r96169q88924m80972
39205B218235n71304j313226j724655r37008M13558Q33745q2187j172723j283371
39196c618936n33020K57919O42601O02480J87499l08252l06257L10381Q13317
39187a952268N93868J00564J16857M96687M92533Q5572k6805K67819K74122k44384
39177B04565o16771m64623l55009o84768q46163k93340L51809K33379k84339j84132
$$ plain form
39242 5088079 3401411 1852677 935641 214891 -962440 -2494819 -3572729 -3616035 -2914759
39233 -2914759 -2269117 -2110613 -2094092 -1584320 -487816 505506 577527 -362402 -1563524
39224 -1563524 -2180130 -2047575 -1668099 -1513306 -1502486 -1230958 -567154 189506 750626 1219997
39214 1219997 1907787 2907749 3997820 4831190 5081495 4584300 3588131 2699207 2218235
39205 2218235 1646931 333705 -1390950 -2327958 -1914400 -1080655 -1162842 -2335565 -3618936
39196 -3618936 -4151956 -3894037 -3251436 -2648956 -2461457 -2769709 -3075966 -2765585 -1952268
39187 -1952268 -1358400 -1257836 -1140979 -644292 -151759 -66187 -92992 174827 448949 204565
39177 204565 -412206 -876829 -1231838 -1916606 -2762769 -3056109 -2704300 -2470921 -2755260 -2939392
39167b939392N38916R21740O24545L42353N07265O36987L11450r5612j20716M8022
39157G75558l325k93483o40557r70355j092412p06358P614L51984N5218l05091
39147b821207k35453o1993k05479l54820m9330M63135P16276Q71946J205206J199665
39137G27946K24968j132855j571948q89866j75581o8057M602M93967Q06045L94639
39127a186140j51440N064O00789P24444K54995m2533K44465O12699M43337j65163
39117A340517n93804m86474j50455j65124o07514q53212m10701K52380K72609
39108a401778k87154m59183J02839N11939N9216o19264n72891k7724J59294L8104
39098b496602L69111J082631J185406L66091m35902m63819j78427k99127o19011
$$ plain form
39167 -2939392 -2400476 -1478736 -854191 -511838 -4573 632414 943864 848252 727536 775558
39157 775558 772233 478750 -161807 -1132162 -2224574 -2930932 -2923318 -2571334 -2516116 -2821207
39147 -2821207 -3056660 -3118653 -3324132 -3678952 -3728282 -3265147 -2548871 -1676925 -471719 727946
39137 727946 952914 -179941 -1751889 -2641755 -2817336 -2885393 -2880791 -2386824 -1580779 -1186140
39127 -1186140 -1337580 -1332516 -731727 -7283 247712 205179 449644 1062343 1505680 1340517
39117 1340517 746713 260239 109784 -55340 -662854 -1516066 -1926767 -1674387 -1401778
39108 -1401778 -1688932 -2148115 -2045276 -1533337 -1474121 -2093385 -2666276 -2694000 -2534706 -2496602
39098 -2496602 -2127491 -1044860 140546 506637 70735 -393084 -571511 -870638 -1489649
39089a489649n05818k8906K08680Q6000Q2360M44260Q33250Q77172O24508L18054
39079A449911M8030j89401l01966j89990L3269J03114l9600q8769K26692O15567
39069A666857M20807m86211j324153j272510n18768J7284q9944l44609j80158
39060b111405K93642O11452N88540L36429m5211m70034p38592o68324k61952L45491
39050b119964R26721J111213O26395k48626p89078o07505o4063K94069L68362
39041e02476L27429J74911p5141p8789M40623J076943J059182K61515n37658n88571
39031A557968n8796K48936r2130o63389p66674k63913L51754O88771R24630J303491
39021C230648J491445R81778N9641l13190K21316Q59591P19433l4765n94039n83826
$$ plain form
39089 -1489649 -1995467 -2024373 -1815693 -1729693 -1647333 -1203073 -369823 507349 1131857 1449911
39079 1449911 1497941 1308540 1006574 816584 849853 952967 913367 824598 1051290 1666857
39069 1666857 2087664 1601453 277300 -995210 -1513978 -1496694 -1586638 -1931247 -2111405
39060 -2111405 -1817763 -1206311 -617771 -281342 -326553 -796587 -1535179 -2203503 -2465455 -2119964
39050 -2119964 -1193243 -82030 544365 295739 -493339 -1100844 -1164907 -870838 -502476
39041 -502476 -175047 -136 -75277 -154066 286557 1363500 2422682 2684197 2146539 1557968
39031 1557968 1499172 1748108 1655978 992589 225915 -37998 313756 1002527 1927157 3230648
39021 3230648 4722093 5703871 5763512 5450322 5671638 6531229 7250662 7215897 6621858 6038032
39011F038032k26965J93605M67134L41236j59503n42589m92771l97230o56486
39002D564463q75405n09553M9136J365m78678n07988o9348n7873n78231n53398
38992I84490M48493J292233J013803L89128P46035K071502L380281M225956M664388
38983A9216309M341805K966115J296990K89684n02057k196109m334315n036187
38975A6042235l753096k243358k034750k350145j678332k67981L82290j13295
38967C983568o58817n25951k57989n00989r59304r76843n10066m9953P2411o0723
38957d44656k09586k32047j41130k8613M8030O5435m8684l12210m84147k71639
38947b059247J51252K30556j33773l01411J66510P32994O29531K1940k75140l8558
$$ plain form
39011 6038032 5811067 6004672 6471806 6813042 6653539 6110950 5618179 5220949 4564463
39002 4564463 3689058 3179505 3228641 3230006 2751328 2243340 2173992 2116119 1537888 984490
38992 984490 1432983 2725216 3739019 4128147 4874182 6945684 10325965 14551921 19216309
38983 19216309 23558114 26524229 27821219 28110903 27608846 25412737 21078422 16042235
38975 16042235 12289139 10045781 8011031 5660886 3982554 3714573 4096863 3983568
38967 3983568 3324751 2798800 2540811 2039822 1080518 103675 -406391 -456344 -383933 -444656
38957 -444656 -654242 -886289 -1027419 -1056032 -1008002 -942567 -991251 -1303461 -1787608 -2059247
38947 -2059247 -1907995 -1677439 -1811212 -2112623 -1946113 -1213119 -583588 -561648 -836788 -875346
38937h75346J99685J94754L67212R32860J363339J094642L15698k78630k15578
38928C098636M41632J161398J221025L48967p65328j058666l70383L32476K01642
38919D611399n33173j120770j261230j108353p54160k24906K64371M73314L92835
38910G39327J03377l40705o78531n05139J36515O53252P29946Q07054J359264
38901C004360K207808K984637L681108M156791L765447K292307O87570j25713
38893B2654315o82965k027877l690805m081091k913001j716647j547199j643349
38885D351381j073332l75983m89893j058030j057430m90652k04634l80624l99750
38876a178947p8682Q2884n0867K9623M92645P66934M63947q120j27954J3471M9553
$$ plain form
38937 -875346 -675661 -480907 -113695 819165 2182504 3277146 3592844 3314214 3098636
38928 3098636 3540268 4701666 5922691 6271658 5506330 4447664 4077281 4409757 4611399
38919 4611399 4078226 2957456 1696226 587873 -166287 -391193 -126822 346492 739327
38910 739327 842704 501999 -176532 -681671 -545156 108096 838042 1645096 3004360
38901 3004360 5212168 8196805 11877913 16034704 19800151 22092458 22780028 22654315
38893 22654315 21971350 19943473 16252668 12171577 9258576 7541929 5994730 4351381
38885 4351381 3278049 2902066 2412173 1354143 296713 -193939 -398573 -779197 -1178947
38876 -1178947 -1257629 -1174745 -1225612 -1195989 -703344 63590 527537 519417 391463 404934 454487
38865D54487q4139k94537o34005j039492j104416n66027J87806N19842L28170
38856b232311N9502L4724J48505K26093K86981L36575K12940j36188m05962k25913
38846a695054L20288O67118L58828l86702p96749k88316Q90111J826455J848131
38837B744110J217301P57397P88938P48830P5170q60969j197210q16231m96092
38828B961244p00684r05874n40591R017l65m73331o75095m26043k47239l28619
$$ plain form
38865 454487 370348 75811 -558194 -1597686 -2702102 -3268129 -3080323 -2560481 -2232311
38856 -2232311 -2172809 -2138085 -1989580 -1763487 -1476506 -1139931 -926991 -1063179 -1469141 -1695054
38846 -1695054 -1374766 -707648 -348820 -735522 -1532271 -1820587 -930476 895979 2744110
38837 2744110 3961411 4718808 5507746 6256576 6331746 5470777 4273567 3457336 2961244
38828 2961244 2260560 1354686 814095 823112 822747 349416 -325679 -751722 -998961 -1327580
$$ [...]
##END NTUPLES=NMR SPECTRUM
##END=
