##TITLE=31Pdec_DE-164
 , 64 sc
 13.7.2026
##JCAMPDX= 6.0         $$ Bruker NMR JCAMP-DX V2.0
##DATA TYPE= NMR SPECTRUM
##DATA CLASS= NTUPLES
##ORIGIN= UXNMR, Bruker Analytische Messtechnik GmbH
##OWNER= root
$$ XWIN-NMR		Version 3.5
$$ Mon Jul 13 15:03:41 2026 Russian Standard Time (UT+4h)  she@DPX200
##.OBSERVE FREQUENCY= 81.013821
##.OBSERVE NUCLEUS= ^31P
##.ACQUISITION MODE= SIMULTANEOUS
##.ACQUISITION SCHEME= undefined
##.AVERAGES= 64
##.DIGITISER RES= 17
##SPECTROMETER/DATA SYSTEM= spect
##.PULSE SEQUENCE= zgpg30
##.SOLVENT NAME= DMSO
##.SHIFT REFERENCE= (INTERNAL, DMSO, 0, 197.392)
##AUDIT TRAIL= $$ (NUMBER, WHEN, WHO, WHERE, WHAT)
$$ ##TITLE= Audit trail, XWIN-NMR		Version 3.5
$$ ##JCAMPDX= 5.01
$$ ##ORIGIN= Bruker BioSpin GmbH
$$ ##OWNER= she
$$ F:/spectra/data/she/nmr/P31/2/pdata/1/auditp.txt
$$ ##AUDIT TRAIL=  $$ (NUMBER, WHEN, WHO, WHERE, WHAT)
(   1,<2026-07-13 15:02:41.35 +0400>,<she>,<DPX200>,
      <created by zg, POWCHK disabled, PULCHK disabled
       configuration hash MD5:
       00 E9 B6 7A A2 85 ED C7 34 08 36 98 17 FE 4E 26
       data hash MD5: 32K
       22 B7 02 B1 ED DF 38 86 6E 9D 47 B6 2E 98 90 D6>)
(   2,<2026-07-13 15:02:43.70 +0400>,<she>,<DPX200>,
      <Start of raw data processing
       efp BC_mod = 2 LB = 1.5 FT_mod = 6 PKNL = 1 PHC0 = 1943.861 PHC1 = 125.2991 SI = 64K 
       data hash MD5: 64K
       BD EB 5A 02 9B 6B AC 96 43 5C 08 1A EC EA EC 46>)
(   3,<2026-07-13 15:03:03.17 +0400>,<she>,<DPX200>,
      <pk PHC0 = 8.304566 PHC1 = 14.6 
       data hash MD5: 64K
       DB 7F B2 62 C5 D2 8E B8 04 D4 E3 5A 32 39 DD 1A>)
(   4,<2026-07-13 15:03:07.21 +0400>,<she>,<DPX200>,
      <abs ABSG = 5 
       data hash MD5: 64K
       8D 19 6C 99 AB 36 A7 3A 32 A5 F4 5D AA 67 29 C9>)
$$ ##END=
$$ 
$$ hash MD5
$$ 23 C0 42 FC 75 D5 02 7A AC E3 EE D8 26 E0 82 19
##$RELAX= 
##$RELAX= 
##$RELAX= 
##$RELAX= 
##$RELAX= 
##$RELAX= 
##$RELAX= 
##$RELAX= 
$$ Bruker specific parameters
$$ --------------------------
##$DU= <F:/spectra>
##$EXPNO= 2
##$NAME= <P31>
##$PROCNO= 1
##$TYPE= <nmr>
##$USER= <she>
##$AMP= (0..31)
100 100 100 100 100 100 100 100 100 100 100 100 100 100 100 100 100 100 
100 100 100 100 100 100 100 100 100 100 100 100 100 100 
##$AQSEQ= 0
##$AQ_mod= 1
##$AUNM= <au_zg>
##$AUTOPOS= <>
##$BF1= 81.014009
##$BF2= 200.13
##$BF3= 200.13
##$BF4= 200.13
##$BF5= 200.13
##$BF6= 200.13
##$BF7= 200.13
##$BF8= 200.13
##$BYTORDA= 1
##$CFDGTYP= 0
##$CFRGTYP= 5
##$CHEMSTR= <none>
##$CNST= (0..31)
1 1 145 1 1 1 1 1 1 1 1 1 1 1 1 1 1 1 1 1 1 1 1 1 1 1 1 1 1 1 1 1 
##$CPDPRG= <waltz16>
##$CPDPRG1= <>
##$CPDPRG2= <waltz16>
##$CPDPRG3= <>
##$CPDPRG4= <mlev>
##$CPDPRG5= <mlev>
##$CPDPRG6= <mlev>
##$CPDPRG7= <mlev>
##$CPDPRG8= <mlev>
##$CPDPRGB= <>
##$CPDPRGT= <>
##$D= (0..31)
0 1 0 0 0 0 0 0 0 0.06 0 0.03 2e-05 3e-06 0 0 0.0002 0 0 0 0 0 0 0 0 0 
0 0 0 0 0 0 
##$DATE= 1783940560
##$DBL= (0..7)
120 120 120 11 120 120 24 19 
##$DBP= (0..7)
150 150 150 150 150 150 150 150 
##$DBP07= 0
##$DBPNAM0= <>
##$DBPNAM1= <>
##$DBPNAM2= <>
$$ [...]
##$SUBNAM3= <"">
##$SUBNAM4= <"">
##$SUBNAM5= <"">
##$SUBNAM6= <"">
##$SUBNAM7= <"">
##$SUBNAM8= <"">
##$SUBNAM9= <"">
##$SW= 400.765351723535
##$SWIBOX= (0..15)
0 1 3 0 0 0 0 0 0 0 0 0 0 0 0 0 
##$SW_h= 32467.5324675325
##$TD= 32768
##$TD0= 1
##$TE= 0
##$TE2= 300
##$TE3= 300
##$TEG= 300
##$TL= (0..7)
0 120 53 12 22 120 120 120 
##$TP= (0..7)
150 150 150 150 150 150 150 150 
##$TP07= 0
##$TPNAME0= <>
##$TPNAME1= <>
##$TPNAME2= <>
##$TPNAME3= <>
##$TPNAME4= <>
##$TPNAME5= <>
##$TPNAME6= <>
##$TPNAME7= <>
##$TPOAL= (0..7)
0.5 0.5 0.5 0.5 0.5 0.5 0.5 0.5 
##$TPOFFS= (0..7)
0 0 0 0 0 0 0 0 
##$TUNHIN= 0
##$TUNHOUT= 0
##$TUNXOUT= 0
##$USERA1= <user>
##$USERA2= <user>
##$USERA3= <user>
##$USERA4= <user>
##$USERA5= <user>
##$V9= 5
##$VALIST= <valist>
##$VCLIST= <CCCCCCCCCCCCCCC>
##$VD= 0
##$VDLIST= <DDDDDDDDDDDDDDD>
##$VPLIST= <PPPPPPPPPPPPPPP>
##$VTLIST= <TTTTTTTTTTTTTTT>
##$WBST= 1024
##$WBSW= 4
##$XGAIN= (0..3)
0 0 0 0 
##$XL= 0
##$YL= 0
##$YMAX_a= 66194
##$YMIN_a= -53233
##$ZGOPTNS= <>
##$ZL1= 120
##$ZL2= 120
##$ZL3= 120
##$ZL4= 120
##$ABSF1= 197.3918
##$ABSF2= -203.3724
##$ABSG= 5
##$ABSL= 3
##$ALPHA= 0
##$AQORDER= 0
##$ASSFAC= 0
##$ASSFACI= 0
##$ASSFACX= 0
##$ASSWID= 0
##$AUNMP= <proc_1d>
##$AZFE= 0.1
##$AZFW= 0.5
##$BCFW= 0
##$BC_mod= 2
##$BYTORDP= 0
##$COROFFS= 0
##$CY= -3
##$DATMOD= 1
##$DC= 0
##$DFILT= <>
##$DTYPP= 0
##$F1P= 0
##$F2P= 0
##$FCOR= 1
##$FTSIZE= 65536
##$FT_mod= 6
##$GAMMA= 0
##$GB= 0
##$INTBC= 1
##$INTSCL= 9.790993e-09
##$ISEN= 30
##$LB= 1.5
##$LEV0= 0
##$LPBIN= 0
##$MAXI= 10000
##$MC2= 0
##$MEAN= 0
##$ME_mod= 0
##$MI= 50
##$NCOEF= 0
##$NC_proc= -6
##$NLEV= 6
##$NOISF1= 182.463
##$NOISF2= 159.3651
##$NSP= 0
##$NTH_PI= 0
##$NZP= 0
##$OFFSET= 197.3918
##$PC= 4
##$PHC0= 1952.166
##$PHC1= 139.8991
##$PH_mod= 1
##$PKNL= yes
##$PPARMOD= 0
##$PSCAL= 0
##$PSIGN= 0
##$REVERSE= no
##$SF= 81.014063255964
##$SI= 65536
##$SIGF1= 159.3651
##$SIGF2= -187.1042
##$SINO= 113.3802
##$SIOLD= 16384
##$SREGLST= <1H.CDCl3>
##$SSB= 0
##$STSI= 65536
##$STSR= 0
##$SW_p= 32467.5324675325
##$SYMM= 0
##$S_DEV= 0
##$TDeff= 32768
##$TDoff= 0
##$TI= <>
##$TILT= no
##$TM1= 0
##$TM2= 0
##$TOPLEV= 0
##$USERP1= <user>
##$USERP2= <user>
##$USERP3= <user>
##$USERP4= <user>
##$USERP5= <user>
##$WDW= 1
##$XDIM= 65536
##$YMAX_p= 503028841
##$YMIN_p= -77151585
$$ End of Bruker specific parameters
$$ ---------------------------------
##NTUPLES= NMR SPECTRUM
##VAR_NAME=  FREQUENCY,     SPECTRUM/REAL,   SPECTRUM/IMAG
##SYMBOL=    X,             R,               I
##VAR_TYPE=  INDEPENDENT,   DEPENDENT,       DEPENDENT
##VAR_FORM=  AFFN,          ASDF,            ASDF
##VAR_DIM=   65536,         65536,           65536
##UNITS=     HZ,            ARBITRARY UNITS, ARBITRARY UNITS
##FACTOR=    0.49542278885378, 1,            1
##FIRST=     15991.5117654749, 0,            0
##LAST=      -16476.0207020576, 0,           0
##MIN=       -16476.0207020576, -77151585,   0
##MAX=       15991.5117654749, 503028841,    0
$$ Real data points
##PAGE= N=1
##DATA TABLE= (X++(R..R)), XYDATA
$$ [...]
$$ plain form
44159 -261055 -86696 -23934 -683794 -1914021 -2663369 -2116008 -657968 550723 801161
44150 801161 437540 344448 1002496 2055025 2755040 2766472 2378203 1935371 1395102 669484
44140 669484 68031 -47429 133155 113198 -121617 -84615 381410 768365 604941 107196
44130 107196 -125252 189406 826317 1388491 1670082 1784389 1977448 2241073 2237837 1814556
44120 1814556 1389456 1438053 1733916 1618493 999612 492824 453888 468515 69174 -571482
44110 -571482 -1021543 -1211159 -1242667 -942576 -116247 929251 1583798 1620283 1354982 1151126
44100 1151126 1033822 810438 387830 -66649 -240695 -23185 269838 194490 -270321 -700780
44090 -700780 -792449 -647035 -418683 -59454 376803 562754 377612 268070 691089 1334369
$$ packed form
44159b61055J74359O2762o59860j230227p49348N47361J458040J208691K50438
44150H01161l63621r3092O58048J052529P00015J1432l88269m42832n40269p25618
44140F69484o01453j15460J80584j9957k34815L7002M66025L86955j63424m97745
44130A07196k32448L14658O36911N62174K81591J14307J93059K63625l236m23281
44120A814556m25100M8597K95863j15423o18881n06788l8936J4627l99341o40656
44110e71482m50061j89616l1508L00091Q26329J045498O54547L6485k65301k03856
44100A151126j17304k23384m22608m54479j74046K17510K93023p5348m64811m30459
44090g00780r1669J45414K28352L59229M36257J85951j85142j09542M23019O43280
$$ plain form
44080 1334369 1353434 454691 -589748 -709913 278166 1421083 1635586 896725 209488
44071 209488 337217 907105 1086914 776650 516680 437868 158361 -219547 25609 972500
44061 972500 1543607 930927 -147835 -429453 160651 648930 558103 342298 374086 436268
44051 436268 354596 350431 535040 683434 716583 822030 904459 556927 -107616 -209617
44041 -209617 827561 2379966 3282995 3100019 2292036 1400327 613378 56290 -55505
44032 -55505 266347 641596 723610 609196 697590 1214613 1997171 2711104 3141136 3220064
44022 3220064 2916333 2280048 1574730 1129527 948521 636422 -136832 -1218416 -2157500
44013 -2157500 -2686000 -2874716 -2944230 -3070339 -3228955 -3091370 -2301695 -1080364 -274554
$$ packed form
44080A334369J9065q98743j044439j20165R88079J142917K14503p38861o87237
44071B09488J27729N69888J79809l10264k59970p8812k79507l77908K45156R46891
44061I72500N71107o12680j078762k81618N90104M88279r0827k15805L1788O2182
44051D36268q1672m165J84609J48394L3149J05447Q2429l47532o64543j02001
44041b09617J037178J552405R03029j82976q07983q91709p86949n57088j11795
44032e5505L21852L75249Q2014j14414Q8394N17023P82558P13933M30032P8928
44022C220064l03731o36285p05318m45203j81006l12099p73254j081584r39084
44013b157500n28500j88716o9514j26109j58616J37585P89675J221331Q05810
$$ plain form
44004 -274554 -436450 -1056340 -1158189 -522044 188700 445955 412034 395717 348749 166018
43994 166018 16910 50144 111329 47477 -19225 -3642 -114133 -454284 -679585 -499281
43984 -499281 -319722 -874596 -2219329 -3515793 -3924255 -3437786 -2741468 -2444485 -2532625
43975 -2532625 -2461127 -1765586 -648548 129826 63866 -549185 -1070900 -1313881 -1479559 -1444093
43965 -1444093 -726311 623559 1643897 1453766 376933 -401932 -217426 470573 836457
43956 836457 600795 48922 -467908 -782091 -890683 -930799 -1026673 -1001893 -462904 608713
43946 608713 1572882 1754595 1212243 583548 309756 361099 595940 936315 1196530 1177309
43936 1177309 989286 894957 808071 409497 -179080 -379479 3109 455488 529170 409134
$$ packed form
44004b74554j61896o19890j01849O36145P10744K57255l3921j6317m6968j82731
43994A66018j49108L3234O1185o3852o6702J5583j10491l40151k25301J80304
43984d99281J79559n54874j344733j296464m08462M86469O96318K96983q8140
43975b532625P1498O95541J117038P78374o5960o13051n21715k42981j65678L5466
43965a444093P17782J349870J020338j90131j076833p78865J84506O87999L65884
43956H36457k35662n51873n16830l14183j08592m0116r5874K4780N38989J071617
43946F08713R64169J81713n42352o28695k73792N1343K34841L40375K60215j9221
43936A177309j88023r4329q6886l98574n88577k00399L82588M52379P3682j20036
$$ plain form
43926 409134 379446 267873 -102193 -373284 -132506 413878 793246 991795 1277958 1595659
43916 1595659 1716485 1716067 1680293 1241224 140799 -1010967 -1418132 -1382700 -1905374 -2980050
43906 -2980050 -3384094 -2488918 -1266096 -937057 -1446248 -1930230 -2022325 -1931514 -1706728 -1225711
43896 -1225711 -693072 -482345 -579314 -672371 -665039 -660536 -591121 -311823 40305 176853 50995
43885 50995 -222409 -684909 -1376255 -1979370 -2057857 -1636571 -1199686 -1110841 -1299362 -1452359
43875 -1452359 -1236443 -435664 769387 1692931 1684441 853943 3014 -223289 79858 343591
43865 343591 166651 -330267 -624936 -271420 602305 1319686 1327105 774740 276811 201249
43855 201249 403542 561420 495108 175726 -303199 -682799 -665363 -207138 382985 690025
$$ packed form
43926D09134k9688j11573l70066k71091K40778N46384L79368J98549K86163L17701
43916A595659J20826m18l5774m39069j100425j151766m07165L5432n22674j074676
43906b980050m04044Q95176J222822L29039n09191m83982r2095R0811K24786M81017
43896a225711N32639K10727r6969r3057P332M503O9415K79298L52128J36548j25858
43885E0995k73404m62500o91346o03115p8487M21286M36885Q8845j88521j52997
43875a452359K15916Q00779J205051R23544q490q30498q50929k26303L03147K63733
43865C43591j76940m96918k94669L53516Q73725P17381P419n52365m97929p5562
43855B01249K02293J57878o6312l19382m78925l79600J7436M58225N90123L07040
$$ plain form
43845 690025 519132 8002 -525293 -851579 -962037 -924811 -706883 -287802 116284 185256
43835 185256 -123187 -538607 -830536 -954295 -875773 -599633 -394022 -578085 -1008728 -1225560
43825 -1225560 -1195525 -1341587 -1633122 -1350243 -223240 814829 682200 -453902 -1485608
43816 -1485608 -1731598 -1339150 -652257 52131 395332 240625 102249 477086 891059
43807 891059 449642 -690569 -1328430 -853808 20136 449474 511288 611436 641865 376494
43797 376494 123676 272065 536321 301941 -469240 -1195434 -1394213 -1033476 -334650 361027
43787 361027 656720 420624 -9790 -212422 -161452 -97405 -110088 -146088 -254704 -488720
43777 -488720 -680913 -646306 -521430 -598036 -886356 -1119640 -1114732 -856140 -330806 382620
$$ packed form
43845F90025j70893n11130n33295l26286j10458L7226K17928M19081M04086O8972
43835A85256l08443m15420k91929j23759P8522K76140K05611j84063m30643k16832
43825a225560L0035j46062k91535K82879J127003J038069j32629j136102j031706
43816a485608k45990L92448O86893P04388L43201j54707j38376L74837M13973
43807H91059m41417j140211o37861M74622Q73944M29338O1814J00148L0429k65371
43797C76494k52818J48389K64256k34380p71181p26194j98779L60737O98826O95677
43787C61027K95693k36096m30414k02632N0970O4047j2683l6000j08616k34016
43777d88720j92193L4607J24876p6606k88320k33284M908K58592N25334P13426
$$ plain form
43767 382620 931760 1003999 864287 1172459 2086150 2878643 2733689 1710660 586963
43758 586963 -150507 -730074 -1408885 -1812306 -1409697 -474827 10077 -449282 -1267849 -1687789
43748 -1687789 -1777966 -1992426 -2132749 -1567943 -425356 286321 -14173 -741372 -1058378
43739 -1058378 -912324 -704414 -492665 -146120 97211 -70714 -360115 -203628 273657
43730 273657 241225 -726673 -2019952 -2704871 -2529018 -1977774 -1564349 -1343348 -1100354 -846979
43720 -846979 -970499 -1756916 -2801891 -3195243 -2491508 -1272416 -464054 -265968 -100059
43711 -100059 478189 1207451 1486438 1006769 -23640 -1037445 -1469119 -1213940 -755441
43702 -755441 -616450 -723713 -611540 -206829 19839 -216238 -571283 -596882 -340756 -111483
$$ packed form
43767C82620N49140P2239j39712L08172R13691P92493j44954j023029j123697
43758E86963p37470n79567o78811m03421M02609R34870M84904m59359q18567m19940
43748a687789r0177k14460j40323N64806J142587P11677l00494p27199l17006
43739a058378J46054K07910K11749L46545K43331j67925k89401J56487M77285
43730B73657l2432r67898j293279o84919J75853N51244M13425K21001K42994K53375
43720h46979j23520p86417j044975l93352P03735J219092Q08362J98086J65909
43711a00059N78248P29262K78987m79669j030409j013805m31674K55179M58499
43702g55441J38991j07263J12173M04711K26668k36077l55045k5599K56126K29273
$$ plain form
43692 -111483 43640 208370 150593 -476425 -1471091 -2087811 -1892841 -1304519 -1062796 -1388149
43682 -1388149 -1893819 -2130297 -1917201 -1258223 -290581 655388 1252036 1506340 1637738
43673 1637738 1582702 990264 -110218 -1015183 -1060848 -379151 398978 940203 1294995 1440596
43663 1440596 1307383 1151870 1294270 1484605 1150211 341815 -231162 -260830 -213488 -374638
43653 -374638 -326297 122974 269966 -449551 -1351883 -1350666 -540661 26881 -50870 -160758
43643 -160758 92429 302512 142023 -86826 -162757 -407526 -936583 -1128346 -464474 586721
43633 586721 1159297 1116856 981110 1002812 965998 821153 875712 1254848 1644520 1721962
43623 1721962 1504769 1147886 693806 184632 -209471 -369534 -423343 -616128 -1031107 -1518078
$$ packed form
43692a11483J55123J64730n7777o27018r94666o16720J94970N88322K41723l25353
43682a388149n05670k36478K13096O58978R67642R45969N96648K54304J31398
43673A637738n5036n92438j100482r04965m5665O81697P78129N41225L54792J45601
43663A440596j33213j55513J42400J90335l34394q08396n72977k9668M7342j61150
43653c74638M8341M49271J46992p19517r02332J217Q10005N67542p7751j09888
43643a60758K53187K10083j60489k28849p5931k44769n29057j91763O63872J051195
43633E86721N72576m2441j35746K1702l6814j44845N4559L79136L89672P7442
43623A721962k17193l56883m54080n09174l94103j60063n3809j92785m14979m86971
$$ plain form
43613 -1518078 -1869830 -2026216 -2114889 -2289829 -2525189 -2633343 -2544977 -2488804 -2752882 -3276071
43603 -3276071 -3626488 -3458883 -2897744 -2359866 -2049611 -1793316 -1428640 -1178377 -1396618
43594 -1396618 -1953389 -2151904 -1443229 -78944 1149950 1744809 1874177 1976484 2218221
43585 2218221 2383806 2169332 1587646 1156269 1515218 2612759 3431000 2949289 1395018
43576 1395018 88774 -89771 371963 476907 22999 -445387 -672817 -984326 -1497378
43567 -1497378 -1661373 -931885 412732 1494877 1765078 1422546 958986 579179 176460
43558 176460 -326860 -835816 -1253990 -1619655 -1985801 -2245868 -2187482 -1737623 -1120455 -740371
43548 -740371 -842417 -1206685 -1227036 -476328 746353 1615777 1655428 1241273 1063476 1291673
$$ packed form
43613a518078l51752j56386q8673j74940k35360j08154Q8366N6173k64078n23189
43603c276071l50417J67605N61139N37878L10255K56295L64676K50263k18241
43594a396618n56771j98515P08675J364285J228894N94859J29368J02307K41737
43585B218221J65585k14474n81686m31377L58949J097541Q18241m81711j554271
43576A395018j306244j78545M61734J04944m53908m68386k27430l11509n13052
43567a497378j63995P29488J344617J082145K70201l42532m63560l79807m02719
43558A76460n03320n08956m18174l65665l66146k60067N8386M49859O17168L80084
43548g40371j02046l64268k0351P50708J222681Q69424L9651m14155j77797K28197
$$ plain form
43538 1291673 1566957 1649463 1623512 1467154 933554 86715 -455797 -186821 601368 1136042
43528 1136042 1037582 556453 54012 -363027 -662752 -701154 -391123 120216 567401 737634
43518 737634 468103 -341589 -1563063 -2787713 -3590312 -3814375 -3536538 -2871283 -1971014
43509 -1971014 -1139986 -704628 -691899 -778850 -640907 -240389 282151 828993 1315123 1570579
43499 1570579 1499958 1277236 1163218 1160008 1059214 788400 443292 6441 -611086 -1190282
43489 -1190282 -1265461 -739616 -74380 348558 661858 1012166 1069435 539387 -153891 -312659
43479 -312659 56150 314962 186042 33715 100976 101653 -209820 -588702 -698531 -550373
43469 -550373 -294028 50672 399160 490500 241487 -82179 -269352 -413012 -530934 -319436
$$ packed form
43538A291673K75284Q2506k5951j56358n33600q46839n42512K68976P88189N34674
43528A136042r8460m81129n02441m17039k99725l8402L10031N11339M47185J70233
43518G37634k69531q09692j221474j224650q02599k24063K77837O65255R00269
43509a971014Q31028M35358J2729q6951J37943M00518N22540N46842M86130K55456
43499A570579p0621k22722j14018l210j00794k70814l45108m36851o17527n79196
43489a190282p5179N25845O65236M22938L13300L50308N7269n30048o93278j58768
43479c12659L68809K58812j28920j52327O7261O77l11473l78882j09829J48158
43469e50373K56345L44700L48488R1340k49013l23666j87173j43660j17922K11498
$$ plain form
43459 -319436 368699 1095280 1264428 803991 129489 -392652 -683647 -834551 -997268 -1243732
43449 -1243732 -1377460 -1105380 -509411 -3139 331602 896448 1785735 2369924 2132241
43440 2132241 1466891 1086546 1035329 935951 859013 1145178 1548717 1419503 763120 330737
43430 330737 504424 786876 606016 13651 -623373 -1025031 -863997 117989 1480194
43421 1480194 2132882 1501153 251801 -556893 -677863 -603134 -674205 -821521 -966439 -1112973
43411 -1112973 -1096344 -712002 -104696 350915 559425 719594 796878 401412 -586939 -1550150
43401 -1550150 -1616355 -594106 777741 1570344 1530165 1110387 768007 507008 187149
43392 187149 -43409 53087 349056 505327 534592 767774 1198610 1348161 1007195 676075
$$ packed form
43459c19436O88135P26581J69148m60437o74502n22141k90995j50904j62717k46464
43449a243732j33728K72080N95969N06272L34741N64846Q89287N84189k37683
43440B132241o65350l80345n1217r9378p6938K86165M03539j29214o56383m32383
43430C30737J73687K82452j80860n92365o37024m01658J61034R81986J362205
43421A480194O52688o31729j249352q08694j20970P4729p1071j47316j44918j46534
43411a112973J6629L84342O07306M55611K08510J60169P7284l95466r88351r63211
43401a550150o6205J022249J371847P92603m0179m19778l42380k60999l19859
43392A87149k30558R6496K95969J56271K9265K33182M30836J49551l40966l31120
$$ plain form
43382 676075 895813 1444884 1625749 1184108 536060 151408 87757 159434 260797 419661
43372 419661 680249 961745 958077 304619 -958846 -2199376 -2731826 -2520220 -2100751 -1852700
43362 -1852700 -1666584 -1387482 -1232745 -1524266 -2182755 -2737010 -2786809 -2288473 -1435883 -471360
43352 -471360 336825 713590 541267 -17763 -645924 -1078087 -1110018 -526875 706313 2146360
43342 2146360 3066320 3155275 2828233 2624284 2514966 2122747 1420418 749727 223249 -348618
43332 -348618 -854339 -772855 48885 956535 1194000 731772 48060 -597802 -1237370 -1763998
43322 -1763998 -1928043 -1717419 -1373459 -1070615 -897898 -1055248 -1647803 -2275829 -2254958 -1419425
43312 -1419425 -458171 -283512 -1150275 -2408076 -3016841 -2388417 -924693 297580 529776
$$ packed form
43382F76075K19738N49071J80865m41641o48048l84652o3651P1677J01363J58864
43372D19661K60588K81496l668o53458j263465j240530n32450K11606M19469K48051
43362a852700J86116K79102J54737k91521o58489n54255m9799M98336Q52590R64523
43352d71360Q08185L76765j72323n59030o28161m32163l1931N83143J233188J440047
43342B146360R19960Q8955l27042k03949j09318l92219p02329o70691n26478n71867
43332c48618n05721Q1484Q21740R07650K37465m62228o83712o45862o39568n26628
43322a763998j64045K10624L43960L02844J72717j57350n92555o28026K0871Q35533
43312a419425R61254J74659q66763j257801o08765O28424J463724J222273K32196
$$ plain form
43303 529776 -20131 -663252 -1091474 -1464739 -1858295 -2110413 -2211606 -2394066 -2718290 -2905302
43293 -2905302 -2692940 -2098976 -1286060 -449548 134675 275817 146207 109092 260016 456527
43283 456527 741261 1262575 1762225 1715436 1124359 576405 269299 -372144 -1658263 -2782932
43273 -2782932 -2648837 -1243932 352760 1115455 773795 -309722 -1388863 -1682660 -1080403
43264 -1080403 -391887 -391417 -800802 -800600 -329160 -103363 -415648 -770798 -851410 -971453 -1217061
43253 -1217061 -951782 205441 1474034 1707368 842092 -69212 -190810 247358 498306
43244 498306 338792 365389 1272806 2875787 4025425 3763407 2454182 1350135 1068508
43235 1068508 1079151 796860 427919 324839 209105 -277306 -739957 -548229 93474 387015
$$ packed form
43303E29776n49907o43121m28222l73265l93556k52118j01193j82460l24224j87012
43293b905302K12362N93964Q12916Q36512N84223J41142j29610l7115J50924J96511
43283D56527K84734N21314M99650m6789n91077n47954l07106o41443j286119j124669
43273b782932J34095J404905J596692P62695l41660j083517j079141k93797O02257
43264a080403O88516M70m09385K02M71440K25797l12285l55150q0612j20043k45608
43253a217061K65279J157223J268593K33334q65276r11304j21598M38168K50948
43244D98306j59514K6597R07417J602981J149638k62018j309225j104047k81627
43235A068508J0643k82291l68941j03080j15734m86411m62651J91728O41703K93541
$$ plain form
43225 387015 131399 -93579 74894 346395 452788 568096 816711 942061 770442 564596
43215 564596 626038 887881 1133169 1301073 1372060 1254325 1003661 927316 1304838 2166454
43205 2166454 3351294 4518297 5141893 4885750 4002474 2988530 1907080 569923 -674611
43196 -674611 -1082558 -609018 -113448 -155728 -301943 -31989 405008 614054 843058 1406016
43186 1406016 1853529 1540957 666528 -33424 -328572 -488343 -554467 -457414 -583675 -1264085
43176 -1264085 -1827186 -1201171 458099 1725884 1721318 1062800 710171 727079 655805 380883
43166 380883 53811 -324058 -761754 -1128463 -1465110 -1969490 -2400431 -2110903 -1055118
43157 -1055118 -115767 67011 -44759 206438 555190 398084 -21815 29090 518063 716610
$$ packed form
43225C87015k55616k24978J68473K71501J06393J15308K48615J25350j71619k05846
43215E64596O1442K61843K45288J67904P0987j17735k50664p6345L77522Q61616
43205B166454J184840J167003O23596k56143q83276j013944j081450j337157j244534
43196f74611m07947M73540M95570m2280j46215K69954M36997K09046K29004N62958
43186A406016M47513l12572q74429o99952k95148j59771o6124R7053j26261o80410
43176a264085n63101O26015J659270J267785m566o58518l52629J6908p1274k74922
43166C80883l27072l77869m37696l66709l36647n04380m30941K89528J055785
43157a055118R39351J82778j11770K51197L48752j57106m19899N0905M88973J98547
$$ plain form
43147 716610 438804 273855 507946 680959 426699 -11405 -378533 -804910 -1235258 -1128766
43137 -1128766 -252959 720542 991108 658681 406049 408883 221272 -293148 -565007 -93440
43127 -93440 790375 1249292 865614 22270 -566972 -567314 -290824 -313590 -805596 -1304572
43117 -1304572 -1313431 -1059343 -1307485 -2268689 -3064963 -2678139 -1214561 275209 1144183
43108 1144183 1686255 2211339 2318597 1611733 639470 408249 1117861 1991350 2299885
43099 2299885 1991159 1325656 512258 -156913 -356844 -159980 -39018 -276361 -709853
43090 -709853 -1120173 -1425364 -1433279 -965998 -384309 -362940 -870216 -1013412 -296836 599130
43080 599130 832000 618532 766132 1407540 1935075 1938009 1528096 926474 368684 248751
$$ packed form
43147G16610k77806j64949K34091J73013k54260m38104l67128m26377m30348J06492
43137a128766Q75807R73501K70566l32427k52632K834j87611n14420k71859M71567
43127i3440Q83815M58917l83678q43344n89242l42K76490k2766m92006m98976
43117a304572q859K54088k48142r61204p96274L86824J463578J489770Q68974
43108A144183N42072N25084J07258p06864r72263k31221P09612Q73489L08535
43099B299885l08726o65503q13398o69171j99931J96864J20962k37343m33492
43090g09853m10320l05191p915M67281N81689K1369n07276j43196P16576Q95966
43080E99130K32870k13468J47600O41408N27535K934m09913o01622n57790j19933
$$ plain form
43070 248751 706702 1192987 1069993 532794 296973 499972 640138 562568 718619 1336429
43060 1336429 2051965 2528203 2766507 2627162 1763656 351024 -761914 -1023349 -795196
43051 -795196 -667720 -690522 -669541 -691626 -837655 -785114 -259522 376940 504858 57044
43041 57044 -483000 -743895 -699259 -337408 437561 1475623 2240070 2179838 1245416 45484
43031 45484 -584336 -366900 63495 -155494 -1059733 -1806943 -1728697 -1022391 -244311 412346
43021 412346 992396 1309257 1070792 340020 -464149 -948563 -945909 -524353 -7941 216484
43011 216484 125945 88035 285734 407186 144238 -323013 -648950 -820586 -976710 -1026264
43001 -1026264 -858044 -660972 -572249 -242938 710079 1957664 2701743 2605710 1994666 1215180
$$ packed form
43070B48751M57951M86285j22994n37199k35821K02999J40166p7570J56051O17810
43060A336429P15536M76238K38304j39345q63506j412632j112938k61435K28153
43051g95196J27476k2802K0981k2085j46029N2541N25592O36462J27918m47814
43041E7044n40044k60895M4636L61851P74969J038062P64447o0232r34422j199932
43031D5484o29820K17436M30395k18989r04239p47210P8246P06306P78080O56657
43021D12346N80050L16861k38465p30772q04169m84414K654M21556N16412K24425
43011B16484r0539l7910J97699J21452k62948m67251l25937j71636j56124m9554
43001a026264J68220J97072Q8723L29311R53017J247585P44079r6033o11044p79486
$$ plain form
42991 1215180 377332 -244179 -182132 602663 1495437 1845025 1488754 547093 -870355
42982 -870355 -2481577 -3685557 -3956714 -3302398 -2189988 -1162182 -584320 -502651 -580551
42973 -580551 -381842 118899 491747 441257 197358 130508 226642 218731 43672 -172680
42963 -172680 -471024 -1000431 -1576224 -1673294 -1026497 47083 1142372 2314739 3761823
42954 3761823 5091127 5433284 4492418 3107031 2404926 2595086 2968805 2958471 2708292
42945 2708292 2554883 2453290 2195507 1857731 1685392 1705153 1735463 1673314 1539910 1332240
42935 1332240 1027903 673203 344261 126491 186510 617354 1095791 1051093 458078 120948
42925 120948 736279 1911677 2616155 2459264 1957468 1554693 1014655 24437 -1082931
$$ packed form
42991A215180q37848o21511O2047P84795Q92774L49588l56271r41661j417448
42982h70355j611222j203980k71157O54316J112410J027806N77862Q1669p7900
42973e80551J98709N00741L72848n0490k43899o6850R6134p911j75059k16352
42963a72680k98344n29407n75793r7070O46797J073580J095289J172367J447084
42954C761823J329304L42157r40866j385387p02105J90160L73719j0334k50179
42945B708292j53409j01593k57783l37776j72339J9761L0310o2149j33404k07670
42935A332240l04337l54700l28942k17770O0019M30844M78437m4698n93015l37130
42925A20948O15331J175398P04478j56891n01796m02775n40038r90218j107368
$$ plain form
42916 -1082931 -1608255 -1303689 -632814 -278605 -529145 -1091700 -1439223 -1359671 -1115781 -1005801
42906 -1005801 -935956 -637131 -159399 154209 125092 -116109 -368930 -436039 -62630 774624
42896 774624 1551155 1645327 1165169 846341 1026463 1263975 1192793 1168351 1624256 2234038
42886 2234038 2277303 1617679 820457 434661 587940 1133123 1684622 1586027 440550 -1186996
42876 -1186996 -2116131 -1881401 -1324682 -1499171 -2285491 -2588050 -1797233 -501926 397424
42867 397424 780324 1114397 1516009 1621104 1370771 1277467 1614737 1846126 1338748 321594
42857 321594 -417132 -587218 -523351 -329957 347333 1479664 2277648 2139795 1528054 1353504
42847 1353504 1760255 2069386 1796804 1171653 615636 208173 -141554 -344206 -226776
$$ packed form
42916a082931n25324L04566O70875L54209k50540n62555l47523P9552K43890J09980
42906a005801O9845K98825M77732L13608k9117k41201k52821o7109L73409Q37254
42896G74624P76531R4172m80158l18828J80122K37512p1182k4442M55905O09782
42886B234038M3265o59624p97222l85796J53279N45183N51499r8595j145477j627546
42876a186996r29135K34730N56719j74489p86320l02559P90817J295307Q99350
42867C97424L82900L34073M01612J05095k50333r3304L37270K31389n07378j017154
42857C21594p38726j70086O3867J93394O77290J132331P97984j37853o11741j74550
42847A353504M06751L09131k72582o25151n56017m07463l49727k02652J17430
$$ plain form
42838 -226776 160813 522525 555153 151508 -539180 -1188879 -1518968 -1524225 -1412976 -1293055
42828 -1293055 -1024513 -482268 114279 314337 -49506 -572098 -662607 -235803 139982 -86037
42818 -86037 -709383 -897807 -115067 1212245 2078381 1923978 1158876 605333 538268 508179
42808 508179 168785 -51020 515486 1702302 2531749 2455040 2039630 2059669 2365032 2214449
42798 2214449 1436925 601839 149076 23809 192161 820562 1738712 2332517 2285869 1963530
42788 1963530 1781686 1670902 1475785 1392806 1580076 1750301 1648287 1600584 2055469 2823668
42778 2823668 3331429 3454352 3508873 3488368 2949088 1802638 703338 350987 695902
42769 695902 1106440 1183347 1170981 1531101 2217556 2546034 1942924 716041 -255512 -593800
$$ packed form
42838b26776L87589L61712L2628m03645o90688o49699l30089n257J11249J19921
42828a293055K68542N42245N96547K00058l63843n22592r0509M26804L75785k26019
42818h6037o23346j88424P82740J327312Q66136j54403p65102n53543o7065l0089
42808E08179l39394k19805N66506J186816Q29447p6709m15410K0039L05363j50583
42798B214449p77524q35086m52763j25267J68352O28401R18150N93805m6648l22339
42788A963530j81844j10784j95117q2979J87270J70225j02014m7703M54885P68199
42778B823668N07761J22923N4521k0505n39280j146450j099300l52351L44915
42769F95902M10538P6907j2366L60120O86455L28478o03110j226883r71553l38288
$$ plain form
42759 -593800 -687532 -733713 -214377 1086796 2121386 1587886 -247717 -1707318 -1792559
42750 -1792559 -1202143 -945348 -886377 -379657 333241 358408 -410438 -980452 -519596 715417
42740 715417 1900232 2541909 2592522 2166669 1570089 1276560 1395773 1357553 629720 -352369
42730 -352369 -568948 185854 910527 712129 -46087 -426241 -280272 -190112 -289239 -58294
42720 -58294 594890 938081 530046 49791 404690 1439312 2147678 1923215 1058467 197106
42710 197106 -189413 65219 677768 988765 672835 279735 532233 1171755 1172497 195206
42700 195206 -860788 -1059294 -605233 -370245 -642417 -890371 -616589 46275 637672
42691 637672 925098 998587 964039 730836 171458 -566278 -1072018 -1114658 -965791 -1106906
$$ packed form
42759e93800r3732m6181N19336J301173J034590n33500j835603j459601q5241
42750a792559N90416K56795N8971N06720P12898K5167p68846n70014M60856J235013
42740G15417J184815O41677N0613m25853n96580k93529J19213l8220p27833r82089
42730c52369k16579P54802P24673j98398p58216l80154J45969R0160r9127K30945
42720e8294O53184L43191m08035m80255L54899J034622P08366k24463q64748q61361
42710A97106l86519K54632O12549L10997l15930l93100K52498O39522P42r77291
42700A95206j055994j98506M54061K34988k72172k47954K73782O62864N91397
42691F37672K87426P3489l4548k33203n59378p37736n05740m2640J48867j41115
$$ plain form
42681 -1106906 -1660752 -2276034 -2519155 -2192060 -1327953 -137926 997434 1691844 1793116
42672 1793116 1384153 606278 -367399 -1251105 -1728872 -1607024 -827730 458918 1674736
42663 1674736 2007157 1244716 210787 -116959 227119 438346 202030 -1844 101507
42654 101507 72343 -421615 -934728 -888912 -424725 -84284 29868 238339 598877 748265
42644 748265 440939 -108579 -508942 -644238 -765567 -1126612 -1514514 -1308945 -238652
42635 -238652 1093164 1850856 2018819 2255517 2742883 2939169 2657018 2538998 2978418
42626 2978418 3309836 2749647 1572739 622052 129712 -169238 -168497 401097 1098980 1101082
42616 1101082 421737 -63838 87766 392659 368040 117631 -237134 -848702 -1466851 -1272470
$$ packed form
42681a106906n53846o15282k43121L27095Q64107J190027J135360O94410J01272
42672A793116m08963p77875r73677q83706m77767J21848P79294J286648J215818
42663A674736L32421p62441j033929l27746L44078K11227k36316k03874J03351
42654A01507k9164m93958n13113M5816M64187L40441J14152K08471L60538J49388
42644G48265l07326n49518m00363j35296j21329l61045l87902K05569J070293
42635b38652J331816P57692J67963K36698M87366J96286k82151j18020M39420
42626B978418L31418n60189j176908r50687m92340k98950P41N69594O97883K102
42616A101082o79345m85575J51604L04893k4619k50409l54765o11568o18149J94381
$$ plain form
42606 -1272470 21520 1498430 2078357 1767509 1281313 873302 278801 -413670 -602427
42597 -602427 51261 1166466 1993317 1911548 766103 -818073 -1613134 -907496 508774
42588 508774 1052204 160287 -1153053 -1710054 -1481891 -1113845 -781722 -217739 490066
42579 490066 944050 1217420 1804274 2648013 2968487 2414304 1720099 1648330 1799650 1237468
42569 1237468 8264 -823765 -647375 13315 451636 614123 640610 349233 -217711
42560 -217711 -343651 495795 1689183 2205248 2021593 1997949 2409855 2533744 1875155 953201
42550 953201 460959 352271 291374 426728 1028624 1697731 1673631 896523 198366 343714
42540 343714 1230167 2073182 2103309 1127345 -261299 -1034606 -646057 341685 848167 536507
$$ packed form
42606a272470J293990J476910N79927l10848m86196m08011n94501o92471j88757
42597f02427O53688J115205Q26851q1769j145445j584176p95061P05638J416270
42588E08774N43430q91917j313340n57001K28163L68046L32123N63983P07805
42579D90066M53984K73370N86854Q43739L20474n54183o94205p1769J51320n62182
42569A237468j229204q32029J76390O60690M38321J62487K6487k91377n66944
42560b17711j25940Q39446J193388N16065j83655k3644M11906J23889o58589r21954
42550I53201m92242j08688o0897J35354O01896O69107k4100p77108o98157J45348
42540C43714Q86453Q43015L0127r75964j388644p73307L88549R87742N06482l11660
$$ plain form
42530 536507 123217 314571 860680 1009966 621588 339844 681408 1394879 1918371 2149728
42520 2149728 2402983 2705484 2567191 1647761 403659 -245292 141974 1158864 2106628
42511 2106628 2634247 2759390 2590135 2295809 2163902 2355603 2631530 2579503 2145087 1743516
42501 1743516 1807096 2358663 3022836 3303692 2882049 1849503 681103 -180702 -694671
42492 -694671 -1004583 -989374 -423362 413626 792023 419008 -167436 -389008 -358945 -386194
42482 -386194 -221027 473817 1151823 796329 -578118 -1671098 -1507364 -634386 -224422
42473 -224422 -519650 -775998 -404540 464871 1386416 1986929 2013681 1502233 929007 828744
42463 828744 1259260 1909318 2566092 3080178 3058027 2166998 759677 -309062 -564396
$$ packed form
42530E36507m13290J91354N46109J49286l88378k81744L41564P13471N23492K31357
42520B149728K53255L02501j38293r19430j244102o48951L87266J016890R47764
42511B106628N27619J25143j69255k94326j31907J91701K75927n2027m34416m01571
42501A743516O3580N51567O64173K80856m21643j032546j168400q61805n13969
42492f94671l09912J5209N66012Q36988L78397l73015n86444k21572L0063k7249
42482c86194J65167O94844O78006l55494j374447j092980J63734Q72978M09964
42473b24422k95228k56348L71458Q69411R21545O00513K6752n11448n73226j00263
42463H28744M30516O50058O56774N14086k2151q91029j407321j068739k55334
$$ plain form
42454 -564396 -223575 325159 849346 1085980 826084 324100 109074 265130 408916 437764
42444 437764 634510 880443 553898 -431598 -1252367 -1330658 -1138235 -1236370 -1246041 -613314
42434 -613314 190761 260829 -276747 -421689 200953 987409 1502790 1989227 2526689 2595467
42424 2595467 1879707 843372 119744 -143509 -28444 498888 1289636 1849947 1917960
42415 1917960 1848909 2021662 2175023 1781200 894142 194751 203585 713263 1021702 602633
42405 602633 -426588 -1415515 -1752921 -1317008 -389013 648172 1377740 1429210 871601
42396 871601 334964 323566 571022 518317 208128 109881 244738 239034 179580 553848 1252936
42385 1252936 1543846 1256407 1037715 1048693 451930 -1111166 -2466390 -2305145 -1016972
$$ packed form
42454e64396L40821N48734N24187K36634k59896n01984k15026J56056J43786K8848
42444D37764J96746K45933l26545r85496q20769p8291J92423r8135r671O32727
42434f13314Q04075P0068n37576j44942O22642P86456N15381M86437N37462O8778
42424B595467p15760j036335p23628k63253J15065N27332P90748N60311O8013
42415A917960o9051J72753J53361l93823q87058o99391Q834N09678L08439m19069
42405F02633j029221r88927l37406M35913R27995J037185P29568N1470n57609
42396H71601n36637j1398K47456n2705l10189r8247J34857n704n9454L74268O99088
42385A252936K90910k87439k18692J0978n96763j563096j355224J61245J288173
$$ plain form
42376 -1016972 -112934 -221530 -659428 -754788 -579461 -369921 -112823 138705 211485 204516
42366 204516 377586 597125 456317 -4783 -280075 -194463 -163327 -513847 -1059651 -1521267
42356 -1521267 -1894655 -2189592 -2204198 -1786798 -1028233 -57564 1056285 2110662 2818282
42347 2818282 3169310 3425756 3643612 3525202 2882506 1949247 1090255 461134 67738
42338 67738 -111538 -199703 -383413 -681189 -944257 -1143911 -1421885 -1798566 -2091458 -2204598
42328 -2204598 -2239149 -2205881 -1872089 -1069371 -37231 658152 552262 -280202 -1134950 -1217019
42318 -1217019 -476298 281105 350741 -68801 -380538 -559325 -1027632 -1761948 -2246770 -2324174
42308 -2324174 -2375327 -2519149 -2322131 -1576867 -763991 -392715 -379045 -419972 -523859 -798890
$$ packed form
42376a016972R04038j08596m37898r5360J75327K09540K57098K51528P2780o969
42366B04516J73070K19539j40808m61100k75292Q5612L1136l50520n45804m61616
42356a521267l73388k94937j4606M17400P58565R70669J113849J054377P07620
42347B818282L51028K56446K17856j18410o42696r33259q58992o29121l93396
42338F7738j79276q8165j83710k97776k63068j99654k77974l76681k92892j13140
42328b204598l4551L3268L33792Q02718J032140O95383j05890q32464q54748q2069
42318a217019P40721P57403O9636m19542l11737j78787m68307p34316m84822p7404
42308b324174n1153j43822J97018P45264Q12876L71276J3670m0927j03887k75031
$$ plain form
42298 -798890 -1119639 -1388714 -1789034 -2401627 -2856192 -2709813 -1962382 -968579 -110530 269367
42288 269367 13491 -497131 -529620 128146 828230 899291 438192 -58415 -404825 -628787
42278 -628787 -584462 -214966 98471 6945 -206377 -26947 483375 823340 856315 917223
42268 917223 1164387 1353881 1317362 1247907 1412655 1848130 2370204 2701999 2652271 2312389
42258 2312389 1931996 1505293 799094 -36257 -332205 274033 1285205 1998980 2286903
42249 2286903 2293114 1888477 1054371 361511 347229 762472 1100691 1405386 1747290 1468988
42239 1468988 107235 -1302921 -1207440 255856 1383081 1313774 880834 797370 571439
42230 571439 -108887 -384359 345355 1145848 858317 -173360 -812968 -831119 -719370 -423070
$$ packed form
42298g98890l20749k69075m00320o12593m54565J46379P47431R93803Q58049L79897
42288B69367k55876n10622l2489O57766P00084P1061m61099m96607l46410k23962
42278f28787M4325L69496L13437r1526k13322J79430N10322L39965L2975O0908
42268I17223K47164J89494l6519o9455J64748M35475N22074L31795m9728l39882
42258B312389l80393m26703p06199q35351k95948O06238J011172P13775K87923
42249B286903O211m04637q34106o92860j4282M15243L38219L04695L41904k78302
42239A468988j361753j410156R5481J463296J127225o9307m32940q3464k25931
42230E71439o80326k75472P29714Q00493k87531j031677o39608j8151J11749K96300
$$ plain form
42220 -423070 448566 1491748 1823677 1397617 945321 738594 456342 201416 541709
42211 541709 1422209 2021597 1887632 1367135 780340 84356 -428125 -57994 1237227
42202 1237227 2492129 2927708 2867573 3032893 3533611 4030399 4345808 4391250 3929198 2927990
42192 2927990 1831495 1055076 522720 45039 -243565 -232075 -210420 -410262 -509558 -120957
42182 -120957 505079 819309 808556 923135 1288103 1532062 1356652 786433 -102566 -1184751
42172 -1184751 -1996832 -1980018 -1162015 -195762 404376 688039 843911 818435 588660 403400
42162 403400 428784 460545 318436 242877 498055 810016 713896 386171 567122 1523658
42152 1523658 2597047 3077965 3121770 3361052 3883213 4148755 3877466 3472561 3428672 3772119
$$ packed form
42220d23070Q71636J043182L31929m26060m52296k06727k82252k54926L40293
42211E41709Q80500N99388j33965n20497n86795o95984n12481L70131J295221
42202A237227J254902M35579o0135J65320N00718M96788L15409M5442m62052j001208
42192B927990j096495p76419n32356m77681k88604J1490K1655j99842r9296L88601
42182a20957O26036L14230j0753J14579L64968K43959j75410n70219q88999j082185
42172a184751q12081J6814Q18003R66253O00138K83663J55872k5476k29775j85260
42162D03400K5384L1761j42109p5559K55178L11961r6120l27725J80951R56536
42152A523658J073389M80918M3805K39282N22161K65542k71289m04905m3889L43447
$$ plain form
42142 3772119 4303136 4956833 5560949 5581715 4631966 3136893 2039056 1798550 2010359
42133 2010359 2045036 1763798 1530045 1765665 2569867 3572618 4122216 3825931 2973906
42124 2973906 2295164 2289909 2893164 3653821 4038196 3727687 2925883 2238541 1941734 1601502
42114 1601502 872881 393313 1140557 2968836 4611590 5257195 5266493 5078806 4383357
42105 4383357 2968352 1556881 972665 1031809 1070982 1109493 1611759 2425793 2876211 2773472
42095 2773472 2517703 2313612 2092399 2143730 2977583 4495971 6053296 7378629 8662139
42086 8662139 9687434 9787044 8899193 7825452 7106568 6426772 5504281 4749425 4489661
42077 4489661 4267117 3591315 2834955 2646057 2843841 2617403 1643693 448693 -223336
$$ packed form
42142C772119N31017O53697O04116K0766r49749j495073j097837k40506K11809
42133B010359L4677k81238k33753K35620Q04202J002751N49598k96285q52025
42124B973906o78742n255O03255P60657L84375l10509q01804o87342k96807l40232
42114A601502p28621m79568P47244J828279J642754O45605R298j87687o95449
42105D383357j415005j411471n84216N9144L9173L8511N02266Q14034M50418j02739
42095B773472k55769k04091k21213N1331Q33853J518388J557325J325333J283510
42086H662139J025295R9610q87851j073741p18884o79796r22491p54856k59764
42077D489661k22544o75802p56360j88898J97784k26438r73710j195000o72029
$$ plain form
42068 -223336 -18483 833437 1612300 1714347 1478834 1940992 3338398 4457234 4150068
42059 4150068 2977629 2438902 2934062 3560556 3794246 4162308 4987533 5571811 5241419
42050 5241419 4436017 4069538 4314594 4684209 4980072 5504502 6482237 7839556 9523712
42041 9523712 11539773 13551520 14788971 14578051 12930099 10605786 8623128 7570159
42033 7570159 7251776 7047897 6645573 6240398 5940630 5314036 3924001 2198061 1266265
42024 1266265 1736610 2942932 3710736 3707164 3652544 4162199 4785038 4523368 3142511 1560607
42014 1560607 872265 1298418 2232649 3006124 3330938 3217048 2835416 2428960 2077069
42005 2077069 1583062 857418 324695 549145 1410215 2078297 2010611 1608256 1583852 1974544
$$ packed form
42068b23336K04853Q51920P78863J02047k35513M62158J397406J118836l07166
42059D150068j172439n38727M95160O26494K33690L68062Q25225N84278l30392
42050E241419q05402l66479K45056L69615K95863N24430R77735J357319J684156
42041I523712K016061K011747J237451k10920j647952k324313j982658j052969
42033G570159l18383k03879m02324m05175k99768o26594j390035j725940r31796
42024A266265M70345J206322P67804l572n4620N09655O22839k61670j380857j581904
42014A560607o88342M26153R34231P73475L24814j13890l81632m06456l51891
42005B077069m94007p25644n32723K24450Q61070O68082o7686m02355k4404L90692
$$ plain form
41995 1974544 2211378 2032184 1842266 2096569 2742001 3493839 4337836 5388753 6400727
41986 6400727 6859715 6650364 6283576 6260266 6472646 6503835 6295303 6122229 6007277 5641396
41976 5641396 4991165 4559122 4801670 5592452 6507566 7358564 8137797 8671145 8700343 8207472
41966 8207472 7368420 6325272 5324269 4898903 5416644 6412033 6834894 6174618 5070722
41957 5070722 4624263 5274817 6467983 7241717 6998195 5857092 4472912 3546351 3419861
41948 3419861 3992653 4852077 5484773 5599371 5377006 5219604 5166015 4880419 4390328 4340769
41938 4340769 5032842 5633631 5104351 3753275 3006496 3513805 4293532 4097060 2923898
41929 2923898 1684658 915684 463601 122736 -71830 -121109 -129900 -57604 257836 777951
$$ packed form
41995A974544K36834j79194j89918K54303O45432P51838Q43997J050917J011974
41986F400727M58988k09351l66788k3310K12380L1189k08532j73074j14952l65881
41976E641396o50231m32043K42548P90782R15114Q50998P79233N33348K9198m92871
41966H207472q39052j043148j001003m25366N17741R95389M22861o60276j103896
41957E070722m46459O50554J193166P73734k43522j141103j384180r26561j26490
41948C419861N72792Q59424O32696J14598k22365j57402n3589k85596m90091m9559
41938D340769O92073O00789n29280j351076p46779N07309P79727j96472j173162
41929B923898j239240p68974m52083l40865j94566m9279q791P2296L15440N20115
$$ plain form
41919 777951 1198326 1248764 941886 554166 430148 702572 1137350 1379342 1362307 1267472
41909 1267472 1121094 849881 815263 1715132 3570041 5275374 5727262 5127166 4590460
41900 4590460 4632061 4694321 4192604 3372613 2853717 2766022 2716855 2431862 2132846 2277063
41890 2277063 3021478 3962744 4469923 4349511 4061078 4117461 4426370 4498311 4174981 3742662
41880 3742662 3324760 2651348 1665710 969810 1244617 2344677 3330425 3447614 2867138
41871 2867138 2412824 2712149 3644203 4461265 4384450 3242336 1684085 702493 796983
41862 796983 1603839 2417270 2962756 3464915 4066180 4573225 4884810 5263766 5874183 6345054
41852 6345054 6206050 5585755 5046734 4837001 4771308 4792421 5093268 5599609 5892400 5863985
$$ packed form
41919G77951M20375N0438l06878l87720j24018K72424M34778K41992j7035r4835
41909A267472j46378k71213l4618Q99869J854909J705333M51888o00096n36706
41900D590460M1601O2260n01717q19991n18896q7695m9167k84993k99016J44217
41890B277063P44415R41266N07179j20412k88433N6383L08909P1941l23330m32319
41880C742662m17902o73412r85638o95900K74807J100060R85748J17189n80476
41871B867138m54314K99325R32054Q17062p6815j142114j558251r81592R4490
41862G96983Q06856Q13431N45486N02159O01265N07045L11585L78956O10417M70871
41852F345054j39004o20295n39021k09733o5693K1113L00847N06341K92791k8415
$$ plain form
41842 5863985 5938356 6304263 6364770 5407012 3585214 1836546 949665 1017795 1662458 2444078
41832 2444078 3051630 3329248 3236914 2854354 2509103 2725936 3703811 4919178 5695923
41823 5695923 6124134 6796867 7573242 7436109 5988130 4322709 3749137 4228346 4798456
41814 4798456 5048332 5295337 5633836 5778751 5778366 5984738 6240376 5907035 4893057 3945021
41804 3945021 3651320 3739745 3648758 3296005 2968494 2851984 3001881 3521224 4465734 5631437
41794 5631437 6518496 6501314 5267592 3351065 1971717 1900448 2642363 3200920 3413423
41785 3413423 3871942 4672481 5103771 4730203 4007884 3519894 3261379 3054548 3072609 3454828
41775 3454828 3813328 3617879 2856234 1986905 1451123 1471258 2056302 2901156 3444559 3281076
$$ packed form
41842E863985P4371L65907O0507r57758j821798j748668q86881O8130O44663P81620
41832B444078O07552K77618r2334l82560l45251K16833R77875J215367P76745
41823E695923M28211O72733P76375j37133j447979j665421n73572M79209N70110
41814D798456K49876K47005L38499J44915l85K06372K55638l33341j013978r48036
41804C945021k93701Q8425r0987l52753l27511j16510J49897N19343R44510J165703
41794E631437Q87059j7182j233722j916527j379348p1269P41915N58557K12503
41785C413423M58519Q00539M31290l73568p22319m87990k58515k06831J8061L82219
41775C454828L58500j95449p61645q69329n35782K0135N85044Q44854N43403j63483
$$ plain form
41765 3281076 2498181 1609583 1264960 1833890 2935371 3577115 3276202 2876471 3571820
41756 3571820 5209060 6422501 6521776 6230546 6227686 6057303 5204014 4319456 4365094 5110128
41746 5110128 5532443 5408699 5498159 6231935 7129186 7598254 7553943 7076948 6127446 4883065
41736 4883065 3894375 3599604 3920454 4468015 4913154 5076097 4903616 4497450 4057893
41727 4057893 3758890 3717258 3963206 4311504 4408984 4102678 3657560 3443792 3519391 3666362
41717 3666362 3709166 3671873 3763658 4269122 5205013 6016461 5987656 5153119 4436917 4616204
41707 4616204 5466598 6195046 6354444 6009105 5381697 4775097 4558575 4786337 5030375
41698 5030375 4958057 4848816 5197528 6080886 7274638 8675871 10183746 11470279 12334545
$$ packed form
41765C281076p82895q88598l44623N68930J101481O41744l00913l99731O95349
41756C571820J637240J213441R9275k91230k860j70383q53289q84558M5638P45034
41746E110128M22315j23744Q9460P33776Q97251M69068m4311m76995r49502j244381
41736D883065r88690k94771L20850N47561M45139J62943j72481m06166m39557
41727D057893k99003m1632K45948L48298R7480l06306m45118k13768P5599J46971
41717C666362M2804l7293R1785N05464R35891Q11448k8805q34537p16202J79287
41707D616204Q50394P28448J59398l45339o27408o06600k16522K27762K44038
41698E030375p2318j09241L48712Q83358J193752J401233J507875J286533Q64266
$$ plain form
41689 12334545 13021546 13780966 14459897 14981452 15765237 17045366 18204318 18558949 18469008
41680 18469008 18808987 19611920 20203692 20520074 21234132 22657669 24795271 28667442 35954099
41671 35954099 46167719 55108184 57673743 52442638 42841328 33776762 27708199 24051637
41663 24051637 21530129 20097175 20395033 22230581 24736981 28090084 33731641 41787947
41655 41787947 48962252 50611382 45310915 36392184 28561226 23848905 21303582 19532128
41647 19532128 18266275 17685163 17411776 16718944 15334727 13674116 12365573 11726757 11680637
41638 11680637 12017478 12566013 13115189 13431750 13542915 13782154 14272533 14555998 14119223
41629 14119223 13185158 12568366 12759301 13522989 14393141 15174986 15902690 16608157 17179622
$$ packed form
41689A2334545O87001P59420O78931N21555P83785J280129J158952L54631q9941
41680A8469008L39979Q02933N91772L16382P14058J423537K137602L872171P286657
41671C5954099J0213620Q940465K565559n231105r601310r064566o068563l656562
41663B4051637k521508j432954K97858J835548K506400L353103N641557Q056306
41655D1787947P174305J649130n300467q918731p830958m712321k545323j771454
41647A9532128j265853n81112k73387o92832j384217j660611j308543o38816m6120
41638A1680637L36841N48535N49176L16561J11165K39239M90379K83465m36775
41629A4119223r34065o16792J90935P63688Q70152P81845P27704P05467N71465
$$ plain form
41620 17179622 17266943 16494656 15089838 14068406 14281814 15358289 16082516 15793342 14966419
41611 14966419 14491135 14832422 15816227 16780696 17074837 16882812 17334832 19261754 22144191
41602 22144191 24929503 27449126 30133697 32768210 34744913 36341027 38440061 41060229
41594 41060229 43548287 46250835 50464335 56548235 63676633 71700341 81520473 93377111
41586 93377111 106912082 123443912 145748976 175050100 211709325 260076512 326646602
41579 326646602 406880067 476242113 503028841 474319149 406662672 329872281 263786801
41572 263786801 211911996 171114948 139891637 117452951 100974340 87242258 75323498
41565 75323498 65837794 58694477 52862299 47645404 43051774 39185576 36032978 33681908
$$ packed form
41620A7179622Q7321p72287j404818j021432K13408J076475P24227k89174q26923
41611A4966419m75284L41287R83805R64469K94141j92025M52020J926922K882437
41602B2144191K785312K519623K684571K634513J976703J596114K099034K620168
41594D1060229K488058K702548M213500O083900P128398Q023708R820132J1856638
41586I3377111J3534971J6531830K2305064K9301124L6659225M8367187O6570090
41579C26646602Q0233465O9362046K6786728k8709692o7656477p6790391o6085480
41572B63786801n1874805m0797048l1223311k2438686j6478611j3732082j1918760
41565G5323498r485704p143317n832178n216895m593630l866198l152598k351070
$$ plain form
41557 33681908 32177979 31197187 30254166 29285695 28811389 29417815 31078712 32953547 33904087
41548 33904087 33352531 31701757 29889336 28536169 27540206 26413468 24904522 23270859
41540 23270859 21983585 21243213 20897980 20807179 20997663 21294333 21140208 20219101 19076761
41531 19076761 18607898 18985037 19629378 20225944 21143522 22757093 25019218 27861496 31223041
41522 31223041 34311785 35699319 34866795 33040939 31743943 31097109 30452593 30102057 31027023
41513 31027023 33103721 34985582 36111394 37597496 40499924 44172259 47129444 48766845
41505 48766845 49357754 49002081 47665917 45957218 44756310 44026586 42891103 41059160
41497 41059160 39389952 38749258 38956763 39233721 39182023 38914946 38593643 38251831 37889079
$$ packed form
41557C3681908j503929r80792r43021r68471m74306O06426J660897J874835R50540
41548C3904087n51556j650774j812421j353167r95963j126738j508946j633663
41540B3270859j287274p40372l45233r0801J90484K96670j54125r21107j142340
41531A9076761m68863L77139O44341N96566R17578J613571K262125K842278L361545
41522C1223041L088744J387534q32524j825856j296996o46834o44516l50536R24966
41513C1027023K076698J881861J125812J486102K902428L672335K957185J637401
41505D8766845N90909l55673j336164j708699j200908p29724j135483j831943
41497D1059160j669208o40694K07505K76958n1698k67077l21303l41812l62752
$$ plain form
41488 37889079 37457744 36892308 36269836 35716620 35086635 34052912 32597265 31014478 29339995
41479 29339995 27302403 25069337 23458865 22998648 23254317 23528386 23739209 24093504 24405558
41470 24405558 24450654 24604132 25308772 26123007 26140034 25300075 24504497 24399672 24792601 25352537
41460 25352537 26115722 27030157 27643837 27636544 27306633 27284172 27980320 29340809 30871014
41451 30871014 31997986 32724286 33705518 35285686 36838573 37699877 38383570 40060637 43119568
41442 43119568 47123779 51886529 57554186 63893677 70668020 78543989 88508187 100797806
41434 100797806 115782069 135275594 161251782 194430459 237008911 294885546 370127920
41427 370127920 448168672 498704303 497261631 446566424 373166176 303843092 248873242
$$ packed form
41488C7889079m31335n65436o22472n53216o29985j033723j455647j582787j674483
41479B9339995k037592k233066j610472m60217K55669K74069K10823L54295L12054
41470B4405558M5096J53478P04640Q14235J7027q39959p95578j04825L92929N59936
41460B5352537P63185R14435O13680p293l29911k2461O96148J360489J530205
41451C0871014J126972P26300R81232J580168J552887Q61304O83693J677067L058931
41442D3119568M004211M762750N667657O339491O774343P875969R964198J2289619
41434A00797806J4984263J9493525K5976188L3178677M2578452N7876635P5242374
41427C70127920P8040752N0535631j442672n0695207p3400248o9323084n4969850
$$ plain form
41420 248873242 205848270 171332384 144559467 124398577 108565133 95739238 85704207
41413 85704207 77691715 70573913 64303504 59463844 55696520 52011392 48345051 45455514
41405 45455514 43461693 41706057 39946621 38549517 37510918 36345500 35106608 34635217
41397 34635217 35488841 37213490 38948006 40348453 41701882 43401404 45513253 47787126
41389 47787126 50021406 52401579 55446596 59693926 65532106 73186886 82680650 93965679
41381 93965679 107193749 122368595 138437591 153560035 167258017 181947009 201557308
41374 201557308 229216259 266909516 315239978 369833628 417744719 441736798 432136535
41367 432136535 394667348 345519679 299391573 262758419 235925367 217533672 206278835
$$ packed form
41420B48873242m3024972l4515886k6772917k0160890j5833444j2825895j0035031
41413H5704207q012492p117802o270409m839660l767324l685128l666341k889537
41405D5455514j993821j755636j759436j397104j038599j165418j238892m71391
41397C4635217Q53624J724649J734516J400447J353429J699522K111849K273873
41389D7787126K234280K380173L045017M247330N838180P654780R493764J1285029
41381I3965679J3228070J5174846J6068996J5122444J3697982J4688992J9610299
41374B01557308K7658951L7693257M8330462N4593650M7911091K3992079r600263
41367D32136535l7469187m9147669m6128106l6633154k6833052j8391695j1254837
$$ plain form
41360 206278835 200887496 200592918 205496211 215906768 231969039 254846563 287794789
41353 287794789 333795667 389396042 440275428 465940213 453208066 406795107 345394964
41346 345394964 286788309 237774278 197284031 164259593 139192605 120792089 105893993
41339 105893993 92916232 82578872 75070197 69001988 63432709 58589159 54160055 49103700
41331 49103700 43772877 40120008 38921739 38621614 37768701 36818298 36607449 36883125 37476007
41322 37476007 39151920 41995806 44818287 47869891 54181724 65488408 77839377 84327420
41314 84327420 82400169 76104906 70706738 67488697 64896530 62513682 61614663 62548627
41306 62548627 63663875 63167385 60895959 57870045 54903854 52111132 49237470 45947076
$$ packed form
41360B06278835n391339k94578M903293J0410557J6062271K2877524L2948226
41353B87794789M6000878N5600375N0879386K5664785j2732147m6412959o1400143
41346C45394964n8606655m9014031m0490247l3024438k5066988j8400516j4898096
41339A05893993j2977761j0337360p508675o068209n569279m843550m429104n056355
41331D9103700n330823l652869j198269l00125q52913r50403k10849K75676N92882
41322C7476007J675913K843886K822481L051604O311833J1306684J2350969O488043
41314H4327420j927251o295263n398168l218041k592167k382848q99019R33964
41306F2548627J115248m96490k271426l025914k966191k792722k873662l290394
$$ plain form
41298 45947076 42026320 37762951 34054367 31781567 31065735 31406693 32504931 34558603
41290 34558603 37638810 41120485 43951527 45282185 44748989 42528985 39394697 36403118
41282 36403118 34164623 32562021 31351715 30668450 30626337 30865607 31031323 31397044 32433656
41273 32433656 34006449 35656581 37528664 40308269 44258339 49021775 54449693 60839497
41265 60839497 67933239 74156144 77380565 76496460 72230936 66585057 61425758 57383522
41257 57383522 54004961 50810608 47788443 44844697 41574832 38105579 35458901 34271291
41249 34271291 33685833 32445797 30642140 29302509 28600965 27755130 26584207 25798553 25579682
41240 25579682 25191146 24358486 23806890 23942228 24161774 24094059 24444765 25850584 27810686
$$ packed form
41298D5947076l920756m263369l708584k272800p15832L40958J098238K053672
41290C4558603L080207L481675K831042J330658n33196k220004l134288k991579
41282C6403118k238495j602602j210306o83265m2113K39270J65716L65721J036612
41273C2433656J572793J650132J872083K779605L950070M763436N427918O389804
41265F0839497P093742O222905L224421q84105m265524n645879n159299m042236
41257E7383522l378561l194353l022165k943746l269865l469253k646678j187610
41249C4271291n85458j240036j803657j339631p01544q45835j170923p85654k18871
41240B5579682l88536q32660n51596J35338K19546o7715L50706J405819J960102
$$ plain form
41231 27810686 29564236 31229876 33223248 35238288 36751152 38062703 39900722 42176006
41223 42176006 43888254 44303756 43852353 43836212 45246072 47700339 49962368 52159105 56751912
41214 56751912 65495466 75313860 79429861 73974961 62133300 50452617 42404904 37147140
41206 37147140 33124749 30184401 28301880 26727474 25207134 24509007 25012497 25954004
41198 25954004 26705376 27730794 29506321 31267191 31616944 29976092 26920417 23461390
41190 23461390 20411815 18131760 16482293 15136426 14062705 13500592 13438880 13450757 13149516
41181 13149516 12565723 12036079 11910407 12275171 12730526 12627604 11839552 11041326 10803037
41172 10803037 10706169 9955580 8636229 7613790 7243263 6974109 6401275 5993407 6417862
$$ packed form
41231B7810686J753550J665640J993372K015040J512864J311551J838019K275284
41223D2176006J712248M15502m51403j6141J409860K454267K262029K196737M592807
41214E6751912Q743554R818394M116001n454900j1841661j1680683q047713n257764
41206C7147140m022391k940348j882521j574406j520340o98127N03490R41507
41198B5954004P51372J025418J775527J760870L49753j640852l055675l459027
41190B3461390l049575k280055j649467j345867j073721n62113o1712J1877l01241
41181A3149516n83793n29644j25672L64764M55355j02922p88052p98226k38289
41172A0803037r6868p50589j319351j022439l70527k69154n72834m07868M24455
$$ plain form
41163 6417862 7602660 8801243 9317260 8986170 8199383 7580711 7422771 7389474 6961392
41154 6961392 6111122 5293129 4880984 4915710 5266514 5674555 5766387 5416087 4986156 4853628
41144 4853628 4886795 4799442 4753712 5046327 5414638 5325902 4844534 4521470 4477606 4325591
41134 4325591 4014672 3983159 4358773 4787742 5262365 6290818 7829509 8789756 8251053
41125 8251053 6726461 5609249 5607733 6253459 6798085 7045961 7221973 7429152 7530252
41116 7530252 7470709 7439081 7563309 7636834 7446918 7262586 7535347 8124786 8451339 8563485
41106 8563485 9257634 10773097 12339673 13768598 16444576 21356103 26740231 29362671
41098 29362671 28169248 25224952 22833576 21154288 19126214 16374540 13354664 10577716
$$ packed form
41163F417862J184798J198583N16017l31090p86787o18672j57940l3297m28082
41154F961392q50270q17993m12145L4726L50804M08041R1832l50300m29931j32528
41144D853628L3167q7353m5730K92615L68311q8736m81368l23064m3864j52015
41134D325591l10919l1513L75614M28969M74623J028453J538691R60247n38703
41125H251053j524592j117212j516O45726N44626K47876J76012K07179J01100
41116G530252n9543l1628J24228P3525j89916j84332K72761N89439L26553J12146
41106H563485O94149J515463J566576J428925K675978M911527N384128K622440
41098B9362671j193423k944296k391376j679288k028074k751674l019876k776948
$$ plain form
41090 10577716 8543577 7730570 7896596 7973100 7306577 6464511 6241613 6484065 6558600
41081 6558600 6411414 6409002 6572317 6725182 7066786 7858790 8781668 9307379 9569345 10200520
41071 10200520 11334048 12327487 12552663 12076003 11499937 11387159 11856379 12584559 13208587
41062 13208587 13707983 14227554 14635578 14686463 14637386 15176407 16594839 18551931 20822594
41053 20822594 23677847 27276209 31330432 35730868 40793654 46329622 51059494 53642280
41045 53642280 53915742 52553086 49914824 45935092 40893497 35622771 30974634 27432840
41037 27432840 25040389 23366413 21846757 20506668 19951079 20238995 20285920 19018518 16753419
41028 16753419 14765879 13772284 13497323 13484858 13594417 13785826 14077198 14711320 15830357
$$ packed form
41090A0577716k034139q13007J66026P6504o66523q42066k22898K42452P4535
41081F558600j47186k412J63315J52865L41604P92004R22878N25711K61966O31175
41071A0200520J133528R93439K25176m76660n76066j12778M69220P28180O24028
41062A3208587M99396N19571M08024N0885m9077N39021J418432J957092K270663
41053B0822594K855253L598362M054223M400436N062786N535968M729872K582786
41045E3642280K73462j362656k638262l979732n041595n270726m648137l541794
41037B7432840k392451j673976j519656j340089n55589K87916M6925j267402k265099
41028A6753419j987540r93595k74961j2465J09559J91409K91372O34122J119037
$$ plain form
41019 15830357 17044052 17855905 18484679 19746753 22097124 25212849 28556018 32013388
41011 32013388 35954119 40808855 46396401 51481994 54358999 54205403 51578588 47400049
41003 47400049 42103079 36239595 31116941 27832713 26023499 24465100 22648476 20890394
40995 20890394 19203768 17198808 15105970 13787090 13450614 13233423 12381707 11120540
40987 11120540 10055240 9382036 9010815 8867942 8733623 8275336 7555227 7093719 7188923
40978 7188923 7564493 7927103 8579328 10310399 13773216 18701599 23350950 25154044 22850181
40969 22850181 17969239 13430020 10677332 9008710 7558244 6606179 6529789 6746226 6569543
40960 6569543 6260612 6352485 6602228 6490110 6225045 6373798 6907441 7462556 8160989 9256610
$$ packed form
41019A5830357J213695Q11853O28774J262074K350371L115725L343169L457370
41011C2013388L940731M854736N587546N085593K877005j53596k626815m178539
41003D7400049n296970n863484n122654l284228j809214j558399j816624j758082
40995B0890394j686626k004960k092838j318880l36476k17191q51716j261167
40987A1120540j065300o73204l71221j42873j34319m58287p20109m61508R5204
40978G188923L75570L62610O52225J731071L462817M928383M649351J803094k303863
40969B2850181m880942m539219k752688j668622j450466r52065p6390K16437j76683
40960F569543l08931R1873K49743j12118k65065J48753N33643N55115O98433J095621
$$ plain form
40950 9256610 10273814 10505442 10235705 10443548 11254829 11704793 11255523 10596893 10568083
40941 10568083 11138088 11930568 12995381 14556520 16797792 20468171 26595653 34389253
40933 34389253 40331081 41273598 38389234 36110152 36594829 37125830 34163165 28266700
40925 28266700 23091250 20633592 19869464 19709997 20600723 22484571 23478751 22035650 18988139
40916 18988139 16099239 13765108 11554730 9961850 9897409 10952206 11709968 11557031 10946206
40907 10946206 10225303 9517483 9449859 10605073 12458382 14290842 16969180 22112669 29241314
40898 29241314 35299774 37560007 35970674 32599796 30148302 30979962 35520023 40729173
40890 40729173 41918771 37402159 30261808 24616832 21525080 19693080 18583651 18792381
$$ packed form
40950I256610J017204K31628k69737K07843Q11281M49964m49270o58630k8810
40941A0568083N70005P92480J064813J561139K241272L670379O127482P793600
40933C4389253N941828R42517k884364k279082M84677N31001k962665n896465
40925B8266700n175450k457658p64128j59467Q90726J883848R94180j443101l047511
40916A8988139k888900k334131k210378j592880o4441J054797P57762j52937o10825
40907A0946206p20903p07820o7624J155214J853309J832460K678338N143489P128645
40898B9241314O058460K260233j589333l370878k451494Q31660M540061N209150
40890D0729173J189598m516612p140351n644976l091752j832000j109429K08730
$$ plain form
40882 18792381 20191853 21820779 23473470 25631200 27695773 27898615 25480895 21831382
40874 21831382 18914477 17367208 16586558 15977881 15517160 15418894 15794167 16787347 18985185
40865 18985185 23357370 30113811 37402023 41972559 41982540 38819282 35488156 33630818
40857 33630818 33000032 33448619 36045293 41811693 50192143 59180884 66348761 69491460
40849 69491460 67217795 59999690 50671338 43060415 39369168 38678164 38173842 35952779
40841 35952779 32474320 29268905 26863320 24651972 22381499 20615641 19617428 18897224
40833 18897224 18286168 18400066 19436567 20560581 21313676 22653372 25545978 29371279
40825 29371279 32898107 36043860 39211209 41446647 40987295 37683683 33564759 30943643
$$ packed form
40882A8792381J399472J628926J652691K157730K064573K02842k417720l649513
40874B1831382k916905j547269p80650o08677m60721r8266L75273R93180K197838
40865A8985185M372185O756441P288212M570536R981l163258l331126j857338
40857C3630818o30786M48587K596674N766400Q380450Q988741P167877L142699
40849F9491460k273665p218105r328352p610923l691247o91004n04322k221063
40841C5952779l478459l205415k405585k211348k270473j765858r98213p20204
40833A8897224o11056J13898J036501J124014P53095J339696K892606L825301
40825B9371279L526828L145753L167349K235438m59352l303612m118924k621116
$$ plain form
40817 30943643 30991298 33754310 37915362 40531442 38868473 33211497 26692133 21981174
40809 21981174 19414477 18525106 19445260 21718108 23332081 22552513 19974023 17560855
40801 17560855 16310991 15919566 15997184 16319824 16304447 15498161 14454345 14135527 14569394
40792 14569394 14925764 14703758 13994889 12848769 11404821 10564174 11445208 13911398 16395341
40783 16395341 17412870 16693890 14812551 12486131 10482269 9512383 9717101 10500922 11062114
40774 11062114 10878861 9762271 7929389 6102604 5055148 4894254 5153848 5621079 6539008
40765 6539008 7833404 8733524 8591778 7735170 7068313 7003456 7145879 6960130 6450297
40756 6450297 6169823 6719432 8194301 9962271 11003807 10654772 9145971 7418740 6341977
$$ packed form
40817C0943643M7655K763012M161052K616080j662969n656976o519364m710959
40809B1981174k566697q89371R20154K272848J613973p79568k578490k413168
40801A7560855j249864l91425P7618L22640j5377q06286j043816l18818M33867
40792A4569394L56370k22006p08869j146120j443948q40647Q81034K466190K483943
40783A6395341J017529p18980j881339k326420k003862r69886K04718P83821N61192
40774A1062114j83253j116590j832882j826785j047456j60894K59594M67231R17929
40765F539008J294396R00120j41746q56608o66857o4857J42423j85749n09833
40756F450297k80474N49609J474869J767970J041536l49035j508801j727231j076763
$$ plain form
40747 6341977 6015977 5809950 5137994 4194227 3784214 4392443 5646209 6875650 7961433
40738 7961433 9261887 10789944 11920611 12075804 11370907 10337221 9254834 8121755
40730 8121755 7172004 6926613 7488923 8117606 7947097 7079301 6501591 6785356 7320414
40721 7320414 7177389 6331628 5474597 4844441 3988533 2785479 2008877 2487486 4103038
40712 4103038 5963156 7307851 8041674 8685895 9990359 12253699 14927749 17399495
40704 17399495 20219984 24594698 30068873 33709133 32831009 28163705 23079989 19801707
40696 19801707 17660586 15270610 12928841 11948132 12551247 13579524 13963712 13548595 12546791
40687 12546791 11017038 9139578 7528714 6911483 7494529 8640674 9201033 8446003 6841227
$$ packed form
40747F341977l26000k06027o71956r43767m10013O08229J253766J229441J085783
40738G961433J300454J528057J130667J55193p04897j033686j082387j133079
40730H121755r49751k45391N62310O28683j70509q67796n77710K83765N35058
40721G320414j43025q45761q57031o30156q55908j203054p76602M78609J615552
40712D103038J860118J344695P33823O44221J304464K263340K674050K471746
40704A7399495K820489M374714N474175L640260q78124m667304n083716l278282
40696A9801707k141121k389976k341769r80709O03115J028277L84188m15117j001804
40687A2546791j529753j877460j610864o17231N83046J146145N60359p55030j604776
$$ plain form
40678 6841227 5638660 5489615 5793149 5723759 5471379 5838050 6834680 7496182 7244412
40669 7244412 6718269 6826721 7484047 7866811 7675288 7500440 7927562 8901647 10268522
40660 10268522 12383212 15483015 18601123 19957775 18855895 16628733 15080159 14356697
40652 14356697 13185886 11050653 9028768 8162611 8052515 7785145 7386458 7337678 7288366
40643 7288366 6533975 5504591 5431220 6499374 7667092 8533406 9978933 12522799 15631868
40634 15631868 19486274 25617384 34030450 40958534 41856901 36464609 29002664 23434655
40626 23434655 20473078 19274547 19563125 21035220 22826406 25198667 30050092 37678766
40618 37678766 44189850 44583267 38289193 29690039 23112861 19186452 16419022 14261440
$$ packed form
40678F841227j202567j49045L03534o9390k52380L66671R96630O61502k51770
40669G244412n26143J08452O57326L82764j91523j74848M27122R74085J366875
40660A0268522K114690L099803L118108J356652j101880k227162j548574p23462
40652A4356697j170811k135233k021885q66157j10096k67370l98687m8780m9312
40643G288366p54391j029384p3371J068154J167718Q66314J445527K543866L109069
40634A5631868L854406O131110Q413066O928084Q98367n392292p461945n568009
40626B3434655k961577j198531K88578J472095J791186K372261M851425P628674
40618C7678766O511084L93417o294074q599154o577178l926409k767430k157582
$$ plain form
40610 14261440 13378572 14208158 16659821 20621583 25573435 29933386 31751251 30199205
40602 30199205 26035109 20802024 15957362 12476457 10651064 10102267 10169694 10316129 10213597
40593 10213597 9759543 9145586 8628414 8140265 7480486 6941483 7161994 8093075 8738525
40584 8738525 8433557 7843021 7970218 8535187 8253387 6729025 5176142 4883493 5625997
40575 5625997 6196330 6119253 6071566 6624791 7390168 7850377 8406341 9786928 11741867
40566 11741867 13433116 15256079 18941948 24930135 30562996 32256543 29262638 24247092
40558 24247092 20372468 18911531 19461454 20903983 21730174 20768489 18374182 16093249
40550 16093249 14720146 13617919 12300266 11429915 11562986 12126343 12572175 13506430 15768823
$$ packed form
40610A4261440q82868Q29586K451663L961762M951852M359951J817865j552046
40602C0199205m164096n233085m844662l480905j825393n48797O7427J46435j02532
40593A0213597m54054o13957n17172m88149o59779n39003K20511R31081O45450
40584H738525l04968n90536J27197N64969k81800j524362j552883k92649P42504
40575E625997N70333p7077m7687N53225P65377M60209N55964J380587J954939
40566A1741867J691249J822963L685869N988187N632861J693547k993905n015546
40558B4247092l874624j460937N49923J442529Q26191r61685k394307k280933
40550A6093249j373103j102227j317653q70351J33071N63357M45832R34255K262393
$$ plain form
40541 15768823 19484977 24867997 32321178 40162283 43880847 40265140 31716018 24052975
40533 24052975 20249456 18669374 17241474 16290767 16488578 17138474 18417646 22840170
40525 22840170 31685801 41170328 44997013 40749174 31882483 23445073 17685072 14094281
40517 14094281 11738357 10219661 9225198 8376221 7533875 6764702 6055939 5331262 4672600
40508 4672600 4327143 4459569 4914047 5262052 5225223 5074217 5383531 6291331 7242642 7590304
40498 7590304 7197312 6345673 5398493 4715406 4509819 4554162 4407393 4160620 4479081 5572204
40488 5572204 6637939 6813552 6239789 5653719 5362325 5255795 5430280 5967410 6283359
40479 6283359 5571738 3979924 2654515 2461764 3188363 4088644 4674077 4828097 4656520
$$ packed form
40541A5768823L716154N383020P453181P841105L718564l615707q549122p663043
40533B4052975l803519j580082j427900r50707J97811O49896J279172M422524
40525B2840170Q845631R484527L826685m247839q866691q437410n760001l590791
40517A4094281k355924j518696r94463q48977q42346p69173p08763p24677o58662
40508D672600l45457J32426M54478L48005l6829j51006L09314R07800R51311L47662
40498G590304l92992q51639r47180o83087k05587M4343j46769k46773L18461J093123
40488E572204J065735J75613n73763n86070k91394j06530J74485N37130L15949
40479F283359p11621j591814j325409j92751P26599R00281N85433J54020j71577
$$ plain form
40470 4656520 4444437 4412887 4412186 4187484 3936876 4143029 4810043 5397509 5655848 5995462
40460 5995462 6771736 7673853 8160260 8135015 7835706 7335971 6542203 5525027 4525235
40451 4525235 3705529 3134767 2946459 3276176 4001427 4644769 4616787 3694550 2396129
40442 2396129 1734504 2279779 3466391 4147153 3870450 3257159 3034634 3139127 3041061
40433 3041061 2593301 2149605 2019501 2205083 2647661 3392660 4386919 5269200 5512723
40424 5512723 4859297 3669400 2743619 2575702 2784565 2563275 1757227 1146100 1428019
40415 1428019 2226181 2472154 1646660 305279 -576989 -490592 352078 1340266 1966607
40406 1966607 2193360 2376532 2732749 2976784 2708163 2072942 1701727 1946932 2519671
$$ packed form
40470D656520k12083l1550p01k24702k50608K06153O67014N87466K58339L39614
40460E995462P76274R02117M86407k5245k99309m99735p93768j017176r99792
40451D525235q19706n70762j88308L29717P25251O43342k7982r22237j298421
40442B396129o61625N45275J186612O80762k76703o13291k22525J04493r8066
40433C041061m47760m43696j30104J85582M42578P44999R94259Q82281K43523
40424E512723o53426j189897r25781j67917K08863k21290q06048o11127K81919
40415A428019P98162K45973q25494j341381q82268Q6397Q42670R88188O26341
40406A966607K26753J83172L56217K44035k68621o35221l71215K45205N72739
$$ plain form
40397 2519671 2998301 3326196 3554022 3446635 2807363 2028094 1781907 2117393 2349699
40388 2349699 2046606 1675962 1922701 2703856 3331401 3458579 3334145 3164120 2790025
40379 2790025 2152462 1588223 1391813 1430646 1458275 1490676 1603354 1697407 1808248 2308305
40369 2308305 3362633 4478327 5135541 5644427 6726507 8325807 9532455 9761475 9331239
40360 9331239 8708589 7904336 6966800 6373619 6343374 6259199 5449772 4216655 3391037 3069535
40350 3069535 2534542 1427763 308074 -123970 197104 899608 1655735 2210790 2357620
40341 2357620 2193439 2095457 2182725 2106041 1624828 1043530 731130 541716 177516 -122348
40331 -122348 156762 908038 1351796 1028274 397106 239409 794338 1673885 2312072 2283354
$$ packed form
40397B519671M78630L27895K27826j07387o39272p79269k46187L35486K32306
40388B349699l03093l70644K46739P81155O27545J27178j24434j70025l74095
40379B790025o37563n64239j96410L8833K7629L2401J12678R4053J10841N00057
40369B308305J054328J115694O57214N08886J082080J599300J206648K29020m30236
40360I331239o22650q04253r37536n93181l0245q4175q09427j233117q25618l21502
40350C069535n34993j106779j119689m32044L21074P02504P56127N55055J46830
40341B357620j64181r7982Q7268p6684m81213n81298l12400j89414l64200k99864
40331a22348K79110P51276M43758l23522o31168j57697N54929Q79547O38187k8718
$$ plain form
40321 2283354 1504664 443765 -105924 184952 751863 827276 447023 382365 1085459 2097992
40311 2097992 2620994 2352470 1589005 769476 193985 72646 540781 1491457 2467188
40302 2467188 2873888 2478732 1761763 1602202 2405696 3617385 4324703 4276635 4008569
40293 4008569 3981477 4013309 3729093 3193588 2764984 2546367 2352041 2127668 2050563 2179692
40283 2179692 2283434 2132555 1815605 1657309 1890871 2487142 3285516 4196441 5148749
40274 5148749 5825910 5699370 4596816 3124888 2166169 1956684 2034755 2095271 2334019
40265 2334019 2760921 2831655 2268119 1736598 2030175 2888153 3358881 3161358 2903803 2971322
40255 2971322 3006769 2665018 2143807 1682804 1206498 824154 1035994 1932407 2708866 2569944
$$ packed form
40321B283354p78690j060899n49689K90876N66911P5413l80253o4658P03094J012533
40311B097992N23002k68524p63465q19529n75491j21339M68135R50676R75731
40302B467188M06700l95156p16969j59561Q03494J211689P07318m8068k68066
40293D008569k7092L1832k84216n35505m28604k18617j94326k24373p7105J29129
40283B179692J03742j50879l16950j58296K33562N96271P98374R10925R52308
40274E148749O77161j26540j102554j471928r58719k09485P8071O0516K38748
40265B334019M26902P0734n63536n31521K93577Q57978M70728j97523k57555O7519
40255B971322L5447l41751n21211m61003m76306l82344K11840Q96413P76459j38922
$$ plain form
40245 2569944 1761902 1154430 1105586 1319431 1567582 1890715 2195200 2299312 2400247 2907607
40235 2907607 3705476 4098351 3667806 2767794 2001313 1586908 1426824 1437813 1563091 1712995
40225 1712995 1910362 2294806 2837167 3279180 3485547 3576892 3547695 3079471 2027456 853917
40215 853917 235754 350810 802938 1116999 1053207 592793 -50108 -467687 -417097 -114237
40205 -114237 79708 172401 409873 696237 577027 -96249 -854382 -1145413 -912902 -477194
40195 -477194 -88880 222473 572348 1166761 2121895 3185428 3864851 3995633 3912749 3850459
40185 3850459 3501268 2535368 1323557 715206 1197359 2603962 4466323 6198156 7095149
40176 7095149 6791842 5850795 5411833 6054503 7318490 8384845 8801905 8503451 7711794
$$ packed form
40245B569944q08042o07472m8844K13845K48151L23133L04485J04112J00935N07360
40235B907607P97869L92875m30545r00012p66481m14405j60084J0989J25278J49904
40225A712995J97367L84444N42361M42013K06367R1345k9197m68224j052015j173539
40215H53917o18163J15056M52128L14061o3792m60414o42901m17579N0590L02860
40205a14237J93945R2693K37472K86364j19210o73276p58133k91031K32511M35708
40195d77194L88314L11353L49875N94413R55134J063533O79423J30782q2884o2290
40185C850459l49191r65900j211811o08351M82153J406603J862361J731833Q96993
40176G095149l03307r41047m38962O42670J263987J066355M17060k98454p91657
$$ plain form
40167 7711794 7062883 7232730 8011247 8213100 7017275 5063799 3717138 3510877 3840504
40158 3840504 3967843 3735500 3368685 3134501 3252455 3724833 4215435 4409346 4410724 4431001
40148 4431001 4266785 3628192 2887280 2817792 3460203 3876111 3326997 2211565 1490902
40139 1490902 1556568 2030792 2434610 2701209 3108556 3879815 4804301 5314076 5178799 5013468
40129 5013468 5625781 6841271 7555173 7137522 6205196 5693180 5747489 6000446 6400218
40120 6400218 7102922 7857554 8177682 8014605 7731028 7517674 7312439 7137186 6976852
40111 6976852 6461812 5287610 3913966 3207281 3307887 3449640 3047804 2389470 2031359
40102 2031359 2069775 2318792 2726798 3236669 3614000 3788863 4038213 4470337 4680138 4353361
$$ packed form
40167G711794o48911J69847P78517K01853j195825j953476j346661k06261L29627
40158C840504J27339k32343l66815k34184J17954M72378M90602J93911J378K0277
40148D431001j64216o38593p40912o9488O42411M15908n49114j115432p20663
40139A490902O5666M74224M03818K66599M07347P71259R24486N09775j35277j65331
40129E013468O12313J215490P13902m17651r32326n12016N4309K52957L99772
40120F400218P02704P54632L20128j63077k83577k13354k05235j75253j60334
40111F976852n15040j174202j373644p06685J00606J41753m01836o58334l58111
40102B031359L8416K49017M08006N09871L77331J74863K49350M32124K09801l26777
$$ plain form
40092 4353361 3890975 3887906 4208180 4196288 3730558 3407585 3578986 3840705 3760483 3551583
40082 3551583 3553877 3446351 2612061 1190576 162114 216227 961444 1524901 1641999 1795952
40072 1795952 2400092 3227647 3739591 3697742 3255599 2612434 1867035 1215830 995667 1315369
40062 1315369 1780230 1844908 1437153 992359 820537 717882 378315 -67819 -230739 -21860
40052 -21860 323752 725901 1366476 2275608 3188292 3908935 4435789 4594341 4014787 2775228
40042 2775228 1657568 1348684 1677618 2031037 2179694 2181304 1801334 771196 -462619
40033 -462619 -987332 -540501 210995 617419 692398 697106 721591 906886 1452914 2094953
40023 2094953 2191596 1725521 1589988 2344512 3253034 3245062 2409056 1759087 1777911 2011151
$$ packed form
40092D353361m62386l069L20274j1892m65730l22973J71401K61719q0222k08900
40082C551583K294j07526q34290j421485j028462N4113P45217N63457J17098J53953
40072A795952O04140Q27555N11944m1849m42143o43165p45399o51205k20163L19702
40062A315369M64861O4678m07755m44794j71822j02655l39567m46134j62920K08879
40052b1860L45612M02149O40575R09132R12684P20643N26854J58552n79554j239559
40042B775228j117660l08884L28934L53419J48657J610l79970j030138j233815
40033d62619n24713M46831P51496M06424P4979M708K4485J85295N46028O42039
40023B094953R6643m66075j35533P54524R08522p972q36006o49969J8824K33240
$$ plain form
40013 2011151 2045898 2082184 2338557 2511744 2169643 1373727 684868 690606 1534604 2715042
40003 2715042 3405733 3225086 2629549 2328322 2463515 2657460 2656270 2491068 2138321 1520438
39993 1520438 822950 358465 105463 -213996 -628627 -918587 -1064698 -1200443 -1154053 -625526
39983 -625526 122851 378221 -33407 -431574 -189678 553766 1325025 1920443 2285165 2310690
39973 2310690 2128193 2159277 2522586 2845114 3005772 3491721 4498943 5256295 4997973
39964 4997973 4212363 4052209 4673627 5041977 4417096 3205815 2162406 1510870 1189758
39955 1189758 1290531 1760381 2145789 2148534 2111012 2464226 2963743 3006195 2547155 2152119
39945 2152119 2160463 2323181 2350144 2320487 2356251 2320424 2119793 1958988 1977258 1949842 1732563
$$ packed form
40013B011151L4747L6286K56373J73187l42101p95916o88859N738Q43998J180438
40003B715042O90691j80647n95537l01227J35193J93945j190j65202l52747o17883
39993A520438o97488m64485k53002l19459m14631k89960j46111j35745M6390N28527
39983f25526P48377K55370m11628l98167K41896P43444P71259N95418L64722K5525
39973B310690j82497L1084L63309L22528J60658M85949J007222P57352k58322
39964D997973p85610j60154O21418L68350o24881j211281j043409o51536l21112
39955A189758J00773M69850L85408K745l7522L53214M99517M2452m59040l95036
39945B152119Q344J62718K6963k9657L5764l5827k00631j60805J8270k7416k17279
$$ plain form
39934 1732563 1705567 2257290 3016306 3222442 2839963 2630036 2958955 3208068 2732583 1828338
39924 1828338 1229345 1078879 993916 856819 909633 1204829 1554581 1969372 2603418 3276269
39914 3276269 3555937 3339568 2912402 2473288 2076170 1948439 2271905 2700715 2806303
39905 2806303 3041838 4449318 7211738 10379994 13422687 17051682 21649227 25569839
39897 25569839 26200363 22728694 17110781 12211799 9505289 8560163 8124586 7395819 6503058
39888 6503058 6016880 6086613 6254021 6178739 6154618 6553815 7053224 6905850 5883667 4531020
39878 4531020 3514463 3056735 2966948 2922645 2753695 2658842 3003435 3702669 4098718 3793501
39868 3793501 3269133 3171869 3272657 2822600 1808456 1085751 1179255 1661471 1936649 1990939
$$ packed form
39934A732563k6996N51723P59016K06136l82479k09927L28919K49113m75485r04245
39924A828338n98993j50466q4963j37097N2814K95196L49752M14791O34046O72851
39914C276269K79668k16369m27166m39114l97118j27731L23466M28810J05588
39905B806303K35535J407480K762420L168256L042693L628995M597545L920612
39897B5569839O30524l471669n617913m898982k706510r45126m35577p28767q92761
39888F503058m86178O9733J67408p5282k4121L99197M99409j47374j022183j352647
39878D531020j016557m57728q9787m4303j68950r4853L44593O99234L96049l05217
39868C793501n24368r7264J00788m50057j014144p22705R3504M82216K75178N4290
$$ plain form
39858 1990939 2022357 1875289 1310088 515739 -37444 -59216 478809 1432070 2366869 2635171
39848 2635171 1958120 856806 240233 575607 1531742 2292982 2182972 1249392 354927
39839 354927 409619 1371276 2314448 2620060 2641060 2897046 3136513 2790586 2022122 1592287
39829 1592287 1772004 2093978 2233173 2397731 2611371 2348351 1406744 601270 886727
39820 886727 2045026 2917779 2848369 2232275 1620597 1019049 379898 163376 852895 2202868
39810 2202868 3451857 4139325 4350858 4340047 4328973 4566878 5141058 5737648 5959534 5881079
39800 5881079 5959233 6423488 7095362 7802450 8700964 10319542 13550214 19117560 26226381
39791 26226381 31948429 33145125 29477086 23773796 19048784 15903837 13245611 10492502
$$ packed form
39858A990939L1418j47068n65201p94349n53183k1772N38025R53261R34799K68302
39848B635171o77051j101314o16573L35374R56135P61240j10010r33580q94465
39839C54927N4692R61657R43172L05612K1000K55986K39467l45927p68464m29835
39829A592287J79717L21974J39195J64558K13640k63020r41607q05474K85457
39820H86727J158299Q72753o9410o16094o11678o01548o39151k16522O89519J349973
39810B202868J248989O87468K11533j0811j1074K37905N74180N96590K21886p8455
39800E881079P8154M64255O71874P07088Q98514J618578L230672N567346P108821
39791B6226381N722048J196696l668039n703290m725012l144947k658226k753109
$$ plain form
39783 10492502 8079354 6400576 5353331 4744672 4337717 3676442 2600819 1734401 1724453
39774 1724453 2205004 2286551 1869891 1611535 1727412 1791652 1727793 2018380 2765403 3454202
39764 3454202 3908880 4686197 6319852 8994725 13071495 18745443 24634109 27832311
39756 27832311 26422358 21471238 15853037 11585993 8926557 7367681 6450317 5773570
39748 5773570 5108553 4626522 4563378 4747906 4832375 4731189 4398352 3531565 2109082 940261
39738 940261 955007 2020690 3092907 3503684 3508743 3572907 3730811 3771813 3559445 3033916
39728 3033916 2289270 1711708 1656230 1956324 2161002 2270910 2751147 3696515 4469432 4442511
39718 4442511 3813605 3462974 4166097 5999583 8285780 10131497 11396040 13191346 16920428
$$ packed form
39783A0492502k413148j678778j047245o08659m06955o61275j075623q66418r948
39774A724453M80551Q1547m16660k58356J15877O4240o3859K90587P47023O88799
39764C454202M54678P77317J633655K674873M076770N673948N888666L198202
39756B7832311j409953m951120n618201m267044k659436j558876r17364o76747
39748E773570o65017m82031o3144J84528Q4469j01186l32837q66787j422483j168821
39738I40261J4746J065683J072217M10777N059O4164J57904M1002k12368n25529
39728C033916p44646n77562n5478L00094K04678J09908M80237R45368P72917k6921
39718D442511o28906l50631P03123J833486K286197J845717J264543J795306L729082
$$ plain form
39709 16920428 22455220 27542578 29453562 27272266 22457856 17333338 13300500 10440259
39701 10440259 8358377 6941306 6223262 5897597 5404008 4544436 3699478 3288009 3248882
39692 3248882 3228048 3061425 2859611 2772410 2846503 2969272 2874512 2496130 2406096 3394713
39682 3394713 5328811 7072331 8174867 10020753 14178142 19731094 23457226 23060680
39674 23060680 19393469 15075247 11779644 9537844 7940173 6910439 6387865 6095248
39666 6095248 5837448 5610906 5362112 4995707 4613318 4368153 4082362 3414316 2479943
39657 2479943 1922040 2197209 3069841 3946816 4450964 4534070 4318712 4044979 3943127 3936071
39647 3936071 3683602 3144758 2800399 2936411 2990523 2241747 1079874 794912 1803458
$$ packed form
39709A6920428N534792N087358J910984k181296m814410n124518m032838k860241
39701A0440259k081882j417071p18044l25665m93589q59572q44958m11469l9127
39692C248882k0834j66623k01814q7201P4093J22769r4760l78382r0034R88617
39682C394713J934098J743520J102536J845886M157389N552952L726132l96546
39674B3060680l667211m318222l295603k241800j597671j029734n22574k92617
39666F095248k57800k26542k48794l66405l82389k45165k85791o68046r34373
39657B479943n57903K75169Q72632Q76975N04148Q3106k15358k73733j01852p056
39647C936071k52469n38844l44359J36012N4112p48776j161873k84962J008546
$$ plain form
39638 1803458 2821665 2448241 1072592 356016 1015066 2074014 2467386 2463460 2970134
39629 2970134 4076460 4997742 5179136 4815729 4370414 4094889 4031807 4086016 4051732 3852046
39619 3852046 3722077 3876002 4066496 3826159 3145614 2565651 2514563 2814219 2927671 2517049
39609 2517049 1746441 1221930 1589995 2924317 4477859 5278046 5018502 4196065 3430039
39600 3430039 2941579 2703608 2727753 3021564 3501432 4123820 4924523 5788471 6392709 6600057
39590 6600057 6765484 7394854 8582932 10097682 12003038 14706459 18012721 20461179
39582 20461179 20329422 17489645 13723459 10852941 9048667 7441320 5814358 4801477
39574 4801477 4679004 4978327 5313264 5637897 5626455 4905141 4135543 4621505 6323055
$$ packed form
39638A803458J018207l73424j375649p16576O59050J058948L93372l926N06674
39629B970134J106326R21282J81394l63407m45315k75525o3082N4209l4284j99686
39619C852046j29969J53925J90494k40337o80545n79963n1088K99656J13452m10622
39609B517049p70608n24511L68065J334322J553542Q00187k59544q22437p66026
39600C430039m88460k37971K4145K93811M79868O22388Q00703Q63948O04238K07348
39590F600057J65427O29370J188078J514750J905356K703421L306262K448458
39582B0461179j31757k839777l766186k870518j804274j607347j626962j012881
39574D801477j22473K99323L34937L24633j1442p21314p69598M85962J701550
$$ plain form
39565 6323055 7536465 7316581 6915986 7773808 9442706 11025520 13399168 17835649 23031826
39556 23031826 25885331 25314284 23220916 21365412 19396966 16727672 14407930 13851430
39548 13851430 14919908 16388582 17505983 18454019 20185349 24197530 31292220 40318555
39540 40318555 49752977 60626813 75056853 90429745 98090664 91198628 72754966
39533 72754966 52853863 38588869 29516356 22454771 16791088 13660194 12805564 12604510
39525 12604510 12052515 11168524 10186836 9421272 9287784 9722494 10244415 11023746 12861727
39516 12861727 15517668 17202901 16614255 14507366 12364910 10484778 8454888 6623560
39508 6623560 5758935 5742645 5814565 5787780 5953596 6129913 5926229 5687758 5996953 6375406
$$ packed form
39565F323055J213410k19884m00595Q57822J668898J582814K373648M436481N196177
39556B3031826K853505n71047k093368j855504j968446k669294k319742n56500
39548A3851430J068478J468674J117401R48036J731330M012181P094690R026335
39540D0318555R434422J0873836J4430040J5372892P660919o892036j8443662
39533G2754966j9901103j4264994r072513p061585n663683l130894q54630k01054
39525A2604510n51995q83991r81688p65564j33488M34710N21921P79331J837981
39516A2861727K655941J685233n88646k106889k142456j880132k029890j831328
39508F623560q64625j6290P1920k6785J65816J76317k03684k38471L09195L78453
$$ plain form
39498 6375406 5730218 4183752 3241973 3786945 4921307 5268055 4557450 3418498 2386844
39489 2386844 1780548 1968203 2991128 4163505 4639293 4290093 3676766 3330838 3376386
39480 3376386 3640615 3789594 3534952 3028907 2861064 3327506 3927324 4011597 3733267 3781767
39470 3781767 4222482 4266425 3413230 2244936 1670829 1803955 2099218 2306313 2634119
39461 2634119 3045906 3095647 2661202 2240247 2165349 2041718 1476676 964626 1349622 2550418
39451 2550418 3528450 3590612 3093129 2702837 2616244 2820544 3465476 4397577 4799998 4030513
39441 4030513 2618144 1738391 1780959 2125736 2320317 2641669 3222783 3454710 2876600
39432 2876600 2090319 2042872 2745537 3483907 4060663 4910699 6013496 6727536 6981460
$$ packed form
39498F375406o45188j546466r41779N44972J134362L46748p10605j138952j031654
39489B386844o06296J87655J022925J172377M75788l49200o13327l45928M5548
39480C376386K64229J48979k54642n06045j67843M66442N99818Q4273k78330M8500
39470C781767M40715M3943q53195j168294n74107J33126K95263K07095L27806
39461B634119M11787M9741m34445m20955p4898j23631n65042n12050L84996J200796
39451B550418R78032O2162m97483l90292q6593K04300O44932R32101M02421p69485
39441D030513j412369q79753M2568L44777J94581L21352N81114K31927n78110
39432B876600p86281m7447P02665P38370N76756Q50036J102797P14040K53924
$$ plain form
39423 6981460 7611948 8994151 10342191 11161676 12391628 14975493 18372675 22331001
39415 22331001 29308310 42073789 57984789 68412898 66353037 53627469 38653678
39408 38653678 27957021 21923731 18001945 14846293 12401323 10396211 8607829 7499433
39400 7499433 7249402 6966365 5940735 4823565 4440246 4248451 3271410 1924117 1446660
39391 1446660 1839818 1841544 956171 145142 262602 983046 1641250 2103816 2358561 2136936
39381 2136936 1475356 949448 879294 919924 824425 922452 1376546 1658483 1362272 945171
39371 945171 1002484 1301773 1233825 817518 534855 492056 487809 653206 1215243 1762334
39361 1762334 1589164 801029 284106 447994 758024 746737 734167 1136907 1718689 2087058
$$ packed form
39423F981460O30488J382203J348040Q19485J229952K583865L397182L958326
39415B2331001O977309J2765479J5911000J0428109k059861j2725568j4973791
39408C8653678j0696657o033290l921786l155652k444970k005112j788382j108396
39400G499433k50031k83037j025630j117170l83319j91795r77041j347293m77457
39391A446660L93158J726q85373q11029J17460P20444O58204M62566K54745k21625
39381B136936o61580n25908p0154M0630r5499R8027M54094K81937k96211m17101
39371I45171N7313K99289o7948m16307k82663m2799m247J65397N62037N47091
39361A762334j73170p88135n16923J63888L10030j1287j2570M02740N81782L68369
$$ plain form
39351 2087058 2440420 3153216 3891244 3836925 2794568 1528882 885192 972087 1383145
39342 1383145 1909070 2729680 3966561 5309278 6303283 7038896 8281543 10531085 12978008
39333 12978008 13919013 12519250 9801072 7512986 6355142 5799130 5289475 4815582 4363614
39324 4363614 3716250 3087178 3161595 4009432 4633784 4284352 3703101 4212469 5855879
39315 5855879 7394966 8112268 8589981 9373660 9784416 8765971 6402967 3874132 2126799
39306 2126799 1212400 790549 636601 571351 421371 255845 310219 515578 452219 -8421
39296 -8421 -328245 103257 1153020 2021000 2072007 1372257 492465 49707 381802 1308432
39286 1308432 2107156 2035909 1095295 89598 -239524 71941 564950 1131040 1987222
$$ packed form
39351B087058L53362P12796P38028n4319j042357j265686o43690Q6895M11058
39342A383145N25925Q20610J236881J342717R94005P35613J242647K249542K446923
39333A2978008R41005j399763k718178k288086j157844n56012n09655m73893m51968
39324D363614o47364o29072P4417Q47837O24352l49432n81251N09368J643410
39315E855879J539087P17302M77713P83679M10756j018445k363004k528835j747333
39306B126799r14399m21851j53948o5250j49980j65526N4374K05359o3359m60640
39296h421l19824M31502J049763Q67980N1007o99750q79792m42758L32095R26630
39286A308432P98724p1247r40614j005697l29122L11465M93009N66090Q56182
$$ plain form
39277 1987222 2999624 3580116 3388587 2701364 1892416 988150 54337 -384567 165478
39268 165478 1416600 2500766 2881676 2705375 2332320 1962599 1737382 1771324 1956837
39259 1956837 2062589 2113698 2347765 2726640 2891534 2757192 2735489 3086138 3382864 3001527
39249 3001527 1962350 951195 586152 911817 1528344 1961193 1935884 1531471 1143621
39240 1143621 1202227 1846659 2801247 3495801 3426695 2642751 1849585 1742140 2201624 2470429
39230 2470429 2170394 1736484 1690102 1948356 2165873 2333909 2582868 2703336 2406343 1901997
39220 1901997 1684259 1786971 1762245 1442584 1239281 1508549 1988444 2099558 1588277 689805
39210 689805 -184495 -752772 -954864 -897853 -732674 -562930 -457156 -466203 -558565 -605402
$$ packed form
39277A987222J012402N80492j91529o87223q08948r04266r33813m38904N50045
39268A65478J251122J084166L80910j76301l73055l69721k25217L3942J85513
39259A956837J05752N1109K34067L78875J64894j34342k1703L50649K96726l81337
39249C001527j039177j011155l65043L25665O16527M32849k5309m04413l87850
39240A143621N8606O44432R54588O94554o9106p83944p93166j07445M59484K68805
39230B470429l00035m33910m6382K58254K17517J68036K48959J20468k96993n04346
39220A901997k17738J02712k4726l19661k03303K69268M79895J11114n11281q98472
39210F89805q74300n68277k02092N7011J65179J69744J05774r047r2362m6837
$$ plain form
39200 -605402 -506516 -277080 17994 295052 385617 134717 -333397 -636570 -540917 -165390
39190 -165390 291869 742687 983867 647695 -324494 -1432506 -2144402 -2420959 -2436811 -2135439
39180 -2135439 -1493365 -919053 -844073 -1091857 -1170329 -1042597 -1073703 -1345796 -1614492 -1870705
39170 -1870705 -2320838 -2806257 -2876112 -2514597 -2177729 -1985889 -1520029 -639601 117526 294029
39160 294029 178766 361966 1022233 1954930 2907159 3561443 3571804 3001283 2448499 2395823
39150 2395823 2642542 2649616 2225670 1642638 1307308 1523517 2315014 3262861 3764064 3642784
39140 3642784 3258749 2892895 2392840 1607058 748219 48486 -550735 -1054008 -1159756
39131 -1159756 -733196 -165266 165545 457229 1036968 1639829 1681688 1092806 365425 -139053
$$ packed form
39200f05402R8886K29436K95074K77058R0565k50900m68114l03173R5653L75527
39190a65390M57259M50818K41180l36172r72189j108012p11896k76557j5852L01372
39180b135439O42074N74312P4980k47784p8472J27732l1106k72093k68696k56213
39170a870705m50133m85419o9855L61515L36868J91840M65860Q80428P57127J76503
39160B94029j15263J83200O60267R32697R52229O54284J0361n70521n52784n2676
39150B395823K46719P074m23946n83032l35330K16209P91497R47847N01203j21280
39140C642784l84035l65854n00055p85782q58839o99733n99221n03273j05748
39131a159756M26560N67930L30811K91684N79739O02861M1859n88882p27381n04478
$$ plain form
39121 -139053 -452244 -626455 -598267 -496439 -677098 -1275603 -1936736 -2123187 -1640474 -882117
39111 -882117 -572956 -1081823 -1877353 -1897176 -652627 1216806 2639163 3113433 2866880
39102 2866880 2381381 2103729 2364568 3186547 4242570 5173425 5749585 5647236 4555441
39093 4555441 2836794 1600605 1591230 2297426 2624586 2138606 1186480 198342 -492086
39084 -492086 -482265 258098 940978 716911 -168253 -654903 -254761 532547 1123375 1394111
39074 1394111 1302259 809657 373588 718437 1798697 2658919 2644536 2117494 1643585 1151871
39064 1151871 386426 -376010 -635317 -329278 281890 1061943 1920220 2638558 3201634
39055 3201634 3955902 5001229 5824051 6157316 6932407 9554824 14039525 18378544 20105053
$$ packed form
39121a39053l13191j74211K8188J01828j80659n98505o61133j86451M82713P58357
39111h82117L09161n08867p95530j9823J244549J869433J422357M74270k46553
39102B866880m85499k77652K60839Q21979J056023R30855N76160j02349j091795
39093D555441j718647j236189r375P06196L27160m85980r52126r88138o90428
39084d92086R821P40363O82880k24067q85164m86650M00142P87308N90828K70736
39074A394111r1852m92602m36069L44849J080260Q60222j4383n27042m73909m91714
39064A151871p65445p62436k59307L06039O11168P80053Q58277P18338N63076
39055C201634P54268J045327Q22822L33265P75091K622417M484701M339019J726509
$$ plain form
39046 20105053 18401592 14637105 11012024 8763296 7590335 6640933 5736621 5326544
39038 5326544 5423281 5254564 4295114 3156795 2882223 3530278 4029912 3502098 2280280
39029 2280280 1403851 1380237 1756001 1855441 1639848 1623953 2037096 2392135 2071402 1142328
39019 1142328 315324 173120 693677 1451837 1990861 2044962 1740363 1601574 2061483 2969622
39009 2969622 3886237 4770190 5901859 7121537 7736961 7436300 6852276 6918832 7933043
39000 7933043 9386645 10377086 10092471 8389298 6145959 4617301 4171730 4060197 3630130
38991 3630130 3211539 3429157 4171840 4772106 4830906 4366834 3503191 2545456 2069306 2353948
38981 2353948 2911067 3067424 2814206 2606947 2583523 2556228 2583757 2915719 3445731 3818591
$$ packed form
39046B0105053j703461l764487l625081k248728j172961r49402r04312m10077
39038E326544R6737j68717r59450j138319k74572O48055M99634n27814j221818
39029B280280q76429k3614L75764R9440k15593j5895M13143L55039l20733r29074
39019A142328q27004j42204N20557P58160N39024N4101l04599j38789M59909R08139
39009B969622R16615Q83953J131669J219678O15424l00661n84024O6556J014211
39000G933043J453602R90441k84615j703173k243339j528658m45571j11533m30067
38991C630130m18591K17618P42683O00266N8800m64072q63643r57735m76150K84642
38981B353948N57119J56357k53218k07259k3424k7295K7529L31962N30012L72860
$$ plain form
38971 3818591 4059784 4518622 5144015 5365524 4822508 3793676 2835062 2382630 2697883
38962 2697883 3683204 4635856 4704633 3865481 3089699 3272344 4260335 5235139 5902549 6956731
38952 6956731 9211637 12348585 14770161 14970313 13022755 10400616 8336163 6865098
38944 6865098 5613190 4759276 4600685 4705512 4336612 3499106 2804876 2437751 2036939
38935 2036939 1558689 1424337 1700955 1920661 1947368 2303986 3291419 4376349 4847282
38926 4847282 4626001 4095045 3556800 3223396 3358218 4009474 4818171 5404623 5799514
38917 5799514 6299369 7059051 7981086 8910369 9942633 11652337 14736447 18954454 22588536
38908 22588536 23661261 21848042 18678520 15806982 13742466 12394819 11970080 12704642
$$ packed form
38971C818591K41193M58838O25393K21509n43016j028832r58614m52432L15253
38962B697883R85321R52652O8777q39152p75782J82645R87991R74804O67410J054182
38952F956731K254906L136948K421576K00152j947558k622139k064453j471065
38944F865098j251908q53914j58591J04827l68900q37506o94230l67125m00812
38935B036939m78250j34352K76618K19706K6707L56618R87433J084930M70933
38926D847282k21281n30956n38245l33404J34822O51256Q08697N86452L94891
38917E799514M99855P59682R22035R29283J032264J709704L084110M218007L634082
38908B2588536J072725j813219l169522k871538k064516j347647m24739P34562
$$ plain form
38900 12704642 14208527 15679769 16560656 16643768 15847055 14287994 12390773 10611303 9154902
38891 9154902 8048452 7257664 6698926 6422112 6708826 7585342 8428548 8704297 8927852
38882 8927852 10049403 12090443 14608045 18406665 24892063 32934091 38196891 37251392
38874 37251392 31419981 25153941 21549328 20959381 22806349 26188921 28816432 27950848
38866 27950848 23428042 18157754 14733491 12837059 10800725 8358432 6579844 5962684
38858 5962684 5963761 6103824 6428999 6883886 7016271 6483728 5508498 4775052 4931057 5959225
38848 5959225 7013682 7286713 7093983 7556564 9093660 10894646 12111260 12871641 13861898
38839 13861898 15772647 19555638 26078294 34488908 41674574 44603089 43018484 38989314
$$ packed form
38900A2704642J503885J471242Q80887Q3112p96713j559061j897221j779470j456401
38891I154902j106450p90788n58738k76814K86714Q76516Q43206K75749K23555
38882H927852J121551K041040K517602L798620O485398Q042028N262800r45499
38874C7251392n831411o266040l604613n89947J846968L382572K627511q65584
38866B7950848m522806n270288l424263j896432k036334k442293j778588o17160
38858E962684J077J40063L25175M54887J32385n32543r75230p33446J56005J028168
38848E959225J054457K73031j92730M62581J537096J800986J216614P60381R90257
38839A3861898J910749L782991O522656Q410614P185666K928515j584605m029170
$$ plain form
38831 38989314 34261717 29217180 24131501 19891702 16970260 14757838 12551287 10491947
38823 10491947 8961809 7673671 6046690 4137852 2578704 1733493 1391944 1201649
38815 1201649 985657 653982 193900 -126199 187155 1339049 2802435 3578187 3069924
38806 3069924 1693969 473986 20092 107739 275025 445245 715679 924893 909847
38797 909847 961772 1460337 2139749 2319938 1917988 1616057 1814594 1985717 1448415 392832
38787 392832 -292670 -6142 1076743 2313878 3113516 3294056 3197047 3352420 3862588
38778 3862588 4253449 4069794 3419965 2770733 2427323 2411190 2625165 2904634 3081024 3181221
38768 3181221 3369972 3567788 3439459 2945738 2524062 2471746 2607475 2897388 3870544 5843997
$$ packed form
38831C8989314m727597n044537n085679m239799k921442k212422k206551k059340
38823A0491947j530138j288138j626981j908838j559148q45211l41549j90295
38815A201649k15992l31675m60082l20099L13354J151894J463386P75752n08263
38806C069924j375955j219983m53894Q7647J67286J70220K70434K09214j5046
38797I09847N1925M98565O79412J80189m01950l01931J98537J71123n37302j055583
38787C92832o85502K86528J082885J237135P99638J80540r7009J55373N10168
38778C862588L90861j83655o49829o49232l43410j6133K13975K79469J76390J00197
38768C181221J88751J97816j28329m93721m21676n2316J35729K89913R73156J973453
$$ plain form
38758 5843997 8226534 10305996 12317059 14977229 18509602 23157428 29949654 39058970
38750 39058970 47440622 50536050 47637978 43788317 44369644 48678816 50831021 46682471
38742 46682471 37895646 29057424 22840260 18942396 16208531 14142120 12690857 11731801
38734 11731801 11004071 10206867 9251060 8550337 8668003 9411096 9726795 8879331 7337258
38725 7337258 6094385 5505552 5268914 5194295 5362331 5654467 5686864 5263089 4570597 3954984
38715 3954984 3738697 4125911 4975541 5749284 5954299 5584689 4969366 4361236 3882754
38706 3882754 3673974 3836978 4354649 5168096 6062189 6401836 5506990 3606242 1903623
38697 1903623 1254271 1271353 1260997 1431231 2344176 3636721 4361686 4457948 4801435 5694410
$$ packed form
38758E843997K382537K079462K011063K660170L532373M647826O792226R109316
38750C9058970Q381652L095428k898072l849661N81327M309172K152205m148550
38742D6682471q786825q838222o217164l897864k733865k066411j451263r59056
38734A1731801p27730p97204r55807p00723J17666P43093L15699q47464j542073
38725G337258j242873n88833k36638p4619J68036K92136L2397m23775o92492o15613
38715C954984k16287L87214Q49630P73743K05015l69610o15323o08130m78482
38706C882754k08780J63004N17671Q13447Q94093L39647q94846j900748j702619
38697A903623o49352J7082j0356J70234R12945J292545P24965R6262L43487Q92975
$$ [...]
##END NTUPLES=NMR SPECTRUM
##END=
