##TITLE=31Pdec_DE-163rm_4h
 , 64 sc
 8.7.2026
##JCAMPDX= 6.0         $$ Bruker NMR JCAMP-DX V2.0
##DATA TYPE= NMR SPECTRUM
##DATA CLASS= NTUPLES
##ORIGIN= UXNMR, Bruker Analytische Messtechnik GmbH
##OWNER= root
$$ XWIN-NMR		Version 3.5
$$ Wed Jul  8 14:39:31 2026 Russian Standard Time (UT+4h)  she@DPX200
##.OBSERVE FREQUENCY= 81.013821
##.OBSERVE NUCLEUS= ^31P
##.ACQUISITION MODE= SIMULTANEOUS
##.ACQUISITION SCHEME= undefined
##.AVERAGES= 64
##.DIGITISER RES= 17
##SPECTROMETER/DATA SYSTEM= spect
##.PULSE SEQUENCE= zgpg30
##.SOLVENT NAME= DMSO
##.SHIFT REFERENCE= (INTERNAL, DMSO, 0, 197.392)
##AUDIT TRAIL= $$ (NUMBER, WHEN, WHO, WHERE, WHAT)
$$ ##TITLE= Audit trail, XWIN-NMR		Version 3.5
$$ ##JCAMPDX= 5.01
$$ ##ORIGIN= Bruker BioSpin GmbH
$$ ##OWNER= she
$$ F:/spectra/data/she/nmr/P31/2/pdata/1/auditp.txt
$$ ##AUDIT TRAIL=  $$ (NUMBER, WHEN, WHO, WHERE, WHAT)
(   1,<2026-07-08 14:38:01.78 +0400>,<she>,<DPX200>,
      <created by zg, POWCHK disabled, PULCHK disabled
       configuration hash MD5:
       00 E9 B6 7A A2 85 ED C7 34 08 36 98 17 FE 4E 26
       data hash MD5: 32K
       D5 54 09 1D 01 7D C1 3B 25 FB C0 4D 10 3B E7 77>)
(   2,<2026-07-08 14:38:09.78 +0400>,<she>,<DPX200>,
      <Start of raw data processing
       efp BC_mod = 2 LB = 1.5 FT_mod = 6 PKNL = 1 PHC0 = 1889.359 PHC1 = 274.0983 SI = 64K 
       data hash MD5: 64K
       13 11 DA AD 5D CD A6 C3 14 B2 92 8E 20 F3 FB 9C>)
(   3,<2026-07-08 14:38:40.84 +0400>,<she>,<DPX200>,
      <pk PHC0 = 100.3531 PHC1 = -299.0005 
       data hash MD5: 64K
       28 40 FB F2 48 C7 66 53 4B 2B 3F 86 B7 71 F5 3C>)
$$ ##END=
$$ 
$$ hash MD5
$$ 3E 0F 8A FA 99 2F 7C 58 99 F5 3D A3 B3 EA 0B C4
##$RELAX= 
##$RELAX= 
##$RELAX= 
##$RELAX= 
##$RELAX= 
##$RELAX= 
##$RELAX= 
##$RELAX= 
$$ Bruker specific parameters
$$ --------------------------
##$DU= <F:/spectra>
##$EXPNO= 2
##$NAME= <P31>
##$PROCNO= 1
##$TYPE= <nmr>
##$USER= <she>
##$AMP= (0..31)
100 100 100 100 100 100 100 100 100 100 100 100 100 100 100 100 100 100 
100 100 100 100 100 100 100 100 100 100 100 100 100 100 
##$AQSEQ= 0
##$AQ_mod= 1
##$AUNM= <au_zg>
##$AUTOPOS= <>
##$BF1= 81.014009
##$BF2= 200.13
##$BF3= 200.13
##$BF4= 200.13
##$BF5= 200.13
##$BF6= 200.13
##$BF7= 200.13
##$BF8= 200.13
##$BYTORDA= 1
##$CFDGTYP= 0
##$CFRGTYP= 5
##$CHEMSTR= <none>
##$CNST= (0..31)
1 1 145 1 1 1 1 1 1 1 1 1 1 1 1 1 1 1 1 1 1 1 1 1 1 1 1 1 1 1 1 1 
##$CPDPRG= <waltz16>
##$CPDPRG1= <>
##$CPDPRG2= <waltz16>
##$CPDPRG3= <>
##$CPDPRG4= <mlev>
##$CPDPRG5= <mlev>
##$CPDPRG6= <mlev>
##$CPDPRG7= <mlev>
##$CPDPRG8= <mlev>
##$CPDPRGB= <>
##$CPDPRGT= <>
##$D= (0..31)
0 1 0 0 0 0 0 0 0 0.06 0 0.03 2e-05 3e-06 0 0 0.0002 0 0 0 0 0 0 0 0 0 
0 0 0 0 0 0 
##$DATE= 1783507081
##$DBL= (0..7)
120 120 120 11 120 120 24 19 
##$DBP= (0..7)
150 150 150 150 150 150 150 150 
##$DBP07= 0
##$DBPNAM0= <>
##$DBPNAM1= <>
##$DBPNAM2= <>
##$DBPNAM3= <>
##$DBPNAM4= <>
##$DBPNAM5= <>
##$DBPNAM6= <>
##$DBPNAM7= <>
##$DBPOAL= (0..7)
0.5 0.5 0.5 0.5 0.5 0.5 0.5 0.5 
##$DBPOFFS= (0..7)
$$ [...]
##$SUBNAM3= <"">
##$SUBNAM4= <"">
##$SUBNAM5= <"">
##$SUBNAM6= <"">
##$SUBNAM7= <"">
##$SUBNAM8= <"">
##$SUBNAM9= <"">
##$SW= 400.765351723535
##$SWIBOX= (0..15)
0 1 3 0 0 0 0 0 0 0 0 0 0 0 0 0 
##$SW_h= 32467.5324675325
##$TD= 32768
##$TD0= 1
##$TE= 0
##$TE2= 300
##$TE3= 300
##$TEG= 300
##$TL= (0..7)
0 120 53 12 22 120 120 120 
##$TP= (0..7)
150 150 150 150 150 150 150 150 
##$TP07= 0
##$TPNAME0= <>
##$TPNAME1= <>
##$TPNAME2= <>
##$TPNAME3= <>
##$TPNAME4= <>
##$TPNAME5= <>
##$TPNAME6= <>
##$TPNAME7= <>
##$TPOAL= (0..7)
0.5 0.5 0.5 0.5 0.5 0.5 0.5 0.5 
##$TPOFFS= (0..7)
0 0 0 0 0 0 0 0 
##$TUNHIN= 0
##$TUNHOUT= 0
##$TUNXOUT= 0
##$USERA1= <user>
##$USERA2= <user>
##$USERA3= <user>
##$USERA4= <user>
##$USERA5= <user>
##$V9= 5
##$VALIST= <valist>
##$VCLIST= <CCCCCCCCCCCCCCC>
##$VD= 0
##$VDLIST= <DDDDDDDDDDDDDDD>
##$VPLIST= <PPPPPPPPPPPPPPP>
##$VTLIST= <TTTTTTTTTTTTTTT>
##$WBST= 1024
##$WBSW= 4
##$XGAIN= (0..3)
0 0 0 0 
##$XL= 0
##$YL= 0
##$YMAX_a= 58923
##$YMIN_a= -53640
##$ZGOPTNS= <>
##$ZL1= 120
##$ZL2= 120
##$ZL3= 120
##$ZL4= 120
##$ABSF1= 0
##$ABSF2= 0
##$ABSG= 0
##$ABSL= 0
##$ALPHA= 0
##$AQORDER= 0
##$ASSFAC= 0
##$ASSFACI= 0
##$ASSFACX= 0
##$ASSWID= 0
##$AUNMP= <proc_1d>
##$AZFE= 0.1
##$AZFW= 0.5
##$BCFW= 0
##$BC_mod= 2
##$BYTORDP= 0
##$COROFFS= 0
##$CY= -3
##$DATMOD= 1
##$DC= 0
##$DFILT= <>
##$DTYPP= 0
##$F1P= 0
##$F2P= 0
##$FCOR= 1
##$FTSIZE= 65536
##$FT_mod= 6
##$GAMMA= 0
##$GB= 0
##$INTBC= 1
##$INTSCL= 9.790993e-09
##$ISEN= 30
##$LB= 1.5
##$LEV0= 0
##$LPBIN= 0
##$MAXI= 10000
##$MC2= 0
##$MEAN= 0
##$ME_mod= 0
##$MI= 50
##$NCOEF= 0
##$NC_proc= -7
##$NLEV= 6
##$NOISF1= 182.463
##$NOISF2= 159.3651
##$NSP= 0
##$NTH_PI= 0
##$NZP= 0
##$OFFSET= 197.3918
##$PC= 4
##$PHC0= 1989.712
##$PHC1= -24.90219
##$PH_mod= 1
##$PKNL= yes
##$PPARMOD= 0
##$PSCAL= 0
##$PSIGN= 0
##$REVERSE= no
##$SF= 81.014063255964
##$SI= 65536
##$SIGF1= 159.3651
##$SIGF2= -187.1042
##$SINO= 113.3802
##$SIOLD= 16384
##$SREGLST= <1H.CDCl3>
##$SSB= 0
##$STSI= 65536
##$STSR= 0
##$SW_p= 32467.5324675325
##$SYMM= 0
##$S_DEV= 0
##$TDeff= 32768
##$TDoff= 0
##$TI= <>
##$TILT= no
##$TM1= 0
##$TM2= 0
##$TOPLEV= 0
##$USERP1= <user>
##$USERP2= <user>
##$USERP3= <user>
##$USERP4= <user>
##$USERP5= <user>
##$WDW= 1
##$XDIM= 65536
##$YMAX_p= 480926016
##$YMIN_p= -151636494
$$ End of Bruker specific parameters
$$ ---------------------------------
##NTUPLES= NMR SPECTRUM
##VAR_NAME=  FREQUENCY,     SPECTRUM/REAL,   SPECTRUM/IMAG
##SYMBOL=    X,             R,               I
##VAR_TYPE=  INDEPENDENT,   DEPENDENT,       DEPENDENT
##VAR_FORM=  AFFN,          ASDF,            ASDF
##VAR_DIM=   65536,         65536,           65536
##UNITS=     HZ,            ARBITRARY UNITS, ARBITRARY UNITS
##FACTOR=    0.49542278885378, 1,            1
##FIRST=     15991.5117654749, 0,            0
##LAST=      -16476.0207020576, 0,           0
##MIN=       -16476.0207020576, -151636494,  0
##MAX=       15991.5117654749, 480926016,    0
$$ Real data points
##PAGE= N=1
##DATA TABLE= (X++(R..R)), XYDATA
$$ [...]
46049d451708m50113K24428J086320J525747J290220Q47364Q07792Q45862K1798
$$ -4451708 -4901821 -4677393 -3591073 -2065326 -775106 72258 880050 1725912 1747710
46040A747710j512957k277889j557366m70748m0858M27218J688827K589721J622816
$$ 1747710 234753 -2043136 -3600502 -4071250 -4112108 -3684890 -1996063 593658 2216474
46031B216474l98948j280350o35297q3598l63626l64492N90393J437660J153225
$$ 2216474 1817526 537176 -98121 -181719 -545345 -909837 -319444 1118216 2271441
46022B271441L20476l5498o2177n43984j467976j985995j490458k58858P63243
$$ 2271441 2591917 2556419 2494242 1950258 482282 -1503713 -2994171 -3253029 -2489786
46013b489786P36394k02214r93867r71765o35063m65532J93278J792606K888992
$$ -2489786 -1753392 -1955606 -2949473 -3921238 -4556301 -5021833 -4828555 -3035949 -146957
46004a46957J739724o78211j479238J2907J248407L34780j312989j529564o21258
$$ -146957 1592767 914556 -564682 -551775 696632 1031412 -281577 -1811141 -2432399
45995b432399k56886o43649p79154n27411n31164o54013k06720O56147J156036
$$ -2432399 -2689285 -3332934 -4112088 -4639499 -5170663 -5824676 -6031396 -5375249 -4219213
45986d219213J059302M33423r91620k784101l039872n77590K663628L543301J832642
$$ -4219213 -3159911 -2726488 -3718108 -6502209 -9542081 -10119671 -7456043 -3912742 -2080100
45977b080100K61022M20971R58390M00378m97284m32391J73781P7121p35733j252706
$$ -2080100 -1819078 -1398107 -439717 -39339 -536623 -969014 -795233 -718112 -1453845 -2706551
45967b706551r91641k68958N48485J201791J412216J231730J034110P50998j36907
$$ -2706551 -3698192 -3967150 -3418665 -2216874 -804658 427072 1461182 2212180 2075273
45958B075273j400760j814403p98078N96087J143378J006876R39047Q42387K83316
$$ 2075273 674513 -1139890 -1937968 -1341881 -198503 808373 1747420 2589807 2873123
45949B873123l07353k57502M4206k13092p32483o08485o4542j54930p84267o79822
$$ 2873123 2565770 2308268 2352474 2139382 1406899 798414 733872 578942 -205325 -885147
45939h85147L46044P53783l37756j512209r13833J177416K760890K521785Q18420
$$ -885147 -539103 214680 -123076 -1635285 -2549118 -1371702 1389188 3910973 4729393
45930D729393j239757k624678k593818j197478L57008P42578M0114n14344l26204
$$ 4729393 3489636 864958 -1728860 -2926338 -2569330 -1826752 -1786638 -2300982 -2627186
45921b627186m8418j76828j20783O46173J371052R66429k74851r66530n15463
$$ -2627186 -2675604 -2852432 -2973215 -2327042 -955990 10439 -264412 -1230942 -1746405
45912a746405K72534N82722O29365R06533J169418P70634l92126j735563k514408
$$ -1746405 -1473871 -891149 -261784 644749 1814167 2584801 2192675 457112 -2057296
45903b057296k199911p57108J072315K136538J928143J009795J87653k68065l82997
$$ -2057296 -4257207 -5014315 -3942000 -1805462 122681 1132476 1320129 1052064 669067
45894F69067k02461j58120q24934j679732j151194J051405K716271J780783n88291
$$ 669067 466606 308486 -516448 -2196180 -3347374 -2295969 420302 2201085 1612794
45885A612794j485597l85737M94179j855l32547P49298J931184J559915K68237
$$ 1612794 127197 -258540 235639 233784 -98763 650535 2581719 4141634 4409871
45876D409871l86461m56396q48450j177510n15962M17782N5152j258335j453685
$$ 4409871 4023410 3567014 2718564 1541054 1025092 1442874 1498026 239691 -1213994
45867a213994R0695J543621J383258M63911L78504J028994J016969j64714j381265
$$ -1213994 -1123299 420322 1803580 2267491 2645995 3674989 4691958 4527244 3145979
45858C145979j269093J13673J221000O77411j001561j823815p89376P27079P97022
$$ 3145979 1876886 1990559 3211559 3888970 2887409 1063594 274218 1001297 1798319
45849A798319n17582j532837j360661o05185J00148P05754Q25142j76740j692523
$$ 1798319 1280737 -252100 -1612761 -2217946 -2117798 -1412044 -586902 -763642 -2456165
45840b456165j936310k86557J600637J907091R49311L96135Q46608J200717K71303
$$ -2456165 -4392475 -4679032 -3078395 -1171304 -221993 174142 1020750 2221467 2492770
45831B492770j634700k841395j986085K70920J606228P38243p35844l74596J620252
$$ 2492770 858070 -1983325 -3969410 -3698490 -2092262 -1354019 -2089863 -2464459 -844207
45822h44207K650223J500961j63486p60510j128120k474199l737324l014199o31064
$$ -844207 1806016 3306977 3143491 2382981 1254861 -1219338 -4956662 -7970861 -8601925
45813h601925J243921J614040J432088J502386J370623O12064k01785m08493j80333
$$ -8601925 -7358004 -5743964 -4311876 -2809490 -1438867 -826803 -1028588 -1437081 -1617414
45804a617414J5414K53932R09836J837129K197917J272789n10615j645435j167397
$$ -1617414 -1602000 -1348068 -438232 1398897 3596814 4869603 4358988 2713553 1546156
45795A546156n1855j22807j515203k380270j515604M036O23832N07968P77535
$$ 1546156 1494301 1371494 -143709 -2523979 -4039583 -4035547 -3411715 -2903747 -2126212
45786b126212J507116J810585J314435L59062p45355j612071j546205n17305K64716
$$ -2126212 -619096 1191489 2505924 2864986 2119631 507560 -1038645 -1555950 -1291234
45777a291234j35829r42785q70988k0520O40656Q68141R16104O46153K66761Q12166
$$ -1291234 -1427063 -2369848 -3240836 -3261356 -2620700 -1752559 -836455 -190302 76459 888625
45767H88625K179272K085686o71104l253299k191770J073226J746635j243618
$$ 888625 3067897 5153583 4482479 1229180 -962590 110636 1857271 613653
45759F13653l644233k263792P88240J979785J200502M16462R4646m24410q43036
$$ 613653 -3030580 -5294372 -4506132 -2526347 -1325845 -909383 -814737 -1239147 -2082183
45750b082183o68680o97508j577977k094786q70010J320717K726456K965111K504105
$$ -2082183 -2750863 -3448371 -5026348 -7121134 -7991144 -6670427 -3943971 -978860 1525245
45741A525245J181995q18337j887224j056072M5612m63405j620962j356649j51278
$$ 1525245 2707240 1888903 1679 -1054393 -1008781 -1472186 -3093148 -4449797 -4601075
45732d601075j2334n95744K96110K459552K969614P94954j343371r61212Q59512
$$ -4601075 -4613409 -5209153 -4913043 -2453491 516123 1311077 -32294 -993506 -133994
45723a33994J605004P98721k12222m66241K3113Q19090J131142K70388j193071
$$ -133994 1471010 2269731 2057509 1591268 1614381 2433471 3564613 3835001 2641930
45714B641930j736685r53442j40930k37868n53005l39999j78682o62951r94693
$$ 2641930 905245 -48197 -189127 -426995 -980000 -1319999 -1498681 -2161632 -3156325
45705c156325k50366Q94792J095914L38306k93243l86555m91942q37800q62611
$$ -3156325 -3406691 -2511899 -1415985 -1077679 -1370922 -1757477 -2249419 -3087219 -3949830
45696c949830j44607Q84208J305982N84319p90525j512884q06354M51624P35732
$$ -3949830 -4094437 -3210229 -1904247 -1319928 -2110453 -3623337 -4429691 -3978067 -3242335
45687c242335M2306j00380Q96825J652624J105100L99946J047168K235892J834821
$$ -3242335 -3200029 -3300409 -2403584 -750960 354140 754086 1801254 4037146 5871967
45678E871967l17107j974889j574492k15323Q7926r57737j889275j512328j29315
$$ 5871967 5554860 3579971 2005479 1790156 1878082 920345 -968930 -2481258 -2610573
45669b610573J134822J585473J294310N50354m67026j346582j383840m76603L02100
$$ -2610573 -1475751 109722 1404032 1954386 1487360 140778 -1243062 -1719665 -1417565
45660a417565p7532r71989p89833N28516J124482n4633j463718j034420R07820
$$ -1417565 -1495097 -2467086 -3256919 -2728403 -1603921 -1658554 -3122272 -4156692 -3248872
45651c248872K187580J718805M97831j76477j65906j9131p5181l42724n87440
$$ -3248872 -1061292 657513 1155344 978867 812961 793830 718649 375925 -211515
45642b11515m09466J76176L21833p09059k211851k582645j368408J44403P46659
$$ -211515 -620981 -444805 -122972 -832031 -3043882 -5626527 -6994935 -6850532 -6103873
45633f103873Q02779J279959J999894J821349L72764j262251j789164j078487
$$ -6103873 -5301094 -4021135 -2021241 -199892 172872 -1089379 -2878543 -3957030
45625c957030L573P52019J156972J420551J472735J171186O44399J65042q5519
$$ -3957030 -3953457 -3201438 -2044466 -623915 848820 2020006 2664405 2829447 2743928
45616B743928P1322P29470J354067Q52773j044978k837379k703867q50653O84014
$$ 2743928 2815250 3544720 4898787 5751560 4706582 1869203 -834664 -1685317 -1001303
45607a001303P09252J78432L74105R89795Q49676l25565j754271k569985k227522
$$ -1001303 -292051 -113619 260486 1250281 2099957 1774392 20121 -2549864 -4777386
45598d777386o09369J473063K512563J876266O05858m4898j19594j88937m3189
$$ -4777386 -5386755 -3913692 -1401129 475137 1080995 1036097 916503 727566 684377
45589F84377N84656Q00224l47843j962449k137943o15765R06648J166642O18238
$$ 684377 1269033 2069257 1721414 -241035 -2378978 -2994743 -2088095 -921453 -303215
45580c03215K17557L15905R24590J696192J485629n13458k879249k954669m28682
$$ -303215 -85658 230247 1154837 2851029 4336658 3823200 943951 -2010718 -2439400
45571b439400J795763J386182l69879p82323L22395Q69976J7522p94844l98942
$$ -2439400 -643637 742545 372666 -409657 -87262 782714 800236 5392 -393550
45562c93550L36065M8794j002579j354895l57192J024824J362046K88998j186167
$$ -393550 -57485 -8691 -1011270 -2366165 -2723357 -1698533 -336487 -47489 -1233656
45553a233656j733207r99193J35617N60538P7868n00448k84878P17883J488412
$$ -1233656 -2966863 -3966056 -3830439 -3269901 -3192033 -3692481 -3977359 -3259476 -1771064
45544a771064R35068q15947k168183j552387O95380K417293J915255j97026j816699
$$ -1771064 -835996 -1651943 -3820126 -5372513 -4677133 -2259840 -344585 -541611 -2358310
45535b358310j743113o89520K2595P7169O2321K20949R9837m48877o81699M5180
$$ -2358310 -4101423 -4790943 -4768348 -4691179 -4628858 -4407909 -4308072 -4756949 -5438648 -5393468
45525e393468J196627J765559J752571J929612K237268J715959L16348o62100
$$ -5393468 -4196841 -2431282 -678711 1250901 3488169 5204128 5520476 4858376
45517D858376o63698r37354k283229l101980j529694J324183K403599P74560j323473
$$ 4858376 4194678 3257324 974095 -2127885 -3657579 -2333396 70203 844763 -478710
45508d78710j656705m06587R73905J617129J359768M48159k62753m8174L53320
$$ -478710 -2135415 -2542002 -1568097 49032 1408800 1856959 1594206 1546032 1899352
45499A899352m86398k235399k775965j222853P47082J388056R71753M21074k63523
$$ 1899352 1412954 -822445 -3598410 -4821263 -4074181 -2686125 -1714372 -1293298 -1556821
45490a556821q91835k84271J641336K635427J063093j269517j529629J3967Q19036
$$ -1556821 -2448656 -2732927 -1091591 1543836 2606929 1337412 -192217 -178250 640786
45481F40786K12044j64581K07071j50244j630411k334948j043421P90502J313062
$$ 640786 852830 688249 895320 745076 -885335 -3220283 -4263704 -3473202 -2160140
45472b160140Q03927N89298Q46557R19290P77871P90151P25627J56110o35077
$$ -2160140 -1356213 -766915 79642 998932 1776803 2566954 3292581 3448691 2813614
45463B813614j048324j020682q12435n27349m32144r47493j596841r39165J353747
$$ 2813614 1765290 744608 -67827 -595176 -1027320 -1974813 -3571654 -4510819 -3157072
45454c157072L211621K413588l42659k180570j757592o50456p21285j633288j830992
$$ -3157072 54549 2468137 2125478 -55092 -1812684 -2463140 -3184425 -4817713 -6648705
45445f648705q55143M46587J351091J738296J461833M24332o67851o95347L88578
$$ -6648705 -7503848 -7057261 -5706170 -3967874 -2506041 -2081709 -2749560 -3444907 -3056329
45436c056329J333717J292969R03309J031347J271392P14353l21171n67510K92904
$$ -3056329 -1722612 -429643 473666 1505013 2776405 3490758 3169587 2602077 2894981
45427B894981J161353J076355K32931o84653j198085r59528j09527J53541j250572
$$ 2894981 4056334 5132689 5365620 4680967 3482882 2523354 2413827 2567368 1316796
45418A316796l187372l024814k37327K353931K139213J039j425975j285020m09365
$$ 1316796 -1870576 -4895390 -5132717 -2778786 -639573 -638534 -2064509 -3349529 -3758894
45409c758894R24779K674576L275447J059557k536496l818754j491433J704117
$$ -3758894 -2834115 -159539 3115908 4175465 1638969 -2179785 -3671218 -1967101
45401a967101K693256J412002l43631j437348j619880q67561K36626O43237L21023
$$ -1967101 726155 2138157 1794526 357178 -1262702 -2130263 -1893637 -1250400 -929377
45392i29377M17613J178489J211151j55499j360734q34926O61720J463914J491169
$$ -929377 -511764 666725 1877876 1722377 361643 -473283 188437 1652351 3143520
45383C143520J557992J312759m5292j650916j744841l96598N19473J71161k54331
$$ 3143520 4701512 6014271 5968979 4318063 2573222 2176624 2696097 2867258 2612927
45374B612927K05535P61568L30725p46573j303819q64742J17524R73357J265450
$$ 2612927 2818462 3580030 3910755 3164182 1860363 995621 1113145 2086502 3351952
45365C351952R52876M43258J55197m6367n21344r93073p09216L67957J208463
$$ 3351952 4304828 4748086 4903283 4856916 4335572 3342499 2633283 3001240 4209703
45356D209703R02586k74247j320336j663919j515657j288438j016059m20882N21661
$$ 4209703 5112289 4838042 3517706 1853787 338130 -950308 -1966367 -2387249 -1865588
45347a865588J275585J290767Q16082O51926R22890P71536k43603j131039o98498
$$ -1865588 -590003 700764 1516846 2168772 3091662 3863198 3619595 2488556 1790058
45338A790058O27647J247666N53730l84437m95466j07702j22673m54410j46452
$$ 1790058 2417705 3665371 4219101 3834664 3339198 3231496 3108823 2654413 2507961
45329B507961J010055J741587P64743j214999j868794j43977J966284J725057
$$ 2507961 3518016 5259603 6024346 4809347 2940553 2796576 4762860 6487917
45321F487917o39916k158169j247257L00145M15735q4732P05024K224645K151681
$$ 6487917 5848001 3689832 2442575 2742720 3158455 3073723 3778747 6003392 8155073
45312H155073J55818j535637j502160q08383p20932q00752l10056J64440j66624
$$ 8155073 8310891 6775254 5273094 4464711 3743779 2943027 2632971 2797411 2630787
45303B630787p36317n41721J74318M17319O5270j78269j26933l10966q88215j235148
$$ 2630787 1894470 1352749 1527067 1944386 2009656 1831387 1704454 1393488 505273 -729875
45293g29875p74240L17087J333405J684193J301840N71615j54674q62223j444400
$$ -729875 -1504115 -1187028 146377 1830570 3132410 3704025 3549351 2687128 1242728
45284A242728j281746K1360J581937J929598R89579L05271P66547J240870L98881
$$ 1242728 -39018 -17658 1564279 3493877 4483456 4788727 5555274 6796144 7195025
45275G195025j064375j398441m96536q2571j073871k141891j600052J62162J117531
$$ 7195025 6130650 4732209 4235673 4153102 3079231 937340 -662712 -500550 616981
45266F16981K49857j114886r76479P98090K240186J670353k60369j418574p42917
$$ 616981 866838 -248048 -1224527 -426437 1813749 3484102 3223733 1805159 1062242
45257A062242P61792J533706J163366L22344l38201o94555r04314j106770j250822
$$ 1062242 1824034 3357740 4521106 4843450 4505249 3810694 2906380 1799610 548788
45248E48788j057125l69174M20530O86795L88138R7049J20000J51204m0186k20603
$$ 548788 -508337 -877511 -456981 229814 617952 715001 835001 986205 946019 725416
45238G25416k42494l14013l98313o6124O27499Q85359L56380j83127n2863J96680
$$ 725416 482922 168909 -229404 -295528 331971 1217330 1573710 1390583 1337720 1534400
45228A534400j74926o05063m7179J059976J092765l01386j351474m24233J723170
$$ 1534400 1359474 754411 707232 1767208 2859973 2558587 1207113 782880 2506050
45219B506050K804290J766557r0304q37855j97138L55490l78168j786816k333218
$$ 2506050 5310340 7076897 6986593 6148738 5951600 6307090 5928922 4142106 1808888
45210A808888j509947j79240Q05597J324143J302673N27329m24606l47763O78138
$$ 1808888 298941 119701 925298 2249441 3552114 4079443 3654837 3307074 3985212
45201C985212Q00668r37734k579374j637331J214254K867843J997815M22124l3004
$$ 3985212 4785880 3848146 1268772 -368559 845695 3713538 5711353 6133477 6100473
45192F100473J36045j78525n71950j94654L82494L0974r74144j397531r77589
$$ 6100473 6236518 6057993 5486043 5291389 5673883 5704857 4730713 3333182 2355593
45183B355593m86034j89380K67043N63254j21818j393286j640663l92567P12064
$$ 2355593 1869559 1680179 1947222 2510476 2388658 995372 -645291 -1037858 -325794
45174c25794K94832n96081q9573J500240J999296O02816r49953r44025O2218N48523
$$ -325794 -30962 -627043 -716616 783624 2782920 3385736 2435783 1491758 1553976 2102499
45164B102499M35430P58913J544153J588448M12830r19733j318185r12106k96009
$$ 2102499 2537929 3296842 4840995 6429443 6842273 5922540 4604355 3692249 3396240
45155C396240M58007J278383J401834K28783j477619k176464j302606K15802J171430
$$ 3396240 3854247 5132630 6534464 6763247 5285628 3109164 1806558 2022360 3193790
45146C193790J226185P81271K26668l78856j035402j458838j234385m37608J84181
$$ 3193790 4419975 5201246 5427914 5049058 4013656 2554818 1320433 882825 1067006
45137A067006Q5465k63419j24682J46078m29098j526043j466211K56423J754816
$$ 1067006 1152471 889052 764370 910448 481350 -1044693 -2510904 -2254481 -499665
45128d99665J195163o22443j526889r72720j65659K13858N82740R41673O59350
$$ -499665 695498 73055 -1453834 -2426554 -2592213 -2378355 -1795615 -853942 -194592
45119a94592r775J03974J152932J852428J524459J019772Q82551J89159j622325
$$ -194592 -204367 -100393 1052539 2904967 4429426 5449198 6331749 6520908 4898583
45110D898583l096169k459184k04474J496733J550436P62749J37792k51550m95112
$$ 4898583 1802414 -656770 -861244 635489 2185925 2948674 3086466 2834916 2339804
45101B339804j78113Q35983J643218J160001l25157j128794j05840J714785K143147
$$ 2339804 2161691 2997674 4640892 5800893 5475736 4346942 4241102 5955887 8099034
45092H099034N88292j084463j079459j43056k60263j469183j738643j07568J849603
$$ 8099034 8687326 7602863 6523404 6380348 6120085 4650902 2912259 2804691 4654294
45083D654294K312971J392796J46561j100456k271168k622495j719165m37156
$$ 4654294 6967265 8360061 8506622 7406166 5134998 2512503 793338 356182
45075C56182K83524Q02809J581924J652658L5398k069240k511888j259414k16369
$$ 356182 639706 1442515 3024439 4677097 4712495 2643255 131367 -1128047 -1344416
45066a344416j34075J34076J080797J521108Q66065L42639P98079J078499K6396
$$ -1344416 -1478491 -1344415 -263618 1257490 2123555 2466194 3264273 4342772 4369168
45057D369168j385109j541518o55641j9762K95820J080776J890006J407992j04491
$$ 4369168 2984059 1442541 786900 767138 1062958 2143734 4033740 5441732 5337241
45048E337241p09613M25469J858800K151231J743727J596171J337793J36166j500990
$$ 5337241 4627628 5053097 6911897 9063128 10806855 12403026 13740819 13876985 12375995
45039A2375995k262972j904470j228887n15310O16491J830213K081591J357389
$$ 12375995 10113023 8208553 6979666 6464356 7080847 8911060 10992651 12350040
45031A2350040J012629J727135K404658K050136J590280K468292M194751M909541
$$ 12350040 13362669 15089804 17494462 19544598 21134878 23603170 27797921 32707462
45023C2707462M121341L257182L288049L323705K192829K08619j488990k446086
$$ 32707462 36828803 40085985 43374034 46697739 48890568 49099187 47610197 45164111
45015D5164111k804583k376298r20909Q82591J750638J253041L52345K79925J199005
$$ 45164111 42359528 39983230 39062321 39944912 41695550 42948591 43300936 43580861 44779866
45006D4779866K120264J986480P54170o57242j553183k302964l521971m688371
$$ 44779866 46900130 48886610 49640780 48983538 47430355 45127391 41605420 36917049
44998C6917049m527894k950760j562585j668132k666399l196625l020580k720845
$$ 36917049 32389155 29438395 27875810 26207678 23541279 20344654 17324074 14603229
44990A4603229k252492j187427r2149j75152j408915k303991j947308j133639
$$ 14603229 12350737 11163310 11071161 10896009 9487094 7183103 5235795 4102156
44982D102156r01061r46008l27674R17523J767107J522534M25760q24804j543348
$$ 4102156 3201095 2255087 1927413 2844936 4612043 6134577 6560337 5735533 4192185
44973D192185j219204M8905J189590Q99931q76207k598913k671443j113274O90995
$$ 4192185 2972981 3021886 4211476 5111407 4235200 1636287 -1035156 -2148430 -1457435
44964a457435J686893J971508J925606J374375J53359j097338j528930j219043
$$ -1457435 229458 2200966 4126572 5500947 5654306 4556968 3028038 1808995
44956A808995r28448q98574p50807m85057n58860q63014o74835J02622P16005
$$ 1808995 880547 -18027 -768834 -1253891 -1812751 -2675765 -3350600 -3247978 -2531973
44947b531973R06074J295920J957302J926737R23975J68391L94237M26878q11114
$$ -2531973 -1625899 -329979 1627323 3554060 4478035 4646426 5040663 5467541 4656427
44938D656427k148952j887019o80712n14375j368453j306441J97806J456039J471005
$$ 4656427 2507475 620456 -60256 -574631 -1943084 -3249525 -3051719 -1595680 -124675
44929a24675J280418J566757J167809o36962k185842j597757K88280J007674q0670
$$ -124675 1155743 2722500 3890309 3253347 1067505 -530252 -241972 765702 685032
44920F85032j202751r49508p7692m4678q34079j142409l85321M20364J70094n71162
$$ 685032 -517719 -1467227 -1544919 -1589597 -2423676 -3566085 -3951406 -3531042 -3360948 -3932110
44910c932110k82387J178587K230511J945861J315628J221181P20712j051972
$$ -3932110 -4214497 -3035910 -805399 1140462 2456090 3677271 4397983 3346011
44902C346011k723598k609079j645925j720517j958882n0098L008867L437306
$$ 3346011 622413 -1986666 -3632591 -5353108 -7311990 -7362088 -4353221 -915915
44894i15915O64926j244785J57407J952914R60605r94139n46041J255230Q35115
$$ -915915 -250989 -1495774 -1338367 614547 1575152 581013 34972 1290202 2125317
44885B125317j655936k533993n76711J410021J373297N49611K93413k13770j550756
$$ 2125317 469381 -2064612 -2641323 -1231302 141995 691606 985019 771249 -779507
44876g79507k132076o54556J420742J732638J97185j233870j223187k16811N66736
$$ -779507 -2911583 -3566139 -2145397 -412759 -215574 -1449444 -2672631 -2889442 -2322706
44867b322706M07200m49910j158112j225687r86745p77130k14984Q62353J451552
$$ -2322706 -1915506 -2365416 -3523528 -4749215 -5735960 -6513090 -6728074 -5865721 -4414169
44858d414169P18475k83323O7880J249482J178058m71010j637137j007186K59381
$$ -4414169 -3695694 -3979017 -3911137 -2661655 -1483597 -1954607 -3591744 -4598930 -4339549
44849d339549O97315N45219N65694N19567O8000j09785N98092J454314J305992
$$ -4339549 -3642234 -3097015 -2531321 -2011754 -1943754 -2053539 -1455447 -1133 1304859
44840A304859J44809j072765j523109q87086N68813J766478J528507K3815j275723
$$ 1304859 1449668 376903 -1146206 -2033292 -1464479 301999 1830506 1854321 578598
44831E78598j364333n34090O10025J704198K086200J235948L7052l9621O83230
$$ 578598 -785735 -1319825 -709800 994398 3080598 4316546 4353598 4313977 4997207
44822D997207M18898r69570j479087m04427K57246p80411j761103q64760P49321
$$ 4997207 5416105 4446535 2967448 2563021 2820267 2039856 278753 -586007 163314
44813A63314J152495Q77529J338531J769060O78687r55015j068700j84424n15045
$$ 163314 1315809 2193338 3531869 5300929 5979616 5024601 3955901 3771477 3256432
44804C256432j955565k252383j035670l42304p59782l43547J670465L066440K025116
$$ 3256432 1300867 -951516 -1987186 -2329490 -3089272 -3432819 -1762354 1304086 3329202
44795C329202r7872r77791m30882K11283K93503n4965p63770j462097j277019
$$ 3329202 3231330 2253539 1822657 2033940 2327443 2272478 1508708 46611 -1230408
44786a230408p5335R75850R18566J62053m77119p83941o14409L41306J551427
$$ -1230408 -1305743 -329893 588673 750726 273607 -510334 -1124743 -783437 767990
44777G67990J738725P64971K7437J74047N4932r70985j490988m07571P91608K29981
$$ 767990 2506715 3271686 3299123 3473170 3528102 2557117 1066129 658558 1450166 1680147
44767A680147j121269q27550J061574K017162R65759k40660P6059R37198N07483
$$ 1680147 558878 -268672 792902 2810064 3775823 3535163 3611222 4548420 5055903
44758E055903j033510j818903q67486Q16567J596566R28147l50722j067090q50399
$$ 5055903 4022393 2203490 1336004 2152571 3749137 4677284 4326562 3259472 2409073
44749B409073k39777J75783L66100M85894L59600k19934r58817j299976j037668
$$ 2409073 2169296 2345079 2711179 3197073 3556673 3336739 2377922 1077946 40278
44740D0278l40608N86872J449788J733924J164128K02765l12856K5900R67655
$$ 40278 -300330 286542 1736330 3470254 4634382 4837147 4524291 4550191 5517846
44731E517846J913998K210947J497217J27003j072101j735038k175321k384907
$$ 5517846 7431844 9642791 11140008 11267011 10194910 8459872 6284551 3899644
44723C899644j623660K73779J909690J747442K01996p96893k67741Q25291J156103
$$ 3899644 2275984 2549763 4459453 6206895 6408891 5611998 5344257 6169548 7325651
44714G325651O51077J25787j9301k07603r55735j956725k025403l60548J999785
$$ 7325651 7976728 8102515 8083214 7875611 6919876 4963151 2937748 2577200 4576985
44705D576985K742593R49033j503873k188363j152648l54946m75992j16867J518201
$$ 4576985 7319578 8268611 6764738 4576375 3423727 3068781 2592789 2475922 3994123
44696C994123K935544K376086L03463j338081j592046j041408l83886L05859R32416
$$ 3994123 6929667 9305753 9609216 8271135 6679089 5637681 5253795 5559654 6492070
44687F492070J031223L77373o26083j422776j814814j823855j332514j78737J344896
$$ 6492070 7523293 7900666 7274583 5851807 4036993 2213138 880624 701887 2046783
44678B046783K293191J756897m2857j698930k098336j663746j498766j610332
$$ 2046783 4339974 6096871 6054014 4355084 2256748 593002 -905764 -2516096
44670b516096j001172M66236J533816J337067N92805K61246Q6047m78682p94396
$$ -2516096 -3517268 -3051032 -1517216 -180149 412656 673902 759949 281267 -513129
44661e13129Q6564J552949J972079J052556K46260N34776J099743P27287m88995
$$ -513129 -426565 1126384 3098463 4151019 4397279 4932055 6031798 6759085 6270090
44652F270090j495960j599161q83805P6642N25957J75086j71859N00066J592901
$$ 6270090 4774130 3174969 2291164 2367806 2893763 3068849 2896990 3397056 4989957
44643D989957J199923j000923k559025j410165R02446J199707p15763j840111
$$ 4989957 6189880 5188957 2629932 1219767 2122213 3321920 2606157 766046
44635G66046n49347J145687R85980j78824k66101N06929L50494p49587r80131
$$ 766046 216699 1362386 2348366 2169542 1903441 2410370 2760864 2011277 1031146
44626A031146J32585R33227M47198k30893j92785l06359j270647j892476j034245
$$ 1031146 1163731 2096958 2544156 2313263 2120478 1814119 543472 -1349004 -2383249
44617b383249J32961j23747j084693o34559J136823J911427Q95425P5926Q75991
$$ -2383249 -2250288 -2374035 -3458728 -4093287 -2956464 -1045037 -149612 -73686 802305
44608H02305J854952J233553j42878l22194N30698O12131m50814j197749r03604
$$ 802305 2657257 3890810 3747932 3425738 3956436 4568567 4117753 2920004 2016400
44599B016400m85830n17976k37271P45803J384479Q45642r2465m10388n04182
$$ 2016400 1530570 1012594 775323 1521126 2905605 3751247 3658782 3248394 2744212
44590B744212j213903k098895k081976j175841j69022Q19088J853645J755540
$$ 2744212 1530309 -568586 -2650562 -3826403 -3995425 -3176337 -1322692 432848
44582D32848o90034l919890m308712p80429L172505L657486J170292o81200k59125
$$ 432848 -257186 -4177076 -8485788 -9266217 -6093712 -2436226 -1265934 -1947134 -2206259
44573b206259O59426L85004j88510M58905J806697K113141J035242n0018j19993
$$ -2206259 -1546833 -1161829 -1350339 -891434 915263 3028404 4063646 4013628 3893635
44564C893635L15548K93535k45898o47369n98447m53734n62411o72065k48185
$$ 3893635 4209183 4502718 4256820 3609451 3011004 2557270 1994859 1322794 1074609
44555A074609O91391J344632R24650l98743j547965j526680k89111J243095J894037
$$ 1074609 1766000 3110632 4035282 3636539 2088574 561894 272783 1515878 3409915
44546C409915J169609k49781j091335q08029j06135J06869j10201j76139j86197
$$ 3409915 4579524 4329743 3238408 2430379 2324244 2431113 2320912 2144773 1958576
44537A958576p16438j516667j511510m33058N62804N19025O6118L72680J343445
$$ 1958576 1242138 -274529 -1786039 -2219097 -1656293 -1137268 -1071150 -698470 644975
44528F44975J843181J396189O78191L39834K03921j56805o73691r21777o56342
$$ 644975 2488156 3884345 4562536 4902370 5106291 4949486 4275795 3354018 2697676
44519B697676j7823N60768N84648r0045r77443j310434p73234K15850R55047J081432
$$ 2697676 2679853 3240621 3825269 3735224 2757781 1447347 674113 889963 1845010 2926442
44509B926442P68840M25534K34734L1065l22095o11364n97568m86080n80183n32715
$$ 2926442 3695282 4120816 4355550 4386615 4064520 3453156 2855588 2369508 1789325 1256610
44499A256610L45403J817098K502803J458501n39015j848363j742132q26274m7903
$$ 1256610 1602013 3419111 5921914 7380415 6841400 4993037 3250905 2424631 2376728
44490B376728J50914n2703p2432N73150J570531J932215J191271P9362m40768
$$ 2376728 2527642 2474939 2402507 2975657 4546188 6478403 7669674 7749036 7308268
44481G308268l65359l16120m78725n53940m15116j62044J52211K91083j66838
$$ 7308268 6942909 6626789 6148064 5594124 5179008 5016964 5169175 5460258 5293420
44472E293420r70855j041756n2709O44317n1306q76892J90646K521120L100643
$$ 5293420 4322565 3280809 3228100 3872417 3821111 2944219 3134865 5655985 8756628
44463H756628O12750k636678l739347k586406j131086m80206j35677M80514J086995
$$ 8756628 9369378 6732700 2993353 406947 -724139 -1204345 -1340022 -859508 227487
44454B27487J140527O15380N6288M6264M81071M69845n11939j503834j024255
$$ 227487 1368014 1983394 2039682 2085946 2567017 3036862 2524923 1021089 -3166
44445c166P31506J775272Q63266r07246j699540j170863k69397L72845Q14782
$$ -3166 728340 2503612 3366878 2459632 760092 -410771 -680168 -307323 507459
44436E07459J060807R09406L88501k55578p95887r14283l24345O25272J078242
$$ 507459 1568266 2477672 2866173 2610595 1814708 900425 576080 1201352 2279594
44427B279594Q46110P59234J295067J637525Q88598m41441j085169p49291l24096
$$ 2279594 3125704 3884938 5180005 6817530 7706128 7264687 6179518 5430227 5106131
44418E106131n79203j334185j795334j303044J2052J108304J043347K12243j89806
$$ 5106131 4526928 3192743 1397409 94365 106417 1214721 2258068 2470311 2280505
44409B280505j2301k50248r95026q89772N19790J559406R18255j55124P6300Q85678
$$ 2280505 2268204 2017956 1022930 133158 652948 2212354 3130609 2975485 3051785 3937463
44399C937463L90296j113681j605258p27390j78413o18873o54546N15922J649212
$$ 3937463 4327759 3214078 1608820 881430 703017 84144 -570402 -54480 1594732
44390A594732J568066Q71614M89562J20460p11508j351889j032290k35444J29011
$$ 1594732 3162798 4034412 4523974 4644434 3932926 2581037 1548747 1313303 1442314
44381A442314J88384O67640J521637K003045J801432J326899J006610Q42437N90686
$$ 1442314 1630698 2298338 3819975 5823020 7624452 8951351 9957961 10800398 11391084
44372A1391084J07637l98084m94912j75090j27991q38327j707048j808941j219564
$$ 11391084 11498721 11100637 10605725 10430635 10302644 9464317 7757269 5948328 4728764
44363D728764o81217l07532K05303M09273l30313j192372n78586J290938K234293
$$ 4728764 4047547 3740015 3945318 4354591 4024278 2831906 2253320 3544258 5778551
44354E778551J123879o57464j511191j652066j827285j651827n98614O12736J035477
$$ 5778551 6902430 6244966 4733775 3081709 1254424 -397403 -996017 -383281 652196
44345F52196R64074J148432J420373J250791Q10248L87131l45048j410592j877880
$$ 652196 1616270 2764702 4185075 5435866 6246114 6633245 6288197 4877605 2999725
44336B999725j264768n63028o47425p78942o5861P57145O46514K53210P26956
$$ 2999725 1734957 1171929 524504 -254438 -320299 436846 1083360 1336570 2063526
44327B063526J427937R10881m40992r10279j98639M12997M31250N76780R00138
$$ 2063526 3491463 4402344 3961352 3051073 2852434 3265431 3696681 4273461 5173599
44318E173599N45343m63792j097999j091889j006801n97135P75602K096442J511693
$$ 5173599 5718942 5255150 4157151 3065262 2058461 1461326 2236928 4333370 5845063
44309E845063m59291j102534L92306J644802R76288r8257J06757M71030o50720
$$ 5845063 5385772 4283238 4675544 6320346 7296634 7198377 7305134 7776164 7125444
44300G125444k198402k040368m65586N11767M08543L77862O94879N58183R8255
$$ 7125444 4927042 2886674 2421088 2932855 3341398 3719260 4414139 4972322 5070577
44291E070577K74084P98726L57308q98966j160096K37890J660813J557290M60528
$$ 5070577 5344661 6143387 6500695 5601729 4441633 4679523 6340336 7897626 8358154
44282H358154k19737j81007j26323n10517j087611j203532k98790J300142K202557
$$ 8358154 8138417 7957410 7831087 7320570 6232959 5029427 4730637 6030779 8233336
44273H233336J473226J17880k08116K17603l72038k052505k576842p70583J452324
$$ 8233336 9706562 9824442 9616326 9833929 9461891 7409386 4832544 4061961 5514285
44264E514285J858136R52894N04561M38780n77632k280171k872790j786879l42639
$$ 5514285 7372421 8325315 8829876 9268656 8691024 6410853 3538063 1751184 1408545
44255A408545M29008P88120R23148M19513m56579o14280J28308O78297O03411
$$ 1408545 1837553 2625673 3548821 3968334 3511755 2897475 3025783 3704080 4307491
44246D307491Q17556J587510J579948M3449j616956j845572j147198p37334k95577
$$ 4307491 5125047 6712557 8292505 8335954 6718998 4873426 3726228 2988894 2693317
44237B693317J004795K245292J784668L1458j014917q02723o24210r51754o85514
$$ 2693317 3698112 5943404 7728072 7759530 6744613 5941890 5317680 4365926 3680412
44228C680412M70290J091396L82928m51584k56888K98731J52163l82707m77725
$$ 3680412 4150702 5242098 5625026 5173442 4916554 5215285 5367448 4984741 4507016
44219D507016j91367J45825P85431J671620J841600Q60777k62819o84479r59272
$$ 4507016 4315649 4461474 5246905 6918525 8760125 9620902 9358083 8673604 7714332
44210G714332j503884j379498j92552L81484r51619k502282j888836J43468R60655
$$ 7714332 6210448 4830950 4638398 5019882 4068263 1565981 -322855 -179387 781268
44201G81268L87467P08073K404087L102980J482275n97131r89402J0764J000641
$$ 781268 1168735 1876808 4280895 7383875 8866150 8269019 7279617 7290381 8291022
44192H291022J469355J272098J0441j772823k445880j540724n65888m97328k75540
$$ 8291022 9760377 11032475 11042916 9270093 6824213 5283489 4717601 4220273 3944733
44183C944733Q98704J703814Q70070m81672o52701r7209k40085p93503n60170
$$ 3944733 4843437 6547251 7417321 6935649 6282948 6185739 5945654 5152151 4591981
44174D591981j282n38334j760279j756572j95971J138264J107533N27786L35070
$$ 4591981 4590699 4052365 2292086 535514 339543 1477807 2585340 3113126 3448196
44165C448196K41665j90085o35578q18384j021779j217714p41464O01106J936825
$$ 3448196 3689861 3499776 2864198 2045814 1024035 -193679 -935143 -334037 1602788
44156A602788K284088J484839M4103j246749j537339o37315M68399O68333J78362
$$ 1602788 3886876 5371715 5415818 4169069 2631730 1994415 2462814 3131147 3309509
44147C309509k2711M6375m43763j201373p54465J124576K477020J649598l78752
$$ 3309509 3286798 3333173 2889410 1688037 933572 2058148 4535168 6184766 5806014
44138E806014j316329n11537N67807N16619l82376q59184l29413N05869N81561
$$ 5806014 4489685 3978148 4545955 5062574 4680198 3821014 3491601 3997470 4579031
44129D579031l14373j452627k129858k218101j693915l94264J303288K314839
$$ 4579031 4264658 2812031 682173 -1535928 -3229843 -3624107 -2320819 -5980
44121e980K090194J408721J207670J308747J124862P67298M03443m67636j697320
$$ -5980 2084214 3492935 4700605 6009352 7134214 7901512 8304955 7837319 6139999
44112F139999j581310P41283K919789J986133j097267k357333m56683J573514
$$ 6139999 4558689 5299972 8219761 10205894 9108627 6751294 6294611 7868125
44104G868125J052640q20794j596946j130941n91987k5949R09180J311811L03557
$$ 7868125 8920765 8099971 6503025 5372084 4780097 4754148 5663328 6975139 7278696
44095G278696j118654j354188m44059N01365J086558J304333N87795j069196k093824
$$ 7278696 6160042 4805854 4361795 4863160 5949718 7254051 7841846 6772650 4678826
44086D678826j256086L18571Q30422M82328N34325P24690o2674j285287j341520
$$ 4678826 3422740 3741311 4571733 5054061 5588386 6313076 6250402 4965115 3623595
44077C623595l32333J09575m02959o24869k5045N97800Q48876J070214J015222
$$ 3623595 3291262 3400837 2997878 2373009 2347964 2945764 3794640 4864854 5880076
44068E880076K45888l14166N17911J677758R85490j180917k101659q93947M56233
$$ 5880076 6125964 5811798 6329709 8007467 8992957 7812040 5710381 4816434 5272667
44059E272667P86176J274674K232450J750098o61447k199972r05992R95549N74098
$$ 5272667 6058843 7333517 9565967 11316065 10654618 8454646 7548654 8544203 9118301
44050I118301j245355j573108k29273O25071L22657O8125K38359J85183K15225
$$ 9118301 7872946 6299838 6070565 6695636 7018293 7086418 7324777 7509960 7725185
44041G725185J031778J586711K16738k232679l080948j684301j25773J47025q4957
$$ 7725185 8756963 10343674 10560412 8327733 5246785 3562484 3436711 3583736 3498779
44032C498779O7127K56509K32205L94453M95398k30747j265267j215457l38868
$$ 3498779 3565906 3822415 4054620 4449073 4944471 4713724 3448457 2233000 1894132
44023A894132l38705j234076j068759N09076J219186k3677j037140J01301J972953
$$ 1894132 1555427 321351 -747408 -238332 980854 957177 -79963 21338 1994291
44014A994291K357342J602328J139191O83331m78852j183111k24481R25315K33212
$$ 1994291 4351633 5953961 7093152 7776483 7297631 6114520 5890039 6815354 7048566
44005G048566j221212q91304P58839R17203p21250j375626J48831J626978J188215
$$ 7048566 5827354 4936050 5694889 6612092 5890842 4515216 4664047 6291025 7479240
43996G479240j21244p67576r76138j158045o33975M87824N10276j022288j883230
$$ 7479240 7357996 6590420 5614282 4456237 3822262 4310086 4820362 3798074 1914844
43987A914844m88393J402059J492117N39305N80907J188027M49138j323172j940291
$$ 1914844 1426451 2828510 4320627 4859932 5440839 6628866 7078004 5754832 3814541
43978C814541r77905j46367n9316N16540J794497K064242N30356j235245j720261
$$ 3814541 2836636 2690269 2630953 3147493 4941990 7006232 7536588 6301343 4581082
43969D581082j370293r80660j06172J526010K609279J889606J56288q24973n59126
$$ 4581082 3210789 2230129 2123957 3649967 6259246 8148852 8305140 7480167 6921041
43960F921041J93662Q34156J101938O27802l99543p83434J48422J139743N45135
$$ 6921041 7114703 7948859 9050797 9678599 9279056 8495622 8644044 9783787 10328922
43951A0328922j143995j834809p69810N78391P47564O6916k93056n733L26739
$$ 10328922 9184927 7350118 6580308 7158699 7906263 7973179 7680123 7674390 8001129
43942H001129J62269m12502p79483k89662R57407J844216J285430m19212j839357
$$ 8001129 8163398 7750896 6971413 6681751 7639158 9483374 10768804 10349592 8510235
43933H510235k037550j332668m57408K56792O69621O09502K69182J99523M72850
$$ 8510235 6472685 5140017 4682609 4939401 5609022 6218524 6487706 6687229 7160079
43924G160079M02922m01276j170937p84442P84751K366382K861450K192202J025368
$$ 7160079 7563001 7161725 5990788 5206346 5991097 8357479 11218929 13411131 14436499
43915A4436499k3595p27210j008476o92569K98422J554386K300979K133953J430910
$$ 14436499 14412904 13685694 12677218 11984649 12283071 13837457 16138436 18272389 19703299
43906A9703299Q18594N24505N86868J278381K620058L702860L419283K010863
$$ 19703299 20521893 21046398 21633266 22911647 25531705 29234565 32653848 34664711
43898C4664711J046375J536840K827067L789466M353856N144035O136112O549526
$$ 34664711 35711086 37247926 40074993 43864459 48218315 53362350 59498462 66047988
43890F6047988N906799M480116K697104P07123j366134l231340m688887n779184
$$ 66047988 71954787 76434903 79132007 79839130 78472996 75241656 70552769 64773585
43882F4773585o493172o564816n813640m651074l933422m012334m060845k933513
$$ 64773585 58280413 51715597 45901957 41250883 37317461 33305127 29244282 26310769
43874B6310769r36970J0641j214439k978004k666555l08979J201608j777k271748
$$ 26310769 25373799 25384440 24170001 21191997 18525442 18216463 19418071 19416294 17144546
43865A7144546k925678j797545p15177m45324j73792L47722K56367n36703p83579
$$ 17144546 14218868 12421323 11706146 11260822 11087030 11434752 11691119 11154416 10370837
43856A0370837P5883Q37186L44448q64476j644061j845319j793293j185184K19773
$$ 10370837 10446720 11283906 11628354 10763878 9119817 7274498 5481205 4296021 4515794
43847D515794J545753J761267J201138Q54565N87824m56876j909200k255960j102080
$$ 4515794 6061547 7822814 9023952 9878517 10466341 10009465 8100265 5844305 4742225
43838D742225J64483M58377L41008N50010N50259k74719j021777l77552J137101
$$ 4742225 4906708 5365085 5706093 6256103 6806362 6531643 5509866 5132314 6269415
43829F269415J579177L25804r20214l74967J493229K583209J686653k26047j204581
$$ 6269415 7848592 8174396 7254182 6879215 8372444 10955653 12642306 12416259 11211678
43820A1211678m72646P68959P61396o71439j832626j267940L67216J231828P03927
$$ 11211678 10739032 11507991 12269387 11597948 9765322 8497382 8864598 10096426 10800353
43811A0800353j17275k24034J24233L14437L33955J95859n58256j844555k340144
$$ 10800353 10683078 10459044 10583277 10897714 11231669 11427528 10869272 9024717 6684573
43802F684573j006047J141302K046337J248505K41294J32739K93079j77223q45973
$$ 6684573 5678526 6819828 8866165 10114670 10355964 10488703 10781782 10604559 9758586
43793I758586p30681R9619P20973P34554M78495P2154p17970j531081j329058
$$ 9758586 9027905 9127524 9848497 10583051 11061546 11133700 10415730 8884649 7555591
43784G555591J52206J510961J087789q81251k333486j824766k04501O80210L62368
$$ 7555591 7707797 9218758 10306547 9425296 7091810 5267044 5062543 5742753 6105121
43775F105121j09774j75040n86247j776561k610683j841208p0377J016440R91652
$$ 6105121 5995347 5820307 5234060 3457499 846816 -994392 -1064769 -48329 943323
43766I43323Q88008J171157J054953K19449k52159M89318J560313J496651K02439
$$ 943323 1831331 3002488 4057441 4276890 4024731 4514049 6074362 7571013 7773452
43757G773452j165372j680845j156985K42218J885995K570834J582313k73818
$$ 7773452 6608080 4927235 3770250 4012468 5898463 8469297 10051610 9777792
43749I777792j525984j709583j393232r02833j03956P05662Q86250N58487N17536
$$ 9777792 8251808 6542225 5148993 4246160 4142204 4847866 5734116 6292603 6810139
43740F810139Q34574O63583j87318o57711q5853N72958J43805q98369j097488
$$ 6810139 7644713 8308296 8120978 7463267 7377414 7950372 8094177 7195808 6098320
43731F098320j74983O52561N16841K697O3364O14268P62524L0071j143986j909660
$$ 6098320 5923337 6575898 7092739 7095436 7158800 7773068 8535592 8565663 7421677 5512017
43721E512017j642554l05879J357800K144036J492232L23006J27098J009543J421317
$$ 5512017 3869463 3563584 4921384 7065420 8557652 8880658 9007756 10017299 11438616
43712A1438616L70106r63167q75555K39254M92398m36606p53649L75004J166349
$$ 11438616 11808722 10845555 9970000 10209254 10701652 10265046 9511397 9886401 11052750
43703A1052750J5711j631815j205754J079774K466687J618505J98561Q3079Q65901
$$ 11052750 11068461 9436646 8230892 9310666 11777353 13395858 13594419 13677498 14543399
43694A4543399J010168J27159r09661j301181r70229m11148l54209j046376j684693
$$ 14543399 15553567 15680726 14771065 13469884 12499655 12088507 11734298 10687922 9003229
43685I003229j298112k50428J71545j99534j30816Q03288J239530J84230j172604
$$ 9003229 7705117 7454689 7626234 7426700 7295884 8099172 9338702 9522932 8350328
43676H350328j088021K38826J174109J009701M53669J35725p4676l27268m16097
$$ 8350328 7262307 7501133 8675242 9684943 10138612 10274337 10199661 9872393 9456296
43667I456296k31100Q0917L43038L01866k70890r64634q34101K50168J111856
$$ 9456296 9225196 9306113 9649151 9951017 9680127 8715493 7881392 8131560 9243416
43658I243416R76248Q02948J696504K758071K171666J19899j141513l04936J446485
$$ 9243416 10219664 11022612 12719116 15477187 17648853 17768752 16627239 16322303 17768788
43649A7768788K373006K305524K130146K175582J989542J203611l9382j289554
$$ 17768788 20141794 22447318 24577464 26753046 28742588 29946199 29906817 28617263
43641B8617263k091076k264644j995831j504628q32723k23011k28137q47279j068363
$$ 28617263 26526187 24261543 22265712 20761084 19928361 19705350 19477213 18629934 17561571
43632A7561571j53082J018175R30054n00310j946748k544515k483364j869083
$$ 17561571 17408489 18426664 19356718 18856408 16909660 14365145 11881781 10012698
43624A0012698m94790J039823J473160O68331k1808K50757O88609L64627l17380
$$ 10012698 9517908 10557731 12030891 12699222 12677414 12928171 13616780 13981407 13664027
43615A3664027n19211k75716L0717N83856J483264J921830J133886k98140j109012
$$ 13664027 13144816 12869100 12899817 13483673 14966937 16888767 18022653 17724513 16615501
43606A6615501j021025q27515j007660j154721q13353j60846L67159O92552J023955
$$ 16615501 15594476 14766961 13759301 12604580 11791227 11630381 11997540 12690092 13714047
43597A3714047J261984Q07133o33977k107738k093870n97758L85744m90913j750796
$$ 13714047 14976031 15783164 15149187 13041449 10947579 10349821 10735565 10244652 8493856
43588H493856j118024J000220K163828J709273J336545J609329P78371j725247
$$ 8493856 7375832 8376052 10539880 12249153 13585698 15195027 15973398 14248151
43580A4248151l398193k241806J5875O33010j4359L31649J774809K353148J466794
$$ 14248151 10849958 8608152 8624027 9257037 9242678 9574327 11349136 13702284 15169078
43571A5169078M49701j0564m65961p88276j25305J039002J079301j68748j091430
$$ 15169078 15618779 15608215 15142254 14353978 14228673 15267675 16346976 16178228 15086798
43562A5086798r05450n11906m14982J5956O96584N07636m17921l54315J048347
$$ 15086798 14181348 13669442 13254460 13270416 13967000 14474636 14056715 13702400 14750747
43553A4750747J698197L28140j278038j045456K30570M82929l09779n80781J5609
$$ 14750747 16448944 16777084 15499046 14453590 14684160 15167089 14857310 14276529 14292138
43544A4292138M05971J92174K2738J36858J84492K76559P10143Q92509O1960j089139
$$ 14292138 14698109 14890283 14913021 15049879 15234371 15510930 16221073 17113582 17175542 16086403
43534A6086403j074241J18511R65669P63367M88572Q96843J223323N43276o53518
$$ 16086403 15012162 15130673 16096342 16859709 17348281 18245124 19468447 20011723 19358205
43525A9358205j100511l05851J150607K306305K341607J060660n99838j102220
$$ 19358205 18257694 17951843 19102450 21408755 23750362 24811022 24211184 23108964
43517B3108964K8676J466533J581522L53299p89950p89686K8010O81613O57333
$$ 23108964 23137640 24604173 26185695 26538994 25749044 24959358 24987368 25668981 26326314
43508B6326314J71047k24320q1989N56696J036412O82107k35010n17300N07628
$$ 26326314 26497361 26273041 26191052 26747748 27784160 28466267 28231257 27713957 28221585
43499B8221585J850039J861213L27283j204855j376007m93517L38113P40660R96538
$$ 28221585 30071624 31932837 32260120 31055265 29679258 29185741 29523854 30264514 31261052
43490C1261052J129390J000074R27143J257312J564205J185139L24435l06014
$$ 31261052 32390442 33390516 34317659 35574971 37139176 38324315 38648750 38342736
43482C8342736o54350j047691j030303J55110J967222K884927K488130J820396
$$ 38342736 37688386 36640695 35610392 35765502 37732724 40617651 43105781 44926177
43474D4926177J503809J070323M97098O28253J405062J468814M72814L5706J187083
$$ 44926177 46429986 47500309 47997407 48625660 50030722 51499536 51972350 52008056 53195139
43465E3195139K548356K511077J657993J365261J480264J278386J358288K405211
$$ 53195139 55743495 58254572 59912565 61277826 62758090 64036476 65394764 67799975
43457F7799975L196941K233311N22668K69301J407640K039925J877879K381098
$$ 67799975 70996916 73230227 73752895 74022196 75429836 77469761 79347640 81728738
43449H1728738L512816L409296J852989J185811K698747M648483N181754M984037
$$ 81728738 85241554 88650850 90503839 91689650 94388397 99036880 104218634 109202671
43441A09202671N484836O340871O407899N810807N530437O017953P331457R456271
$$ 109202671 114687507 121028378 127436277 133247084 138777521 144795474 152126931 161583202
43433A61583202J1557965J2327872J2020626J2568686J4681261J6685921J7455681
$$ 161583202 173141167 185469039 197489665 210058351 224739612 241425533 258881214
43426B58881214J8285636K0078230K0936611J9134418J6682628J6886788J9465389
$$ 258881214 277166850 297245080 318181691 337316109 353998737 370885525 390350914
43419C90350914K1159788K0438454J8406827J5470705J0628667M470661m85331
$$ 390350914 411510702 431949156 450355983 465826688 476455355 480926016 480440685
43412D80440685l522978o931313j2150183j7284997k0110226k1304363k2712729
$$ 480440685 476917707 469986394 457836211 440551214 420440988 399136625 376423896
43405C76423896k4147230k4096514k2483073k0648056j9260298j8012807j6907661
$$ 376423896 352276666 328180152 305697079 285049023 265788725 247775918 230868257
43398B30868257j6203599j5380633j3662482j1483686j0150502j0027925j0148880
$$ 230868257 214664658 199284025 185621543 174137857 163987355 153959430 143810550
43391A43810550r654855q658152p625322o809719o432501o626159o944102o520717
$$ 143810550 134155695 125497543 117872221 111062502 104630001 98003842 91059740 84539023
43383H4539023n025401l160918k046730k195384l015964l275715k328438r61637
$$ 84539023 79513622 76352704 74305974 72110590 69094626 65818911 63490473 62528836
43375F2528836o00966j572699k740827l024606k509632j785936j148628r35445
$$ 62528836 61927870 60355171 57614344 54589738 52080106 50294170 49145542 48210097
43367D8210097j544773k360944j879981k5989R06861p61743l223676l371253j219333
$$ 48210097 46665324 44304380 42424399 42398410 43305271 42543528 39319852 35948599 34729266
43358C4729266K78345k71339j016763k81225Q77642Q41259N0457k91254n13145
$$ 34729266 35007611 34736272 33719509 33438284 34315926 35157185 35207642 34916388 34403243
43349C4403243j469046k329794j522031N92087J894004J301651j84004j230786
$$ 34403243 32934197 30604403 29082372 29674459 31568463 32870114 32686110 31455324
43341C1455324j535087j301989o87328o0350K03608L74614Q69774J124607J86235
$$ 31455324 29920237 28618248 27930920 27870570 28074178 28448792 29318566 30443173 30629408
43332C0629408j398985j691623K8284J943088J903882J41653j203831q00558N49169
$$ 30629408 29230423 27538800 27567084 29510172 31414054 31555707 30351876 29551318 30100487
43323C0100487J167219L77408r75099j488939n22827J349793L011437L648499
$$ 30100487 31267706 31645114 30670015 29181076 28658249 30008042 33019479 36667978
43315C6667978K953124J138228p93096j468526o55241K09618k5962m14005N24564
$$ 36667978 39621102 40759330 39966234 38497708 37842467 38052085 38026123 37612118 38136682
43306C8136682K007730J817186j39770j444264q95825j74214n97328o76944J104472
$$ 38136682 40144412 41961598 41821828 40377564 39481739 39307525 38710197 38033253 39137725
43297C9137725L113216K770290O46672m09512M60799J499318J715605K085285
$$ 39137725 42250941 45021231 45667903 45258391 45719190 47218508 48934113 51019398
43289E1019398L032987L356354K528904J860646K256971K684710K114660J414677
$$ 51019398 54052385 57408739 59937643 61798289 64055260 66739970 68854630 70269307
43281G0269307J900629L161727L701770K973995J661668N74879J88566O74177
$$ 70269307 72169936 75331663 79033433 82007428 83669096 84243975 84432541 85106718
43273H5106718J612706K255855K621248L510870M884575N330802M092857K603663
$$ 85106718 86719424 88975279 91596527 95107397 99991972 105322774 109415631 112019294
43265A12019294K797501M625714O460630P358499P624118P564551P129673O797403
$$ 112019294 114816795 119442509 125903139 133261638 140885756 148450307 155579980 162377383
43257A62377383P546440R561014J1741422J2874065J2881621J2736569J3377605
$$ 162377383 169923823 179484837 191226259 204100324 216981945 229718514 243096119
43250B43096119J4760730J5933627J6208186J6126953J6701943J7727047J7732576
$$ 243096119 257856849 273790476 289998662 306125615 322827558 340554605 358287181
43243C58287181J5872764J2908391R902006O994483M098635J646851l50061l002178
$$ 358287181 374159945 387068336 396970342 403964825 408063460 409710311 409360250 406358072
43235D06358072p069485j1471530j4467258j5810729j6617640j7573842j8410536
$$ 406358072 399288587 387817057 373349799 357539070 340921430 323347588 304937052
43228C04937052j8763094j8466160j7342444j5678174j4475452j4256690j4145958
$$ 304937052 286173958 267707798 250365354 234687180 220211728 205955038 191809080
43221A91809080j3162113j1776185j1002224j0647842r882052q907051q466405
$$ 191809080 178646967 166870782 155868558 145220716 135338664 126431613 117965208
43214A17965208q197936p206531n905146n442646n516119m704144k981085j927043
$$ 117965208 109767272 102560741 96655595 91212949 85696830 80992686 78011601 76084558
43206G6084558k214228k776982k802745k681115k566096j884854q41716n93993
$$ 76084558 73870330 71093348 68290603 65609488 63043392 61158538 60316822 59722829
43198E9722829j292148j691914j317311j163621j596762j572169q02865n91304
$$ 59722829 58430681 56738767 55421456 54257835 52661073 51088904 50286039 49694735
43190D9694735j395556j733034q89645m89233j566407k256926p46145J333633
$$ 49694735 48299179 46566145 45676500 45187267 43620860 41363934 40617789 41951422
43182D1951422J246372m28979p97512N93630J168744l44280j871467j191777R40440
$$ 41951422 43197794 42768815 41971303 42564933 43733677 43389397 41517930 40326153 41266593
43173D1266593K053751J062729q48630j768233r92781K17676l5750j800386k862836
$$ 41266593 43320344 44383073 43534443 41766210 40773429 40991105 40955355 39154969 36292133
43164C6292133j718029J01253K19338r76969j075073M56896J541684Q52368m64974
$$ 36292133 34574104 34675357 34894695 33917726 32842653 33299549 34841233 35693601 35228627
43155C5228627j037200j024034p20173M91144K463787L390348K216493N41469
$$ 35228627 34191427 33167393 32447220 32938364 35402151 38792499 41008992 41550461
43147D1550461L56876J017162M19177j518256k680838j968141o89845k91071l41848
$$ 41550461 41907337 42924499 43343676 41825420 39144582 37176441 36486596 36195525 35853677
43138C5853677K77768J344198J661832R76173L51361N71441J059103Q08200j69054
$$ 35853677 36131445 37475643 39137475 40113648 40465009 41036450 42095553 42903753 42734699
43129D2734699r29008q83364l43213K11227O91324R67203N72722n56274j497847
$$ 42734699 41805691 40922327 40579114 40790341 41481665 42448868 43021590 42465316 40967469
43120D0967469j246551o3218P47056M43301l35257n51075j49846p8669r21936
$$ 40967469 39720918 39657700 40404756 40848057 40512800 39961725 39811879 39733210 38811274
43111C8811274j830298j344273M82955J523617J07810k356614k849428q76650
$$ 38811274 36980976 35636703 36119658 37643275 37751085 35394471 32545043 31668393
43103C1668393P54364J0246j523020j321955L19020J251646Q56526J02063q16411
$$ 31668393 32422757 32433003 30909983 29588028 29907048 31158694 32015220 32117283 31300872
43094C1300872k249272l038731j570501J094582J979585M84909q74441o61302
$$ 31300872 29051600 26012869 24442368 25536950 27516535 28001444 27127003 26465701
43086B6465701m25753j218169j283798P14628K808838K650147J292910J226452
$$ 26465701 26039948 24821779 23537981 24252609 27061447 29711594 31004504 32230956
43078C2230956K189132K055201R23107R96724K567487L324214K256803J444655
$$ 32230956 34420088 36475289 37398396 38395120 40962607 44286821 46543624 47988279
43070D7988279K767605N020824N832557M978364M210297M590797N359115N183995
$$ 47988279 50755884 55776708 61609265 66587629 70797926 75388723 80747838 85931833
43062H5931833L613607J280601q63774k458602l898200n481554o702639o864511
$$ 85931833 89545440 90826041 89962267 87503665 83605465 78123911 71421272 64556761
43054F4556761o097344n076078l988188k648184j442654j080055j362939j343324
$$ 64556761 58459417 53383339 49395151 46746967 45304313 44224258 42861319 41517995
43046D1517995r29788j147539k272894k843413j452469J183136K928255K662869
$$ 41517995 40588207 39440668 37167774 34324361 32871892 34055028 36983283 39646152
43038C9646152J190953r7629o93594j011180j531582k186149k425434j773975
$$ 39646152 40837105 40739476 40045882 39034702 37503120 35316971 32891537 31117562
43030C1117562l50937J128078J819530J230617m88756k427178l306030k546878
$$ 31117562 30766625 31894703 33714233 34944850 34456094 32028916 28722886 26176008
43022B6176008j005608j56306m08080p16887p9316J142211J848908J739853J519387
$$ 26176008 25170400 25014094 24606014 23889127 23809811 24952022 26800930 28540783 30060170
43013C0060170J648964J634143Q99494j48179n63583k08815O1943k77404o70365
$$ 30060170 31709134 33343277 34242771 34094592 33531009 33322194 33384137 33106733 32436368
43004C2436368n54150m71019j135501j843915j189766N56258J287086n9534j807829
$$ 32436368 31882218 31411199 30275698 28431783 27242017 27798275 29085361 29025827 27217998
42995B7217998j839248n13171J55358m57730j056354p58844k58651l31673o48816
$$ 27217998 25378750 24865579 25020937 24563207 23506853 22748009 22489358 22157685 21508869
42986B1508869p04888p48468r89835q21557K18262J324605J275919J66014n81477
$$ 21508869 20803981 20055513 19065678 18244121 18462383 19786988 21062907 21228921 20647444
42977B0647444L3813J441936K259985J793989N89894k97828l66209J0888J61405
$$ 20647444 20681257 22123193 24383178 26177167 26767061 26469233 26103024 26113912 26275317
42968B6275317j86593q10704j323793j400863r17424j44194L88277M92669N52995
$$ 26275317 26088724 25278020 23954227 22553364 21635940 21491746 21880023 22372692 22925687
42959B2925687Q75723J225331J473523K186499L707156M976435M414342K094595
$$ 22925687 23801410 25026741 26500264 28686763 32393919 37370354 41784696 43879291
42951D3879291k1366l98894M40825J112188J289807J593876K109667K056512R78723
$$ 43879291 43857925 43459031 43899856 45012044 46301851 47895727 50005394 52061906 53040629
42942E3040629m12558q81488L4171J485723K108923J471564O69458J203139L262975
$$ 53040629 52628071 51746583 51780754 53266477 55375400 56846964 57516422 58719561 61982536
42933F1982536N488672O496472O245603N746535N813794O352670O597521N827317
$$ 61982536 67471208 73967680 80213283 85959818 91773612 98126282 104723803 110551120
42925A10551120M012412J840055n9745j792774l734035n545141o346197o003633
$$ 110551120 114563532 116403587 116343842 114551068 110817033 105271892 98925695 92922062
42917I2922062n541180n857151o543816o483768n310048l781457k812817k498959
$$ 92922062 87380882 81523731 74979915 68496147 63186099 59404642 56591825 54092866
42909E4092866k154154j210260k6307L73113m48139j607789j852441j025936k4210
$$ 54092866 51938712 50728452 50702145 51075258 50627119 49019330 47166889 46140953 46116743
42900D6116743N42742Q74622J168372J169479Q15893N69859P28956J043941J370395
$$ 46116743 46659485 47534107 48702479 49871958 50687851 51257710 51986666 53030607 54401002
42891E4401002K035623L128535M059306M356688M411760M930766O036747P280076
$$ 54401002 56436625 59565160 63624466 67981154 72392914 77323680 83360427 90640503
42883I0640503Q117630Q123875P304832O482461O628279P392524P121619M977181
$$ 90640503 98758133 106882008 114186840 120669301 127297580 134690104 141811723 146788904
42875A46788904K261636Q33001Q82383J230455J289721J644126K908882M971181
$$ 146788904 149050540 149883541 150765924 151996379 153286100 154930226 157839108 162810289
42867A62810289P291201R230534J0248762J0448194J0628497J1006076J0199149
$$ 162810289 170101490 179332024 189580786 200028980 210657477 221663553 231862702
42860B31862702O538620M12291n612070r191868j0101369r725117r431027r600036
$$ 231862702 238401322 238813613 233201543 224009675 213908306 204183189 194752162 185152126
42852A85152126r598412q438439n859382k834134o59528L61945R33945J693779
$$ 185152126 175553714 167115275 161255893 158421759 157762231 158124176 159058121 160751900
42844A60751900K673074L548699L691043K165193j386801n785268r049518j0270898
$$ 160751900 163424974 166973673 170664716 172829909 171443108 165657840 156608322 146337424
42836A46337424j0104281r411699q338796o954071n793420n125495m323602k667450
$$ 146337424 136233143 126821444 118482648 111528577 105735157 100609662 96286060 93618610
42828I3618610m34398J370878K172536K247001K111726J940520J708113J668152
$$ 93618610 93184212 94555090 96727626 98974627 101086353 103026873 104734986 106403138
42820A06403138K351623L874066N424334N971905N608405N549195O423728P295657
$$ 106403138 108754761 112628827 118053161 124025066 129633471 135182666 141606394 148902051
42812A48902051P105660O395640O487575P390423P910544P782238Q178396R686564
$$ 148902051 156007711 162403351 168890926 176281349 184191893 191974131 200152527 209839091
42804B09839091J1148442J1305587J0536155R981702R717286Q888305P263177
$$ 209839091 220987533 232293120 242829275 252810977 262528263 271416568 278679745
42797B78679745N560867M220668K679277J62371l198456o283680p969873q233920
$$ 278679745 284240612 288461280 291140557 291302928 288104472 281820792 273850919 265616999
42789B65616999q300276r492480j1834065j3964808j4508486j3341537j1539715
$$ 265616999 257316723 247824243 235990178 222025370 207516884 194175347 182635632
42782A82635632j0387978j0470947j1367629j2057028j1777565j0547954q861589
$$ 182635632 172247654 161776707 150409078 138352050 126574485 116026531 107164942
42775A07164942p207470o088276n943649o489211o637820n820482m872096m669479
$$ 107164942 99957472 93869196 87925547 81436336 74798516 68978034 64105938 59436459
42767E9436459m500035l185860j429436j204690k690449l738318k983408j624525
$$ 59436459 54936424 51750564 50321128 49116438 46425989 42687671 39704263 38079738
42759C8079738j154489j110632m87492J20303m65519j874942k812410l074939
$$ 38079738 36925249 35814617 35327125 35447428 34981909 33106967 30294557 27219618
42751B7219618l284870l243333k304048r58591k75763m4735O84288J372149M13312
$$ 27219618 23934748 20691415 18387367 17428776 17153013 17108278 17792566 19164715 19578027
42742A9578027j893582k917247j170164J482135K293943J042503l56902o96027
$$ 19578027 17684445 14767198 13597034 15079169 17373112 18415615 18058713 17362686
42734A7362686m60783l76239l40486N332N02418O50109K59299k79081m06396j16088
$$ 17362686 16901903 16525664 16185178 16190510 16692928 17343037 17602336 17323255 16916859 16800771
42724A6800771m9588n34153p86930K29722K229182L745356M013787L766919L777270
$$ 16800771 16751183 16217030 15430100 15659822 17889004 21634360 25648147 29415066 33192336
42715C3192336L635465K761923J808838J947122L128501M140399M333756M297373
$$ 33192336 36827801 39589724 41398562 43345684 46474185 50614584 54948340 59245713
42707E9245713M590242M664573L593915J385142j042806l004979m568398n821440
$$ 59245713 63835955 68500528 72094443 73479585 72436779 69431800 64863402 59041962
42699E9041962o223939n251977l480614k303646k385645l014608l320886l413335
$$ 59041962 52818023 47566046 44085432 41781786 39396141 36381533 33060647 29647312
42691B9647312l643294l468742k226386p08576n49073j838650k708726j884588
$$ 29647312 26004018 22535276 20308890 19600314 19051241 17212591 14503865 12619277
42683A2619277m69441k65395j218511j696112q45269M68495J007117N46682j97621
$$ 12619277 12149836 11884441 10665930 8969818 8124549 8593044 9600161 10146843 9949222
42674I949222m27096P2112P31579O78979l00649j425204j808589j421857q25725
$$ 9949222 9522126 9594238 10325817 11004796 10704147 9278943 7470354 6048497 5222772
42665E222772l11353J82408N75062O42174L80216m8969n34420q09575m15335N94476
$$ 5222772 4911419 5093827 5668889 6311063 6691279 6642310 6107890 5298315 4882980 5477456
42655E477456J297550R28654k4067m20312J16365J048094J786087J881622Q27263
$$ 5477456 6775006 7703660 7679593 7259281 7375646 8423740 10209827 12091449 12918712
42646A2918712j200796k710717k321474p16043K17211J40741M70906J590147J882887
$$ 12918712 11717916 9007199 6685725 5969682 6186893 6327634 6798540 8388687 10271574
42637A0271574M80248r22245m77815J073986J827240J652511J687671J776041
$$ 10271574 10751822 9829577 9351762 10425748 12252988 13905499 15593170 17369211
42629A7369211Q02192o88593o76506J133406K504067J866225M07593j17881M1905
$$ 17369211 18171403 17482810 16806304 17939710 20443777 22310002 22717595 22599714 22641619
42620B2641619k99628r70581r10481j42375L87750N36895R97671J762962J998746
$$ 22641619 22341991 21371410 20460929 20318554 20706304 21243199 22240870 24003832 26002578
42611B6002578J534188J161080J166533P89264l26182j182463p70850K87034L80807
$$ 26002578 27536766 28697846 29864379 30653643 30327461 29144998 28374148 28661182 29041989
42602B9041989r51062k276642j888934J85532K106327K146846M89003j118820
$$ 29041989 28090927 25814285 23925351 24110883 26217210 28364056 28853059 27734239
42594B7734239j373836o53693j63800m51444j182485j848282k002490j166127
$$ 27734239 26360403 25706710 25542910 25091466 23908981 22060699 20058209 18892082
42586A8892082O21899K246292K383457J076576k75944o65419m79918n30356q47880
$$ 18892082 19513981 21760273 24143730 25220306 24944362 24278943 23799025 23268669 22420789
42577B2420789r51340p49724n81167o25191p34132p10507m66910k9196M67389
$$ 22420789 21469449 20719725 20138558 19513367 18779235 18068728 17601818 17572622 18040011
42568A8040011Q98531J238585J328469P87724l60258j212643q95055J46101O73152
$$ 18040011 18938542 20177127 21505596 22293320 21933062 20720419 19825364 19971465 20644617
42559B0644617M96941O37359J360900J405931l8141j763513k110826j241237n57228
$$ 20644617 21141558 21778917 23139817 24545748 24507607 22744094 20633268 19392031 18834803
42550A8834803m83294k56938L73488P13973M53322J45801J24368M4313j65766
$$ 18834803 18351509 18094571 18468059 19182032 19635354 19781155 19905523 19949836 19784070
42541A9784070O1166Q60596J379314Q89251j89808r69090j273954j506910j642512
$$ 19784070 19845236 20705832 22085146 22974397 22784589 21815499 20541545 19034635 17392123
42532A7392123j051812N71308K490177L416595K772908J323706L21434J09355
$$ 17392123 16340311 16911619 19401796 22818391 25591299 26915005 27236439 27345794
42524B7345794K0529l45240n34883k84785k46717r03604j524085j179459j46252
$$ 27345794 27366323 27021083 26486200 26201415 25954698 25051094 23527009 22347550 22201298
42515B2201298Q03200J776610K981550L261481J402419j319141k124804n43855
$$ 22201298 23004498 24781108 27762658 31024139 32426558 31107417 28982613 28438758
42507B8438758J033857J205327J417075K706108L182647J084316j590158j454146
$$ 28438758 29472615 30677942 32095017 34801125 37983772 39068088 37477930 36023784
42499C6023784J212369K791872J559069k63719j88842J339983K521210K930001
$$ 36023784 37236153 40028025 41587094 41323375 41134533 42474516 44995726 47925727
42491D7925727L210848L426228L238331K924049K898614K763217J969140J050914
$$ 47925727 51136575 54562803 57801134 60725183 63623797 66387014 68356154 69407068
42483F9407068J113807K238422L317787L485818K967940K470666K401198K859491
$$ 69407068 70520875 72759297 76077084 79562902 82530842 85001508 87402706 90262197
42475I0262197L850387N175758O365086O963311O862697O348094N898203N870535
$$ 90262197 94112584 99288342 105653428 112616739 119479436 125827530 131725733 137596268
42467A37596268O233330O656401O986027P515190Q588936J0039773J1276402J1908212
$$ 137596268 143829598 150485999 157472026 164987216 173576152 183615925 194892327 206800539
42459B06800539J2019546J1850760J1592966J1596909J2253784J3219809J3199807
$$ 206800539 218820085 230670845 242263811 253860720 266114504 279334313 292534120
42452B92534120J1313117Q561339O920866O678575N787094K709618j083680k894744
$$ 292534120 303847237 312408576 319329442 326008017 331795111 334504729 333421049 330526305
42444C30526305k601660k955483n891750j0191510j3464120j4966013j5406541
$$ 330526305 327924645 324969162 319077412 308885902 295421782 280455769 265049228
42437B65049228j5223788j4504051j3837178j3731031j3539712j2351254j0720440
$$ 265049228 249825440 235321389 221484211 207753180 194213468 181862214 171141774
42430A71141774j0125120j0699385j0887825r645300p780599o649750o501854
$$ 171141774 161016654 150317269 139429444 129784144 122003545 115353795 108851941
42423A08851941o668637o621518o280803n814654n549433n657012n732084n201177
$$ 108851941 102183304 95561786 89280983 83466329 77916896 72259884 66527800 61326623
42415F1326623m268208l770969l891649l760439k711463j284753n59156r93181
$$ 61326623 57058415 53287446 49395797 45635358 42923895 41639142 41079986 40086805
42407D0086805k222469l450992l780547k815645j326296p04912j369233k275078
$$ 40086805 37864336 34413344 30632797 27817152 26490856 25785944 24416711 22141633
42399B2141633k339402j640958q03936n7244L77477k35891k183770m146696m085877
$$ 22141633 19802231 18161273 17357337 17300093 17677570 17441679 15257909 11111213 7025336
42390G025336j449717K074544M083575L424988Q82836j591800k449728j813256
$$ 7025336 5575619 7650163 11733738 15158726 16041562 14449762 12000034 10186778
42382A0186778j170928j569600k354897k077971l91738J489458K182888J551247
$$ 10186778 9015850 7446250 5091353 3013382 2621644 4111102 6293990 7845237
42374G845237O16972L08020M86218L34111l47386p19205k37472J16754r96852
$$ 7845237 8462209 8770229 9256447 9590558 9243172 8523967 8286495 8403249 7406397
42365G406397k971374l454068j372924J398803K267008R41456p22948j230179
$$ 7406397 4435023 980955 -391969 1006834 3273842 4215298 3492350 2262171
42357B262171p16429j09075k1758l83263n11175K46757J524425K117584J641663
$$ 2262171 1545742 1436667 1414909 1031646 520471 767228 2291653 4409237 6050900
42348F050900J195291J590785J869248P86833j010145j815686j375727r21627
$$ 6050900 7246191 8836976 10706224 11493057 10482912 8667226 7291499 6369872
42340F369872r30434o18139K18099N95612M6405o08525p86719j029616j603621
$$ 6369872 5439438 4821299 5039398 5635010 5681415 5072890 4286171 3256555 1652934
42331A652934j546931j64064J508714J862633P61275n10240r30429n91385j43026
$$ 1652934 106003 -58061 1450653 3313286 4074561 3564321 2633892 2042507 1899481
42322A899481o637k2580L46365J183639J587049P24394o01316o32300P29886J362356
$$ 1899481 1892844 1870264 2216629 3400268 4987317 5711711 5110395 4478095 5207981 6570337
42312F570337j40918k215949k353772n03734J124038J204348N61649K66407J14608
$$ 6570337 6429419 4213470 1859698 1355964 2480002 3684350 4245999 4512406 4627014
42303D627014m00801q85934p79336n33545r98576j880577j823933k69096J502842
$$ 4627014 4226213 3340279 2560943 2027398 1028822 -851755 -2675688 -2944784 -1441942
42294a441942J767161M94347n80412q9351J389413K219179J651881L45787p01539
$$ -1441942 325219 819566 239154 149803 1539216 3758395 5410276 5756063 5054524
42285E054524j053524q00476k80311J19789L08271N46145Q16598N39655m69066
$$ 5054524 4001000 3200524 2920213 3040002 3348273 3894418 4711016 5250671 4781605
42276D781605j237081p65902M31556J017613P69961N44140M82362j56391j224477
$$ 4781605 3544524 2778622 3210178 4227791 4997752 5541892 6024254 5867863 4643386
42267D643386j421047l31612P80945Q95508N30202L93868J70331m51097q50946
$$ 4643386 3222339 2890727 3671672 4567180 5097382 5491250 5661581 5210484 4359538
42258D359538n61479j05809Q5485L48804O27646J45276r08812j122806l47277
$$ 4359538 3798059 3692250 3777735 4126539 4754185 4899461 3990649 2867843 2520566
42249B520566l97932j857671k477311q09319Q75744M6999j750926j376355O57718
$$ 2520566 2122634 264963 -2212348 -3021667 -2145923 -2098924 -3849850 -5226205 -4568487
42240d568487J245438M6582l75210M94883L75547j079239j101288J279861L068182
$$ -4568487 -3323049 -3276467 -3651677 -3156794 -2781247 -3860486 -4961774 -3681913 -613731
42231f13731K024471J59743J46948J154289R49204j72291m37827P1821q0734r23651
$$ -613731 1410740 1570483 1717431 2871720 3820924 3648633 3210806 3282627 3201893 2278242
42221B278242j237195p67405k55891J29781O73247J007950O23678r0164m58246
$$ 2278242 1041047 273642 17751 147532 820779 1828729 2452407 2362243 1903997
42212A903997m45426j22864O36998J120142O3516j936314k290187j97888J590457
$$ 1903997 1458571 1335707 1972705 3092847 3156363 1220049 -1070138 -1268026 322431
42203C22431P93366q21724m71906J055818J079314k46468n17604M45861M66746
$$ 322431 1115797 294073 -177833 877985 1957299 1710831 1193227 1639088 2105834
42194B105834q41644j397561m27450L90170J21327j74663r4518p37988j928002
$$ 2105834 1264190 -133371 -560821 -170651 -49324 -223987 -318505 -1056493 -2984495
42185b984495j562128Q61393K717160J909549j59876r66726k85364M75295P29020
$$ -2984495 -4546623 -3685230 -968070 941479 781603 -185123 -470487 4808 733828
42176G33828P78031O39009K87618J33706K12676o1956o05360m70288L39983M98989
$$ 733828 1511859 2150868 2438486 2572192 2784868 2722912 2117552 1647264 1987247 2486236
42166B486236l27724n96334N52135J672728J354206M28189K61256N08465L63094
$$ 2486236 2158512 1562178 2114313 3787041 5141247 5569436 5830692 6339157 6702251
42157F702251N02010J725188K885456K347886O82775j10255N61580J608208K150878
$$ 6702251 7204261 8929449 11814905 14162791 14845566 14735311 15296891 16905099 19055977
42148A9055977J961857P40542j193062k099149o39643J915384L109413K507841
$$ 19055977 21017834 21758376 20565314 18466165 17826522 19741906 22851319 25359160
42140B5359160J660517J303868O78238m58554j187641j098392r48120j329854
$$ 25359160 27019677 28323545 29001783 28543229 27355588 26257196 25309076 23979222
42132B3979222j987962k555103k775700k182180q55560j36018j030526k329330
$$ 23979222 21991260 19436157 16660457 14478277 13622717 13486699 12456173 10126843
42124A0126843k120915q15106n15796j514343j837291o19502N28713L15800l18798
$$ 10126843 8005928 7190822 6675026 5160683 3323392 2703890 3232603 3548403 3229605
42115C229605j69851L42670M86030O64766J241463J468382R29917N78273R34553
$$ 3229605 3059754 3402424 3888454 4553220 5794683 7263065 8192982 8771255 9705808
42106I705808P27716j013405k799537k551892p60728K26194l87914j089952o50040
$$ 9705808 10433524 9420119 6620582 4068690 3307962 3534156 3146242 2056290 1406250
42097A406250K77483M90866j42132r03933j224677j070885q01126p20920n10499
$$ 1406250 1683733 2174599 2032467 1128534 -96143 -1167028 -1968154 -2689074 -3199573
42088c199573N17839K100137K629380J079748j163905j724726l86771N93820l26975
$$ -3199573 -2681734 -581597 2047783 3127531 1963626 238900 -147871 445949 118974
42079A18974j850676j765002l9543J234930O79626p97730j482617r36544L7187
$$ 118974 -1731702 -3496704 -3536247 -2301317 -1621691 -2419421 -3902038 -4838582 -4801395
42070d801395Q58823J603155K093934J683978L98269n86017l74417L53488L90762
$$ -4801395 -3942572 -2339417 -245483 1438495 1836764 1250747 876330 1229818 1620580
42061A620580j62153k32494L40207N69115M0926m23309j82943L07926N00030O12097
$$ 1620580 1458427 1225933 1566140 2135255 2176181 1752872 1569929 1877855 2377885 2989982
42051B989982Q98216R92031O21610J41878k25058p90433j444701j321913k05219
$$ 2989982 3888198 4880229 5501839 5643717 5418659 4628226 3183525 1861612 1656393
42042A656393P34788N50914q2674j37681P7744k05553n43244p9090N94906J66482
$$ 1656393 2391181 2942095 2859421 2721740 2799484 2593931 2050687 1971597 2566503 2732985
42032B732985j065137j413109m52962L24486o2134o39892k10593Q19444J262281
$$ 2732985 1667848 254739 -198223 126263 64129 -575763 -786356 33088 1295369
42023A295369P89450j50845j209510j998908j789743l84893J127276J466564P76612
$$ 1295369 2084819 1933974 724464 -1274444 -3064187 -3449080 -2321804 -855240 -78628
42014g8628K72590M25874M32236l87523j491344j840099j225410m21657k17191
$$ -78628 193962 619836 1052072 664549 -826795 -2666894 -3892304 -4313961 -4531152
42005d531152o16689r30258m77209P18373J833961J999483J247999M86749L49336
$$ -4531152 -5147841 -6078099 -6555308 -5836935 -4002974 -2003491 -755492 -268743 80593
41996H0593M36458J12996l26213j03949N38299L97724p63065j514135q53449M4838
$$ 80593 517051 630047 303834 199885 738184 1135908 372843 -1141292 -1994741 -1949903
41986a949903m47048j659910j409897N99392K101773J494928k8695n39096p7839
$$ -1949903 -2396951 -4056861 -5466758 -4867366 -2765593 -1270665 -1299360 -1838456 -1916295
41977a916295j428o65953j205215j032193k90170Q02590J919639K239443J185360
$$ -1916295 -1917723 -2583676 -3788891 -4821084 -5111254 -4308664 -2389025 -149582 1035778
41968A035778n65940j684104j651859r47687j28311M59835M38676j94829o77645
$$ 1035778 469838 -1214266 -2866125 -3813812 -3942123 -3482288 -3043612 -3238441 -3916086
41959c916086l63892K83917M40783K76305N63620J257717J571871J274011Q11112
$$ -3916086 -4279978 -3996061 -3555278 -3278973 -2715353 -1457636 114235 1388246 2199358
41950B199358L09040m10623r34601o02293K16934L64792m54690j325534j507845
$$ 2199358 2508398 2097775 1163174 560881 777815 1142607 687917 -637617 -2145462
41941b145462j124742m36722M24462R35073N99138r466J29370P53097O52750j22605
$$ -2145462 -3270204 -3706926 -3282464 -2347391 -1748253 -1757719 -1628349 -875252 -222502 -345107
41931c45107j28740R21692J316103J64j611107j776219r51025o37228q47664m60258
$$ -345107 -473847 447845 1763948 1764112 153005 -1623214 -2574239 -3211467 -4059131 -4519389
41921d519389O07200J305417J200387P62566R9845j064580k094186j637917L76620
$$ -4519389 -3912189 -2606772 -1406385 -643819 -543974 -1608554 -3702740 -5340657 -4964037
41912d964037K093989J768003k37459k051846k394017j506971l23552O50868J483409
$$ -4964037 -2870048 -1102045 -1339504 -3391350 -5785367 -7292338 -7615890 -6965022 -5481613
41903e481613K208623K514884K192957J608779J303947J195048O79616l67420
$$ -5481613 -3272990 -758106 1434851 3043630 4347577 5542625 6222241 5854821
41895E854821j243411j323421q45160m34545k35020L6658L62837K15921p85299
$$ 5854821 4611410 3287989 2442829 2008284 1773264 1809922 2172759 2388680 1603381
41886A603381k121318k495841j088093J227475K491651J896907P26819L51556
$$ 1603381 -517937 -3013778 -4101871 -2874396 -382745 1514162 2240981 2592537
41878B592537J56277j182189l002109l191223j417327K57736N56396P16662J939458
$$ 2592537 2748814 1566625 -1435484 -4626707 -6044034 -5786298 -5229902 -4513240 -2573782
41869b573782K994675K087181j71817j522538j079961M5001O70782N86981j2660
$$ -2573782 420893 2508074 2336257 813719 -266242 -221241 449541 1036522 1023862
41860A023862p56528r18865j73104O84785P80293N25357P91022J184822O16569
$$ 1023862 267334 -651531 -824635 -139850 640443 1165800 1956822 3141644 3758213
41851C758213n99252p99978N63450J836583J149568j272228l286656k984988n56554
$$ 3758213 3158961 2358983 2922433 4759016 5908584 4636356 1349700 -1635288 -2191842
41842b191842J774930J931112L06073p50686j35034N19482m73957k028194j933700
$$ -2191842 -416912 1514200 1820273 1069587 934553 1454035 980078 -1048116 -2981816
41833b981816m11523K78620m96820r09306J35937J277323J100852L21345K70983
$$ -2981816 -3393339 -3114719 -3611539 -4520845 -4384908 -3107585 -2006733 -1685388 -1414405
41824a414405O92573M93155k92227o84727l38588J97761M28805K76045j39830
$$ -1414405 -721832 -228677 -520904 -1205631 -1544219 -1346458 -917653 -641608 -781438
41815g81438m21200n3729P52141R48106P0235q28801n58009L75902L97867q12028
$$ -781438 -1202638 -1256367 -504226 443880 514115 -314686 -872695 -496793 -98926 -910954
41805i10954j753938j177541J83145O26641k17292r50006l42098J046469J727044
$$ -910954 -2664892 -3842433 -3659288 -3032647 -3249939 -4199945 -4542043 -3495574 -1768530
41796a768530J285698O78075O50533Q66255Q22359O13249K96911m81789j532269
$$ -1768530 -482832 195243 845776 1712031 2534390 3147639 3444550 2962761 1430492
41787A430492j790792q59517J08603J25066r2346L65312O61577l80013j821646
$$ 1430492 -360300 -1219817 -1111214 -986148 -1078494 -713182 -51605 -431618 -2253264
41778b253264j768156m87489o525p36780r86910n6860O98723M67813K13918N31186
$$ -2253264 -4021420 -4508909 -4515434 -5252214 -6239124 -6295984 -5597261 -5129448 -4915530 -4384344
41768d384344O67449O35104J746403L684458L631075L02138l340435l724225j296920
$$ -4384344 -3716895 -3081791 -1335388 2349070 5980145 6282283 2941848 -782377 -2079297
41759b079297P99471J146853O41780l9104q14607q52106M45526J579948O81528
$$ -2079297 -1279826 -132973 508807 469703 -344904 -1197010 -751484 828464 1509992
41750A509992j234187j415143K98392J144984j23378j331235n37374Q68115M69581
$$ 1509992 275805 -1139338 -840946 304038 180660 -1150575 -1687949 -819834 -350253
41741c50253j466475k530461j578160Q8138P40276K05790l55098j5808Q90683
$$ -350253 -1816728 -4347189 -5925349 -5837211 -5096935 -4891145 -5246243 -5262051 -4371368
41732d371368J291584P76906M1100k78760m81131q69194p53915M42126J645415
$$ -4371368 -3079784 -2302878 -2261778 -2540538 -3021669 -3890863 -4644778 -4202652 -2557237
41723b557237J188187p23114k048183j545175m3816J086339J392225R36641j93869
$$ -2557237 -1369050 -2092164 -4140347 -5685522 -5729338 -4642999 -3250774 -2314133 -2508002
41714b508002j344541j346661J14874J856309K449293J630844K46736o40221n02341
$$ -2508002 -3852543 -5199204 -5084330 -3228021 -778728 852116 1098852 458631 -43710
41705d3710J97031L87124j62213k44188R36720J975627R59943j416382k472954
$$ -43710 153321 540445 378232 134044 1070764 3046391 4006334 2589952 116998
41696A16998j354519j1J85219K25291J058309J476275L55225r56415o64463M21803
$$ 116998 -1237521 -1237532 -1052313 -827022 231287 1707562 2062787 1106372 441909 863712
41686H63712K54038r03892q53521P85473J687053K72273j923972k400524r25985
$$ 863712 1117750 213858 -639663 145810 1832863 2105136 181164 -2219360 -3145345
41677c145345N45085N57034l15403n93043J54538R09255O82569r8701k13458N51297
$$ -3145345 -2600260 -2043226 -2358629 -2951672 -2797134 -1887879 -1205310 -1304011 -1517469 -966172
41667i66172J082162O05513k64815o20445m70421j55624N22122J566347J947637
$$ -966172 115990 721503 456688 -163757 -634178 -789802 -267680 1298667 3246304
41658C246304Q07230q97701j300907j06314J093152J104484N25003M10323O09426
$$ 3246304 4053534 3155833 1854926 1748612 2841764 3946248 4471251 4881574 5491000
41649E491000K46047o93101j159194m87658N42679N28869p66465j931710j548801
$$ 5491000 5737047 5043946 3884752 3397094 3939773 4468642 3702177 1770467 221666
41640B21666L4444J172696R63545N4803m95454k32613Q07338K030996J958715
$$ 221666 256110 1428806 2392351 2447154 1951700 1719087 2526425 4557421 6516136
41631F516136m73260l656363m089271p08742L038258L195637K67317j830595j065381
$$ 6516136 6042876 2386513 -1702758 -2411500 626758 3822395 4089712 2259117 1193736
41622A193736P33782J076702k01873j620805j989073j042809N53545J371276N12727
$$ 1193736 1927518 3004220 2802347 1181542 -807531 -1850340 -1296795 74481 587208
41613E87208r79665j175257J27222J179663Q90118J11529j17215l9577j64734
$$ 587208 -392457 -1567714 -1440492 -260829 629289 740818 623603 584026 419292
41604D19292k06252J05912L85572N49955J158746K004815J789556K30504r68912
$$ 419292 213040 318952 704524 1254479 2413225 4418040 6207596 6438100 5469188
41595E469188n81271J05934o26403k010391j992887n97694J26757o87258j679137
$$ 5469188 4887917 4993851 4367448 2357057 364170 -233524 -106767 -794025 -2473162
41586b473162j624853r59154m39755M4116N98677O67331J54199J03761J243182
$$ -2473162 -4098015 -5057169 -5496924 -5452808 -4854131 -4186800 -4032601 -3928840 -2685658
41577b685658K598511K558512R05509j008332j842322j403262m41150J20794j07405
$$ -2685658 -87147 2471365 3376874 2368542 526220 -877042 -1318192 -1197398 -1304803
41568a304803n90326l08856R98226K172632J730006l00784k088052j902957j27482
$$ -1304803 -1895129 -2203985 -1205759 966873 2696879 2396095 308043 -1594914 -1722396
41559a722396J120720M88379j019718j458976n14018L50854K82708K59603J265554
$$ -1722396 -601676 -113297 -1133015 -2591991 -3106009 -2755155 -2472447 -2212844 -947290
41550i47290K458678K396921J296368N70523N29090J79905o98447r94327j98656
$$ -947290 1511388 3908309 5204677 5775200 6304290 6484195 5785748 4791421 4592765
41541D592765O34892N84131K11130L77747Q43049R49231O73462P2113j226417
$$ 4592765 5227657 5811788 6022918 6400665 7243714 8192945 8866407 8938520 7712103
41532G712103k860364l195780j412509P96681J286993M63260L05066R92039Q75549
$$ 7712103 4851739 1655959 243450 1040131 2327124 2790384 3095450 4087489 4963038
41523D963038k45871m66943R09394J908531J064544j60545J5409N55759n12448
$$ 4963038 4717167 4250224 5159618 7068149 8132693 7972148 7987557 8543316 8030868
41514H030868k361240k330634k06481J295246O64822l56085J68782J449845J580276
$$ 8030868 5669628 3338994 3132513 4427759 5092581 4736496 4905278 6355123 7935399
41505G935399M73734m91410p45151p73326o79744q4140P52860J068469Q41752
$$ 7935399 8409133 7917723 7172572 6399246 5719502 5635362 6388222 7456691 8298443
41496H298443P23678O98180j1300j474736k577311k427555j383055k63269O20929
$$ 8298443 9022121 9720301 9709001 8234265 5656954 3229399 1846344 1583075 2204004
41487B204004J140278Q90732j36705r88050p37643K08996O06909N2221o05508
$$ 2204004 3344282 4235014 4098309 3110259 2372616 2581612 3188521 3240742 2635234
41478B635234n63120j7603L92137M08258N0874o79223j417887j260874J90544
$$ 2635234 2072114 2054511 2446648 2854906 2905780 2226557 808670 -452204 -261660
41469b61660J790912J821051K22443j017976k83843J543172K184136Q00867j198077
$$ -261660 1529252 3350303 3572746 2554770 2270927 3814099 5998235 6799102 5601025
41460E601025k083540j573812n06389L29060N49217O3326p79671j304673j217743
$$ 5601025 3517485 1943673 1437284 1766344 2315561 2378887 1599216 294543 -923200
41451i23200q85013o50205l83152j1621J57331R8122L15659Q47281Q68790J37892
$$ -923200 -1808213 -2458418 -2841570 -2853191 -2695860 -2597738 -2282079 -1434798 -566008 -428116
41441d28116j07970J039668K259070J592275n02702j626392r24338k0582q7403
$$ -428116 -536086 503582 2762652 4354927 3852225 2225833 1301495 1280913 1193510
41432A193510j90983M67687P73030k54774j340661q64717L52976L67989o23890
$$ 1193510 1002527 1470214 2243244 1988470 647809 -216908 136068 504057 -119833
41423a19833p38978K20716M07839p32550j243151J85526J880357J573962k58052
$$ -119833 -858811 -638095 -230256 -962806 -2205957 -2020431 -140074 1433888 1175836
41414A175836j190864k39335J212304J655627J192547Q00543Q86235J004546N15725
$$ 1175836 -15028 -254363 957941 2613568 3806115 4606658 5492893 6497439 7013164
41405G013164p22907k033252k288494r89920R97490K134026J698051L51095p53231
$$ 7013164 6290257 4257005 1968511 978591 1976081 4110107 5808158 6159253 5406022
41396E406022j091827r41555p65493p06590o29680m35673j81394N7401K25918
$$ 5406022 4314195 3372640 2607147 1900557 1270877 835204 653810 711211 937129
41387I37129J34569m24213j142335j114567J63728J851348K461778J570458J92658
$$ 937129 1071698 647485 -494850 -1609417 -1445689 405659 2867437 4437895 4630553
41378D630553o56653j010919j228965j080469l09261M65395L67636m05525p61027
$$ 4630553 3973900 2962981 1734016 653547 344286 809681 1177317 771792 10765
41369A0765k61034K95473J04840m41673k41680J073321K507913K554730P25349
$$ 10765 -250269 45204 150044 -291629 -533309 540012 3047925 5602655 6328004
41360F328004j675585k538609j082320J125341J756380L35054j269295j116007
$$ 6328004 4652419 2113810 1031490 2156831 3913211 4248265 2978970 1862963
41352A862963N84097J914610J549903M3864j129252j299184j066070j256078j841860
$$ 1862963 2447060 4361670 5911573 5955437 4826185 3527001 2460931 1204853 -637007
41343f37007k112834j685800r09203k03330N10946J347140J768826J007583p91192
$$ -637007 -2749841 -4435641 -5344844 -5548174 -5037228 -3690088 -1921262 -913679 -1704871
41334a704871k343298k394177r13597R52204J915642J534090M55984k25221l7862
$$ -1704871 -4048169 -6442346 -7355943 -6403739 -4488097 -2954007 -2498023 -2723244 -2761106
41325b761106M76666O13110M75589O02225Q40443M61620m61159p71192R0092R46869
$$ -2761106 -2284440 -1671330 -1195741 -593516 246927 708547 247388 -523804 -433712 513157
41315E13157L59478j292195k287746j903491j069689n91062j7985J068872J764857
$$ 513157 872635 -419560 -2707306 -4610797 -5680486 -6271548 -6289533 -5220661 -3455804
41306c455804R93559o00180j212023l32809N56959J82353o45523k36863J433088
$$ -3455804 -2462245 -3062425 -4274448 -4607257 -4050298 -3867945 -4513468 -4750331 -3317243
41297c317243K519548J742922N4092p16683k58838P6258n67823j260993p10171
$$ -3317243 -797695 945227 999319 282636 23798 100056 -467767 -1728760 -2438931
41288b438931P00920J303889N08994k89427L24655J762603K286371J417825L28690
$$ -2438931 -1738011 -434122 74872 -214555 110100 1872703 4159074 5576899 5905589
41279E905589j27883m76371j234124j675923r77999K35605P30222N53796P03260
$$ 5905589 5777706 5301335 4067211 2391288 1413289 1648894 2379116 2932912 3636172
41270C636172J090092M48777j375687k603098j849723p3484Q97253P93719N61074
$$ 3636172 4726264 5175041 3799354 1196256 -653467 -726951 170302 964021 1525095
41261A525095L48943n15942j777424k110359j025117L85533J005879Q70316L64979
$$ 1525095 1874038 1358096 -419328 -2529687 -3554804 -3169271 -2163392 -1293076 -928097
41252i28097n15656j407036j226110L35841J779393J469049j33529j111985p06371
$$ -928097 -1443753 -2850789 -4076899 -3741058 -1961665 -492616 -626145 -1738130 -2444501
41243b444501q229k194j97085K98883J325966K018744J984803J429647N40629
$$ -2444501 -2452730 -2454924 -2652009 -2353126 -1027160 991584 2976387 4406034 4946663
41234D946663m91505j064329o06930M64801R35514K47907p89065j221631j366503
$$ 4946663 4455158 3390829 2783899 3248700 4184214 4432121 3643056 2421425 1054922
41225A054922k140575l114521k420364P17098M186932M934762K556148k31163
$$ 1054922 -1085653 -4200174 -6620538 -5903440 -1716508 3218254 5774402 5543239
41217E543239r76629k02868P143q84275j514046j013549k50674k58375n88239
$$ 5543239 4566610 4363742 4370885 3486610 1972564 959015 708341 449966 -138273
41208a38273j29970J042831J665325J010567k57125j152921j531787j679012j327414
$$ -138273 -268243 774588 2439913 3450480 3193355 2040434 508647 -1170365 -2497779
41199b497779K0439J826319K492811J147124j046721k035234j168092K83546Q68844
$$ -2497779 -2477340 -651021 1841790 2988914 1942193 -93041 -1261133 -977587 -108743
41190a08743N19517J27703J82659L76375L04950J1016k37298l97252p05776j298568
$$ -108743 410774 538477 721136 1097511 1402461 1413477 1176179 778927 73151 -1225417
41180a225417j829751j626489m12030J200467K197081K140766J424975O18101
$$ -1225417 -3055168 -4681657 -5093687 -3893220 -1696139 444627 1869602 2487703
41172B487703r4131p96613j531205k184505k474891k127937j304718n86003j35698
$$ 2487703 2393572 1596959 65754 -2118751 -4593642 -6721579 -8026297 -8612300 -8747998
41163h747998O56326J969668K553057J225490q53680j105238R20247K600595J687584
$$ -8747998 -8091672 -6122004 -3568947 -2343457 -3197137 -4302375 -3382128 -781533 906051
41154I06051p88898k178757j509687J44802J511221J944839J288910K46149Q3221
$$ 906051 117153 -2061604 -3571291 -3426489 -1915268 29571 1318481 1564630 1647851
41145A647851P60175M54743j611393l242599k203236J55123P86833m12301r02432
$$ 1647851 2408026 2862769 1251376 -1991223 -4194459 -4039336 -3252503 -3664804 -4567236
41136d567236m3680J08042j036702j156044R49371K945087K440894L95374r54780
$$ -4567236 -4610916 -4502874 -5539576 -6695620 -5746249 -2801162 -360268 35106 -919674
41127i19674j418775j926430k088237j056539M35268J096037J176899J605196
$$ -919674 -2338449 -4264879 -6353116 -7409655 -6974387 -5878350 -4701451 -3096255
41119c096255J973394J315084M2005p38219j031848j333919j119824J55727J450135
$$ -3096255 -1122861 192223 234228 -503991 -1535839 -2869758 -3989582 -3833855 -2383720
41110b383720J498078R18525R26244R20282k93206j783142j723264p12390q85866
$$ -2383720 -885642 32883 959127 1879409 1586203 -196939 -1920203 -2632593 -3518459
41101c518459k005261j667008L93550J560853O78015j39025O29576J255607r5586
$$ -3518459 -5523720 -7190728 -6797178 -5236325 -4558310 -4697335 -4067759 -2812152 -2907738
41092b907738k081798k323482r98304m2127q5449k86697k19271M3441J002215
$$ -2907738 -4989536 -7313018 -8311322 -8353449 -8438898 -8725595 -8944866 -8901425 -7899210
41083g899210L043984N052121N235897L238443M55283j431477j581887l52794
$$ -7899210 -4855226 196895 5432792 8671235 9126518 7695041 6113154 5760360
41075E760360P67286L87746r69150j317007j20102O74412m48316k202797k571961
$$ 5760360 6527646 6915392 5946242 4629235 4509133 5183545 4735229 2532432 -39529
41066c9529j797056j374672j245794k82364J096738J220489k7754r27600o89732
$$ -39529 -1836585 -3211257 -4457051 -4739415 -3642677 -2422188 -2449942 -3377542 -4067274
41057d067274m71923j087172j533609p39127O02236J038769L93849j98500O2558
$$ -4067274 -4539197 -5626369 -7159978 -7899105 -7296869 -6258100 -5864251 -6062751 -6000193
41048f000193P03485P11387r9770o99911o9322J318490J925344J200853K55060
$$ -6000193 -5296708 -4585321 -4685091 -5385002 -5454324 -4135834 -2210490 -1009637 -754577
41039g54577L8006N233n39888r50823l70846N99836Q44398N32043M04340P6894
$$ -754577 -716571 -711338 -1251226 -2202049 -2572895 -1973059 -1128661 -596618 -192278 -115384
41029a15384j040041j774094m43742K070051K868851R85147j370876k028411j235264
$$ -115384 -1155425 -2929519 -3373261 -1303210 1565641 2550788 1179912 -848499 -2083763
41020b083763j45417R09460J543763P26390j396356k640466j426778Q31844J598255
$$ -2083763 -2229180 -1319720 224043 950433 -445923 -3086389 -4513167 -3681323 -2083068
41011b083068N98657k85890L3264O22181J89097j218066k364714k080794m05065
$$ -2083068 -1484411 -1770301 -1737037 -1114856 -925759 -2143825 -4508539 -6589333 -6994398
41002f994398J245658J451292N14532O2833P02124J221522O91359j9489J48907
$$ -6994398 -5748740 -4297448 -3782916 -3720083 -3017959 -1796437 -1105078 -1124567 -975660
40993i75660O35839M89288K93473J072264K012224J307980r47944k661657k622792
$$ -975660 -339821 149467 442940 1515204 3527428 4835408 3887464 1225807 -1396985
40984a396985j693003q63413O41Q49608P09956o01785j438405l99495J490350
$$ -1396985 -3089988 -3953401 -3952760 -3103152 -2393196 -2994981 -4433386 -4832881 -3342531
40975c342531K099674J063834r8152l98924l93948o78915q15972l58247J17439
$$ -3342531 -1242857 -179023 -277175 -676099 -1070047 -1748962 -2564934 -2923181 -2805742
40966b805742j33941p49402p18623J45867R95869J172002R37759Q21243P96899
$$ -2805742 -2939683 -3689085 -4407708 -4261841 -3265972 -2093970 -1156211 -334968 461931
40957D61931M84028j44960o19986m89274J68562P33068O00247j01620n12447q7867
$$ 461931 945959 800999 181013 -308261 -139699 593369 1193616 1091996 579549 491682
40947D91682N40251L42986n28878p99977K6183P46723J43409j109266j183946
$$ 491682 1031933 1374919 846041 46064 72247 818970 962379 -146887 -1330833
40938a330833N13072K517123K832511Q02955k307971m157195l174151j83704K213237
$$ -1330833 -817761 1699362 4531873 5334828 3026857 -1130338 -4304489 -4488193 -2274956
40929b274956K397542J222144J70291p78818k098384k698170j199406J199746
$$ -2274956 122586 1344730 1515021 736203 -1362181 -4060351 -5259757 -4060011
40921d060011J670797j09238j265608q9056J312009L63316j918650k447141n35929
$$ -4060011 -2389214 -2498452 -3764060 -3853116 -2541107 -2177791 -4096441 -6543582 -7079511
40912g079511J441079J530824L61737l63178j4982Q04196J311570J270772J053530
$$ -7079511 -5638432 -4107608 -3745871 -4109049 -4124031 -3319835 -2008265 -737493 316037
40903C16037J102089J207671O75294n39393j448753j270618m74240m3153k53382
$$ 316037 1418126 2625797 3301091 2761698 1312945 42327 -431913 -475066 -728448
40894g28448p17845j026419q09001J17676J106470J042621j4787n87131K3026
$$ -728448 -1446293 -2472712 -3281713 -3164037 -2057567 -1014946 -1029733 -1616864 -1593838
40885a593838N00316l72672j618812j609109o03900P0964M57246J411096K229797
$$ -1593838 -1093522 -1466194 -3085006 -4694115 -5298015 -5227051 -4769805 -3358709 -1128912
40876a128912J299295r42035k136538j486114p61721j113388j165032M32077K458354
$$ -1128912 170383 -771652 -2908190 -4394304 -5156025 -6269413 -7434445 -7002368 -4544014
40867d544014K815915J483662J29944l80910n20071o25015l96561J55935L85247
$$ -4544014 -1728099 -244437 -114493 -495403 -1015474 -1640489 -2037050 -1881115 -1495868
40858a495868j42975j062537j574401j106988K43162J636132K054967J234273
$$ -1495868 -1638843 -2701380 -4275781 -5382769 -5139607 -3503475 -1448508 -214235
40850b14235j03124j024733j164578p42334k26257m1014k32809m23631m25859
$$ -214235 -317359 -1342092 -2506670 -3249004 -3475261 -3516275 -3749084 -4172715 -4598574
40841d598574o37601j261326j518428n86850R07103J502426J003024O80146J157946
$$ -4598574 -5236175 -6497501 -8015929 -8602779 -7695676 -6193250 -5190226 -4510080 -3352134
40832c352134J473057P99948j53567k97629K82503P57520P26738K05980p33122
$$ -3352134 -1879077 -1079129 -1232696 -1530325 -1247822 -490302 236436 442416 -290706
$$ [...]
##END NTUPLES=NMR SPECTRUM
##END=
