##TITLE=31Pdec_DE-163_oil_TFA
 DMSO-d6+CCl4, 64 sc
 10.7.2026
##JCAMPDX= 6.0         $$ Bruker NMR JCAMP-DX V2.0
##DATA TYPE= NMR SPECTRUM
##DATA CLASS= NTUPLES
##ORIGIN= UXNMR, Bruker Analytische Messtechnik GmbH
##OWNER= root
$$ XWIN-NMR		Version 3.5
$$ Fri Jul 10 14:40:24 2026 Russian Standard Time (UT+4h)  she@DPX200
##.OBSERVE FREQUENCY= 81.013821
##.OBSERVE NUCLEUS= ^31P
##.ACQUISITION MODE= SIMULTANEOUS
##.ACQUISITION SCHEME= undefined
##.AVERAGES= 64
##.DIGITISER RES= 17
##SPECTROMETER/DATA SYSTEM= spect
##.PULSE SEQUENCE= zgpg30
##.SOLVENT NAME= DMSO
##.SHIFT REFERENCE= (INTERNAL, DMSO, 0, 197.392)
##AUDIT TRAIL= $$ (NUMBER, WHEN, WHO, WHERE, WHAT)
$$ ##TITLE= Audit trail, XWIN-NMR		Version 3.5
$$ ##JCAMPDX= 5.01
$$ ##ORIGIN= Bruker BioSpin GmbH
$$ ##OWNER= she
$$ F:/spectra/data/she/nmr/P31/2/pdata/1/auditp.txt
$$ ##AUDIT TRAIL=  $$ (NUMBER, WHEN, WHO, WHERE, WHAT)
(   1,<2026-07-10 14:38:45.70 +0400>,<she>,<DPX200>,
      <created by zg, POWCHK disabled, PULCHK disabled
       configuration hash MD5:
       00 E9 B6 7A A2 85 ED C7 34 08 36 98 17 FE 4E 26
       data hash MD5: 32K
       52 A9 48 14 17 D5 0D DC 86 0C EB A2 CF 7D 96 7E>)
(   2,<2026-07-10 14:38:48.71 +0400>,<she>,<DPX200>,
      <Start of raw data processing
       efp BC_mod = 2 LB = 1.5 FT_mod = 6 PKNL = 1 PHC0 = 1920.179 PHC1 = 182.8978 SI = 64K 
       data hash MD5: 64K
       04 5D D0 54 0A 3F 1C 9C 0D 55 17 44 70 84 2B 07>)
(   3,<2026-07-10 14:39:07.60 +0400>,<she>,<DPX200>,
      <pk PHC0 = 104.9464 PHC1 = -272.6 
       data hash MD5: 64K
       EC 79 41 04 B4 6F 1B 98 BF C7 61 56 72 46 23 84>)
(   4,<2026-07-10 14:39:11.32 +0400>,<she>,<DPX200>,
      <abs ABSG = 5 
       data hash MD5: 64K
       AB 8E 19 21 FC E3 4F EA 94 87 E7 80 B5 DB 5B 02>)
(   5,<2026-07-10 14:39:41.78 +0400>,<she>,<DPX200>,
      <pk PHC0 = -360.3083 PHC1 = 976.2017 
       data hash MD5: 64K
       62 7C E3 02 DB A6 7D 3A 44 D2 9B 45 55 3A B4 65>)
(   6,<2026-07-10 14:39:50.48 +0400>,<she>,<DPX200>,
      <abs ABSG = 5 
       data hash MD5: 64K
       92 12 5F 2E 9F C1 C3 C5 88 6C 20 A9 7D 9A EC B7>)
$$ ##END=
$$ 
$$ hash MD5
$$ CB F1 9D BD 66 43 FB 66 0E B2 5C 95 91 A8 D3 87
##$RELAX= 
##$RELAX= 
##$RELAX= 
##$RELAX= 
##$RELAX= 
##$RELAX= 
##$RELAX= 
##$RELAX= 
$$ Bruker specific parameters
$$ --------------------------
##$DU= <F:/spectra>
##$EXPNO= 2
##$NAME= <P31>
##$PROCNO= 1
##$TYPE= <nmr>
##$USER= <she>
##$AMP= (0..31)
100 100 100 100 100 100 100 100 100 100 100 100 100 100 100 100 100 100 
100 100 100 100 100 100 100 100 100 100 100 100 100 100 
##$AQSEQ= 0
##$AQ_mod= 1
##$AUNM= <au_zg>
##$AUTOPOS= <>
##$BF1= 81.014009
##$BF2= 200.13
##$BF3= 200.13
##$BF4= 200.13
##$BF5= 200.13
##$BF6= 200.13
##$BF7= 200.13
##$BF8= 200.13
##$BYTORDA= 1
##$CFDGTYP= 0
##$CFRGTYP= 5
##$CHEMSTR= <none>
##$CNST= (0..31)
1 1 145 1 1 1 1 1 1 1 1 1 1 1 1 1 1 1 1 1 1 1 1 1 1 1 1 1 1 1 1 1 
##$CPDPRG= <waltz16>
##$CPDPRG1= <>
##$CPDPRG2= <waltz16>
##$CPDPRG3= <>
##$CPDPRG4= <mlev>
##$CPDPRG5= <mlev>
$$ [...]
##$SUBNAM3= <"">
##$SUBNAM4= <"">
##$SUBNAM5= <"">
##$SUBNAM6= <"">
##$SUBNAM7= <"">
##$SUBNAM8= <"">
##$SUBNAM9= <"">
##$SW= 400.765351723535
##$SWIBOX= (0..15)
0 1 3 0 0 0 0 0 0 0 0 0 0 0 0 0 
##$SW_h= 32467.5324675325
##$TD= 32768
##$TD0= 1
##$TE= 0
##$TE2= 300
##$TE3= 300
##$TEG= 300
##$TL= (0..7)
0 120 53 12 22 120 120 120 
##$TP= (0..7)
150 150 150 150 150 150 150 150 
##$TP07= 0
##$TPNAME0= <>
##$TPNAME1= <>
##$TPNAME2= <>
##$TPNAME3= <>
##$TPNAME4= <>
##$TPNAME5= <>
##$TPNAME6= <>
##$TPNAME7= <>
##$TPOAL= (0..7)
0.5 0.5 0.5 0.5 0.5 0.5 0.5 0.5 
##$TPOFFS= (0..7)
0 0 0 0 0 0 0 0 
##$TUNHIN= 0
##$TUNHOUT= 0
##$TUNXOUT= 0
##$USERA1= <user>
##$USERA2= <user>
##$USERA3= <user>
##$USERA4= <user>
##$USERA5= <user>
##$V9= 5
##$VALIST= <valist>
##$VCLIST= <CCCCCCCCCCCCCCC>
##$VD= 0
##$VDLIST= <DDDDDDDDDDDDDDD>
##$VPLIST= <PPPPPPPPPPPPPPP>
##$VTLIST= <TTTTTTTTTTTTTTT>
##$WBST= 1024
##$WBSW= 4
##$XGAIN= (0..3)
0 0 0 0 
##$XL= 0
##$YL= 0
##$YMAX_a= 12458
##$YMIN_a= -5157
##$ZGOPTNS= <>
##$ZL1= 120
##$ZL2= 120
##$ZL3= 120
##$ZL4= 120
##$ABSF1= 197.3918
##$ABSF2= -203.3724
##$ABSG= 5
##$ABSL= 3
##$ALPHA= 0
##$AQORDER= 0
##$ASSFAC= 0
##$ASSFACI= 0
##$ASSFACX= 0
##$ASSWID= 0
##$AUNMP= <proc_1d>
##$AZFE= 0.1
##$AZFW= 0.5
##$BCFW= 0
##$BC_mod= 2
##$BYTORDP= 0
##$COROFFS= 0
##$CY= -3
##$DATMOD= 1
##$DC= 0
##$DFILT= <>
##$DTYPP= 0
##$F1P= 0
##$F2P= 0
##$FCOR= 1
##$FTSIZE= 65536
##$FT_mod= 6
##$GAMMA= 0
##$GB= 0
##$INTBC= 1
##$INTSCL= 9.790993e-09
##$ISEN= 30
##$LB= 1.5
##$LEV0= 0
##$LPBIN= 0
##$MAXI= 10000
##$MC2= 0
##$MEAN= 0
##$ME_mod= 0
##$MI= 50
##$NCOEF= 0
##$NC_proc= -8
##$NLEV= 6
##$NOISF1= 182.463
##$NOISF2= 159.3651
##$NSP= 0
##$NTH_PI= 0
##$NZP= 0
##$OFFSET= 197.3918
##$PC= 4
##$PHC0= 1664.817
##$PHC1= 886.4995
##$PH_mod= 1
##$PKNL= yes
##$PPARMOD= 0
##$PSCAL= 0
##$PSIGN= 0
##$REVERSE= no
##$SF= 81.014063255964
##$SI= 65536
##$SIGF1= 159.3651
##$SIGF2= -187.1042
##$SINO= 113.3802
##$SIOLD= 16384
##$SREGLST= <1H.CDCl3>
##$SSB= 0
##$STSI= 65536
##$STSR= 0
##$SW_p= 32467.5324675325
##$SYMM= 0
##$S_DEV= 0
##$TDeff= 32768
##$TDoff= 0
##$TI= <>
##$TILT= no
##$TM1= 0
##$TM2= 0
##$TOPLEV= 0
##$USERP1= <user>
##$USERP2= <user>
##$USERP3= <user>
##$USERP4= <user>
##$USERP5= <user>
##$WDW= 1
##$XDIM= 65536
##$YMAX_p= 267802420
##$YMIN_p= -136662194
$$ End of Bruker specific parameters
$$ ---------------------------------
##NTUPLES= NMR SPECTRUM
##VAR_NAME=  FREQUENCY,     SPECTRUM/REAL,   SPECTRUM/IMAG
##SYMBOL=    X,             R,               I
##VAR_TYPE=  INDEPENDENT,   DEPENDENT,       DEPENDENT
##VAR_FORM=  AFFN,          ASDF,            ASDF
##VAR_DIM=   65536,         65536,           65536
##UNITS=     HZ,            ARBITRARY UNITS, ARBITRARY UNITS
##FACTOR=    0.49542278885378, 1,            1
##FIRST=     15991.5117654749, 0,            0
##LAST=      -16476.0207020576, 0,           0
##MIN=       -16476.0207020576, -136662194,  0
##MAX=       15991.5117654749, 267802420,    0
$$ Real data points
##PAGE= N=1
##DATA TABLE= (X++(R..R)), XYDATA
$$ [...]
##PAGE= N=2
##DATA TABLE= (X++(I..I)), XYDATA
$$ plain form
7466 -3081112 -3574984 -4761984 -4514054 -2001347 1245190 3098913 2508661 53924 -2149376
7457 -2149376 -1845099 1032966 4029315 4873112 3692889 1948699 409313 -795649 -1246749
7448 -1246749 -636162 606837 2053273 3880579 5940632 7201984 7059788 6224989 5371025
7439 5371025 4030172 1979806 524518 871905 2145393 2667034 2573894 3425823 5494778
7430 5494778 7120279 6954449 5644020 4930098 5650308 6668654 5646727 1543174 -3371224
7421 -3371224 -5217062 -3046475 -341005 -685996 -3276726 -4559205 -3293932 -1669559
7413 -1669559 -1769130 -3253476 -4703909 -5184517 -4042296 -1020828 2782235 5620004 7293925
7404 7293925 9029196 10526592 9096066 3286874 -3890843 -7353445 -5417170 -1498891
$$ packed form
7466c081112m93872j187000K47930K512707L246537J853723n90252k454737k203300
7457b149376L04277K878065K996349Q43797j180223j744190j539386j204962m51100
7448a246749O10587J242999J446436J827306K060053J261352j42196q34799q53964
7439E371025j340853k050366j455288L47387J273488N21641r3140Q51929K068955
7430E494778J625501j65830j310429p13922P20210J018346j021927m103553m914398
7421c371224j845838K170587K705470l44991k590730j282479J265273J624373
7413a669559r9571j484346j450433m80608J142221L021468L803063K837769J673921
7404G293925J735271J497396j430526n809192p177717l462602J936275L918279
$$ plain form
7396 -1498891 -131074 -2269986 -5071407 -5717781 -4541585 -4011013 -5216928 -6410305 -5292416
7387 -5292416 -1848026 1775607 3534190 2863401 478478 -2166915 -3670088 -3931756 -4218971
7378 -4218971 -5129140 -5369273 -3975818 -2798214 -4481191 -8168453 -9773556 -7232849 -3305642
7369 -3305642 -1983998 -3824534 -6121434 -6307004 -3839328 110335 3396870 4115175 2350098
7360 2350098 180881 -900807 -1721091 -3649258 -6138424 -7330264 -6333387 -3592819 310109
7351 310109 4778537 8570186 10480237 10526007 9423586 7288512 4017893 543783 -1650591
7342 -1650591 -2115498 -1393140 270940 2782369 4954310 5055239 2986352 661147 -288981
7333 -288981 -295040 -976943 -3230514 -6420222 -8844521 -8959183 -6847683 -4542610 -4287387
$$ packed form
7396a498891J367817k138912k801421o46374J176196N30572j205915j193377J117889
7387e292416L444390L623633J758583o70789k384923k645393j503173k61668k87215
7378d218971r10169k40133J393455J177604j682977l687262j605103K540707L927207
7369c305642J321644j840536k296900j85570K467676L949663L286535P18305j765077
7360B350098k169217j081688q20284j928167k489166j191840R96877K740568L902928
7351C10109M468428L791649J910051M5770j102421k135074l270619l474110k194374
7342a650591m64907P22358J664080K511429K171941J00929k068887k325205r50128
7333b88981o059o81903k253571l189708k424299j14662K111500K305073K55223
$$ plain form
7324 -4287387 -6477640 -9636760 -11876358 -11866279 -9443413 -6497455 -6227463 -9696065 -13748908
7315 -13748908 -14325551 -11338777 -8063239 -6169782 -4234147 -1289533 1367150 2893891
7307 2893891 4421657 6365294 6958144 5291524 3269969 2462501 1518791 -785768 -2411930
7298 -2411930 -1178817 967603 558663 -1801387 -2437803 -596446 770647 470229 1158570
7289 1158570 4661455 8698614 10210169 9342610 8088203 6886569 4600504 709583
7281 709583 -4000159 -8159775 -10393451 -10106777 -8213055 -6108501 -4042642 -2061651 -1960413
7272 -1960413 -5302877 -9271517 -8346730 -1928969 3236451 1207419 -5242543 -8433790
7264 -8433790 -5794809 -2131950 -2360048 -5694513 -7973568 -7245473 -5653505 -6679126 -11097458
$$ packed form
7324d287387k190253l159120k239598J0079K422866K945958K69992l468602m052843
7315a3748908n76643K986774L275538J893457J935635K944614K656683J526741
7307B893891J527766J943637N92850j666620k021555q07468r43710k304559j626162
7298b411930J233113K146420m08940k360050o36416J841357J367093l00418O88341
7289A158570L502885M037159J511555q67559j254407j201634k286065l890921
7281G09583m709742m159616k233676K86674J893722K104554K065859J980991J01238
7272a960413l342464l968640R24787O417761N165420k029032o449962l191247
7264h433790K638981L662859k28098l334465k279055P28095J591968j025621m418332
$$ plain form
7255 -11097458 -15509704 -15490420 -10578832 -4899675 -2157004 -1876627 -1863585 -2017173 -3339058
7246 -3339058 -5119723 -6049194 -6690749 -7851618 -7898422 -5108481 -1490506 -405026 -1259450
7237 -1259450 -838765 655484 -186550 -3591049 -5776779 -5601257 -6431603 -9215810 -9370936
7228 -9370936 -4245844 1265465 1321923 -2499295 -4671248 -4524323 -5677259 -8421427 -8879227
7219 -8879227 -5652140 -1861301 80581 944931 1067699 -997910 -4585249 -6028052 -4018543
7210 -4018543 -2178795 -3534579 -5564828 -4045328 508115 3870303 4226611 3600945 3550142
7201 3550142 2967128 962170 -895124 -856189 195229 69218 -1333472 -1710872 477221
7192 477221 3922946 6092011 5841275 3555527 -248014 -4774312 -7904590 -7629765 -5167751
$$ packed form
7255a1097458m412246J9284M911588N679157K742671K80377J3042j53588j321885
7246c339058j780665r29471o41555j160869m6804K789941L617975J085480q54424
7237a259450M20685J494249q42034l404499k185730J75522q30346k784207j55126
7228i370936N125092N511309N6458l821218k171953J46925j152936k744168m57800
7219h879227L227087L790839J941882Q64350J22768k065609l587339j442803K009509
7210d018543J839748j355784k030249J519500M553443L362188L56308o25666n0803
7201C550142n83014k004958j857294L8935J051418j26011j402690l77400K188093
7192D77221L445725K169065k50736k285748l803541m526298l130278K74825K462014
$$ plain form
7183 -5167751 -4450225 -7057681 -9519165 -7669965 -2252346 2284473 3579919 3102500 2472009
7174 2472009 1202284 -1224270 -3676372 -4877816 -4625224 -2753914 884974 4433300
7166 4433300 4514745 504368 -3684474 -4162422 -1846351 -465009 -1144531 -1728311 -928948
7157 -928948 -226565 -1061784 -2480941 -2908873 -2895737 -4511041 -8258517 -11794263 -12279842
7148 -12279842 -9623899 -6602836 -5505120 -5517268 -4377771 -1900442 -190419 -538197 -2168084
7139 -2168084 -4487489 -8149592 -12495905 -14255879 -11303317 -6402396 -4393339 -5986558
7131 -5986558 -7023942 -4343402 -76837 1071406 -2521985 -7686168 -9903614 -7741314
7123 -7741314 -3924217 -2183680 -3170004 -4026263 -2117897 1917791 5446758 6734051 5336213
$$ packed form
7183e167751P17526k607456k461484J849200N417619M536819J295446m77419o30491
7174B472009j269725k426554k452102j201444K52592J871310L638888L548326
7166D433300Q1445m010377m188842m77948K316071J381342o79522n83780P99363
7157i28948P02383q35219j419157m27932J3136j615304l747476l535746m85579
7148a2279842K655943L021063J097716j2148J139497K477329J710023l47778j629887
7139b168084k319405l662103m346313j759974K952562M900921K009057j593219
7131e986558j037384K680540M266565J148243l593391n164183k217446K162300
7123g741314L817097J740537r86324q56259J908366M035688L528967J287293j397838
$$ plain form
7114 5336213 1228836 -4208795 -7449790 -6019951 -2288580 -1130829 -3464217 -5195173
7106 -5195173 -3545409 -1084920 -1340133 -3263644 -3294452 -1221524 -359636 -2242401 -4454792
7097 -4454792 -4393493 -2581008 -1106966 -700278 -706615 -690723 -725952 -851681 -1345091 -3000113
7087 -3000113 -6143060 -9656918 -11779733 -11721162 -9980090 -7479294 -5153071 -4054589 -4703057
7078 -4703057 -5948599 -5328237 -1378252 4482455 8850709 9269308 6199434 2212031 -517339
7069 -517339 -1852381 -3044008 -4725181 -5875034 -5037777 -2435417 -279320 -597110 -3138438
7060 -3138438 -6006422 -8044955 -9646681 -11099284 -11287028 -8886061 -4278447 576252
7052 576252 3885309 4995927 4179939 2522861 1702448 2481506 3273237 1622303 -2367458
$$ packed form
7114E336213m107377n437631l240995J429839L731371J157751k333388j730956
7106e195173J649764K460489k55213j923511l0808K072928Q61888j882765k212391
7097d454792O1299J812485J474042M06688o337J5892l5229j25729m93410j655022
7087c000113l142947l513858k122815N8571J741072K500796K326223J098482o48468
7078d703057j245542O20362L949985N860707M368254M18599l069874l987403k729370
7069e17339j335042j191627j681173j149853Q37257K602360K156097l17790k541328
7060c138438k867984k038533j601726j452603j87744K400967M607614M854699
7052E76252L309057J110618q15988j657078q20413P79058P91731j650934l989761
$$ plain form
7043 -2367458 -5498280 -5327198 -3253902 -2293566 -2762992 -2290232 33160 1827405 728124
7034 728124 -2176502 -3802200 -3134724 -2171139 -2879948 -4649994 -5262816 -3505498 -149629
7025 -149629 3224461 5695463 7239223 7877520 7024051 4103536 -94848 -3273771 -3510791
7016 -3510791 -1164984 1620128 3140577 3274323 2769760 2485067 3293519 5380837 7215395
7007 7215395 6632207 3798960 1721139 2426927 3799919 2108096 -2848092 -7108755 -7097521
6998 -7097521 -3071718 2061191 5549738 6024426 3767589 663378 -1386882 -2553201
6990 -2553201 -4237094 -5980837 -5507905 -2784488 -1350164 -3406896 -5737417 -3593757
6982 -3593757 2479865 7009696 6571247 3243780 569789 -952699 -2908980 -5719547
$$ packed form
7043b367458l130822J71082K073296R60336m69426M72760K323392J794245j099281
7034G28124k904626j625698O67476R63585p08809j770046o12822J757318L355869
7025a49629L374090K471002J543760O38297q53469k920515m198384l178923k37020
7016c510791K345807K785112J520449J33746n04563k84693Q08452K087318J834558
7007G215395n83188k833247k077821P05788J372992j691823m956188m260663J1234
6998g097521M025803N132909L488547M74688k256837l104211k050260j166319
6990b553201j683893j743743M72932K723417J434324k056732k330521K143660
6982c593757O073622M529831m38449l327467k673991j522488j956281k810567
$$ plain form
6974 -5719547 -8282745 -9779756 -10290875 -10117334 -9508138 -8742525 -7912407 -6931977 -5886601
6965 -5886601 -4814197 -3326656 -1464420 -678789 -2348073 -5155627 -5853814 -3351377 -210359
6956 -210359 915983 403907 -233290 -1341123 -3833508 -6217863 -5834883 -2850704 -337222
6947 -337222 22014 -139516 864970 1882919 1050469 -719883 -645067 1954753 4685738
6938 4685738 5474956 5166367 5630265 6582554 6165924 4447125 4219393 7301372 11530672
6929 11530672 13120145 11246298 8387336 6349601 4241115 1112869 -1471246 -1199276
6921 -1199276 1669998 4334942 4415212 1836706 -1729608 -4242140 -4567626 -3503161 -3234130
6912 -3234130 -4853845 -6886338 -7307317 -6405836 -6113275 -6765787 -6401308 -3823822 -908383
$$ packed form
6974e719547k563198j497011n11119J73541O09196P65613Q30118R80430J045376
6965e886601J072404J487541J862236P85631j669284k807554o98187K502437L141018
6956b10359J126342n12076o37197j107833k492385k384355L82980K984179K513482
6947c37222L59236j61530J004486J017949q32450j770352P4816K599820K730985
6938D685738P89218l08589M63898R52289m16630j718799k27732L081979M229300
6929A1530672J589473j873847k858962k037735k108486l128246k584115K71970
6921a199276K869274K664944Q0270k578506l566314k512532l25486J064465K69031
6912c234130j619715k032493m20979R01481K92561o52512L64479K577486K915439
$$ plain form
6903 -908383 -807184 -4458846 -9594394 -12943264 -13085277 -11341983 -9988409 -9543793 -8295949
6894 -8295949 -4974171 -1113267 534461 -363424 -1328893 -663175 229940 -864468 -3604533
6885 -3604533 -5495967 -5111318 -3439157 -2053158 -1273540 -610474 -14066 168407 13037
6876 13037 -34103 111208 237053 583910 1592899 2636163 2105869 -371008 -2734848
6867 -2734848 -2830315 -1315415 -566358 -1043390 -988684 -91948 -867163 -4883217 -9753482
6858 -9753482 -12097298 -12064443 -12388852 -13815329 -14323920 -12878557 -11149421 -10655730 -10450194
6849 -10450194 -9011638 -6871366 -5745800 -5795311 -5183070 -2414989 1598816 4114926 3237506
6840 3237506 -21768 -2828177 -3818531 -4354235 -5847798 -7181410 -6359066 -3752057 -1613724
$$ packed form
6903i08383J01199l651662n135548l348870j42013J743294J353574M44616J247844
6894h295949L321778L860904J647728q97885r65469O65718Q93115j094408k740065
6885c604533j891434L84649J672161J385999P79618O63066N96408J82473j55370
6876A3037m7140J45311J25845L46857J008989J043264n30294k476877k363840
6867b734848r5467J514900P49057m77032N4706Q96736p75215m016054m870265
6858i753482k343816L2855l24409j426477n08591J445363J729136M93691K05536
6849a0450194J438556K140272J125566m9511O12241K768081M013805K516110q77420
6840C237506l259274k806409r90354n35704j493563j333612Q22344K607009K138333
$$ plain form
6831 -1613724 -806956 -207570 797650 1618396 2485608 4615023 7529586 8546444 6184882
6822 6184882 2256554 -624390 -1982735 -2897474 -4178234 -6210497 -8905631 -10714296
6814 -10714296 -9549968 -5919464 -3119194 -2875707 -3011390 -1297338 772959 681734 -726408
6805 -726408 -837614 167126 -29654 -1314251 -989703 1543160 3340289 2072803 -1085988
6796 -1085988 -3752749 -5118023 -5270551 -3913529 -1330548 824535 1174292 236398 -480173
6787 -480173 -180461 971650 2322268 2885399 2016568 468590 -139132 654781 1560117
6778 1560117 1261359 -295732 -2609500 -5353131 -7838097 -8869168 -7854266 -5311898
6770 -5311898 -1945223 1783087 4791491 5372959 2945282 -939105 -4064311 -5543259
$$ packed form
6831a613724Q06768N99386J005220Q20746Q67212K129415K914563J016858k361562
6822F184882l928328k880944j358345r14739j280760k032263k695134j808665
6814a0714296J164328L630504K800270K43487j35683J714052K070297r1225j408142
6805g26408j11206J004740j96780j284597L24548K532863J797129j267486l158791
6796a085988k666761j365274j52528J357022K582981K155083L49757r37894p16571
6787d80173K99712J152111J350618N63131q68831j547978o07722P93913R05336
6778A560117k98758j557091k313768k743631k484966j031071J014902K542368
6770e311898L366675L728310L008404N81468k427677l884387l125206j478948
$$ plain form
6762 -5543259 -5974850 -6265455 -6693712 -6667164 -5292698 -2695981 -482953 48646 -211481
6753 -211481 517419 1979871 2149266 684420 -3426 1826670 4495688 5031691 2941314
6744 2941314 503217 2175 1729240 4133687 5107535 3663317 939486 -1068485 -2020027
6735 -2020027 -3342973 -5473254 -6647619 -5540110 -3581377 -3022126 -3754276 -3937823 -3209008
6726 -3209008 -3183386 -4508509 -5158766 -2728227 2271010 6449797 7072581 4961323 3210303
6717 3210303 3250697 3534382 2708744 2303576 4251852 6921326 6551483 2559371 -1613399
6708 -1613399 -3547159 -4617641 -6380590 -7251652 -5139106 -1150563 1910310 3171808
6700 3171808 3386202 2381181 -527870 -4333754 -6882973 -7241702 -5886511 -3436843 -937026
$$ packed form
6762e543259m31591k90605m28257K6548J374466K596717K213028N31599k60127
6753b11481P28900J462452J69395j464846o87846J830096K669018N36003k090377
6744B941314k438097n01042J727065K404447R73848j444218k723831k007971r51542
6735b020027j322946k130281j174365J107509J958733N59251p32150j83547P28815
6726c209008K5622j325123o50257K430539M999237M178787O22784k111258j751020
6717C210303M0394K83685q25638m05168J948276K669474l69843l992112m172770
6708a613399j933760j070482j762949q71062K112546L988543L060873J261498
6700C171808K14394j005021k909051l805884k549219l58729J355191K449668K499817
$$ plain form
6691 -937026 -236167 -1931063 -3803505 -3374945 -1146623 678613 1521637 2155833 2331070
6682 2331070 1391985 304307 217206 -115735 -2460736 -5540576 -6718934 -6419463 -6954968
6673 -6954968 -7539585 -5201455 -985309 -63193 -4023642 -7893733 -7446886 -5171397 -5555624
6664 -5555624 -8007630 -8576610 -6295155 -3586860 -1730178 139680 2042688 2585462 1438084
6655 1438084 -209975 -1706997 -3388525 -5227067 -7025638 -9562772 -13411369 -16899006
6647 -16899006 -17513440 -15404557 -13324997 -12757799 -12180395 -9896456 -6739668 -4707948 -4081349
6638 -4081349 -3373319 -1862136 -879138 -1904342 -3867196 -3582163 350802 4971243 5901967
6629 5901967 2721408 -478538 -305791 2210163 4112187 4591129 4628079 4096179 1786711
$$ packed form
6691i37026P00859j694896j872442M28560K228322J825236Q43024O34196J75237
6682B331070r39085j087678q7101l32941k345001l079840j178358K99471n35505
6673f954968n84617K338130M216146R22116l960449l870091M46847K275489l84227
6664e555624k452006n68980K281455K708295J856682J869858J903008N42774j147378
6655A438084j648059j497022j681528j838542j798571k537134l848597l487637
6647a6899006o14434K108883K079560N67198N77404K283939L156788K031720O26599
6638d081349P08030J511183R82998j025204j962854K85033L932965M620441R30724
6629E901967l180559l199946J72747K515954J902024M78942L6950n31900k309468
$$ plain form
6620 1786711 -1998673 -5057220 -5919960 -5552814 -5888241 -7267004 -7763157 -5297364 -728535
6611 -728535 1905344 -232779 -4515492 -5411239 -1785691 1286067 -457882 -4578451 -5746589
6602 -5746589 -3116202 -440895 -168624 -1086605 -1514806 -1483013 -1347452 -955684 -768303
6593 -768303 -1670605 -3278886 -4359227 -5100311 -6924832 -9732971 -11325360 -10130696 -6973448
6584 -6973448 -3803979 -1997627 -1862575 -2392798 -1733246 615897 2579831 2221284 836772
6575 836772 1015721 2365309 2119880 -248273 -2246445 -2451686 -2147709 -2200690 -1530275
6566 -1530275 136504 966686 -41172 -1420698 -1976158 -2576267 -3616033 -3290570 -498447
6557 -498447 2605579 3111052 875538 -2187269 -4782589 -6489796 -6744152 -5218896 -2322769
$$ packed form
6620A786711l785384l058547q62740L67146l35427j378763m96153K465793M568829
6611g28535K633879k138123m282713q95747L625548L071758j743949m120569j168138
6602e746589K630387K675307K72271r17981m28201L1793J35561L91768J87381
6593g68303r02302j608281j080341p41084j824521k808139j592389J194664L157248
6584f973448L169469J806352J35052n30223O59552K349143J963934l58547j384512
6575H36772J78949J349588k45429k368153j998172k05241L03977n2981O70415
6566a530275J666779Q30182j007858j379526n55460o00109j039766L25463K792123
6557d98447L104026N05473k235514l062807k595320j707207k54356J525256K896127
$$ plain form
6548 -2322769 1432952 5202176 6858364 4913083 1947206 2688918 7201106 9726969
6540 9726969 6738462 2384807 2468612 6286790 8732002 7893918 5688526 2735051 -1964333
6531 -1964333 -6765982 -8052221 -5725474 -3608880 -3578868 -3443927 -1719879 -389326 -1111902
6522 -1111902 -2224282 -1716446 -407782 -8943 -381651 -822559 -1965141 -4200419 -5949194
6513 -5949194 -5763408 -4817835 -5132397 -6367333 -6608957 -5657029 -5178100 -5567076 -4829374
6504 -4829374 -1490432 2753956 4644942 3275925 1166345 1009318 2395762 2952047 2017217
6495 2017217 1110512 609076 -1332465 -5091663 -7384221 -5400891 -1322971 455193 -610116
6486 -610116 -1468729 -1057644 -1495069 -3425270 -4390513 -3231810 -2467320 -4331187 -7447693
$$ packed form
6548b322769L755721L769224J656188j945281k965877P41712M512188K525863
6540I726969k988507m353655Q3805L818178K445212q38084k205392k953475m699384
6531a964333m801649j286239K326747K116594L0012J34941J724048J330553p22576
6522a111902j112380N07836J308664L98839l72708m40908j142582k235278j748775
6513e949194J85786R45573l14562j234936k41624R51928M78929l88976P37702
6504d829374L338942M244388J890986j369017k109580j57027J386444N56285r34830
6495B017217r06705n01436j941541l759198k292558J983330M077920J778164j065309
6486f10116q58613M11085m37425j930201r65243J158703P64490j863867l116506
$$ plain form
6477 -7447693 -9532162 -10734511 -12056428 -12835699 -12261842 -11421040 -11379931 -10912642 -8524985
6468 -8524985 -5243035 -3056673 -2009010 -1157628 -955113 -2069691 -3111762 -2388796 -1087098
6459 -1087098 -1919137 -5142910 -8503897 -10581870 -11585027 -11400461 -9762590 -8052998 -7861807
6450 -7861807 -7762355 -4777914 475658 3473222 1755531 -1817888 -3368240 -2824679 -2495299
6441 -2495299 -3207829 -4316590 -5816490 -7776940 -8620524 -6516080 -2286573 1046105 1662634
6432 1662634 452881 -747362 -1027795 -521326 111806 217627 81863 1163777 4387479
6423 4387479 8443077 10991508 11385663 10779378 9602043 6899315 3018127 1077641 3807445
6414 3807445 9541601 13253972 11877595 7341490 3888826 3429337 4262907 3659270 696405
$$ packed form
6477g447693k084469j202349j321917p79271N73857Q40802M1109M67289K387657
6468h524985L281950K186362J047663Q51382K02515j114578j042071P22966J301698
6459a087098q32039l223773l360987k077973j003157J84566J637871J709592J91191
6450g861807R9452K984441N253572K997564j717691l573419j550352N43561L29380
6441b495299p12530j108761j499900j960450q43584K104444M229507L332678O16529
6432A662634j209753j200243k80433N06469O33132J05821j35764J081914L223702
6423D387479M055598K548431L94155o06285j177335k702728l881188j940486K729804
6414C807445N734156L712371j376377m536105l452664m59489Q33570o03637k962865
$$ plain form
6405 696405 -3337185 -6545310 -8079033 -8431032 -8396869 -8094646 -7353663 -6784232 -7502573
6396 -7502573 -9419142 -10720709 -9918677 -7825126 -6493706 -6593190 -6967492 -6629887 -5979587
6387 -5979587 -5926823 -6860535 -8563845 -10069966 -9640529 -6394946 -2296661 -861484 -3079272
6378 -3079272 -6109411 -7037802 -6417316 -6682727 -8463799 -10395025 -11650209 -12469062 -12491649
6369 -12491649 -10738886 -7514239 -4564559 -2952570 -2312522 -2604172 -4871789 -9278233
6361 -9278233 -13654240 -15242299 -13372060 -9732011 -6606241 -5374878 -5890995 -6460134 -5060319
6352 -5060319 -1523644 1937093 3288771 3265442 4092715 5789365 5535515 1665992 -3109658
6343 -3109658 -4350904 -1468667 1304649 203125 -3495035 -5579564 -4372619 -2043417
$$ packed form
6405F96405m033590l208125j533723l51999L4163L02223P40983N69431p18341
6396g502573j916569j301567Q02032K093551J331420r9484l74302L37605O50300
6387e979587N2764r33712j703310j506121M29437L245583M098285J435177k217788
6378c079272l030139r28391O20486k65411j781072j931226j255184q18853k2587
6369a2491649J752763L224647K949680J611989O40048k91650k267617m406444
6361i278233m376007j588059J870239L640049L125770J231363n16117n69139J399815
6352e060319L536675L460737J351678k3329Q27273J696650k53850l869523m775650
6343c109658j241246K882237K773316j101524l698160k084529J206945K329202
$$ plain form
6335 -2043417 -890469 -593717 312751 2128623 4104978 5408945 4982778 1861456 -3071506
6326 -3071506 -6790274 -7051690 -4876233 -2921685 -2290696 -2320768 -2594900 -3337147 -4225481
6317 -4225481 -4519432 -4288008 -4202001 -4365749 -4617420 -5528122 -7591408 -9762685 -10377443
6308 -10377443 -9257177 -7363988 -4837495 -1363439 1751406 2284379 367394 -1081732
6300 -1081732 -81776 1951529 2384085 561895 -2125007 -4213832 -5258390 -5721752 -6460709
6291 -6460709 -7863402 -9387638 -10435293 -11140487 -11319910 -9600838 -5402522 -1011278 696472
6282 696472 184569 248871 1337103 1077066 -1276148 -3511067 -4516067 -5990657 -8579243
6273 -8579243 -10073682 -9743071 -10721568 -14857039 -18404744 -16863574 -11777373 -8432035 -8332960
$$ packed form
6335b043417J152948K96752R06468J815872J976355J303967m26167l121322m932962
6326c071506l718768k61416K175457J954548O30989l0072k74132p42247q88334
6317d225481k93951K31424Q6007j63748k51671r10702k063286k171277o14758
6308a0377443J120266J893189K526493L474056L114845N32973j916985j449126
6300a081732R99956K033305M32556j822190k686902k088825j044558m63362p38957
6291f460709j402693j524236j047655p05194j79423J719072M198316M391244J707750
6282F96472n11903O4302J088232k60037k353214k234919j005000j474590k588586
6273h579243j494439L30611r78497m135471l547705J541170N086201L345338R9075
$$ plain form
6264 -8332960 -8397981 -6848277 -5426028 -5522121 -5995025 -5647567 -4765746 -3425149 -1017824
6255 -1017824 1748860 2859336 1850821 614333 680602 1493447 1694286 332298 -3148290
6246 -3148290 -7940253 -10895590 -9030716 -3434164 1564360 3392465 3095066 2202141 762528
6237 762528 -838268 -1188369 -320089 -304348 -1968848 -3285190 -2375253 -73353 1581294
6228 1581294 1236977 -2158328 -8748990 -15447192 -17317048 -13335556 -8104034 -5795841
6220 -5795841 -5329478 -4034434 -2874812 -4292526 -7187464 -8244409 -6982173 -5584351
6212 -5584351 -4582595 -2540881 411825 2408022 3082648 3625879 3783984 2298404 259328
6203 259328 236062 1745852 1525763 -965172 -2503357 -1909253 -2513006 -6383670 -10089595
$$ packed form
6264h332960o5021J549704J422249r6093m72904L47458Q81821J340597K407325
6255a017824K766684J110476j008515j236488O6269Q12845K00839j361988l480588
6246c148290m791963k955337J864874N596552M998524J828105k97399q92925j439613
6237G62528j600796l50101Q68280J5741j664500j316342R09937K301900J654647
6228A581294l44317l395305o590662o698202j869856L981492N231522K308193
6220e795841M66363J295044J159622j417714k894938j056945J262236J397822
6212e584351J001756K041714K952706J996197O74626N43231J58105j485580k039076
6203B59328k3266J509790k20089k490935j538185N94104o03753l870664l705925
$$ plain form
6194 -10089595 -9617950 -6376110 -4423320 -4221230 -3593073 -3247682 -6137613 -11241703 -12951048
6185 -12951048 -8384302 -1583100 1911843 1786456 1421558 1776751 546041 -2941987 -5571746
6176 -5571746 -4607206 -1768727 -1115478 -3854867 -7226237 -8295638 -6965458 -4832661 -2857459
6167 -2857459 -1294995 -632535 -1017603 -1386437 -646046 648595 1231661 1386096 2546863
6158 2546863 4684607 5974545 5473091 4305816 3551212 2822488 1958168 2204587 4099847
6149 4099847 5693656 4827848 2232388 476163 570077 1492712 2471473 3613354 4450241
6140 4450241 3942890 2199094 532602 -343136 -620852 -18127 1895092 3828097 3552229
6131 3552229 1270782 -49613 1189527 2977709 3092982 2516210 3237441 4493355 4089189
$$ packed form
6194a0089595M71645L241840J952790K02090O28157L45391k889931n104090j709345
6185a2951048M566746O801202L494943j25387l64898L55193j230710l488028k629759
6176e571746R64540K838479O53249k739389l371370j069401J330180K132797J975202
6167b857459J562464O62460l85068l68834P40391J294641N83066J54435J160767
6158B546863K137744J289938n01454j167275p54604p28724q64320K46419J895260
6149D099847J593809q65808k595460j756225R3914R22635R78761J141881Q36887
6140D450241n07351j743796j666492q75738k77716O02725J913219J933005k75868
6131C552229k281447j320395J239140J788182J15273n76772P21231J255914m04166
$$ plain form
6122 4089189 2458296 2237554 3881340 4706967 2993862 448519 -597458 -330762 -279559
6113 -279559 -594703 -242682 1010878 2316888 2865745 2157438 -126481 -3261705 -5165370
6104 -5165370 -4466306 -2621568 -2503351 -4858067 -7483058 -8086858 -6736774 -5158417 -4794249
6095 -4794249 -6093685 -8645428 -11117977 -11670107 -9330857 -4966428 -620037 1912120
6087 1912120 1952397 213328 -1449541 -1356697 276131 1493948 1067021 140925 593107
6078 593107 2364963 3668629 3627535 3270766 3550807 3727506 2679895 925462 26559
6069 26559 287383 428115 -161839 -169342 1665471 4188328 4925107 3380585 1645944 1230452
6059 1230452 922184 -892647 -3072739 -2961933 -352398 2049430 2383693 1594605 788765
$$ packed form
6122D089189j630893k20742J643786Q25627j713105k545343j045977K66696N1203
6113b79559l15144L52021J253560J306010N48857p08307k283919l135224j903665
6104e165370O99064J844738J18217k354716k624991o03800J350084J578357L64168
6095d794249j299436k551743k472549n52130K339250M364429M346391K532157
6087A912120M0277j739069j662869R2844J632828J217817m26927r26096M52182
6078E93107J771856J303666m1094l56769K80041J76699j047611j754433q98903
6069B6559K60824J40732n89954p503J834813K522857P36779j544522j734641m15492
6059A230452l08268j814831k180092J10806K609535K401828L34263p89088q05840
$$ plain form
6050 788765 -979097 -4467758 -7686904 -8077315 -6206690 -4747428 -4498594 -4319105 -4686451
6041 -4686451 -7677636 -12418509 -14118138 -10029996 -3837776 -1204815 -2648869 -3973112
6033 -3973112 -2719615 -656027 149523 251628 743321 1067910 625509 536494 1870273
6024 1870273 3462960 3416222 1939479 892659 944030 900586 -129551 -1352661 -1456028
6015 -1456028 -279525 1072475 1453590 968015 1044628 2614234 4123328 2760913 -1423941
6006 -1423941 -4276708 -2442156 1600666 2247033 -1663582 -5200561 -4217812 -733282 703023
5997 703023 -520262 -1372945 -556657 -20458 -1120355 -2384295 -1925599 280575 3345211
5988 3345211 6395466 7574928 4683050 -1332269 -5685865 -5036438 -1945613 -1381436 -3986277
$$ packed form
6050G88765j767862l488661l219146l90411J870625J459262K48834J79489l67346
6041d686451k991185m740873j699629M088142O192220K632961j444054j324243
6033c973112J253497K063588Q05550J02105M91693L24589m42401q9015J333779
6024A870273J592687m6738j476743j046820N1371m3444j030137j223110j03367
6015a456028J176503J352000L81115m85575P6613J569606J509094j362415m184854
6006a423941k852767J834552M042822O46367l910615l536979R82749L484530J436305
5997G03023j223285q52683Q16288N36199j099897j263940M58696K206174L064636
5988C345211L050255J179462k891878o015319m353596O49427L090825N64177k604841
$$ plain form
5979 -3986277 -6071422 -5706995 -4901914 -5065824 -4279887 -1184421 1650701 1253458 -1092245
5970 -1092245 -2080150 -1741168 -2756841 -5046216 -5217557 -2132604 797881 612817 -1010532
5961 -1010532 -884496 810862 1549405 703465 -179972 -431081 -684602 -586136 1094287
5952 1094287 3730818 4726125 2940360 274940 -1050538 -1096309 -1088008 -1255336 -1114726
5943 -1114726 -934354 -1648234 -3699433 -6621694 -9276998 -10202571 -8629822 -5686528 -3718626
5934 -3718626 -3873050 -5152024 -6145908 -6472764 -6024735 -4418036 -2354998 -2147401 -5276803
5925 -5276803 -10186908 -13828129 -14725389 -13445174 -11101298 -8884044 -8018512 -8283780 -7290863
5916 -7290863 -3248620 2071940 5229072 5477107 4810024 3975196 1581105 -2212369 -4411218
$$ packed form
5979c986277k085145L64427Q05081j63910P85937L095466K835122l97243k345703
5970a092245r87905L38982j015673k289375j71341L084953K930485j85064j623349
5961a010532J26036J695358P38543q45940q83437k51109k53521R8466J680423
5952A094287K636531R95307j785765k665420j325478m5771Q301j67328J40610
5943a114726J80372p13880k051199k922261k655304r25573J572749K943294J967902
5934c718626j54424j278974r93884l26856M48029J606699K063038K07597l129402
5925e276803m910105l641221q97260J280215K343876K217254Q65532k65268R92917
5916g290863M042243N320560L157132K48035o67083q34828k394091l793474k198849
$$ plain form
5907 -4411218 -3420528 -1997700 -3548460 -7186301 -9088083 -7796543 -5604912 -4999993 -6099219
5898 -6099219 -7792421 -9274868 -9696882 -7935154 -3896077 672889 3505130 3675800 1907659
5889 1907659 -397314 -2037376 -2429118 -1767542 -798013 -224355 -290210 -868535 -1786555
5880 -1786555 -2950931 -4079004 -4325868 -2636912 882835 4126300 4557827 2053541 -721078
5871 -721078 -1435594 -788859 -1183337 -3423264 -5997900 -7375981 -7693373 -7955475 -8555369
5862 -8555369 -8932501 -8102975 -5474132 -1786185 880543 980295 -608093 -1656703 -1651882
5853 -1651882 -2331256 -4586385 -6498744 -5948051 -3979146 -3424690 -4533820 -4424324 -1589818
5844 -1589818 1344071 1172972 -1136410 -1853094 -180995 472234 -2094195 -5001083 -4372703
$$ packed form
5907d411218R90690J422828j550760l637841j901782J291540K191631O04919j099226
5898f099219j693202j482447m22014J761728M039077M568966K832241J70670j768141
5889A907659k304973j640062l91742O61576R69529N73658o5855n78325r18020
5880a786555j164376j128073k46864J688956L519747L243465M31527k504286k774619
5871g21078p14516O46735l94478k239927k574636j378081l17392k62102n99894
5862h555369l77132Q29526K628843L687947K666728R9752j588388j048610M821
5853a651882o79374k255129j912359N50693J968905N54456j109130J09496K834506
5844a589818K933889j71099k309382p16684J672099O53229k566429k906888O28380
$$ plain form
5835 -4372703 -1688604 -2562325 -8910960 -15527559 -16184702 -11025886 -5576111 -3641115 -3912439
5826 -3912439 -3473324 -1903002 -716164 -615335 -1100067 -1989427 -3615585 -5582122 -6694322
5817 -6694322 -6428784 -5490037 -4561581 -3433546 -1896196 -567443 65051 675039 1929305
5808 1929305 2784245 1637447 -733600 -1322665 1104618 3891680 3942944 1971435 1207472
5799 1207472 2625996 3939248 3365378 1849783 678544 -850698 -3749010 -6839760
5791 -6839760 -7847683 -6369989 -4260764 -3373531 -4139012 -6148142 -8914380 -11813375 -13976008
5782 -13976008 -14600316 -13375982 -10804228 -8008421 -5663373 -3190675 128636 3339928
5774 3339928 4476658 3376080 2385663 3586082 6602347 9714732 11469207 10451014
$$ packed form
5835d372703K684099q73721o348635o616599o57143N158816N449775J934996k71324
5826c912439M39115J570322J186838J00829m84732q89360j626158j966537j112200
5817f694322K65538R38747R28456J128035J537350J328753O32494O09988J254266
5808A929305Q54940j146798k371047n89065K427283K787062N1264j971509p63963
5799A207472J418524J313252n73870j515595j171239j529242k898312l090750
5791f839760j007923J477694K109225Q87233p65481k009130k766238k898995k162633
5782a3976008o24308J224334K571754K795807K345048K472698L319311L211292
5774C339928J136730j100578r90417J200419L016265L112385J754475j018193
$$ plain form
5766 10451014 5709193 -951738 -5180377 -4877847 -3172383 -4038765 -6402060 -5783202 -985021
5757 -985021 4421056 7313448 8210854 8399015 7044921 2878060 -3311090 -9315914 -13195172
5748 -13195172 -13570683 -10215050 -5410798 -2786693 -3390983 -4460682 -3349609 -1059584
5740 -1059584 -387322 -2074682 -4590793 -6597911 -7688309 -7330031 -5052061 -1755227 546669
5731 546669 679354 -591965 -1473604 -850330 754025 1803063 1607181 1301457 2271620
5722 2271620 4018530 4806386 4121704 2852962 1197565 -1428282 -4056886 -4253094 -1665637
5713 -1665637 719682 394144 -1518387 -2570094 -2577561 -2818105 -3139885 -2255189 -104767
5704 -104767 2119145 3685683 4328743 3396578 971557 -872304 -139195 1981531 2080807
$$ packed form
5766A0451014m741821o660931m228639L02530J705464q66382k363295O18858M798181
5757i85021N406077K892392Q97406J88161j354094m166861o189150o004824l879258
5748a3195172l75511L355633M804252K624105o04290j069699J111073K290025
5740a059584O72262j687360k516111k007118j090398L58278K277970L296834K301896
5731E46669J32685j271319q81639O23274J604355J049038j95882l05724R70163
5722B271620J746910P87856o84682j268742j655397k625847k628604j96208K587457
5713a665637K385319l25538j912531j051707p467k40544l21780Q84696K150422
5704a04767K223912J566538O43060r32165k425021j843861P33109K120726R9276
$$ plain form
5695 2080807 -1316692 -6186342 -9632660 -10603093 -9906157 -8940130 -8766840 -9542040 -10549804
5686 -10549804 -11040350 -10677423 -9088505 -6148013 -3224177 -2613255 -4717545 -7288682 -8581871
5677 -8581871 -9442814 -10854951 -11670680 -10956983 -10335254 -11071048 -10914890 -7576056 -3787091
5668 -3787091 -4396013 -8904958 -11570361 -9424379 -5747343 -4329427 -4469557 -3723777 -2089310
5659 -2089310 -870832 59929 1426472 2836232 3782112 4503588 4291853 1192214 -4637872
5650 -4637872 -9441221 -10091593 -8074023 -6867768 -7006839 -6556925 -5401227 -5849582 -8830756
5641 -8830756 -11949382 -12139818 -8911237 -4396032 -1009278 457444 668121 74013 -1760448
5632 -1760448 -4435405 -5455238 -2854989 1255069 2545760 323416 -1513200 -544308
$$ packed form
5695B080807l397499m869650l446318r70433O96936R66027J73290p75200j007764
5686a0549804m90546L62927J588918K940492K923836O10922k104290k571137j293189
5677h581871q60943j412137q15729P13697O21729p35794J56158L338834L788965
5668c787091o08922m508945k665403K145982L677036J417916j40130P45780J634467
5659b089310J218478R30761J366543J409760R45880P21476k11735l099639n830086
5650d637872m803349o50372K017570J206255j39071M49914J155698m48355k981174
5641h830756l118626j90436L228581M515205L386754J466722K10677n94108j834461
5632a760448k674957j019833K600249M110058J290691k222344j836616R68892
$$ plain form
5624 -544308 417834 -2082831 -6627502 -9064235 -8241872 -6414695 -5212632 -4345521 -3558439
5615 -3558439 -2991141 -2057856 -482452 164833 -1506909 -3877075 -4320666 -3457697 -4256690
5606 -4256690 -7079445 -8940947 -8109212 -6283770 -5411226 -5316667 -5587888 -6896880 -8809306
5597 -8809306 -8804187 -5600822 -1718332 -620483 -2418094 -4198063 -3795334 -1606482 818280
5588 818280 2513171 3530401 4622535 6516697 9031348 11067208 11710207 11070920 9983499
5579 9983499 9248064 9055095 8741004 7503534 5869106 5558278 6832792 7090740 3932678
5570 3932678 -1211131 -4799804 -5919375 -6503346 -7091553 -5950871 -3259496 -2438257 -5139753
5561 -5139753 -7830509 -6153155 -729138 4128679 6041626 6223823 6616520 8078305 10819416
$$ packed form
5624e44308R62142k500665m544671k436733Q22363J827177J202063Q67111P87082
5615c558439N67298R33285J575404O47285j671742k370166m43591Q62969p98993
5606d256690k822755j861502Q31735J825442Q72544R4559k71221j308992j912426
5597h809306N119L203365L882490J097849j797611j779969M02729K188852K424762
5588H18280J694891J017230J092134J894162K514651K035860O42999o39287j087421
5579I983499p35435j92969l14091j237470j634428l10828J274514K57948l158062
5570C932678n143809l588673j119571n83971n88207J140682K691375Q21239k701496
5561e139753k690756J677354N424017M857817J912947J82197L92697J461785K741111
$$ plain form
5552 10819416 14094638 15675204 13804482 9582536 5579412 2420260 -1290146 -5954284
5544 -5954284 -10041248 -12183241 -12298209 -10659361 -7832181 -5535933 -5365768 -6339115 -5867251
5535 -5867251 -3616055 -2088424 -2563845 -2931953 -1175291 956306 -119487 -5205074 -11442206
5526 -11442206 -15440018 -15799325 -13043824 -8634697 -4209200 -916600 683476 62263
5518 62263 -3067960 -7465653 -10371368 -9918725 -6919767 -3367290 -14160 3338642 5913868
5509 5913868 6012653 3014798 -1816911 -6481786 -9306166 -9317725 -6909886 -4073662 -2795329
5500 -2795329 -3272054 -4682512 -7100557 -10854710 -14271680 -14515921 -11464285 -8608071 -8735536
5491 -8735536 -10440664 -10646529 -9217346 -8777013 -10382944 -11636110 -9737214 -5159133 -1503440
$$ packed form
5552A0819416L275222J580566j870722m221946m003124l159152l710406m664138
5544e954284m086964k141993j14968J638848K827180K296248J70165r73347M71864
5535e867251K251196J527631m75421l68108J756662K131597j075793n085587o237132
5526a1442206l997812l59307K755501M409127M425497L292600J600076o21213
5518F2263l130223m397693k905715M52643K998958L552477L353130L352802K575226
5509E913868R8785k997855m831709m664875k824380j1559K407839K836224J278333
5500b795329m76725j410458k418045l754153l416970k44241L051636K856214j27465
5491h735536j705128k05865J429183M40333j605931j253166J898896M578081L655693
$$ plain form
5482 -1503440 -2042330 -6512585 -11049960 -11513498 -7267336 -1456399 2529568 4035709 4303415
5473 4303415 4075103 3260953 1985627 464194 -1514982 -3605132 -4280987 -2998816 -2090094
5464 -2090094 -4010252 -7043576 -6676307 -1747540 3622241 5379842 4202533 3234868 3645501
5455 3645501 4711155 6371724 8850280 10690079 9903327 6890755 4077420 2727738
5447 2727738 1981892 911497 -414737 -1998526 -4081165 -5733692 -4939927 -978168 4184264
5438 4184264 7433324 6973530 3484992 -176266 -645319 3206531 8874165 12420217 12045822
5429 12045822 8728486 4121856 -320196 -2428698 -121636 5706850 10729718 11059225
5421 11059225 6945580 1948038 -745281 -558993 1000627 2254248 2974868 4206252
$$ packed form
5482a503440n38890m470255m537375m63538M246162N810937L985967J506141K67706
5473D303415k28312q14150j275326j521433j979176k090150o75855J282171R08722
5464b090094j920158l033324L67269M928767N369781J757601j177309r67665M10633
5455C645501J065654J660569K478556J839799p86752l012572k813335j349682
5447B727738p45846j070395j326234j583789k082639j652527P93765L961759N162432
5438D184264L249060m59794l488538l661258m69053L851850N667634L546052l74395
5429A2045822l317336m606630m442052k108502K307062N828486N022868L29507
5421A1059225m113645m997542k693319J86288J559620J253621P20620J231384
$$ plain form
5413 4206252 6054938 6354223 3052096 -2362125 -5898354 -5866121 -4471185 -3919846 -3388274
5404 -3388274 -1409014 925736 1431483 136167 -1143491 -1647885 -2012794 -2465533 -2718753
5395 -2718753 -3091726 -3702608 -3101396 -38503 3633273 4375478 1663977 -1072559 -970838
5386 -970838 947266 2081094 1985797 2207723 3571068 5227261 5936920 5224382 3554590
5377 3554590 1967641 1114190 378337 -1255131 -3255837 -3765995 -2387824 -1278039 -2271122
5368 -2271122 -4205947 -4738375 -3829189 -3401152 -3940729 -3647409 -1325100 1731539 3504283
5359 3504283 3501197 2437215 969347 -160805 214489 2422523 4774521 5050091 3216758
5350 3216758 1537438 1618610 2276247 1094084 -2282346 -5328401 -5528819 -3602930 -2882583
$$ packed form
5413D206252J848686K99285l302127n414221l536229L2233J394936N51339N31572
5404c388274J979260K334750N05747j295316j279658n04394l64909m52739k53220
5395b718753l72973o10882O01212L062893L671776P42205k711501k736536J01721
5386i70838J918104J133828r5297K21926J363345J656193P09659p12538j669792
5377C554590j586949q53451p35853j633468k000706n10158J378171J109785r93083
5368b271122j934825n32428R09186M28037n39577K93320K322309L056639J772744
5359C504283l086j063982j467868j130152L75294K208034K351998K75570j833333
5350C216758j679320Q1172O57637j182163l376430l046055k00418J925889P20347
$$ plain form
5341 -2882583 -5089132 -7673124 -6654433 -1845454 2465446 2632965 -170645 -2188900
5333 -2188900 -2126027 -1918792 -3079574 -4692735 -5504353 -5904326 -6612144 -6747637 -4646542
5324 -4646542 -50031 5487761 9957915 11998961 11287006 8794494 6465057 5884609 7071553
5315 7071553 8492277 7952060 3921272 -2783901 -8555046 -9727147 -6383638 -2157600
5307 -2157600 221386 1390533 2544777 2614224 428386 -2162978 -2318506 -510382 199306
5298 199306 -1046578 -1846625 -684631 749523 451801 -1071779 -2290748 -3077277 -4036290
5289 -4036290 -4717030 -4099088 -2263365 -573329 -641468 -3444538 -8439622 -13059758 -14245861
5280 -14245861 -11254208 -6216527 -1731511 915421 1120193 -1390361 -5312512 -7946517
$$ packed form
5341b882583k206549k583992J018691M808979M310900J67519k803610k018255
5333b188900O2873K07235j160782j613161q11618l99973p07818j35493K101095
5324d646542M596511N537792M470154K041046p11955k492512k329437n80448J186944
5315G071553J420724n40217m030788o705173n771145j172101L343509M226038
5307b157600K378986J169147J154244O9447k185838k591364j55528J808124P09688
5298A99306j245884q00047J161994J434154k97722j523580j218969p86529r59013
5289d036290o80740O17942J835723J690036o8139k803070m995084m620136j186103
5280a4245861K991653N037681M485016K646932K04772k510554l922151k634005
$$ plain form
5272 -7946517 -8027139 -7141416 -7167290 -7697746 -7431829 -6719342 -6715589 -6751120 -4656981 152107
5262 152107 5345711 7811183 6462537 2895566 -303270 -1948467 -3015278 -4707325
5254 -4707325 -6239379 -5748240 -3201779 -690068 342438 177070 -1227045 -4809953 -9752745
5245 -9752745 -12743974 -11788588 -8768694 -6346593 -4398553 -1711769 955437 2335560
5237 2335560 3298653 4771568 4558781 63878 -6655744 -10604340 -10534572 -9969840 -11129114
5228 -11129114 -11892527 -10150597 -7489253 -6351654 -6240629 -5111436 -2742106 -696968
5220 -696968 -231053 -1700845 -4706900 -7541152 -7949659 -5751314 -3288128 -2126751 -1105469
5211 -1105469 791936 1594654 -1142361 -6117852 -9269928 -8800646 -6988455 -6766435 -8361057
$$ packed form
5272g946517q0622Q85723k5874n30456K65917P12487L753l5531K094139M809088
5262A52107N193604K465472j348646l566971l198836j645197j066811j692047
5254d707325j532054M91139K546461K511711J032506j65368j404115l582908m942792
5245i752745k991229R55386L019894K422101J948040K686784K667206J380123
5237B335560R63093J472915k12787m494903o719622l948596O9768N64732j159274
5228a1129114p63413J741930K661344J137599J11025J129193K369330K045138
5220f96968M65915j469792l006055k834252m08507K198345K463186J161377J021282
5211a105469J897405Q02718k737015m975491l152076M69282J812191K22020j594622
$$ plain form
5202 -8361057 -9879782 -9783138 -7992713 -5483847 -3585886 -3264199 -4484393 -6262217 -7388958
5193 -7388958 -6996183 -4670492 -673429 3645346 6081422 4943126 582084 -4604422
5185 -4604422 -8092460 -9207853 -8973426 -8300232 -7225728 -6111112 -6385015 -9029655 -12827052
5176 -12827052 -15136279 -14361310 -11125026 -7324028 -4535686 -2921871 -1255712 1332949
5168 1332949 3319080 1788474 -3551775 -8755225 -9669498 -6657926 -3572722 -2842763 -3580131
5159 -3580131 -4041413 -3766764 -3216498 -3052021 -3855837 -5198005 -5395041 -3742652 -2224309
5150 -2224309 -2975136 -4876532 -5251573 -4274800 -4482000 -6004865 -5927168 -3169422 -534840
5141 -534840 -401367 -1384094 -1127629 108587 643344 120022 -775226 -1592789 -1543882 585403
$$ packed form
5202h361057j518725R6644J790425K508866J897961L21687j220194j777824j126741
5193g388958L92775K325691L997063M318775K436076j138296m361042n186506
5185d604422l488038j115393K34427O73194J074504J114616k73903k644640l797397
5176a2827052k309227P74969L236284L800998K788342J613815J666159K588661
5168A332949J986131j530606n340249n203450r14273L011572L085204P29959p37368
5159c580131m61282K74649N50266J64477q03816j342168j97036J652389J518343
5150b224309p50827j901396l75041R76773k07200j522865P7697K757746K634582
5141e34840J33473r82727K56465J236216N34757n23322q95248q17563M8907K129285
$$ plain form
5131 585403 4434267 7726862 9293804 10480898 12138809 12521803 10145988 6597683 4163867
5122 4163867 2470753 -17301 -2650244 -3428256 -2226945 -702122 411612 1695563
5114 1695563 3153240 3887447 3563028 2833902 2481068 2789710 3032419 1300765 -3422290
5105 -3422290 -8454451 -9196810 -5114176 -1223350 -1501749 -3542552 -2694653 916209 3247344
5096 3247344 2617701 1088990 232851 -634585 -1882238 -2517724 -2250400 -2148514 -2923613
5087 -2923613 -4481856 -6891168 -9760300 -11252053 -9978351 -7187212 -4736086 -2000879
5079 -2000879 2238683 5977429 5908293 2835411 1152902 2588149 4360486 4287152 3723478
5070 3723478 3981283 3538359 983363 -2123798 -3547362 -3360811 -2825326 -2312081 -1960860
$$ packed form
5131E85403L848864L292595J566942J187094J657911L82994k375815l548305k433816
5122D163867j693114k488054k632943p78012J201311J524823J113734J283951
5114A695563J457677P34207l24419p29126l52834L08642K42709j731654m723055
5105c422290n032161p42359M082634L890826k78399k040803Q47899L610862K331135
5096C247344o29643j528711q56139q67436j247653o35486K67324J01886p75099
5087b923613j558243k409312k869132j491753J273702K791139K451126K735207
5079b000879M239562L738746o9136l072882j682509J435247J772337p3334n63674
5070C723478K57805m42924k554996l107161j423564J86551N35485N13245L51221
$$ plain form
5061 -1960860 -2386340 -3129401 -2399186 29485 1668737 788713 -943816 -1205036 -497346
5052 -497346 -689851 -1654958 -1753805 -597677 905518 2419201 3990741 4709441 3663942
5043 3663942 1815010 964569 1145062 884846 -136490 -636710 -63162 445189 -88293
5034 -88293 -1169525 -2021297 -2807796 -3834851 -4481369 -3942384 -2600121 -1812644 -2458322
5025 -2458322 -4208532 -6038820 -6900451 -6077783 -3704152 -1184115 -456734 -2295506 -5529339
5016 -5529339 -8129412 -8694563 -6872746 -3341974 21860 1046537 -530128 -2567405
5008 -2567405 -3392208 -4046393 -5965986 -7686928 -6557278 -3083082 -396712 597153 2185801
4999 2185801 5540523 9054751 11859730 15054703 17920489 17170455 12491487 8791736
$$ packed form
5061a960860m25480p43061P30215K428671J639252q80024j732529k61220P07690
5052d97346j92505r65107r8847J156128J503195J513683J571540P18700j045499
5043C663942j848932q50441J80493k60216j021336n00220N73548N08351n33482
5034h8293j081232q51772p86499j027055o46518N38985J342263P87477o45678
5025b458322j750210j830288q61631Q22668K373631K520037P27381j838772l233833
5016e529339k600073n65151J821817L530772L363834J024677j576665k037277
5008b567405q24803o54185j919593j720942J129650L474196K686370R93865J588648
4999B185801L354722L514228K804979L194973K865786p50034m678968l699751
$$ plain form
4991 8791736 9668807 12296584 12473398 11103543 11145681 11417167 8979873 5517093 5456977
4982 5456977 8667310 10399106 8196851 4165345 779843 -1023436 -215378 3008419
4974 3008419 4703249 994767 -5672525 -9029967 -7589021 -5574535 -5364730 -4876593 -3260414
4965 -3260414 -3246187 -6002898 -8761571 -9452812 -9194986 -8646599 -6440734 -2746138 66816
4956 66816 1594280 3756139 6169113 6250584 4736070 5277472 7385510 6234059 1289317
4947 1289317 -1813543 -641996 -25456 -3167273 -5896654 -4445309 -2122468 -2615518 -2861353
4938 -2861353 901320 5183575 4321724 -433191 -3518196 -3470760 -2486601 -635260 3080262
4929 3080262 6261277 5907327 3989397 4655815 7297464 7505076 3803247 -959249 -3750737
$$ packed form
4991H791736Q77071K627777J76814j369855M2138K71486k437294l462780o0116
4982E456977L210333J731796k202255m031506l385502j803279Q08058L223797
4974C008419J694830l708482o667292l357442J440946K014486K09805M88137J616179
4965c260414J4227k756711k758673o91241K57826N48387K205865L694596K812954
4956F6816J527464K161859K412974Q1471j514514N41402K108038j151451m944742
4947A289317l102860J171547O16540l141817k729381J451345K322841m93050k45835
4938b861353L762673M282255q61851m754915l085005M7436R84159J851341L715522
4929C080262L181015l53950j917930O66418K641649K07612l701829m762496k791488
$$ plain form
4920 -3750737 -3256656 639527 5882686 8671700 7756300 6055784 5960747 6530294 7229904
4911 7229904 9448267 11759391 9723550 3849279 1071803 4104567 6732171 4808486
4903 4808486 3581182 7304328 10247466 6748252 2130149 3583508 7515966 6900175
4895 6900175 4429917 6541623 10432777 9510064 6332095 7330564 9820328 7421269 3171583
4886 3171583 3635746 5743056 3915074 3337080 9819790 14596277 8537665 2457173 9802342
4877 9802342 18996278 12746268 4418276 13010930 5120262 -81255147 -234620230 -345369295
4869 -345369295 -324528151 -210943056 -115274174 -85820275 -82495277 -65670026 -47249838
4862 -47249838 -46608106 -50620923 -41632248 -29092826 -28360779 -32672483 -28495693 -20123682
$$ packed form
4920c750737M94081L896183N243159K789014r15400j700516r5037N69547O99610
4911G229904K218363K311124k035841n874271k777476L032764K627604j923685
4903D808486j227304L723146K943138l499214m618103J453359L932458o15791
4895F900175k470258K111706L891154r22713l177969R98469K489764k399059m249686
4886C171583M64163K107310j827982n77994O482710M776487o058612o080492P345169
4877I802342R193936o250010q327992Q592654p890668q6375409j53365083j10749065
4869c45369295K0841144J13585095R5668882K9453899L324998J6825251J8420188
4862d7249838O41732m012817Q988675J2539422P32047m311704M176790Q372011
$$ plain form
4854 -20123682 -18609433 -20507675 -16283641 -9030664 -7956733 -11431480 -11491315 -8831379
4846 -8831379 -9914325 -14117803 -15729424 -14945708 -16354781 -19449304 -19838825 -17472933 -15797288
4837 -15797288 -15049216 -13223718 -11261573 -11097456 -11059966 -8843788 -6388959 -6506790 -7447292
4828 -7447292 -5963172 -3017737 -1553615 -1447923 -1450032 -3013189 -7099648 -10167180 -8834295
4819 -8834295 -6102907 -7353228 -11971638 -14453344 -12641251 -9612933 -7879955 -6545154
4811 -6545154 -4538408 -2796832 -2391913 -2902105 -3121586 -2208233 -683095 -895861 -4701976
4802 -4701976 -9865780 -11448563 -8199430 -4614047 -4822065 -7600766 -9671810 -10534910 -11073747
4793 -11073747 -10450210 -7860656 -5110098 -4300545 -4884149 -5512307 -6452159 -7719141 -7608839
$$ packed form
4854b0123682J514249j898242M224034P252977J073931l474747n9835K659936
4846h831379j082946m203478j611621P83716j409073l094523l89521K365892J675645
4837a5797288P48072J825498J962145J64117L7490K216178K454829j17831r40502
4828g447292J484120K945435J464122J05692k109j563157m086459l067532J332885
4819h834295K731388j250321m618410k481706J812093L028318J732978J334801
4811f545154K006746J741576M04919n10192k19481R13353J525138k12766l806115
4802d701976n163804j582783L249133L585383k08018k778701k071044q63100n38837
4793a1073747O23537K589554K750558Q09553n83604o28158r39852j266982J10302
$$ plain form
4784 -7608839 -5889789 -5562018 -8314068 -11088511 -10558375 -8236519 -7487752 -8158074 -8143765
4775 -8143765 -7806188 -8511984 -8846222 -6709890 -3570852 -2333645 -2418705 -1229324 851829
4766 851829 1430968 994553 2073763 3949305 2957501 -1465508 -5237743 -5166122 -2781382
4757 -2781382 -1594357 -2953692 -5381155 -6248698 -3971208 -10299 1849458 -209455
4749 -209455 -3486986 -4218452 -2116023 532113 2365165 2895788 973216 -3240441 -6180998
4740 -6180998 -4378440 876366 5600571 8618110 11350262 13278651 11950244 7392559
4732 7392559 2674395 -219051 -1934717 -3270724 -4215615 -5225845 -6485926 -6430030 -4106857
4723 -4106857 -2131166 -3616030 -6953449 -7770971 -5552670 -3754049 -3405999 -1589176 2855994
$$ packed form
4784g608839J719050L27771k752050k774443N30136K321856P48767o70322J4309
4775h143765L37577p05796l34238K136332L139038J237207q5060J189381K081153
4766H51829N79139m36415J079210J875542r91804m423009l772235P1621K384740
4757b781382J187025j359335k427463q67543K277490L960909J859757k058913
4749b09455l277531p31466K102429K648136J833052N30623j922572m213657k940557
4740f180998J802558N254806M724205L017539K732152J928389j328407m557685
4732G392559m718164k893446j715666j336007r44891j010230j260081N5896K323173
4723d106857J975691j484864l337419q17522K218301J798621L48050J816823M445170
$$ plain form
4714 2855994 6805725 7557244 6023417 3717033 368776 -3777695 -6832915 -8165824
4706 -8165824 -9284629 -10406950 -9483880 -6119089 -3025670 -1945653 -1593422 -1379666 -3349203
4697 -3349203 -7995051 -11766532 -11748271 -9769087 -8745103 -7792464 -4586296 -383745 1187341
4688 1187341 -804231 -4045463 -6687181 -8678129 -10006760 -10324188 -10104909 -10048004 -9591608
4679 -9591608 -7785071 -5122266 -2737783 -309615 3385487 8067316 11741808 12899972
4671 12899972 11756713 9377921 6489907 3147062 -768916 -4435271 -5792057 -3713526
4663 -3713526 -486101 -117709 -3468174 -7083137 -7928439 -7117758 -7290146 -8283665 -7714461
4654 -7714461 -4666823 -650117 2425411 3551959 2683747 1015204 322009 576168 -669146
$$ packed form
4714B855994L949731P51519j533827k306384l348257m146471l055220j332909
4706h165824j118805j122321R23070L364791L093419J080017L52231K13756j969537
4697c349203m645848l771481J8261J979184J023984R52639L206168M202551J571086
4688A187341j991572l241232k641718j990948j328631l17428K19279N6905M56396
4679i591608J806537K662805K384483K428168L695102M681829L674492J158164
4671A2899972j143259k378792k888014l342845l915978l666355j356786K078531
4663c713526L227425L68392l350465l614963q45302Q10681j72388r93519N69204
4654g714461L047638M016706L075528J126548q68212j668543o93195K54159j245314
$$ plain form
4645 -669146 -4844373 -9539624 -11255325 -10044507 -8934692 -9151001 -8617682 -5656547 -1832549
4636 -1832549 68150 -540397 -1898367 -2465593 -2504019 -3104594 -4370299 -5165346 -4712090
4627 -4712090 -3750963 -3417460 -3463395 -2707542 -986908 713477 1938616 2877691 2777373
4618 2777373 409778 -3304291 -5429499 -4809488 -3459949 -2879983 -1575639 1595900 4073383
4609 4073383 2757829 -915829 -2467286 -423224 2199845 2406501 322159 -2559928
4601 -2559928 -5457287 -7646139 -7940581 -6160176 -3748456 -1907887 -193281 2227820
4593 2227820 4889258 6461125 6283854 4855641 3148697 1750037 435992 -1371352
4585 -1371352 -3490890 -4817132 -4889283 -4993645 -6579978 -8902261 -9517778 -7184155 -3143577
$$ packed form
4645f69146m175227m695251j715701J210818J109815k16309N33319K961135L823998
4636a832549J900699o08547j357970n67226l8426o00575j265705p95047M53256
4627d712090R61127L33503m5935P55853J720634J700385J225139R39075j00318
4618B777373k367595l714069k125208O20011J349539N79966J304344L171539K477483
4609D073383j315554l673658j551457K044062K623069K06656k084342k882087
4601b559928k897359k188852k94442J780405K411720J840569J714606K421101
4593B227820K661438J571867j77271j428213j706944j398660j314045j807344
4585a371352k119538j326242p2151j04362j586333k322283o15517K333623M040578
$$ plain form
4576 -3143577 621700 3316548 5128766 6019334 5471849 3301704 365678 -1820398 -2596885
4567 -2596885 -3244168 -5672687 -9641226 -12306511 -11401815 -8063830 -5561952 -5956302 -8923962
4558 -8923962 -12865748 -15755841 -15730513 -12647715 -8796046 -6483900 -5164059 -2557791 1574342
4549 1574342 4680856 4729800 2584976 492432 -458290 -727918 -1274006 -2733224 -4871326
4540 -4871326 -6427677 -6137612 -4068472 -1389770 873771 1964573 871465 -2670739
4532 -2670739 -6778736 -8809980 -8398524 -7397952 -6616152 -4847897 -1966063 -497950 -2212954
4523 -2212954 -4898768 -4928498 -2157678 57880 -593364 -3021163 -5072546 -6144832 -6689082
4514 -6689082 -6713711 -5970222 -4783362 -3702674 -2824258 -2208738 -2486557 -4171852 -6526330
$$ packed form
4576c143577L765277K694848J812218Q90568n47485k170145k936026k186076p76487
4567b596885o47283k428519l968539k665285R04696L337985K501878l94350k967660
4558h923962l941786k890093K5328L082798L851669K312146J319841K606268M132133
4549A574342L106514M8944k144824k092544r50722k69628n46088j459218k138102
4540d871326j556351K90065K069140K678702K263541J090802j093108l542204
4532b670739m107997k031244M11456J000572P81800J768255K881834J468113j715004
4523b212954k685814k9730K770820K215558o51244k427799k051383j072286n44250
4514f689082k4629P43489J186860J080688Q78416O15520k77819j685295k354478
$$ plain form
4505 -6526330 -7841744 -6974513 -4295421 -1264594 591778 565211 -807409 -2290458 -3311829
4496 -3311829 -4419152 -5799973 -6068093 -3992906 -1239679 -1366495 -5307151 -9673294 -10918053
4487 -10918053 -9583316 -8550484 -8564439 -8241341 -7787014 -9351306 -13128201 -16140504 -16282903
4478 -16282903 -15088382 -14707707 -14297275 -11749553 -7577926 -4512723 -3785955 -4011977 -3629908
4469 -3629908 -2648711 -1892651 -1951068 -2992039 -4558122 -5664312 -6014510 -6659391 -8333790
4460 -8333790 -9778788 -9241525 -7199869 -5801724 -5684932 -5257023 -3492577 -1641359 -1338048
4451 -1338048 -2424589 -3638378 -4380667 -4693092 -4240271 -2616640 -531811 424449 -362660
4442 -362660 -1525448 -1289934 11311 -70934 -2896676 -6261961 -6657082 -4066586 -2731721
$$ packed form
4505f526330j315414Q67231K679092L030827J856372k6567j372620j483049j021371
4496c311829j107323j380821k68120K075187K753227j26816l940656m366143j244759
4487a0918053J334737J032832j3955L23098M54327j564292l776895l012303j42399
4478a6282903J194521L80675M10432K547722M171627L065203P26768k26022L82069
4469c629908R81197P56060n8417j040971j566083j106190l50198o44881j674399
4460h333790j444998N37263K041656J398145J16792M27909J764446J851218L03311
4451a338048j086541j213789p42289l12425M52821J623631K084829R56260p87109
4442c62660j162788K35514J301245q2245k825742l365285l95121K590496J334865
$$ plain form
4433 -2731721 -6109376 -12407765 -16549049 -15667480 -11122528 -5747877 -1063710 2652025
4425 2652025 5251463 6582669 6785950 6139095 4818311 2973494 961476 -430911 -241465
4416 -241465 1485193 2891536 1955183 -705161 -2142985 -950208 801205 722005 -347164
4407 -347164 282295 3334166 6971771 9154064 8849314 5863045 1485593 -1454183 -1350377
4398 -1350377 -104637 -570965 -2419181 -3061780 -2212416 -2468272 -5037379 -7862618 -8995270
4389 -8995270 -9208289 -9711950 -9385292 -6404954 -1661048 1396356 478327 -2911745 -5024115
4380 -5024115 -3959187 -1694170 -1249830 -2323153 -1739543 1412388 4020830 4082276 4481719
4371 4481719 8283593 12672840 12142947 6566056 1225872 -965855 -2244538 -4334572
$$ packed form
4433b731721l377655o298389m141284Q81569M544952N374651M684167L715735
4425B652025K599438J331206K03281o46855j320784j844817k012018j392387J89446
4416b41465J726658J406343r36353k660344j437824J192777J751413p9200j069169
4407c47164O29459L051871L637605K182293l04750k986269m377452k939776J03806
4398a350377J245740m66328j848216o42599Q49364k55856k569107k825239j132652
4389h995270k13019n03661L26658K980338M743906L057404r18029l390072k112370
4380e024115J064928K265017M44340j073323N83610L151931K608442O1446L99443
4371D481719L801874M389247n29893n576891n340184k191727j278683k090034
$$ plain form
4363 -4334572 -5200735 -3421325 -1384816 -1506722 -2733739 -3250282 -3350797 -3088119 -471616
4354 -471616 4785617 8647576 7570327 3836117 2434279 4191922 5657673 4773096 2939741
4345 2939741 1626315 235009 -2004584 -4296222 -5223622 -4236796 -2004608 -85824 92121
4336 92121 -1325125 -2744253 -3156115 -3021774 -2766124 -2074383 -1474178 -2673265 -6071303
4327 -6071303 -9736184 -12119275 -13791471 -15029645 -14019815 -9718759 -4715571 -2777291
4319 -2777291 -4592363 -7800381 -10119658 -10887816 -10762747 -11167110 -12567465 -12627222 -8569471
4310 -8569471 -2213604 944469 -608266 -1908791 499728 2766767 366159 -3740663
4302 -3740663 -3595613 109091 1716873 275905 229529 2598112 2797650 -1130451 -4532999
$$ packed form
4363d334572q66163J779410K036509j21906j227017n16543j00515K62678K616503
4354d71616N257233L861959j077249l734210j401838J757643J465751q84577j833355
4345B939741j313426j391306k239593k291638r27400R86826K232188J918784J77945
4336I2121j417246j419128m11862J34341K55650O91741O00205j199087l398038
4327f071303l664881k383091j672196j238174J009830M301056N003188J938280
4319b777291j815072l208018k319277p68158J25069m04363j400355n9757M057751
4310h569471O355867L158073j552735j300525K408519K267039k400608m106822
4302c740663J45050L704704J607782j440968m6376K368583J99538l928101l402548
$$ plain form
4293 -4532999 -3199177 588422 2189744 1028522 -145834 326898 1927871 3350356
4285 3350356 3230347 1158616 -1150798 -1638785 -1128028 -2203368 -4704184 -5604203 -4028135
4276 -4028135 -2887814 -4294610 -6586431 -7419415 -6967341 -6606406 -6943701 -8210136 -10064506
4267 -10064506 -10412041 -7480138 -3601925 -3285734 -6696834 -9128143 -8160374 -6829350 -7745749
4258 -7745749 -8767175 -7409936 -5285092 -4667586 -4379374 -2806809 -1665364 -2807081 -4257038
4249 -4257038 -3577384 -2571372 -4301012 -7594588 -8971682 -8325884 -8230131 -8854026 -8005557
4240 -8005557 -5490490 -3295084 -1890364 -205081 1085647 27106 -2937148 -5222559
4232 -5222559 -6014115 -6675127 -7404558 -6909838 -5542239 -5367066 -6646592 -7430806 -7301923
$$ packed form
4293d532999J333822L787599J601322j161222j174356M72732J600973J422485
4285C350356j20009k071731k309414m87987N10757j075340k500816r00019J576068
4276d028135J140321j406796k291821q32984M52074L60935l37295j266435j854370
4267a0064506l47535K931903L878213L16191l411100k431309R67769J331024r16399
4258g745749j021426J357239K124844O17506K88212J572565J141445j141717j449957
4249d257038O79654J006012j729640l293576j377094O45798R5753o23895Q48469
4240h005557K515067K195406J404720J685283J290728j058541k964254k285411
4232e222559p91556o61012p29431M94720J367599J75173j279526p84214J28883
$$ plain form
4223 -7301923 -8414864 -11654075 -14403239 -13762946 -10372972 -7678155 -8136235 -10730094 -11874550
4214 -11874550 -9081761 -4145112 -1699345 -4018519 -8866160 -13317661 -17096965 -20277092
4206 -20277092 -20719147 -17101176 -12225334 -9618644 -8645317 -6803177 -5084079 -6642383
4198 -6642383 -11352217 -16117344 -19602549 -22332636 -23423556 -22072610 -20910839 -22630345
4190 -22630345 -25391211 -28275706 -38217805 -60235699 -80259389 -71695070 -26880660 27732915
4182 27732915 57601372 55254129 40436358 31242607 27715659 22772312 16133557 12164062
4174 12164062 11615951 11590021 10426351 8755946 7656363 8130430 10784143 14502720 16924515
4165 16924515 17120170 16309578 15518623 14321116 12363759 10425141 9439176 9663483 10711058
$$ packed form
4223g301923j112941l239211k749164O40293L389974K694817m58080k593859j144456
4214a1874550K792789M936649K445767k319174m847641m451501l779304l180127
4206b0277092m42055L617971M875842K606690R73327J842140J719098j558304
4198f642383m709834m765127l485205k730087j090920J350946J161771j719506
4190b2630345k760866k884495r942099k2017894k0023690Q564319M4814410N4613575
4182B7732915K9868457k347243j4817771r193751l526948m943347o638755l969495
4174A2164062n48111k5930j163670j670405j099583M74067K653713L718577K421795
4165A6924515J95655q10592p90955j197507j957357j938618r85965K24307J047575
$$ plain form
4156 10711058 11217864 9308637 5189904 2269067 3345893 6642817 8371786 8259989
4148 8259989 9049820 11077413 11486508 9257472 7006385 6725228 7386869 7965606 9088518
4139 9088518 10130031 8520246 4131358 759511 713294 1431280 396294 -246936 2137746
4130 2137746 5167130 4995903 3119606 4175623 8051246 9788471 7408378 4427032
4122 4427032 3599175 3307875 2081564 1902338 4000050 5219810 2351749 -2451740 -4319028
4113 -4319028 -2208507 456960 635901 -1845361 -5825851 -9840821 -11938499 -11130214 -8983213
4104 -8983213 -7593354 -6373838 -3325693 868083 3026438 2094023 652618 914019 1887380
4095 1887380 1846972 1188996 1066598 1074381 189174 -1332216 -2624235 -3530191 -3794967 -2416876
$$ packed form
4156A0711058N06806j909227m118733k920837J076826L296924J728969j11797
4148H259989P89831K027593M09095k229036k251087k81157O61641N78737J122912
4139I088518J041513j609785m388888l371847m6217P17986j034986o43230K384682
4130B137746L029384j71227j876297J056017L875623J737225k380093k981346
4122D427032q27857k91300j226311j79226K097712J219760k868061m803489j867288
4113d319028K110521K665467J78941k481262l980490m014970k097678Q08285K147001
4104h983213J389859J219516L048145M193776K158355r32415j441405K61401R73361
4095A887380m0408o57976j22398P783q85207j521390j292019r05956k64776J378091
$$ plain form
4085 -2416876 441504 2350481 1597101 142901 1159170 4320204 6146098 4825667
4077 4825667 2156007 466679 31140 170555 782211 1761458 2480835 2733672 2967248
4068 2967248 3113215 2662989 2320868 3707129 6541452 7970003 6000728 2091407 -1034831
4059 -1034831 -2650531 -3474288 -3296721 -1385876 1413551 3170611 3351858 2981040 2307778
4050 2307778 206233 -3552526 -6920251 -7358405 -4323594 364662 3887434 4064873 826898
4041 826898 -3294275 -4962822 -3098998 234170 2340987 2609343 2208760 1953918 1658507
4032 1658507 1349442 1745334 2970246 3699462 2509441 -275967 -3016163 -4988859 -7167666
4023 -7167666 -10324057 -13259105 -13901465 -11842594 -8849339 -6861603 -6233326 -5992190 -5059544
$$ packed form
4085b416876K858380J908977p53380j454200J016269L161034J825894j320431
4077D825667k669660j689328m35539J39415O11656R79247P19377K52837K33576
4068B967248J45967m50226l42121J386261K834323J428551j969275l909321l126238
4059a034831j615700q23757J77567J910845K799427J757060J81247l70818o73262
4050B307778k101545l758759l367725m38154L034811M688256L522772J77439l237975
4041H26898m121173j668547J863824L333168K106817K68356m00583k54842k95411
4032A658507l09065L95892J224912P29216j190021k785408k740196j972696k178807
4023g167666l156391k935048o42360K058871K993255J987736O28277K41136R32646
$$ plain form
4014 -5059544 -3014928 -375595 1519887 1434962 -589711 -3304185 -5623155 -7485013 -9202027
4005 -9202027 -10481959 -10429783 -8345565 -4565106 -777717 868802 -301448 -2665311 -4137862
3996 -4137862 -4416920 -4308346 -3406417 -430543 3940655 6736258 6156712 3613745 1251160
3987 1251160 -690780 -2518181 -3030278 -1242202 1004980 842370 -1640243 -3760798 -4509868
3978 -4509868 -5671856 -8016461 -9111898 -6733140 -2666697 -866065 -2434089 -4419834
3970 -4419834 -3754149 -836547 1505992 1657067 683430 326578 634716 254390 -1519673
3961 -1519673 -3954679 -5969980 -6973043 -6552218 -4587343 -2117398 -817052 -795952 -127464
3952 -127464 2324041 4734372 4436146 1374255 -2128652 -4408784 -5553974 -5959474 -5760447
$$ packed form
4014e059544K044616K639333J895482q4925k024673k714474k318970j861858j717014
4005i202027j279932N2176K084218L780459L787389J646519j170250k363863j472551
3996d137862k79058J08574R01929K975874M371198K795603n79546k542967k362585
3987A251160j941940j827401n12097J788076K247182j62610k482613k120555p49070
3978d509868j161988k344605j095437K378758M066443J800632j568024j985745
3970d419834O65685K917602K342539J51075r73637l56852L08138l80326j774063
3961a519673k435006k015301j003063M20825J964875K469945J300346K1100O68488
3952a27464K451505K410331k98226l061891l502907k280132j145190m05500J99027
$$ plain form
3943 -5760447 -5649972 -6366088 -7141918 -6426463 -4451648 -3225707 -3368584 -2848597 -44399
3934 -44399 3379844 4141971 1188867 -3271770 -6172134 -6131596 -3855758 -761041 2488184
3925 2488184 5879746 8472906 7919610 2856137 -4573936 -10075846 -11185669 -8730192
3917 -8730192 -4661695 -329766 2999680 4179525 3664704 3209080 3235306 2309637 94335
3908 94335 -1427666 -1212877 -1438931 -4253683 -7949846 -9142840 -7774130 -7038035 -8591097
3899 -8591097 -10600925 -10893286 -9581893 -7797656 -5901963 -4130182 -3445761 -4373112 -5869949
3890 -5869949 -6559700 -6605137 -7336214 -9136319 -10544564 -9878390 -7531564 -6056726 -7398875
3881 -7398875 -10333003 -11705201 -10339097 -8238212 -7168495 -5798803 -2012464 3227829
$$ packed form
3943e760447J10475p16116p75830P15455J974815J225941j42877N19987K804198
3934d4399L424243P62127k953104m460637k900364M0538K275838L094717L249225
3925B488184L391562K593160n53296n063473p430073n501910j109823K455477
3917h730192M068497M331929L329446J179845n14821m55624K6226r25669k215302
3908I4335j522001K14789k26054k814752l696163j192994J368710P36095j553062
3899h591097k009828k92361J311393J784237J895693J771781O84421r27351j496837
3890e869949o89751m5437p31077j800105j408245O66174K346826J474838j342149
3881g398875k934128j372198J366104K100885J069717J369692L786339N240293
$$ plain form
3873 3227829 6801130 7763531 8145869 9163039 9226652 6776584 2926114 -210983 -2171116
3864 -2171116 -3439989 -3437908 -1270601 2074521 4218045 4122978 2904857 1823125 827349
3855 827349 -563474 -2165933 -3556540 -4686878 -5364509 -4897636 -3243647 -2046210 -3245271
3846 -3245271 -6451449 -8804970 -8101845 -5299540 -3112656 -2779111 -3340325 -3654280 -3532511
3837 -3532511 -2784884 -912739 1444187 2313047 940392 -633307 -110869 1764134 2161844
3828 2161844 -32094 -3125134 -5207809 -6113451 -6585392 -7032308 -7536887 -7867398 -7157602
3819 -7157602 -4764242 -1705321 24743 -61026 -346756 648083 2617551 4306700 4678209
3810 4678209 3049198 -270435 -3019064 -2534973 822848 3508931 3095542 1059617 80810
$$ packed form
3873C227829L573301R62401L82338J017170O3613k450068l850470l137097j960133
3864b171116j268873K081K167307L345122K143524r5067j218121j081732r95776
3855H27349j390823j602459j390607j130338o77631M66873J653989J197437j199061
3846c245271l206178k353521P03125K802305K186884L33545n61214l13955J21769
3837c532511P47627J872145K356926Q68860j372655j573699N22438J875003L97710
3828B161844k193938l093040k082675r05642m71941m46916n04579l30511P09796
3819g157602K393360L058921J730064q5769k85730R94839J969468J689149L71509
3810D678209j629011l319633k748629M84091L357821K686083m13389k035925r78807
$$ plain form
3801 80810 382385 431864 -302525 -1246412 -2102330 -2376618 -743573 2921671 5900566 5405166
3791 5405166 2245164 -607857 -2209441 -3587472 -4331117 -2949481 -803673 -1661780 -5876231
3782 -5876231 -8522260 -5668039 206472 3734686 3526390 2492165 2653265 2952531 2125820
3773 2125820 952462 911075 2347391 4663328 7197130 9478372 11378061 13093968 14328231
3764 14328231 13802578 10606166 5831970 1782471 -405736 -1341180 -1700517 -1206878 420458
3755 420458 2460684 3636686 3187290 1489585 23484 371943 2495713 4265874 3586998
3746 3586998 835427 -1584948 -1798020 244573 3334927 5510351 4574081 84594 -5124441
3737 -5124441 -7339205 -6221713 -4807487 -4953034 -5213725 -4220009 -3435751 -4433630 -5611780
$$ packed form
3801H0810L01575M9479p34389r43887q55918k74288J633045L665244K978895m95400
3791E405166l160002k853021j601584j378031p43645J381636K145808q58107m214451
3782e876231k646029K854221N874511L528214k08296j034225J61100K99266q26711
3773B125820j173358m1387J436316K315937K533802K281242J899689J715907J234263
3764A4328231n25653l196412m774196m049499k188207r35444l59337M93639J627336
3755D20458K040226J176002m49396j697705j466101L48459K123770J770161o78876
3746C586998k751571k420375k13072K042593L090354K175424r36270m489487n209035
3737e124441k214764J117492J414226j45547k60691R93716P84258r97879j178150
$$ plain form
3728 -5611780 -4507528 -2031512 -1173474 -2045534 -1673828 818323 2132342 -596822 -5646088
3719 -5646088 -9085892 -9411064 -7654008 -4452015 149531 4403092 5272978 2098860 -1942525
3710 -1942525 -3220034 -1508918 447250 409687 -1386961 -3312117 -4276594 -4420054 -4480372
3701 -4480372 -4765114 -4644346 -3200545 -584037 1614439 1845018 245877 -1798213 -3570185
3692 -3570185 -5590726 -8140898 -10301176 -11129790 -10918793 -10339186 -9092134 -6702263 -4149829
3683 -4149829 -3070223 -3368901 -3369172 -2577503 -2269741 -2549049 -1165644 2899739 6655102
3674 6655102 6591607 3727175 1973589 1956988 176967 -4968798 -10067640 -11641296 -11144651
3665 -11144651 -12048829 -14064314 -13844358 -10476026 -6590794 -3882503 -947607 3326051
$$ packed form
3728e611780J104252K476016Q58038q72060L71706K492151J314019k729164n049266
3719e646088l439804l25172J757056L201993M601546M253561Q69886l174118m041385
3710a942525j277509J711116J956168l7563j796648j925156r64477j43460o0318
3701d480372k84742J20768J443801K616508K198476K30579j599141k044090j771972
3692c570185k020541k550172k160278q28614K10997N79607J247052K389871K552434
3683d149829J079606k98678k71P91669L07762k79308J383405M065383L755363
3674F655102o3495k864432j753586j6601j780021n145765n098842j573656M96645
3665a1144651r04178k015485K19956L368332L885232K708291K934896M273658
$$ plain form
3657 3326051 7073268 7974818 6551320 4985379 3876098 2115708 -581894 -2811638
3649 -2811638 -3187056 -1723377 663511 3226519 5696354 7878254 9095039 8264695 5161815
3640 5161815 1590035 165585 1311487 2457994 1138232 -1983338 -4271755 -4542144
3632 -4542144 -3921679 -3725065 -3986602 -4116579 -3730320 -2690772 -1427781 -1264733 -3250049
3623 -3250049 -6534458 -9098510 -10223450 -10891150 -11513381 -10983654 -8822453 -6692202 -6391045
3614 -6391045 -7333223 -7445139 -5976156 -4136630 -3333766 -3940989 -5541551 -7270998 -8010992
3605 -8010992 -7206282 -5540343 -4207263 -3715647 -3881743 -4370401 -4424630 -2795382 796157
3596 796157 4548864 6249688 5811401 4902120 4397737 3744344 2671720 1717842 792143
$$ packed form
3657C326051L747217R01550j423498j565941j109281j760390k697602k229744
3649b811638l75418J463679K386888K563008K469835K181900J216785q30344l102880
3640E161815l571780j424450J145902J146507j319762l121570k288417k70389
3632d542144O20465J96614k61537j29977L86259J039548J262991J63048j985316
3623c250049l284409k564052j124940o67700o22231N29727K161201K130251L01157
3614f391045r42178j11916J468983J839526Q02864o07223j600562j729447p39994
3605h010992Q04710J665939J333080M91616j66096m88658n4229J629248L591539
3596G96157L752707J700824m38287r09281n04383o53393j072624r53878r25699
$$ plain form
3587 792143 -1018441 -3647808 -5612528 -5984536 -5329461 -4176129 -2345741 -571201 -632143
3578 -632143 -2322754 -2211158 2295201 8802518 12256326 10905675 7699938 5895436 5557126
3569 5557126 4926733 3310857 1451219 34482 -1072020 -2270213 -3427736 -3887540 -3555046
3560 -3555046 -3677101 -5404210 -7419700 -6797128 -3255206 -597524 -1942492 -5188013 -5905238
3551 -5905238 -3529662 -1387545 -1143432 -1021451 46730 373566 -958548 -1912063 -883127
3542 -883127 499557 228987 -775538 -541658 952410 3112727 6859729 12341865 16249131
3533 16249131 14943828 9427145 3983446 593389 -2015320 -4383581 -5268686 -4804841
3525 -4804841 -4905818 -5604070 -4556383 -1555797 7814 -1679794 -3407640 -1567547 2221276
$$ packed form
3587G92143j810584k629367j964720l72008O55075J153332J830388J774540o0942
3578f32143j690611J11596M506359O507317L453808j350651l205737j804502l38310
3569E557126o30393j615876j859638j416737j106502j198193j157523m59804L32494
3560c555046j22055j727109k015490O22572L541922K657682j344968l245521p17225
3551e905238K375576K142117K44113J21981J068181L26836j332114r53515J028936
3542h83127J382684k70570j004525K33880J494068K160317L747002N482136L907266
3533A6249131j305303n516683n443699l390057k608709k368261q85105M63845
3525d804841j00977o98252J047687L000586J563611j687608j727846J840093L788823
$$ plain form
3516 2221276 3564454 1823157 390559 813258 388751 -3373570 -8801357 -12382312 -13234559
3507 -13234559 -13172757 -13124144 -11679313 -7681338 -2716481 277258 443321 -226181 274700
3498 274700 1609010 2292405 2057666 1615905 813816 -1066043 -3236024 -3644153 -1886403
3489 -1886403 -149577 -301971 -1495607 -1795364 -951653 -240098 -476322 -1491236 -2859069
3480 -2859069 -3933765 -3779959 -2182078 -157585 1385848 2554070 3075048 1532572 -2163774
3471 -2163774 -4878113 -3483111 543210 2625041 1277973 -249564 646996 2057540
3463 2057540 1085818 -1245684 -1608185 297451 1173409 -981158 -4065875 -5000560 -3772433
3454 -3772433 -2775044 -3017607 -2763443 -188922 3808125 6369688 5913474 3700095 1960942
$$ packed form
3516B221276J343178j741297j432598M22699m24507l762321n427787l580955q52247
3507a3234559O1802M8613J444831L997975M964857K993739J66063o69502N00881
3498B74700J334310O83395k34739m41761q02089j879859k169981m08129J757750
3489a886403J736826j52394j193636k99757Q43711P11555k36224j014914j367833
3480b859069j074696J53806J597881K024493J543433J168222N20978j542476l696346
3471b163774k714339J395002M026321K081831j347068j527537Q96560J410544
3463B057540r71722k331502l62501J905636Q75958k154567l084717r34685J228127
3454c772433R97389k42563K54164K574521L997047K561563m56214k213379j739153
$$ plain form
3445 1960942 1285266 566882 -1025810 -3128510 -5110266 -6705338 -7398747 -6355197 -3707669
3436 -3707669 -1059159 143135 59932 -509398 -1692473 -3893673 -6196846 -7014513 -6161223
3427 -6161223 -4586857 -1959740 3298300 10469568 15067866 13243846 6939706 2260766
3419 2260766 2485666 4751324 4392697 595163 -3763272 -6413981 -7668556 -8585859 -9377140
3410 -9377140 -10029140 -10732361 -10872201 -9033860 -5162466 -1682597 -1109508 -3063287 -4817812
3401 -4817812 -4382141 -1889803 1527970 4586838 5620942 3449684 -677249 -3425314
3393 -3425314 -2868287 -776900 -310640 -2160800 -4247155 -4690105 -3547467 -1735297 88211
3384 88211 1086963 184784 -2587632 -5669220 -7861421 -9742227 -12023084 -13428884 -12102591
$$ packed form
3445A960942o75676p18384j592692k102700j981756j595072o93409J043550K647528
3436c707669K648510J202294q3203n69330j183075k201200k303173q17667Q53290
3427f161223J574366K627117N258040P171268M598298j824020o304140m678940
3419B260766K24900K265658l58627l797534m358435k650709j254575r17303p91281
3410i377140o52000p03221j39840J838341L871394L479869N73089j953779j754525
3401d817812M35671K492338L417773L058868J034104k171258m126933k748065
3393c425314N57027K091387M66260j850160k086355m42950J142638J812170J823508
3384H8211R98752r02179k772416l081588k192201j880806k280857j405800J326293
$$ plain form
3375 -12102591 -8903494 -7160765 -8475681 -10636163 -10893333 -9651524 -9127679 -9640091 -9638881
3366 -9638881 -8861626 -8711439 -9194450 -8247230 -5259004 -2736752 -2582068 -2875158 -1000180
3357 -1000180 1584056 1095038 -2430263 -4328135 -1648675 2625374 3531482 287133 -3567937
3348 -3567937 -4873929 -3539297 -1181552 800316 1640574 1197913 8450 -1320715 -2722116
3339 -2722116 -4070046 -4459004 -3194177 -1333275 -1053038 -3268961 -6710014 -9427210 -10422206
3330 -10422206 -9840715 -8602065 -8057377 -9046581 -10869078 -11832386 -11027129 -8935353 -6372491
3321 -6372491 -3872922 -2193763 -2051289 -2787864 -2528410 -435631 2289018 4440598 6525631
3312 6525631 9194463 11184878 10636740 7835559 4877375 2966673 1773629 1090681 1009665
$$ packed form
3375a2102591L199097J742729j314916k160482k57170J241809N23845n12412J210
3366i638881P77255J50187m83011R47220K988226K522252J54684k93090J874978
3357a000180K584236m89018l525301j897872K679460M274049R06108l244349l855070
3348c567937j305992J334632K357745J981868Q40258m42661j189463j329165j401401
3339b722116j347930l88958J264827J860902K80237k215923l441053k717196r94996
3330a0422206N81491J238650N44688r89204j822497r63308Q05257K091776K562862
3321f372491K499569J679159J42474p36575K59454K092779K724649K151580K085033
3312F525631K668832J990415n48138k801181k958184j910702j193044o82948q1016
$$ plain form
3303 1009665 466918 -1990919 -5415583 -6799596 -5241883 -3435347 -3486399 -3614566 -1318563
3294 -1318563 2170920 3653110 2938493 2668621 3613070 3674253 1854031 -294796 -2025954
3285 -2025954 -4620673 -7691094 -7956683 -4463934 -1890636 -4876456 -11105509 -14151495
3277 -14151495 -12053885 -8771499 -7502243 -7112134 -5886072 -4463428 -3427387 -1832194
3269 -1832194 -233231 -1538198 -6081567 -9233400 -7533305 -4444000 -5641873 -10533525
3261 -10533525 -13496030 -12731116 -12351435 -14879641 -16987912 -15104172 -11037373 -8747821
3253 -8747821 -8505881 -7806117 -6120644 -5171000 -5501602 -6030364 -6558743 -7802035 -8957083
3244 -8957083 -7886130 -4139933 225966 3151365 4161134 3507713 1790560 657166
$$ packed form
3303A009665n42747k457837l424664j384013J557713J806536n1052j28167K296003
3294a318563L489483J482190p14617k69872R44449O1183j820222k148827j731158
3285b025954k594719l070421k65589L492749K573298k985820o229053l045986
3277a4151495K097610L282386J269256L90109J226062J422644J036041J595193
3269a832194J598963j304967m543369l151833J700095L089305j197873m891652
3261a0533525k962505P64914L79681k528206k108271J883740M066799K289552
3253h747821K41940O99764J685473R49644l30602n28762n28379j243292j155048
3244h957083J070953L746197M365899K925399J009769o53421j717153j133394
$$ plain form
3236 657166 1792229 4657605 7022021 8083298 9022294 10017164 9262879 6237703 3601243
3227 3601243 3849414 5693202 5847605 3322607 -68137 -2680119 -4514364 -6072439 -7459522
3218 -7459522 -8561333 -8888338 -7522108 -4306655 -618710 2126068 4040582 5639967
3210 5639967 6098621 4314094 987531 -2204726 -4936491 -7762132 -9878327 -9693245 -7493920
3201 -7493920 -5247914 -3775267 -2517315 -2066325 -3927574 -7142937 -8262045 -6000953
3193 -6000953 -3110874 -2014671 -1473563 174824 1198845 -1009635 -5470153 -8935092
3185 -8935092 -10461057 -11414510 -11765897 -9950313 -6472614 -4301438 -4788612 -5756631 -4657683
3176 -4657683 -1611493 1595063 3722775 4401113 3842992 3150920 3593724 4841258 5067927
$$ packed form
3236F57166J135063K865376K364416J061277R38996R94870p54285l025176k636460
3227C601243K48171J843788J54403k524998l390744k611982j834245j558075j387083
3218g459522j101811l27005J366230L215453L687945K744778J914514J599385
3210E639967M58654j784527l326563l192257k731765k825641k116195J85082K199325
3201g493920K246006J472647J257952M50990j861249l215363j119108K261092
3193f000953K890079J096203N41108J648387J024021k208480m460518l464939
3185h935092j525965r53453l51387J815584L477699K171176m87174r68019J098948
3176d657683L046190L206556K127712O78338n58121o92072M42804J247534K26669
$$ plain form
3167 5067927 3222894 -84405 -4042868 -8048566 -10256652 -8246608 -2653755 1851741
3159 1851741 1259443 -3276842 -7375831 -8684477 -8150473 -7002999 -5122592 -2582482 -532508
3150 -532508 339768 722989 1147336 716278 -1534400 -4754791 -6935559 -7211528 -6519103
3141 -6519103 -5958262 -5535707 -5017599 -5150258 -6919191 -9723130 -11386892 -10455878 -7798796
3132 -7798796 -5438714 -4371785 -4106523 -3836762 -3378690 -3254444 -4325144 -6858093 -9499980
3123 -9499980 -9971067 -7569532 -4216680 -2132117 -1448414 -1308807 -2024333 -4026307 -5480136
3114 -5480136 -3671124 1015960 4926486 5609055 4400523 3820050 4451068 5470646 6362716
3105 6362716 6635254 5220911 1706887 -2504505 -5192620 -5014694 -2189275 1352427 2719775
$$ packed form
3167E067927j845033l307299l958463m005698k208086K010044N592853M505496
3159A851741n92298m536285m098989j308646N34004J147474J880407K540110K049974
3150e32508Q72276L83221M24347m31058k250678l220391k180768k75969O92425
3141f519103N60841M22555N18108j32659j768933k803939j663762R31014K657082
3132g798796K360082J066929K65262K69761M58072J24246j070700k532949k641887
3123i499980m71087K401535L352852K084563O83703J39607p15526k001974j453829
3114e480136J809012M687084L910526O82569j208532n80473O31018J019578Q92070
3105F362716K72538j414343l514024m211392k688115J77926K825419L541702J367348
$$ plain form
3096 2719775 932215 -899889 1240533 6454505 9261828 6832160 2612939 931550
3088 931550 1449274 1834126 2656664 5485246 8298870 7520516 3806056 1423832 1946405
3079 1946405 2609874 1403421 23837 687600 3057367 5519022 7068287 7040585 5252751
3070 5252751 3130068 2499211 2823191 2043215 452383 761801 3578495 5995431 5983868
3061 5983868 5103019 5098882 4826929 2972551 1305159 2290673 5077922 6659518 6059723
3052 6059723 4944041 4662233 4669195 3482731 -110738 -5931562 -11271542 -12318903 -8485408
3043 -8485408 -3969467 -2900298 -4082408 -3011268 1694445 6641442 8344523 6960302
3035 6960302 4830224 3457482 2873553 2542975 1936751 965876 237237 142292 -336713
$$ packed form
3096B719775j787560j832104K140422N213972K807323k429668m219221j681389
3088I31550N17724L84852Q22538K828582K813624p78354l714460k382224N22573
3079A946405O63469j206453j379584O63763K369767K461655J549265k7702j787834
3070E252751k122683o30857L23980p79976j590832L09418K816694K416936j1563
3061E983868q80849m137k71953j854378j667392R85514K787249J581596n99795
3052F059723j115682k81808O962j186464l593469n820824n339980j047361L833495
3043h485408M515941J069169j182110J071140M705713M946997J703081j384221
3035F960302k130078j372742n83929l30578o06224r70875p28639r4945m79005
$$ plain form
3026 -336713 -2771928 -6849730 -9811537 -9155747 -5578466 -2628012 -3271173 -6884587 -9875009
3017 -9875009 -9472053 -6527632 -4020905 -3415040 -3802046 -4258068 -4911954 -5152572 -3064629
3008 -3064629 1793549 6639202 8281213 6752331 4729567 4307378 5649139 7689305
3000 7689305 8655693 6960765 3156056 47646 -517244 245845 509072 562126 1183593
2991 1183593 1407000 633378 899884 3459897 4881120 1172244 -5047024 -6749656 -2250354
2982 -2250354 2576642 3250189 2459350 4065930 6220811 4781778 243564 -3451756 -4972689
2973 -4972689 -5908940 -6308286 -4594606 -1804949 -1542555 -4720432 -7749030 -7310684 -4289437
2964 -4289437 -1519252 100129 1409948 2487663 2425056 1189419 170706 586588 1975266
$$ packed form
3026c36713k435215m077802k961807O55790L577281K950454o43161l613414k990422
3017i875009M02956K944421K506727O05865l87006m56022o53886k40618K087943
3008c064629M858178M845653J642011j528882k022764m22189J341761K040166
3000G689305R66388j694928l804709l108410n64890P63089K63227N3054O21467
2991A183593K23407p73622K66506K560013J421223l708876o219268j702632M499302
2982b250354M826996O73547p90839J606580K154881j439033m538214l695320j520933
2973d972689r36251l99346J713680K789657K62394l177877l028598M38346L021247
2964d289437K770185J619381J309819J077715o2607j235637j018713M15882J388678
$$ plain form
2955 1975266 2596233 1353323 -781202 -1723807 -915325 -274691 -1759639 -4635512 -6360065
2946 -6360065 -5833703 -4355080 -3299567 -2355142 -693672 1300776 2550466 3005836 3786958
2937 3786958 5501530 7148509 7251879 5924443 5114296 6382847 8980727 10906907 11384309
2928 11384309 10981563 9567363 6227087 1858368 -389406 1070163 3742577 4459787
2920 4459787 3877961 4905215 7554138 8599130 6474819 3394296 1723591 1023252 45652
2911 45652 -778991 -669898 -406264 -965805 -1701655 -1754871 -2032032 -3843196 -6597222 -8750346
2901 -8750346 -10070400 -10968550 -10615924 -8180180 -5248090 -4225260 -4477537 -2990030 768930
2892 768930 3711638 3947570 3732073 5540810 7567811 5966701 431165 -5145324 -7232018
$$ packed form
2955A975266O20967j242910k134525r42605Q08482O40634j484948k875873j724553
2946f360065N26362J478623J055513R44425J661470J994448J249690M55370P81122
2937C786958J714572J646979J03370j327436q10147J268551K597880J926180M77402
2928A1384309m02746j414200l340276m368719k247774J459569K672414P17210
2920D459787n81826J027254K648923J044992k124311l080523j670705p00339r77600
2911D5652q24643J09093K63634n59541p35850n3216k77161j811164k754026k153124
2901h750346j320054q98150L52626K435744K932090J022830k52277J487507L758960
2892G68930K942708K35932k15497J808737K027001j601110n535536n576489k086694
$$ plain form
2883 -7232018 -5637050 -2027681 2225924 6049953 8282972 8598740 8228862 8914092 11136316
2874 11136316 13507594 13826416 11047052 6587744 3296457 2569566 2950755 2290551 706762
2865 706762 234729 1761700 3608373 3460741 863755 -2462210 -4218717 -3479810 -1679567
2856 -1679567 -1483766 -3995453 -7426525 -9349482 -9622866 -9751039 -9940547 -8827057 -6291761
2847 -6291761 -4494527 -5176910 -7292810 -8222919 -6524640 -3138884 -783918 -2010962 -6392123
2838 -6392123 -9849028 -8852208 -5270768 -4333496 -7322613 -9710367 -8056021 -5097171 -5096766
2829 -5096766 -7205932 -7410415 -5113489 -3409132 -3638428 -3957393 -3388593 -3367982 -4524997
2820 -4524997 -5285149 -4693122 -3786056 -3201591 -2075493 -256829 1021106 1732153 3674196
$$ packed form
2883g232018J594968L609369M253605L824029K233019L15768l69878O85230K222224
2874A1136316K371278L18822k779364m459308l291287p26891L81189o60204j583789
2865G06762m72033J526971J846673j47632k596986l325965j756507P38907J800243
2856a679567J95801k511687l431072j922957k73384j28173j89508J113490K535296
2847f291761J797234o82383k115900r30109J698279L385756K354966j227044m381161
2838f392123l456905R96820L581440R37272k989117k387754J654346K958850M05
2829e096766k109166k04483K296926J704357k29296l18965N68800K0611j157015
2820d524997p60152N92027R07066N84465J126098J818664J277935P11047J942043
$$ plain form
2811 3674196 7183312 9693881 9057615 6118409 2670334 -804279 -3937582 -5616336
2803 -5616336 -6222320 -8209040 -12064658 -13991668 -10504117 -3628719 1486098 2858834
2795 2858834 2513736 2094333 1172840 -138813 -218851 1482389 3098819 2507050 -484315
2786 -484315 -4258922 -6345808 -4581951 719464 5736482 6286932 2371072 -2130421 -4391960
2777 -4391960 -5169495 -5953940 -6019230 -3787062 403577 4437365 6514447 6098380 3726438
2768 3726438 973778 -203643 698668 2030586 2131794 1676963 2666388 5337500 7591877
2759 7591877 8001366 8114544 10473950 14719673 17153739 14785622 8823493 3174638 145746
2750 145746 -1076678 -2039077 -2878022 -3009518 -2420408 -1311220 513584 2931660 4955449
$$ packed form
2811C674196L509116K510569o36266k939206l448075l474613l133303j678754
2803e616336o05984j986720l855618j927010L487551O875398N114817J372736
2795B858834l45098m19403r21493j311653q0038J701240J616430n91769k991365
2786d84315l774607k086886J763857N301415N017018N50450l915860m501493k261539
2777d391960p77535p84445o5290K232168M190639M033788K077082m16067k371942
2768C726438k752660j177421R02311J331918J01208m54831R89425K671112K254377
2759G591877M09489J13178K359406M245723K434066k368117n962129n648855l028892
2750A45746j222424r62399q38945j31496N89110J109188J824804K418076K023789
$$ plain form
2741 4955449 5777815 5746835 5627511 5578506 5400370 4942110 3796461 1735614 -47286
2732 -47286 310799 2512510 3824740 2883194 1763624 2390734 2928447 548051 -3563936
2723 -3563936 -5222409 -2906488 466469 1428470 -880017 -5350291 -10049194 -12487255
2715 -12487255 -11267492 -7947260 -5173979 -3012577 273935 3834834 4141768 433844
2707 433844 -3032564 -2272823 1288381 3240062 1993649 -122326 -449107 1425173 4119226
2698 4119226 5830767 5442002 3283152 686920 -1461858 -3088790 -3930199 -3571944 -2777137
2689 -2777137 -3172220 -4957766 -6346114 -5871831 -3896756 -1530743 137238 -574902 -4846273
2680 -4846273 -10543162 -12833788 -9230793 -2294658 3885807 7732809 9213471 7513908
$$ packed form
2741D955449Q22366l0980j19324m9005j78136m58260j145649k060847j782900
2732d7286L58085K201711J312230r41546j119570O27110N37713k380396m111987
2723c563936j658473K315921L372957R62001k308487m470274m698903k438061
2715a2487255J219763L320232K773281K161402L286512L560899L06934l707924
2707D33844l466408P59741L561204J951681j246413k115975l26781J874280K694053
2698D119226J711541l88765k158850k596232k148778j626932q41409L58255P94807
2689b777137l95083j785546j388348M74283J975075K366013J667981p12140m271371
2680d846273n696889k290626L602995O936135O180465L847002J480662j699563
$$ plain form
2672 7513908 2528945 -2816440 -4663016 -2325845 1465368 3807556 3709301 2053330 1134198
2663 1134198 3167844 7605185 11009016 11158857 9880078 9958457 10831659 9794777 6300020
2654 6300020 2372304 -557317 -2656654 -3953458 -4019217 -3221401 -2223867 -550295 2342603
2645 2342603 5006235 5228148 3129110 1016002 352669 755648 1578637 2412238 2357947
2636 2357947 978732 -226609 616226 2906515 4254821 3710585 2335436 1073677 217961
2627 217961 377743 1557930 1931470 254304 -1191580 664719 4370010 5079696 1301491
2618 1301491 -3162182 -4705430 -3685669 -1646714 1418884 5140174 7298061 6509310
2610 6509310 4034369 1272987 -2045125 -5655380 -7598150 -7191377 -6425951 -6330425 -4859855
$$ packed form
2672G513908m984963n345385j846576K337171L791213K342188r8255j655971r19132
2663A134198K033646M437341L403831J49841j278779P8379Q73202j036882l494757
2654F300020l927716k929621k099337j296804o5759P97816R97534J673572K892898
2645B342603K663632K21913k099038k113108o63333M02979Q22989Q33601n4291
2636B357947j379215j205341Q42835K290289J348306n44236j375149j261759q55716
2627B17961J59782J180187L73540j677166j445884J856299L705291P09686l778205
2618A301491m463673j543248J019761K038955L065598L721290K157887p88751
2610F509310k474941k761382l318112l610255j942770M06773P65426R5526J470570
$$ plain form
2601 -4859855 -1022269 1739276 -231376 -5146266 -7972716 -7206149 -6078936 -7455050
2593 -7455050 -10419069 -12002950 -10304458 -6084648 -2651574 -3177235 -6557962 -7437377 -2527359
2584 -2527359 4568703 7500637 4867093 700515 -1726762 -2818588 -3405482 -2517782 174212
2575 174212 2559689 2663362 1434682 1450045 3756151 6916520 8451281 6821836 2939038
2566 2939038 19386 890288 4982598 8766561 9372764 7055495 4171226 2741188 3046920
2557 3046920 3574101 2176085 -1811287 -6475960 -9069620 -8772436 -7024095 -5474976 -4686252
2548 -4686252 -4670603 -5478210 -6981231 -8820934 -10641380 -11900684 -11833820 -10277267 -8035915
2539 -8035915 -5745550 -3194092 -723084 -133120 -2450268 -5520226 -5903430 -3057074 212423
$$ packed form
2601d859855L837586K761545j970652m914890k826450P66567J127213j376114
2593g455050k964019j583881J698492M219810L433074n25661l380727q79415M910018
2584b527359P096062K931934k633544m166578k427277j091826n86894Q87700K691994
2575A74212K385477J03673j228680J5363K306106L160369J534761j629445l882798
2566B939038k919652Q70902M092310L783963O06203k317269k884269j430038L05732
2557C046920N27181j398016l987372m664673k593660K97184J748341J549119P88724
2548d686252J5649q07607j503021j839703j820446j259304O6864J556553K241352
2539h035915K290365K551458K471008N89964k317148l069958l83204K846356L269497
$$ plain form
2530 212423 1464488 901748 -294024 -1898299 -4022493 -5967569 -6757185 -6139592 -4492907
2521 -4492907 -2300999 -27814 1995751 3674619 4787565 4864784 3992930 3159722 2969852
2512 2969852 2718898 1810095 1256318 2270546 3990470 4298810 2476104 -698808 -5011710
2503 -5011710 -10786538 -16754464 -20183103 -19884500 -17592255 -15713661 -14801794 -13570790 -10515358
2494 -10515358 -5566931 -892887 757242 -247970 320412 5369913 11662561 13206520
2486 13206520 9043095 4274792 3097081 4354662 5024473 4625642 4216462 3739510 2748486
2477 2748486 2068633 2651862 3794766 3898660 2206333 -824929 -3723139 -4414144 -2152738
2468 -2152738 836750 1662061 575793 -119630 -678135 -3678339 -8745497 -11855553 -11298652
$$ packed form
2530B12423J252065n62740j195772j604275k124194j945076p89616O17593J646685
2521d492907K191908K273185K023565J678868J112946P7219q71854q33208j89870
2512B969852k50954r08803n53777J014228J719924L08340j822706l174912m312902
2503e011710n774828n967926l428639K98603K292245J878594R11867J231004L055432
2494a0515358M948427M674044J650129j005212N68382N049501O292648J543959
2486A3206520m163425m768303j177711J257581O69811l98831m09180m76952r91024
2477B748486o79853N83229J142904J03894j692327l031262k898210o91005K261406
2468b152738K989488Q25311j086268o95423n58505l000204n067158l110056N56901
$$ plain form
2459 -11298652 -9887473 -9246125 -6801504 -1585384 1937964 471996 -1793286 959985
2451 959985 6958135 9439585 6575191 2785613 1253454 1155076 2024234 4776015 7652098
2442 7652098 6751631 2092558 -1639718 -1941576 -1638380 -3529615 -6224768 -7399226 -7302084
2433 -7302084 -6791632 -5430743 -3770007 -4045116 -6139987 -6231444 -2343395 1741106 1354215
2424 1354215 -2617928 -5405099 -4667299 -2096148 -140593 -13504 -1898298 -4556950 -5537779
2415 -5537779 -3918557 -2000319 -2482081 -5089962 -7750852 -9639352 -10975603 -11193495 -9652674
2406 -9652674 -7187766 -4949786 -2837820 -920996 -786765 -3133863 -5652492 -6028685 -5502123
2397 -5502123 -6293136 -6997016 -4522410 89412 2132264 -166055 -3635353 -5718508 -7985198
$$ packed form
2459a1298652J411179O41348K444621N216120L523348j465968k265282K753271
2451I59985N998150K481450k864394l789578j532159r8378Q69158K751781K876083
2442G652098r00467m659073l732276l01858L03196j891235k695153j174458R7142
2433g302084N10452J360889J660736k75109k094871r1457L888049M084501l86891
2424A354215l972143k787171P37800K571151J955555J27089j884794k658652r80829
2415e537779J619222J918238m81762k607881k660890j888500j336251k17892J540821
2406i652674K464908K237980K111966J916824J34231k347098k518629l76193N26562
2397e502123p91013p03880K474606M611822K042852k298319l469298k083155k266690
$$ plain form
2388 -7985198 -12107541 -15735780 -15333533 -11227831 -7132748 -5539784 -5662980 -5557213 -4723662
2379 -4723662 -4529412 -6580708 -10475539 -13364838 -12780533 -9776115 -7750990 -8106115 -8954194
2370 -8954194 -8438907 -6972380 -5207557 -2284049 2042304 5536207 6166041 5367515 6096220
2361 6096220 8326923 9068993 6781086 3322967 986845 -284207 -1634990 -2858616
2353 -2858616 -2776489 -1413294 -359497 -761799 -1750470 -1396427 901392 3446667 4014696
2344 4014696 2423840 771154 978871 2749219 4343907 4720628 4114012 2873512 741286
2335 741286 -2470375 -6072256 -8752483 -9544616 -8520013 -6644024 -4904057 -3514845 -2107978
2326 -2107978 -642540 297565 237619 -624662 -1793930 -2901836 -3535657 -3363474 -2896421
$$ packed form
2388g985198m122343l628239M02247M105702M095083J592964j23196J05767Q33551
2379d723662J94250k051296l894831k889299N84305L004418K025125l55125q48079
2370h954194N15287J466527J764823K923508M326353L493903O29834p98526P28705
2361F096220K230703P42070k287907l458119k336122j271052j350783j223626
2353b858616Q2127J363195J053797m02302r88671L54043K297819K545275N68029
2344D014696j590856j652686K07717J770348J594688L76721o06616j240500k132226
2335G41286l211661l601881k680227p92133J024603J875989J739967J389212J406867
2326b107978J465438R40105n9946q62281j169268j107906o33821J72183M67053
$$ plain form
2317 -2896421 -3317743 -4737816 -5341804 -3464218 -119428 1918976 1568407 532438 505481
2308 505481 662173 -980274 -4448125 -7313329 -7320352 -4754159 -2010114 -1187958 -2267187
2299 -2267187 -3559602 -3874883 -3908612 -4972451 -6547260 -6200388 -2539878 2551760 5520376
2290 5520376 4526307 509824 -4362362 -8007847 -8717600 -6093086 -2167095 -14296 -448849
2281 -448849 -1352288 -951231 -137464 -353176 -976696 -898286 -1294753 -3961207 -7437856 -8071141
2271 -8071141 -5379198 -3127347 -3771841 -4912582 -3448742 -582664 363014 -792128 -1626218
$$ packed form
2317b896421m21322j420073o03988J877586L344790K038404l50569j035969k6957
2308E05481J56692j642447l467851k865204p023K566193K744045Q22156j079229
2299b267187j292415l15281l3729j063839j574809L46872L660510N091638K968616
2290E520376r94069m016483m872186l645485p09753K624514L925991K152799m34553
2281d48849r03439M01057Q13767k15712o23520P8410l96467k666454l476649o33285
2271h071141K691943K251851o44494j140741J463840K866078R45678j155142q34090
$$ [...]
##END NTUPLES=NMR SPECTRUM
##END=
