##TITLE=31Pdec_DE-162rm_3h
 , 64 sc
 7.7.2026
##JCAMPDX= 6.0         $$ Bruker NMR JCAMP-DX V2.0
##DATA TYPE= NMR SPECTRUM
##DATA CLASS= NTUPLES
##ORIGIN= UXNMR, Bruker Analytische Messtechnik GmbH
##OWNER= root
$$ XWIN-NMR		Version 3.5
$$ Tue Jul  7 14:38:46 2026 Russian Standard Time (UT+4h)  she@DPX200
##.OBSERVE FREQUENCY= 81.013821
##.OBSERVE NUCLEUS= ^31P
##.ACQUISITION MODE= SIMULTANEOUS
##.ACQUISITION SCHEME= undefined
##.AVERAGES= 64
##.DIGITISER RES= 17
##SPECTROMETER/DATA SYSTEM= spect
##.PULSE SEQUENCE= zgpg30
##.SOLVENT NAME= DMSO
##.SHIFT REFERENCE= (INTERNAL, DMSO, 0, 197.392)
##AUDIT TRAIL= $$ (NUMBER, WHEN, WHO, WHERE, WHAT)
$$ ##TITLE= Audit trail, XWIN-NMR		Version 3.5
$$ ##JCAMPDX= 5.01
$$ ##ORIGIN= Bruker BioSpin GmbH
$$ ##OWNER= she
$$ F:/spectra/data/she/nmr/P31/2/pdata/1/auditp.txt
$$ ##AUDIT TRAIL=  $$ (NUMBER, WHEN, WHO, WHERE, WHAT)
(   1,<2026-07-07 14:37:13.59 +0400>,<she>,<DPX200>,
      <created by zg, POWCHK disabled, PULCHK disabled
       configuration hash MD5:
       00 E9 B6 7A A2 85 ED C7 34 08 36 98 17 FE 4E 26
       data hash MD5: 32K
       C2 8B 67 37 B5 8A B8 58 0D 32 8C E9 FD 48 E9 A0>)
(   2,<2026-07-07 14:37:16.07 +0400>,<she>,<DPX200>,
      <Start of raw data processing
       efp BC_mod = 2 LB = 1.5 FT_mod = 6 PKNL = 1 PHC0 = 1938.558 PHC1 = 145.2988 SI = 64K 
       data hash MD5: 64K
       CA E1 1B 6C E1 69 DD 04 58 E2 2B BA 9A A7 F1 28>)
(   3,<2026-07-07 14:37:36.00 +0400>,<she>,<DPX200>,
      <pk PHC0 = -5.953813 PHC1 = 0 
       data hash MD5: 64K
       27 3D 8B 5D 46 48 36 9B 1A BF 0F 9B 4F 25 9B A2>)
(   4,<2026-07-07 14:38:11.64 +0400>,<she>,<DPX200>,
      <pk PHC0 = 1.942068 PHC1 = 17.59999 
       data hash MD5: 64K
       BD C0 B8 DE 00 32 BB E0 74 90 8C 0E 02 65 00 F8>)
(   5,<2026-07-07 14:38:18.90 +0400>,<she>,<DPX200>,
      <abs ABSG = 5 
       data hash MD5: 64K
       D3 96 EF 9C 9C 88 D9 21 AF D7 CC 3C 42 46 D2 D0>)
$$ ##END=
$$ 
$$ hash MD5
$$ 0C F2 B8 E8 97 62 6B 45 42 59 D9 EA 9D D5 19 AC
##$RELAX= 
##$RELAX= 
##$RELAX= 
##$RELAX= 
##$RELAX= 
##$RELAX= 
##$RELAX= 
##$RELAX= 
$$ Bruker specific parameters
$$ --------------------------
##$DU= <F:/spectra>
##$EXPNO= 2
##$NAME= <P31>
##$PROCNO= 1
##$TYPE= <nmr>
##$USER= <she>
##$AMP= (0..31)
100 100 100 100 100 100 100 100 100 100 100 100 100 100 100 100 100 100 
100 100 100 100 100 100 100 100 100 100 100 100 100 100 
##$AQSEQ= 0
##$AQ_mod= 1
##$AUNM= <au_zg>
##$AUTOPOS= <>
##$BF1= 81.014009
##$BF2= 200.13
##$BF3= 200.13
##$BF4= 200.13
##$BF5= 200.13
##$BF6= 200.13
##$BF7= 200.13
##$BF8= 200.13
##$BYTORDA= 1
##$CFDGTYP= 0
##$CFRGTYP= 5
##$CHEMSTR= <none>
##$CNST= (0..31)
1 1 145 1 1 1 1 1 1 1 1 1 1 1 1 1 1 1 1 1 1 1 1 1 1 1 1 1 1 1 1 1 
##$CPDPRG= <waltz16>
##$CPDPRG1= <>
##$CPDPRG2= <waltz16>
##$CPDPRG3= <>
##$CPDPRG4= <mlev>
##$CPDPRG5= <mlev>
##$CPDPRG6= <mlev>
##$CPDPRG7= <mlev>
##$CPDPRG8= <mlev>
##$CPDPRGB= <>
##$CPDPRGT= <>
##$D= (0..31)
0 1 0 0 0 0 0 0 0 0.06 0 0.03 2e-05 3e-06 0 0 0.0002 0 0 0 0 0 0 0 0 0 
$$ [...]
##$SUBNAM3= <"">
##$SUBNAM4= <"">
##$SUBNAM5= <"">
##$SUBNAM6= <"">
##$SUBNAM7= <"">
##$SUBNAM8= <"">
##$SUBNAM9= <"">
##$SW= 400.765351723535
##$SWIBOX= (0..15)
0 1 3 0 0 0 0 0 0 0 0 0 0 0 0 0 
##$SW_h= 32467.5324675325
##$TD= 32768
##$TD0= 1
##$TE= 0
##$TE2= 300
##$TE3= 300
##$TEG= 300
##$TL= (0..7)
0 120 53 12 22 120 120 120 
##$TP= (0..7)
150 150 150 150 150 150 150 150 
##$TP07= 0
##$TPNAME0= <>
##$TPNAME1= <>
##$TPNAME2= <>
##$TPNAME3= <>
##$TPNAME4= <>
##$TPNAME5= <>
##$TPNAME6= <>
##$TPNAME7= <>
##$TPOAL= (0..7)
0.5 0.5 0.5 0.5 0.5 0.5 0.5 0.5 
##$TPOFFS= (0..7)
0 0 0 0 0 0 0 0 
##$TUNHIN= 0
##$TUNHOUT= 0
##$TUNXOUT= 0
##$USERA1= <user>
##$USERA2= <user>
##$USERA3= <user>
##$USERA4= <user>
##$USERA5= <user>
##$V9= 5
##$VALIST= <valist>
##$VCLIST= <CCCCCCCCCCCCCCC>
##$VD= 0
##$VDLIST= <DDDDDDDDDDDDDDD>
##$VPLIST= <PPPPPPPPPPPPPPP>
##$VTLIST= <TTTTTTTTTTTTTTT>
##$WBST= 1024
##$WBSW= 4
##$XGAIN= (0..3)
0 0 0 0 
##$XL= 0
##$YL= 0
##$YMAX_a= 54316
##$YMIN_a= -38242
##$ZGOPTNS= <>
##$ZL1= 120
##$ZL2= 120
##$ZL3= 120
##$ZL4= 120
##$ABSF1= 197.3918
##$ABSF2= -203.3724
##$ABSG= 5
##$ABSL= 3
##$ALPHA= 0
##$AQORDER= 0
##$ASSFAC= 0
##$ASSFACI= 0
##$ASSFACX= 0
##$ASSWID= 0
##$AUNMP= <proc_1d>
##$AZFE= 0.1
##$AZFW= 0.5
##$BCFW= 0
##$BC_mod= 2
##$BYTORDP= 0
##$COROFFS= 0
##$CY= -3
##$DATMOD= 1
##$DC= 0
##$DFILT= <>
##$DTYPP= 0
##$F1P= 0
##$F2P= 0
##$FCOR= 1
##$FTSIZE= 65536
##$FT_mod= 6
##$GAMMA= 0
##$GB= 0
##$INTBC= 1
##$INTSCL= 9.790993e-09
##$ISEN= 30
##$LB= 1.5
##$LEV0= 0
##$LPBIN= 0
##$MAXI= 10000
##$MC2= 0
##$MEAN= 0
##$ME_mod= 0
##$MI= 50
##$NCOEF= 0
##$NC_proc= -7
##$NLEV= 6
##$NOISF1= 182.463
##$NOISF2= 159.3651
##$NSP= 0
##$NTH_PI= 0
##$NZP= 0
##$OFFSET= 197.3918
##$PC= 4
##$PHC0= 1934.546
##$PHC1= 162.8988
##$PH_mod= 1
##$PKNL= yes
##$PPARMOD= 0
##$PSCAL= 0
##$PSIGN= 0
##$REVERSE= no
##$SF= 81.014063255964
##$SI= 65536
##$SIGF1= 159.3651
##$SIGF2= -187.1042
##$SINO= 113.3802
##$SIOLD= 16384
##$SREGLST= <1H.CDCl3>
##$SSB= 0
##$STSI= 65536
##$STSR= 0
##$SW_p= 32467.5324675325
##$SYMM= 0
##$S_DEV= 0
##$TDeff= 32768
##$TDoff= 0
##$TI= <>
##$TILT= no
##$TM1= 0
##$TM2= 0
##$TOPLEV= 0
##$USERP1= <user>
##$USERP2= <user>
##$USERP3= <user>
##$USERP4= <user>
##$USERP5= <user>
##$WDW= 1
##$XDIM= 65536
##$YMAX_p= 333528177
##$YMIN_p= -134367791
$$ End of Bruker specific parameters
$$ ---------------------------------
##NTUPLES= NMR SPECTRUM
##VAR_NAME=  FREQUENCY,     SPECTRUM/REAL,   SPECTRUM/IMAG
##SYMBOL=    X,             R,               I
##VAR_TYPE=  INDEPENDENT,   DEPENDENT,       DEPENDENT
##VAR_FORM=  AFFN,          ASDF,            ASDF
##VAR_DIM=   65536,         65536,           65536
##UNITS=     HZ,            ARBITRARY UNITS, ARBITRARY UNITS
##FACTOR=    0.49542278885378, 1,            1
##FIRST=     15991.5117654749, 0,            0
##LAST=      -16476.0207020576, 0,           0
##MIN=       -16476.0207020576, -134367791,  0
##MAX=       15991.5117654749, 333528177,    0
$$ Real data points
##PAGE= N=1
##DATA TABLE= (X++(R..R)), XYDATA
$$ [...]
44103C67528L38346J98939l98014j040917j292548j029645m40078n8175l59810
44094c714374r65383q41614K92770J455874J742097J353676P85042N221p72166
44085f58857o06659P43331J838834J349117J15934k5411J003035J487812M51103
44076E698239j223493k201317j988022p96031O75784J252759K51328j353036j739449
44067a423238m44261J118413J464699N28058p26362j313642p90147L64694Q89611
44058c32175M7708j287744j669493r55209j35216M11996J147903J948799J955727
44049A132296J073870K43282p4385l42130o37376l93853J79948N7682o68435n52578
44039A8321O81051J226303N5422j070067j77605J714482J984550J12613j992199
$$ y = [367528, 705874, 904813, 506799, -534118, -1826666, -2856311, -3296389, -3354564, -3714374, -4679757, -5521371, -5228601, -3772727, -2030630, -676954, 108088, 113309, -658857, -1265516, -522185, 1316649, 2665766, 2781700, 2756289, 3759324, 5247136, 5698239, 4474746, 2273429, 285407, -510624, 165160, 1417919, 1669247, 316211, -1423238, -1867499, -749086, 715613, 1243671, 517309, -796333, -1586480, -1221786, -332175, -284467, -1572211, -3241704, -4196913, -4332129, -3920133, -2772230, -823431, 1132296, 2206166, 2449448, 2375063, 2032933, 1395557, 1001704, 1181652, 1239334, 570899, 18321, 699372, 1925675, 1981097, 911030, 733425, 2447907, 4432457, 4545070, 2552871]
44030B552871k821799k502965j499627J0220J379674J743960J279197R48796R20435
44021B010762M78761m70724j127740j142183r92381r07895o15451k07802j9076
44012b993729L30241J336637K118242J272535n96052j213838n5349P11388k98658
44003F11417j428879p99707N21392L28976j063895j375988R8549J761068K278255
43994I31188J839313Q92566m31190j445594j233577k02341K01045m03625r83551
43985h35766r87003q53461l88951J284672L426734L501849O83430k316264k660557
43976H54683j111195l20192o60206k72190J284017K129721J177828j57247k84810
43967B640409K71360Q6470q77393j444661r85597N8233R89735J358689R69165
$$ y = [2552871, -268928, -2771893, -4271520, -4261300, -2881626, -1137666, 141531, 1090327, 2010762, 2489523, 2018799, 891059, -251124, -1243505, -2151400, -2766851, -2974653, -2993729, -2663488, -1326851, 791391, 2063926, 1467874, 254036, 198687, 910075, 611417, -817462, -1617169, -1095777, -766801, -1830696, -3206684, -3108135, -1347067, 931188, 2770501, 3663067, 3231877, 1786283, 552706, 350365, 551410, 147785, -835766, -1822769, -2676230, -3065181, -1780509, 1646225, 5148074, 5831504, 3515240, 854683, -256512, -576704, -1236910, -1509100, -225083, 1904638, 3082466, 2925219, 2640409, 2911769, 2998239, 2120846, 676185, -309412, -251179, 738556, 2097245, 3066410]
43958C066410J07179m74103l92652k10629o00902j237319j229607n04050O5913
43949a409760j8003k56047j94384k95457j028947j635042q93638Q92299J860351
43940b978628J043797j87407r5462Q52455P91943n69942j518335j028052j26474
43931c816105J15202K44890R11784J198183J14059j337993j458304m88233q490
43922d525007j99704J56272J107933J278608M76715K71581J241056J814176R42390
43913B564020p9327J31486P50173L94556m40027n09118j75724n41067j086034
43904A008938m22697J047520J485621N75932n1383L28069L64773q94927k156405
43895A285441j662688L69543K224339K757362K014862N02176j113287j972229
$$ y = [3066410, 3173589, 2699486, 2306834, 2096205, 1495303, 257984, -971623, -1475673, -1409760, -1427763, -1683810, -1878194, -2173651, -3202598, -4837640, -5731278, -4838979, -2978628, -1934831, -2122238, -2217700, -1365245, -573302, -1143244, -2661579, -3689631, -3816105, -3700903, -3456013, -2544229, -1346046, -1231987, -2569980, -4028284, -4516517, -4525007, -4724711, -4568439, -3460506, -2181898, -1705183, -1433602, -192546, 1621630, 2564020, 2484693, 2616179, 3366352, 3760908, 3320881, 2811763, 2636039, 2094972, 1008938, 586241, 1633761, 3119382, 3695314, 3643931, 3972000, 4336773, 3441846, 1285441, -377247, -7704, 2216635, 4973997, 6988859, 7491035, 6377748, 4405519]
43887D405519j672366q66422n37203p38525o40784J71071J037195J119258N51346
43878B829089J98138L32890J92655p40496j565842r67302P81192J921310J496140
43869D477774L27393o90723j782741k838298k364893L51002L134697L158956Q30202
43860D603369p70263k67137M90447k49922j531747j481781l6190J362600J635719
43851C755095O35618j111722k365140j912805j91011Q73716L75249m40578l78639
43842g60217j47647p42557j368640o88132Q35340J634659J435835J210217J196512
43833B605370P41708j06719n56271n81017q87102j334322r92722K8358L93181
43824f89536l79888j067885n69338N94895J208594Q04756l02296j464253j746089
$$ y = [4405519, 2733153, 1866731, 1329528, 591003, -49781, 121290, 1158485, 2277743, 2829089, 3027227, 3360117, 3552772, 2812276, 1246434, 279132, 1060324, 2981634, 4477774, 4805167, 4114444, 2331703, -506595, -2871488, -2520486, 614211, 3773167, 4603369, 3833106, 3565969, 4056416, 3806494, 2274747, 792966, 756776, 2119376, 3755095, 4390713, 3278991, 913851, -998954, -1189965, -316249, 59000, -381578, -760217, -907864, -1650421, -3019061, -3707193, -2871853, -1237194, 198641, 1408858, 2605370, 3347078, 3240359, 2684088, 2103071, 1215969, -118353, -1111075, -1082717, -689536, -1069424, -2137309, -2706647, -2111752, -903158, -98402, -400698, -1864951, -3611040]
43815c611040n59627J231708J850708Q21951l40257k54228N99799J035899R08341
43806A683254O14743j26213j543800k509444j647621L37296J061156l93176k057282
43797d581087j586854P39877K518367K219531O42884n77626q89570p73014n24877
43788b812369J394O20086P17859K10643j59710N8541L24633J76444K64829J245673
43778F48023K156800J362673q87624k359931j718978j18711P74783R63065J230130
43769B050230J309929N04781n98501p59500j89732l40573j451663j941925q18973
43760b235927O95887Q75242j65505q79177m48645N12744J166739J386615J386264
43751B294237J107797L16142r12829j975334k092272j097359J09633L27999m93086
$$ y = [-3611040, -4170667, -2938959, -1088251, -266300, -606557, -860785, -260986, 774913, 1683254, 2297997, 2171784, 627984, -1881460, -3529081, -3191785, -2130629, -2523805, -4581087, -6167941, -5428064, -2909697, -690166, -47282, -624908, -1514478, -2287492, -2812369, -2810975, -2190889, -1473030, -1262387, -1422097, -1363556, -1038923, -862479, -597650, 648023, 2804823, 4167496, 3279872, 919941, -799037, -917748, -142965, 820100, 2050230, 3360159, 3864940, 3266439, 2506939, 2317207, 1976634, 524971, -1416954, -2235927, -1540040, -664798, -830303, -1709480, -2158125, -1645381, -478642, 907973, 2294237, 3402034, 3718176, 2805347, 830013, -1262259, -2359618, -2249985, -1921986, -2415072]
43742b415072j035001k61950J144490J639535Q29984j44789k23619L85085Q57010
43733G75673Q64188N30367j87726j328117k271448k025106m87350J009989R66186
43724b153344m98180j610189j007832N15038R23455m41536j916250j574978M02874
43715g360942K125224K321056J379963K42145o60310j116277q09948J04356P75063
43706b999670O24635O1163k85566m56436o61118m86592N07531J771417K268488
43697C43852J812125J047298K85480o74063j617820j877240j409303r59573q58897
43688c908141n81560J11875N37344K10996j83899K58901J280172J787687J282586
43679G95961L12952l00449j89384M19106Q74146O24000j07216m52447n287O19174
$$ y = [-2415072, -3450073, -3712023, -2567533, -927998, -98014, -242803, -466422, -81337, 775673, 1639861, 2170228, 1982502, 654385, -1617063, -3642169, -4129519, -3119530, -2153344, -2651524, -4261713, -5269545, -4754507, -3831052, -4272588, -6188838, -7763816, -7360942, -5235718, -2914662, -1534699, -1292554, -1952864, -3069141, -3879089, -3774733, -2999670, -2375035, -2313872, -2599438, -3055874, -3716992, -4203584, -3696053, -1924636, 343852, 2155977, 3203275, 3488755, 2814692, 1196872, -680368, -2089671, -3049244, -3908141, -4489701, -4377826, -3840482, -3629486, -3813385, -3554484, -2274312, -486625, 795961, 1108913, 808464, 619080, 1038186, 1912332, 2536332, 2429116, 1976669, 1971382, 2590556]
43669B590556P09358M67273N21874P86330M88568p17731k163002k742678j945542
43660b004994m50846L23488k71837j080845m18985J447723K242534P20338j433457
43651i26881j848907n75889N35009P55627R20892J274324R33839j81271p47100
43642A39643n9149Q94944J218191J493797K280424K509896Q87916j858083l604943
43633C902636l342620j822975r1161J226508J344650l12712k702159l503394j730209
43624g031436R43526K333960K338837K206883J945913K85532k582244m078922
43616c637951k292977J121313K674234J307028o22066p31759N38071J179969N06253
43607D2115l76960m24728J45885N07043L47341J26496L88643Q73476N74836q27983
$$ y = [2590556, 3299914, 3767187, 4289061, 5075391, 5563959, 4846228, 2683226, -59452, -2004994, -2455840, -2132352, -2404189, -3485034, -3904019, -2456296, -213762, 506576, -926881, -2775788, -3351677, -2816668, -2061041, -1140149, 134175, 1068014, 886743, 139643, 80494, 975438, 2193629, 3687426, 5967850, 8477746, 9365662, 7507579, 3902636, 560016, -1262959, -1354120, -127612, 1217038, 904326, -1797833, -5301227, -7031436, -6087910, -3753950, -1415113, 791770, 2737683, 3023215, 440971, -3637951, -5930928, -4809615, -2135381, -828353, -1450419, -2182178, -1644107, -464138, 42115, -334845, -759573, -613688, -106645, 240696, 367192, 755835, 1629311, 2204147, 1376164]
43597A376164j927109j075856J053330J871365L71305j350525j100877M10920
43589c71283J062902M44393l98918j223209k307154k633474r18841J693800K520485
43580b131299J170737O3123O11677J362085Q18500k45008n98010n89387q17855
43571c55437n52362P89745K009082J717107M59646l53226o20870j059436j462762
43562E71487j147779m95728m58727r31182r51504k03501P34769J235510R37405
43553g09250r7845q93008k96148J049497R60680j019966k430140j514990p2639
43544e023809m33037j426782l51115K279435L313746J784991j51124j009126j424147
43535b440968j540660k95490J854868K590076J317801L37558J078704J845721
$$ y = [1376164, -550945, -1626801, -573471, 1297894, 1669199, 318674, -782203, -371283, 691619, 1136012, 737094, -486115, -2793269, -5426743, -6345584, -4651784, -2131299, -960562, -897439, -285762, 1076323, 1894823, 1649815, 1051805, 462418, -355437, -907799, -118054, 1891028, 3608135, 4067781, 3714555, 3093685, 2034249, 571487, -576292, -1072020, -1530747, -2461929, -3413433, -3616934, -2882165, -1646655, -709250, -807095, -1700103, -1996251, -946754, 13926, -1006040, -3436180, -4951170, -5023809, -5456846, -6883628, -7234743, -4955308, -1641562, 143429, -7695, -1016821, -2440968, -3981628, -4277118, -2422250, 167826, 1485627, 1823185, 2901889, 4747610]
43527D747610R21598n95567r84980p23914r80150j151458j87925J091052J234796
43518C371062N51490J81217j16920j126529k096397j718655m69134J66849J72785
43509a084232N34047Q83423L7164j373128j345939K20422J140236L57546n67899
43500a198360k76182K57989k63452j090902p15437O78186J689432J834359J637961
43491B553594J141091n0027j334820j315774J47905J275993M93646j491762k529258
43482a109412j593878K39935J331857J246195P10136L84021K81514K27338K44239
43473A961945L08333J54080l70174r45944j037858m83717K44386L95065k99549
43464g3433j141135j065372J5072R07833P02023J28634M44124J306247J090063
$$ y = [4747610, 5669208, 5073641, 4088661, 3364747, 2384597, 1233139, 1045214, 2136266, 3371062, 3922552, 4103769, 3986849, 2860320, 763923, -954732, -1423866, -1257017, -1084232, -550185, 333238, 370402, -1002726, -2348665, -2128243, -988007, -630461, -1198360, -1474542, -1216553, -1480005, -2570907, -3286344, -2608158, -918726, 915633, 2553594, 3694685, 3644658, 2309838, 994064, 1141969, 2417962, 2911608, 1419846, -1109412, -2703290, -2463355, -1131498, 114697, 824833, 1208854, 1490368, 1717706, 1961945, 2270278, 2424358, 2054184, 1108240, 70382, -413335, -168949, 226116, -73433, -1214568, -2279940, -2264868, -1357035, -655012, -526378, -82254, 1223993, 2314056]
43455B314056n61891j945338j671073n69963k54617p79747r55814l65696K36656
43446d553427L27820K52904L69552M40603J27369m59545q96820q36181k26256
43437e453981O32944J286655J461360J112373L17429m77051m15801P16046J600121
43428G80095P63575j089975j640157k40875J075804P18846j77102N0971Q59306
43419A100488Q20300J96452k7534m55033k006978l197840j701758J544933K897171
43410h29799J096473j122053j376023p02023q43398j133234j79381J343434J918735
43401a827269J807144K122990K318998J030512j077625j760007o09582J55109
43393B160270j034477k783255k730200p21125J171650J294540Q8544q38971o18719
$$ y = [2314056, 1752165, -193173, -1864246, -2434209, -2688826, -3468573, -4424387, -4790083, -4553427, -4225607, -3972703, -3603151, -3162548, -3035179, -3494724, -4391544, -5227725, -5453981, -4821037, -3534382, -2073022, -960649, -643220, -1120271, -1536072, -820026, 780095, 1543670, 453695, -1186462, -1427337, -351533, 367313, 190211, 241182, 1100488, 1920788, 2117240, 2089706, 1634673, -372305, -3570145, -5271903, -3726970, -829799, 266674, -855379, -2231402, -2933425, -3776823, -4910057, -5089438, -3746004, -1827269, -20125, 2102865, 4421863, 5452375, 4374750, 2614743, 2005161, 2160270, 1125793, -1657462, -4387662, -5108787, -3937137, -2642597, -2554053, -3393024, -4011743]
43384d011743K01529O05006L32344K502K03860P65230R52688K27155j139523k088473
43374c949425j669919j62875J073123J227125R44889R80873P24247o98527k382983
43365c913472k386650n26812J215023J390779N87599j84576q47578j255816o43665
43356f565168P78145J295247J55668q92713j32519J377470J476998K85594k13868
43347b435146O22911J444413J273176O08687Q9746k91501n12947m95353p66966
43338d62980j745899k433992j376982J028234K738044K682701J655199N35375
43330B619700o24595j496112j313585l67863M9871k19739J01775J218616J418069
43321A386137j42758j697823j437065j97788J53632l31068l20015K52624M04833
$$ y = [-4011743, -3810214, -3205208, -2872864, -2870362, -2666502, -1901272, -948584, -721429, -1860952, -3949425, -5619344, -5782219, -4709096, -3481971, -2537082, -1556209, -831962, -1530489, -3913472, -6300122, -6826934, -5611911, -4221132, -3633533, -3818109, -4665687, -5921503, -6565168, -5787023, -4491776, -4336108, -5228821, -5361340, -3983870, -2506872, -2221278, -2435146, -1812235, -367822, 905354, 1514041, 1603787, 1312286, 799339, 303986, -462980, -2208879, -4642871, -6019853, -4991619, -2253575, 429126, 2084325, 2619700, 1995105, 498993, -814592, -1182455, -1132584, -1352323, -1250548, -31932, 1386137, 1243379, -454444, -1891509, -2089297, -1935665, -2266733, -2586748, -2334124, -1929291]
43312a929291K28358O45940J335587J000962k50002q15749k14000J38923o06858
43303d66130j274572o50716N57662R95813P48111P50963R04749L15723q73803
43294A007800j387826p24931O4512k8218n68437n52299Q996K55063q2774l15380
43284b323494N8120O01956O53090K16571k39584m47064l84622p6980J94085o5287
43274a813209p09836o67730O11621J868886J435681k33525r33628J18622J107691
43265G84573M09545r68146j061853R3490Q43452N56189J20854O0713j15920n39086
43255A83811n07374K02800Q39535R07275P36371M68051k47326j056957q34161
43246F92025M04709R31745j97907j406476q94028M29680L32085j043429j255913
$$ y = [-1929291, -1700933, -1054993, 280594, 1281556, 1031554, 215805, 1805, 140728, -466130, -1740702, -2391418, -1833756, -837943, -89832, 661131, 1565880, 1881603, 1007800, -380026, -1104957, -1040445, -1068663, -1637100, -2189399, -2180403, -1925340, -2008114, -2323494, -2265374, -1663418, -1010328, -793757, -1033341, -1480405, -1865027, -1942007, -1747922, -1813209, -2523045, -3190775, -2579154, -710268, 725413, 491888, -441740, -323118, 784573, 1194118, 225972, -835881, -742391, 101061, 657250, 778104, 838817, 722897, 183811, -323563, -120763, 718772, 1626047, 2362418, 2830469, 2583143, 1526186, 692025, 1096734, 2028479, 1830572, 424096, -469932, -40252, 291833, -751596, -2007509]
43237b007509M88610J869507R43655q84711j033786M60032J304624M93921n53719
43228A080624m73759K61892O41637O96381Q33575P16689j6149o54720k93494O06040
43218C398716P75923O1170n14295n88343r18449j640057j578119j75331J196117
43209A7332J143310N06939J103996K744522L302685J800571l01364j361925j527981
43200G428085j579448j176107L84291K424261L343878K650521J418252P15181
43192A5608914N01874K19554l14693q51975j013294n01957N06002J141476O18964
43183A5914865o03318j065426l9719J506917K115580J543313O88511J31490m45972
43174A9746241j310877j950900j834296j411546j550877k046024j605965K41482
$$ y = [-2007509, -1518899, 350608, 1294263, 409552, -624234, -164202, 1140422, 1634343, 1080624, 606865, 868757, 1510394, 2206775, 3040350, 3757039, 3740890, 3086170, 2792676, 3398716, 4174639, 4235809, 3721514, 3133171, 2214722, 574665, -1003454, -1178785, 17332, 1160642, 1667581, 2771577, 5516099, 8818784, 10619355, 10317991, 8956066, 7428085, 5848637, 4672530, 5056821, 7481082, 10824960, 13475481, 14893733, 15608914, 16110788, 16330342, 16015649, 15163674, 14150380, 13648423, 14154425, 15295901, 15914865, 15311547, 14246121, 14206402, 15713319, 17828899, 19372212, 20060723, 20192213, 19746241, 18435364, 16484464, 14650168, 13238622, 11687745, 9641721, 8035756, 8277238]
43166H277238K027364J989498M03223q21636p70390m91478j007341j664787j348866
43157F592825l18859L79789O71135J237618J878896J566950K36935q63822j021617
43148A0359850j030406j690580k368564j911997l45846J125436J394960K25752
43140E758605j694090k951635k358514m12619Q43698K68771p46958k19020J431890
43131g9872J895008M52318q00561M9184J923069K239216M50192j388517j495643
43122C244394m36797J64297o5071j66793M12841J078167J135332P03692K31498
43113F301560j82616m68376k09517O75081J332434R48901M7128j90174K43853
43104H498274K07824n97269r97696k53069O53786N29822k50833n93577m98094
$$ y = [8277238, 10304602, 12294100, 12697323, 11875687, 11105297, 10613819, 9606478, 7941691, 6592825, 6273966, 6653755, 7324890, 8562508, 10441404, 12008354, 12245289, 11381467, 10359850, 9329444, 7638864, 5270300, 3358303, 3012457, 4137893, 5532853, 5758605, 4064515, 1112880, -1245634, -1658253, -814555, -545784, -1292742, -1511762, -79872, 1815136, 2267454, 1466893, 1516077, 3439146, 5678362, 6128554, 4740037, 3244394, 2807597, 2971894, 2906823, 2740030, 3152871, 4231038, 5366370, 6070062, 6301560, 6118944, 5650568, 5441051, 6116132, 7448566, 8397467, 8444595, 8254421, 8498274, 8706098, 8108829, 7111133, 6858064, 7511850, 8041672, 7790839, 7197262, 6699168]
43095F699168p15410j093392o98629M69560J159567N23936p99475j514600r45962
43086C084763N72812J983137K197016J106299j85101o73486o92181j132913j870462
43077D389884j996386j337303n53845J47366J131583K153486K383435J775391
43069H093611J090783L88941r81734k521005k469239m49375J387622J123671l13641
43060E349634p46276R2040O65095K73373j86913k4449K29768m3463m85063l52946
43050D770800L58324P94999J62785j224121j913493q29437J137269J862722O39460
43041E759308q38050p40551N68450J333325P65535l72754r67208m27109J101116
43032F182062K553829K570241J126600j08789J14789J002826J165211O74907L83970
$$ y = [6699168, 5983758, 4890366, 4191737, 4661297, 5820864, 6344800, 5545325, 4030725, 3084763, 3657575, 5640712, 7837728, 8944027, 8758926, 8085440, 7393259, 6260346, 4389884, 2393498, 1056195, 502350, 649716, 1781299, 3934785, 6318220, 8093611, 9184394, 9573335, 8591601, 6070596, 3601357, 3151982, 4539604, 5663275, 5349634, 4603358, 4695398, 5360493, 5633866, 5446953, 5422504, 5652272, 5608809, 5123746, 4770800, 5129124, 5924123, 6086908, 4862787, 2949294, 2119857, 3257126, 5119848, 5759308, 4921258, 4180707, 4749157, 6082482, 6848017, 6475263, 5508055, 5080946, 6182062, 8735891, 11306132, 12432732, 12323943, 12438732, 13441558, 14606769, 15281676, 15665646]
43023A5665646K02866k93277m04172O24179J690571J134705l79933n40285J042016
43014A8742316K222157J645824M50597k3091j07711m25590n33044j77077l37544
43005B1456837j662274l035992k967383j523909J23379J245815J746468J582610
42997A6965551Q43015j36810j165150k065730k177318j134430q7908m96964j580855
42988H963401j058518J100943K130875P32579o84348K46087K230075K683450J652706
42979A7997250P71735O7447j216402j953804o01458J411611J126110j293201k592256
42970A3717032j351241K62521L11302l05810j42596M85054P99195J009409J162094
42961A5946960M63091j000303j684880r89434m34853j138638j930956j493185
$$ y = [15665646, 15868512, 15575235, 15171063, 15795242, 17485813, 18620518, 18240585, 17700300, 18742316, 20964473, 22610297, 23060894, 23037803, 22930092, 22504502, 21971458, 21794381, 21456837, 19794563, 16758571, 13791188, 12267279, 12390658, 13636473, 15382941, 16965551, 17808566, 17671756, 16506606, 14440876, 12263558, 11129128, 11041220, 10544256, 8963401, 7904883, 9005826, 11136701, 11869280, 11184932, 11431019, 13661094, 16344544, 17997250, 18768985, 18836432, 17620030, 15666226, 15064768, 16476379, 17602489, 16309288, 13717032, 12365791, 12628312, 12939614, 12633804, 12491208, 12976262, 13775457, 14784866, 15946960, 16410051, 15409748, 13724868, 12735434, 12300581, 11161943, 9230987, 7737802]
42953G737802n82527l50468j31947R70773J736313N39874j513205j800452j58244
42944F447919R18702J57138q56524n27533M03760M30519m32447j151742j325087
42935D064705j137684m98964N78125J233730N64116r46101j747266j101492Q5299
42926A094468N53108K32763M6470M64042Q64467M90888m02795q21662l33852L92618
42916B580515M92897o4669o09125o07503o0741O81267J127193Q45853j15987j053147
42906C216553j201022n53660J82880M52725L58565K59876K35500J96607K58342
42897C406366N60427P63923K57343q75773j579792j071834k8656K77664j14541
42888A595127P1826J128841J531885J95497j592523j834085o06439M24086P44766
$$ y = [7737802, 7155275, 6804807, 6672860, 7643633, 9379946, 9919820, 8406615, 6606163, 6447919, 7366621, 7523759, 6667235, 6139702, 6543462, 6973981, 6541534, 5389792, 4064705, 2927021, 2428057, 3006182, 4239912, 4804028, 3857927, 2110661, 1009169, 1094468, 1647576, 1880339, 1926809, 2390851, 3255318, 3746206, 3343411, 2521749, 2187897, 2580515, 3073412, 3008743, 2399618, 1792115, 1731374, 2412641, 3539834, 4385687, 4269700, 3216553, 2015531, 1461871, 1644751, 2097476, 2456041, 2715917, 2951417, 3148024, 3406366, 3966793, 4730716, 4988059, 4112286, 2532494, 1460660, 1432004, 1709668, 1595127, 1666953, 2795794, 4327679, 4523176, 2930653, 1096568, 490129, 914215, 1658981]
42879A658981J311476K154371J787654l15347k458881k953184k160442j251192
42871b226564l12909R58391J862864J597457P81835N37194O36185J44645n66410
42862C412688k31741R63159J238405j66275j721588j654239j85295J032934R80775
42853C668823N9880p34234q18272l50376R3560J38082j15423m29618p15231p96629
42843E62m09267K00974L14435q3814L2795J045592J583708M28780j230290j195109
42833F88366M82636J621506J265176P33170Q57549M62834j230805k668741k117352
42824I4339l75230M54009m7686n87402m41869k867N82223J586307K531240K344762
42814F137826R15208o41741j403708j363622p93583K3895M55743O4065m60152
$$ y = [1658981, 2970457, 5124828, 6912482, 6597135, 4138254, 1185070, -975372, -2226564, -2539473, -1581082, 281782, 1879239, 2661074, 3198268, 3834453, 3979098, 3412688, 3180947, 4144106, 5382511, 5216236, 3494648, 1840409, 1655114, 2688048, 3668823, 3728703, 2994469, 2176197, 1825821, 1919381, 2057463, 1942040, 1512422, 797191, 562, -408705, -207731, 106704, 22890, 55685, 1101277, 2684985, 3113765, 1883475, 688366, 1171002, 2792508, 4057684, 4790854, 5648403, 6111237, 4880432, 2211691, 94339, -280891, 173118, 125432, -461970, -903839, -906706, -324483, 1261824, 3793064, 6137826, 7053034, 6411293, 5007585, 3643963, 2850380, 2874275, 3330018, 3394083, 2933931]
42805B933931p6737Q52617R35339N0923k49613Q27273K025764K053442J470114
42796A0823053J381973J489201R47413K59414N59983J493661J591098O53573K2666
42787A9222035K98552N24044J28681n8879L45540Q0559j652624l170183k343409
42778A3374316j2298P80139r78660k875897k599723j017490m28871j114944j410459
42769C716113n79164K82171L15599K04042P24156J226766N76130j051630k297997
42760C116186k299495j449494n86849j20604j2703m6586P4353N16524J057648
42751B48980J320040J311339J385422J580574J411301N75894m31070p59565j64564
42742F478351P00218R12555J24220j092501j686813j172779l42578n43001j916319
$$ y = [2933931, 2857194, 3709811, 4645150, 4696073, 4446460, 5273733, 7299497, 9352939, 10823053, 12205026, 13694227, 14641640, 14901054, 15461037, 16954698, 18545796, 19199369, 19222035, 19520587, 20044631, 20173312, 20114433, 20459973, 20540532, 18887908, 15717725, 13374316, 13362018, 14142157, 13163497, 10287600, 7687877, 6670387, 6241516, 5126572, 3716113, 3136949, 3419120, 3734719, 3938761, 4662917, 5889683, 6465813, 5414183, 3116186, 816691, -632803, -1219652, -1340256, -1352959, -1399545, -1325192, -808668, 248980, 1569020, 2880359, 4265781, 5846355, 7257656, 7833550, 7402480, 6642915, 6478351, 7178569, 8091124, 8215344, 7122843, 5436030, 4263251, 3920673, 3377672, 1461353]
42733A461353k788462j478116J427409L390754K710351L03461j633031k027632
42725A366087j346874k25439J173244K426053K608780J391775k45750j051272
42717F096604r22312p37716j043476j535644j707874j343066l78126R99853J993444
42708A421687J720380M60169l94104j83404M4788o72161j259974j7191K292150
42699C412340K748191L08647k322467k228611k34198N82133o00009j662612j207803
42690a204389m17753n94680j035157o14299K32736O31017R96435J937735K497102
42681B428747J417011m67345j065376l5616Q63125M23271o89496j383032j312940
42672A78349m26730J088576K138971J575216M2128o06242o6127J5374j109697
$$ y = [1461353, -1327109, -2805225, -1377816, 2012938, 4723289, 5026750, 3393719, 1366087, 19213, -206226, 967018, 3393071, 6001851, 7393626, 7147876, 6096604, 5174292, 4436576, 3393100, 1857456, 149582, -1193484, -1571610, -571757, 1421687, 3142067, 3602236, 3208132, 3024728, 3069516, 2397355, 1137381, 1120190, 3412340, 6160531, 6469178, 4146711, 1918100, 1683902, 2266035, 1666026, 3414, -1204389, -1622142, -2216822, -3251979, -3866278, -3633542, -3002525, -2006090, -68355, 2428747, 3845758, 3378413, 2313037, 2277421, 3140546, 3563817, 2874321, 1491289, 178349, -248381, 840195, 2979166, 4554382, 4596510, 3990268, 3924141, 3939515, 2829818]
42663B829818k016128j539438n17055N9219O95736J730744J876351K84979j493856
42654A910370j639905p68431l87969m5729J416493K859575K118088j85313j152546
42645D124633R518J100827Q58779P67311J876341K558591J130663j321549k546729
42636H558385k155681j451450j296261j538640j785786j681819j084924n88930
42628c025106r26593j426879m67390J882691L315093K408285O82649J93246N67990
42619C203986R4571j417595k617960k653545j674670k5792J636278K142503J121700
42610a90524j73710n40625l62100k60610L63150J693440J923335k30851k598982
42601c77477k065227O38487J851101N91573k08368J232157K663457J594903q76092
$$ y = [2829818, 813690, -725748, -1242803, -1183584, -487848, 1242896, 3119247, 3404226, 1910370, 270465, -497966, -885935, -931664, 484829, 3344404, 5462492, 5277179, 4124633, 4134151, 5234978, 6093757, 6861068, 8737409, 11296000, 12426663, 11105114, 8558385, 6402704, 4951254, 3654993, 2116353, 330567, -1351252, -2436176, -3025106, -3951699, -5378578, -5845968, -3963277, -648184, 1760101, 2442750, 2635996, 3203986, 3298557, 1880962, -736998, -3390543, -5065213, -5091005, -3454727, -1312224, -190524, -364234, -904859, -1266959, -1527569, -1164419, 529021, 2452356, 2221505, -377477, -2442704, -1804217, 46884, 638457, 430089, 1662246, 4325703, 5920606, 5044514]
42592E044514k166265j999725j759913j594530o41873O88117R75727J15246m93458
42583a832160j33145L51199Q4627n93676p98572l04877K50089J49354m23851k93753
42573c544765J244470K905495K499234p660j848289r04496J384292K029692N23138
42564D281111r71620j037122n70256o74705q81142l69467L88379L75595l26328
42555B14445p09424l04363L87109P84010Q58095Q46245Q17712O50400K07980m98742
42545C253467j222776j624013j571071j156649m02533P04408J743457J928930
42537A653220J096351J90302O2683Q8516r76910k720056k994260q50371J685373
42528b765152K125408R78231Q35282K252701K778894P69851j900038k429215r18626
$$ y = [5044514, 2878249, 878524, -881389, -2475919, -3117792, -2429675, -1453948, -1338702, -1832160, -1965305, -1614106, -1529479, -2123155, -2921727, -3226604, -2976515, -2827161, -3251012, -3544765, -2300295, 605200, 3104434, 3096774, 1248485, 343989, 1728281, 3757973, 4281111, 3309491, 2272369, 1702113, 1027408, 146266, -223201, 165178, 540773, 214445, -494979, -799342, -412233, 371777, 1229872, 2076117, 2893829, 3544229, 3752209, 3253467, 2030691, 406678, -1164393, -2321042, -2723575, -2019167, -275710, 1653220, 2749571, 2939873, 3002556, 3091072, 2114162, -605894, -3600154, -4450525, -2765152, -639744, 338487, 1173769, 3426470, 6205364, 6975215, 5075177, 2645962, 1727336]
42519A727336K27281j54817r63894r77374k09327Q42803J737420J813394Q07812
42510D850634k33959j29974M13132l06534j969630k223036l13271J434919J015530
42501B537811k83286k8509J650246K511470J581269J42376m20420j50662J83493
42492G723788J41935j93024l48049J31210Q97598Q69985l29983j634686j931201
42483E327573j456724r52766l30299O39313J108670J13370j684130k594092j985278
42474a814363o32234N69294J049241L77937r04709r43652J167232L313105K631385
42465D813236m11200k482895j926108l71146N05943J102821J803615J474023k55260
42456D253029j417530n05269Q63205L11252j543718k085209o55428Q48240J022399
$$ y = [1727336, 1954617, 1799800, 835906, -141468, -350795, 492008, 2229428, 4042822, 4850634, 4616675, 4486701, 4899833, 4593299, 2623669, 400633, 87362, 1522281, 2537811, 2254525, 2226016, 3876262, 6387732, 7969001, 8111377, 7690957, 7540295, 7723788, 7865723, 7672699, 7324650, 7455860, 8353458, 9223443, 8893460, 7258774, 5327573, 3870849, 2918083, 2587784, 3227097, 4335767, 4449137, 2765007, 170915, -1814363, -2446597, -1877303, -828062, -450125, -1354834, -2298486, -1131254, 2181851, 4813236, 4402036, 1919141, -6967, -378113, 127830, 1230651, 3034266, 4508289, 4253029, 2835499, 2330230, 3193435, 3504687, 1960969, -124240, -779668, 68572, 1090971]
42447A090971M26821j2986j30973J75176J050005J767367J263996n1234n27349
42438E051794K38584O76218l09205j655355j917198j419405j307104j404638o04003
42429b650312J024097K045945J651224N69662k25100o01176o64534j51478Q56685
42420A855013J429004Q74180k09262q43003j127184j726897k292889j795019m42339
42411d278396K71360j03701j27370J190590K661908K796965K110102J895116J794095
42402H210669O90337o80788n05106Q39668R15984q93584k247180j588893m84906
42393D256201o30818r05724L02552J710649R22011j456768k439538j115555K79725
42384I22735j5j007823j218257o91256j42204L97341Q96983P24410j76035o78809
$$ y = [1090971, 1517792, 1504806, 1373833, 1549009, 2599014, 4366381, 5630377, 5579143, 5051794, 5290378, 5966596, 5657391, 4002036, 2084838, 665433, -641671, -2046309, -2650312, -1626215, 419730, 2070954, 2640616, 2415516, 1814340, 1149806, 998328, 1855013, 3284017, 4158197, 3948935, 3105932, 1978748, 251851, -2041038, -3836057, -4278396, -4007036, -4110737, -4238107, -3047517, -385609, 2411356, 4521458, 6416574, 8210669, 8901006, 8220218, 7715112, 8554780, 9470764, 8577180, 6330000, 4741107, 4256201, 3625383, 2719659, 3022211, 4732860, 5654871, 4198103, 1758565, 643010, 922735, 922720, -85103, -1303360, -1994616, -2136820, -1739479, -842496, -118086, -294121, -972930]
42374i72930j05474O06848M37953l7471K29634P85731K92655j262865k386393
42365b412312k091945r44139M7081N54677O55897L00566l95811q48341n73353
42356e707680J16509M30229J24638j02932N61072J946265K915003K622506J516243
42347D421853P27339N84877K78123q22838k051985k201269j186468l01550n93372
42338a145290j479105j514607l50299Q10153R38974O12400R78475J837466J908095
42329B596262R11505M9111M4628Q5755m89500p68931K12639J575820J798626J126590
42319G142505J075812J948259K643703K732143K734122K276363K02088k838187
42311A7916808m085213k224183M59621R52353p55213k297785k234252j136591
$$ y = [-972930, -1078404, -471556, -33603, -71074, 158560, 944291, 1236946, -25919, -2412312, -4504257, -5448396, -5401315, -4846638, -4190741, -3890175, -4285986, -5134327, -5707680, -5591171, -5160942, -5036304, -5139236, -4578164, -2631899, 283104, 2905610, 4421853, 5149192, 5734069, 6012192, 5189354, 3137369, 936100, -250368, -551918, -1145290, -2624395, -4139002, -4489301, -3679148, -2740174, -2127774, -1149299, 688167, 2596262, 3507767, 3556878, 3601506, 3687261, 3197761, 2428830, 2641469, 4217289, 6015915, 7142505, 8218317, 10166576, 12810279, 15542422, 18276544, 20552907, 20754995, 17916808, 13831595, 11607412, 12067033, 13019386, 12264173, 9966388, 7732136, 6595545]
42303F595545j33131R0947p06337j971870k348515j178133L74420P91329L05243
42294A819498L29872J241268K051094K011064J256174O1954j263383j915100j327999
42285D264442l04202j38859o86843o28532L42884J031863O32857k54282q02250
42276C457078q58748l61403P89571J812147J360719n46833k108991k003116j004678
42267E35746n62487p68934o79238J23162J175253J787272J401213n2922j581602
42258A377463j698716k70286R78106N57116r16674j743741j304230k98619N29260
42249b790321R31394Q68961N51786M02712L75289q8170q37831p29267N16501J259878
42239D60932J44047j581666j696791l10520N36457K85614N03957J753843K243340
$$ y = [6595545, 6462414, 6553361, 5847024, 3875154, 1526639, 348506, 722926, 1514255, 1819498, 2149370, 3390638, 5441732, 7452796, 8708970, 8770924, 7507541, 5592441, 4264442, 3960240, 3821381, 3134538, 2506006, 2848890, 3880753, 4513610, 4259328, 3457078, 2598330, 2236927, 3026498, 4838645, 6199364, 5652531, 3543540, 1540424, 535746, -26741, -795675, -1474913, -1351751, -176498, 1610774, 3011987, 2959065, 1377463, -321253, -591539, 386567, 943683, 27009, -1716732, -3020962, -3319581, -2790321, -1858927, -989966, -438180, -35468, 339821, 251651, -586180, -1315447, -798946, 460932, 604979, -976687, -2673478, -2983998, -2447541, -2161927, -1657970, 95873, 2339213]
42230B339213P72298r77715q28571N86667Q84023m29616j439295r06632L4922
42221C5294j22643j042581j355571p70975j60483Q1504N15106J351096J753224
42212B83971J023322k53680r95536j052675r93716q23197k7866J096012J361082
42203c82283L80723o21681l19336J106536K390572K505545J083125j550682l995930
42194E96589m351059k222480M71254J655456J340671P11238k326j137476j866160
42185d804293r40301R64893J710335P67485j03350K42890P21041K41797k80787
42176a480290L93024J484741J256964k80221j350973r20079J27505M83040R4484
42167a91805r7285L87369R03764N84939l70351q62770m75492p9619k74612k16880
$$ y = [2339213, 3111511, 2133796, 1305225, 1891892, 2775915, 2346299, 907004, 372, 35294, -87349, -1129930, -2485501, -3256476, -3416959, -3335455, -2820349, -1469253, 283971, 1307293, 1053613, 58077, -994598, -1988314, -2811511, -2839377, -1743365, -382283, -1560, -623241, -942577, 163959, 2554531, 5060076, 6143201, 4592519, 596589, -3754470, -5976950, -5505696, -3850240, -2509569, -1798331, -1800657, -2938133, -4804293, -5744594, -4779701, -3069366, -2301881, -2405231, -2162341, -1441300, -1199503, -1480290, -1087266, 397475, 1654439, 1374218, 23245, -896834, -769329, -286289, -191805, -289090, 98279, 1002043, 1586982, 1216631, 353861, -121631, -201250, -475862, -692742]
42157f92742Q08732J583130N44441j363998j667841j09671R99419M93324j97211
42148C97583p2035k69414j381367j761879m43112P00776O575r84701k44446J038887
42138c013133N52523r74449j118161j05812j61298j158815p19317J387956K588239
42129b722267J664853K40745m39276r43860j232290j67589J598398J612151k71055
42120f60190j075280N29513K008930J307970R37j46915l61690j758172k250872
42111b405769p6221K248705J413847j250834j902362k28456Q45445M57368M41114
42102d57163J067547N26604j080054j354654N0733N25003r85409k097722j011831
42093d816946Q17901J564465J560245J283328j91056k654773l437586j125049
$$ y = [-692742, 115990, 1699120, 2243561, 879563, -788278, -897949, 101470, 594794, 397583, 325548, 56134, -1325233, -3087112, -3530224, -2829448, -2822873, -3807574, -4052020, -3013133, -2460610, -3435059, -4553220, -4659032, -4820330, -5979145, -6698462, -5310506, -2722267, -1057414, -816669, -1255945, -2199805, -3432095, -3599684, -2001286, -389135, -660190, -1735470, -1205957, 802973, 2110943, 2111880, 1964965, 1603275, -154897, -2405769, -2481990, -233285, 1180562, -70272, -1972634, -2201090, -1355645, -898277, -457163, 610384, 1136988, 56934, -1297720, -1246987, -721984, -1707393, -3805115, -4816946, -3999045, -2434580, -874335, 408993, 217937, -2436836, -5874422, -6999471]
42085f999471J611502J542033n35949j416065k74683R39862J004028N80702K34969
42076c313072l23569r92000j145211q06512m86535n7136Q05093J405938Q01073
42067d111931m74534r38475k13694Q49627J733733K331427J846477l57828k723539
42058b058737k456956P24640L556914L035685J6649k133186j608502K89010J242388
42049F07905M70106q99417j357574n67574N64059J115813J005972N00053m36445
42040A002898j650278k239944j489252j25817M22312L3033P5986J331451K715878
42031G6267K648955J054528n99859r70115j15351Q05662Q82677L59479M7665L8510
42021D228418l21937j052703j137159j30857Q20660N79260k41469l94889p4240
$$ y = [-6999471, -5387969, -3845936, -4381885, -5797950, -6072633, -5132771, -4128743, -3548041, -3313072, -3636641, -4628641, -5773852, -6580364, -7066899, -7124035, -6318942, -4913004, -4111931, -4586465, -5524940, -5738634, -4889007, -3155274, -823847, 1022630, 664802, -2058737, -4515693, -3791053, -234139, 2801546, 2818195, 685009, -923493, -634483, 607905, 1078011, 178594, -1178980, -1746554, -1182495, -66682, 939290, 1439343, 1002898, -647380, -2887324, -4376576, -4502393, -4080081, -4047048, -3971062, -2639611, 76267, 2725222, 3779750, 3179891, 2209776, 2094425, 2900087, 3782764, 4142243, 4189908, 4228418, 3906481, 2853778, 1716619, 1585762, 2406422, 2985682, 2744213, 2349324, 2275084]
42012B275084k86353p70648m57436K76414n2048j284234j411594K86206J976974
42003E52365K065740J284118P99208J48711j257868k139934r30839J510446K758079
41994D790026K005471P12498K69501N12296N53470j47278j584774l079042l387054
41985F45114j860117N41972K127586K206029J342261L35492k62392j11545M80309
41976E444709N01304m80654j500395j620493j433102j840976k098568q39969J346441
41967b521703K363694J639363P31731O21268M43563l98385q69097k17793M35350
41958B227991o9402p94992r0806J688129K546133J626248J55179l86747J57554
41949G059287J034716J611274J699790J507394J518419K000709K494790K185539
$$ y = [2275084, 1988731, 1218083, 760647, 1037061, 985013, -299221, -1710815, -1424609, 552365, 2618105, 3902223, 4701431, 4850142, 3592274, 1452340, 521501, 2031947, 4790026, 6795497, 7507995, 7777496, 8289792, 8843262, 8695984, 7111210, 4032168, 645114, -1215003, -673031, 1454555, 3660584, 5002845, 5338337, 5075945, 4964400, 5444709, 5946013, 5465359, 3964964, 2344471, 911369, -929607, -3028175, -3868144, -2521703, -158009, 1481354, 2213085, 2834353, 3277916, 2879531, 2010434, 1792641, 2227991, 2158589, 1363597, 1272791, 2960920, 5507053, 7133301, 7288480, 6901733, 7059287, 8094003, 9705277, 11405067, 12912461, 14430880, 16431589, 18926379, 21111918]
41941B1111918R52504k08895r609J903158M540915O406774O767921N988155M554870
41932E2007711K252342j134415m616703o445067n952846m253435k845384k136673
41924B6875530j598385p37916M64751J637372K252010K133559J770548J653183
41916C4450652J450934N73355o65158j497709k182805l602080n226407n187413
41908A8113369l033598p60557r4943l16626n9652K59735m36903j528494j476139
41899A0666192l06117N76088N86441J74328o86884k178255l016084j407059K018175
41890F426825M247114L564456J534724N66773J030326J733105J965741J909862
41882B2978926J782351J544381J080747K03205j048567j940494j647091n42688
$$ y = [21111918, 22064422, 21855527, 21845918, 23749076, 28289991, 34696765, 41464686, 47452841, 52007711, 54260053, 53125638, 48508935, 42063868, 36111022, 31857587, 29012203, 26875530, 25277145, 24539229, 25003980, 26641352, 28893362, 31026921, 32797469, 34450652, 35901586, 36474941, 35809783, 34312074, 32129269, 28527189, 23300782, 18113369, 15079771, 14319214, 14224271, 13907645, 13847993, 14107728, 13670825, 12142331, 10666192, 10360075, 10936163, 11522604, 11696932, 11010048, 8831793, 5815709, 4408650, 6426825, 10673939, 14238395, 15773119, 16339892, 17370218, 19103323, 21069064, 22978926, 24761277, 26305658, 27386405, 27589610, 26541043, 24600549, 22953458, 22410770]
41874B2410770l3161q07494k066766k698459k339827j144227M56678J554789J467524
41865A6799827R07677J287157K630136L548543L603542M049191N565950O919884
41857D5311907O865279N856550M704651K975888J49676k793551m419182m623728
41849E4027490m185052l508205k961891l255208m112208l852023j895922l33399
41841B9923582r66761k059999o03216K960839N140174M384891K832748K629151
41833D4241409L148833K856906J731255N48223o03440j834968k686568k889389
41825D4512261k948513l215040l309136l004994k630614k118315q95200P18302
41817B7108751J368541P33760M31461J834065M023463M958459L828757J334588
$$ y = [22410770, 22377609, 21570115, 19503349, 16804890, 14465063, 13320836, 13777514, 15332303, 16799827, 17707504, 18994661, 21624797, 25173340, 28776882, 32826073, 38392023, 45311907, 52177186, 58033736, 62738387, 65714275, 65863951, 63070400, 58651218, 54027490, 49842438, 46334233, 43372342, 40117134, 36004926, 32152903, 30256981, 29923582, 28956821, 26896822, 26293606, 29254445, 34394619, 38779510, 41612258, 44241409, 47390242, 50247148, 51978403, 52526626, 51923186, 50088218, 47401650, 44512261, 41563748, 38348708, 35039572, 32034578, 29403964, 27285649, 26390449, 27108751, 28477292, 29211052, 29642513, 31476578, 35500041, 40458500, 44287257, 45621845]
41809D5621845j499873l784300m751594m306130l193877k062512r58527j32231
41801B4932801l07087j463793k386827k253689j708608j522611j278632m34579
41793A3576975L76587L72018K4776Q9832N2335r26911k123312j937943k45186
41784I259171J361462J580059N10769j019660k088734j860613l16803J291762
41776H717413J678896R65547O7296p12061j338292j098127L86508J751606J370429
41767A1789215N212M6917K077149M086363M292898K844790N02759k225952m096993
41758A9322358l550066j188503J86086o94472j711589p90242O89802M8583k460059
41749I851898l982249l013395p88383J050304K103629K397676J758696N22542
$$ y = [45621845, 44121972, 40337672, 35586078, 31279948, 28086071, 26023559, 25065032, 24932801, 24625714, 23161921, 20775094, 18521405, 16812797, 15290186, 14011554, 13576975, 13953562, 14325580, 14350356, 14440188, 14492523, 13565612, 11442300, 9504357, 9259171, 10620633, 12200692, 12711461, 11691801, 9603067, 7742454, 7425651, 8717413, 10396309, 11361856, 11429152, 10717091, 9378799, 8280672, 8667180, 10418786, 11789215, 11794427, 11841344, 13918493, 18004856, 22297754, 25142544, 25645303, 23419351, 19322358, 15772292, 14583789, 14769875, 14075403, 12363814, 11573572, 12263374, 12311957, 9851898, 5869649, 2856254, 2067871, 3118175, 5221804, 7619480, 9378176, 9900718]
41741I900718m22948p10839o54571l30690L25833N85281l77916j616641r77648
41732E720579J697093L543000K122723j269265l235975k408500l30223J262239
41724G101671K081125K089438P55594j415047k207545k93395K320962K389489
41716A2822292j80283k065588j169696N56412L24911j227074j311534L86824J237991
41707I374255N9063r05705K33896J684524P26041j786347k527040p46947P38820
41698F850560L942j324562j123034j47796l11040j181912p56313R26206J570020
41689D506071K93764q68703j43888J229248R86809p09772j648370p77288P43003
41680C610874J547511J463776P43282n01344j575461j340882J46614J312228J214619
$$ y = [9900718, 9477770, 8766931, 8112360, 7781670, 8107503, 8692784, 8314868, 6698227, 5720579, 7417672, 10960672, 13083395, 11814130, 8578155, 6169655, 5839432, 7101671, 9182796, 11272234, 12027828, 10612781, 8405236, 8111841, 10432803, 12822292, 12642009, 10576421, 9406725, 9963137, 10288048, 9060974, 7749440, 8136264, 9374255, 9433318, 8527613, 8761509, 10446033, 11172074, 9385727, 6858687, 6111740, 6850560, 6854502, 5529940, 4406906, 4259110, 3948070, 2766158, 2009845, 2936051, 4506071, 4799835, 3931132, 3787244, 5016492, 6003301, 5293529, 3645159, 2867871, 3610874, 5158385, 6622161, 7365443, 6864099, 5288638, 3947756, 4094370, 5406598, 6621217]
41671F621217Q92282J527864K351272J771453j22124j695206k038060j692044
41663G616654j307877r17498m77278O3361J096924K547852L038268J422161j024549
41654A2058018j822254q27373m42970j707224k433778n81878K419009L548818
41646A0210368K168909K68660n03874l42339j82965n19304j172816j339244k53555
41637H333840J504136K163238J039825l95798p62061p76718j570293k364833j860670
41628E310666q27286q70794j348515k63217K003831K778553J273790j33870L67458
41619H290616J634759K050718J911000J820119J001509q37906j871398o62094
41611A3337323J098696P94901j070095j537193L79526K274803J734894o28494
$$ y = [6621217, 7513499, 9041363, 11392635, 13164088, 13041964, 11346758, 9308698, 7616654, 6308777, 5391279, 4914001, 4977362, 6074286, 8622138, 11660406, 13082567, 12058018, 10235764, 9408391, 8965421, 7258197, 4824419, 4242541, 6661550, 10210368, 12379277, 12647937, 12144063, 11801724, 11618759, 11099455, 9926639, 8587395, 8333840, 9837976, 12001214, 13041039, 12645241, 11883180, 11106462, 9536169, 7171336, 5310666, 4483380, 3612586, 2264071, 2000854, 4004685, 6783238, 8057028, 7923158, 8290616, 9925375, 11976093, 13887093, 15707212, 16708721, 15870815, 13999417, 13337323, 14436019, 15230920, 14160825, 12623632, 13003158, 15277961, 17012855, 16384361]
41603A6384361k147821r91190K326678N524334O479569N253552M140138N053572
41595D2023193P208278Q324244P809610P528736R436732J3683918J9271280K5293386
41587A40579377L0746889L3805209L2193655K4536080J1564704l597996j6621935
41580B53205983k4382071k6735879k5780552k3442590k0247982j6317439j2604979
41573A03694491j0414774r885624r607325q117980n609035l628853k944951k439759
41565E1046190q80991Q73497Q77606p98486j695948k28688K362214M256539N595957
41556F1407890P349612R136962J0157508J1362467J4628067K0180630K6511628
41549A60734764L2130433L5410520L3501499K4239754R461637n822526j7879608
$$ y = [16384361, 14236540, 13245350, 15572028, 21096362, 27575931, 32829483, 36969621, 42023193, 49231471, 57555715, 65365325, 72894061, 82330793, 96014711, 115285991, 140579377, 171326266, 205131475, 237325130, 261861210, 273425914, 269827918, 253205983, 228823912, 202088033, 176307481, 152864891, 132616909, 116299470, 103694491, 93279717, 83394093, 73786768, 65668788, 60059753, 56430900, 53485949, 51046190, 50165199, 51038696, 51916302, 51117816, 49421868, 49193180, 51555394, 55811933, 61407890, 68757502, 77894464, 88051972, 99414439, 114042506, 134223136, 160734764, 192865197, 228275717, 261777216, 286016970, 295478607, 289656081, 271776473]
41542B71776473k5930772k9735519k8705678k4267475k0007960j7730199j5671565
41535A09727305j2207439q853369p561974p386263o398232n024668m660040m523610
41527E3111710k995706r63614n84463j445012j350114n35532j342434l436483
41519D0458352l339529J2004K936047K317814J41761O6926J967077L020102K564173
41510E0144727K498205L597254M646834N237743O555878Q873472J0714398J1403129
41502A03671640J2439059J5279452J9363815K3334842K6605029K8428409K7006282
41495B56128528K1566896J4654377J0277720R611395R962907Q114094L212260
41488C33528177l904301j2349078k0816556k6809554k8186354k5494802k1498536
$$ y = [271776473, 245845701, 216110182, 187404504, 163137029, 143129069, 125398870, 109727305, 97519866, 88666497, 81104523, 73718260, 67320028, 62295360, 57635320, 53111710, 50116004, 49152390, 48567927, 47122915, 45772801, 45237269, 43894835, 40458352, 37118823, 37130827, 40066874, 42384688, 42526449, 42593375, 44560452, 47580554, 50144727, 52642932, 56240186, 60887020, 66124763, 72680641, 81554113, 92268511, 103671640, 116110699, 131390151, 150753966, 174088808, 200693837, 229122246, 256128528, 277695424, 292349801, 302627521, 312238916, 322201823, 330315917, 333528177, 329623876, 317274798, 296458242, 269648688, 241462334, 215967532, 194468996]
41481A94468996j8281173j5876183j3701934j1808288j0109717p825719m840258
41474A12025724k620209k449449l439634l732546l170868l081632l567431k976384
41466H6987571o28295J612265J511304q86992l685927n260730n137851l770751
41458G0740594k461664k641529m131401m860310l393295r41861L90163N47914
41450E3248611J137648K688479M094961M515272L947105J969434j973327o555839
41442F3072344q866570p689953m923458k827683j526463l83757n2686j244248
41434C5557526k671065k418527q49856r9139q24583j454442r15247k46674p53202
41425B5324791j960681k386959j496516p9563P72972N30471m55339j110212n83308
$$ y = [194468996, 176187823, 160311640, 146609706, 134801418, 124691701, 116865982, 112025724, 109405515, 106956066, 103516432, 99783886, 96613018, 93531386, 89963955, 86987571, 86359276, 87971541, 89482845, 88595853, 84909926, 79649196, 74511345, 70740594, 68278930, 65637401, 61506000, 56645690, 53252395, 52310534, 52700697, 53248611, 54386259, 57074738, 61169699, 65684971, 69632076, 71601510, 69628183, 63072344, 54205774, 46515821, 41592363, 38764680, 37238217, 36854460, 36801774, 35557526, 32886461, 30467934, 29618078, 29518939, 28694356, 27239914, 26324667, 26077993, 25324791, 23364110, 20977151, 19480635, 19401072, 20174044, 20704515, 20249176, 19138964, 18555656]
41416A8555656P67064J872717K410412K823286K824703J307367j538944l405510
41408B5616751k510470j70477Q46134N2600m06071Q64315K577811K876938J881784
41399C1629315J017348Q06764O80938M62896N94654Q72451K91269j363786k800157
41390C2191692k841003k034690j718812j943197j478487R1634J429519J135450
41382B4832106l58595j286826o04986J003023J997655J509914J99224k37297J141636
41373B8195854L019331K883016J14690k871626l496694k125134r45116n33631
41365B4240690M42356K289654L419906L042825K505045K736493K378379K02101
41357D1257449k282606k854185k052447k144176l265395l290486j562686r6385
$$ y = [18555656, 19322720, 21195437, 23605849, 26429135, 29253838, 30561205, 29022261, 25616751, 23106281, 22935804, 23781938, 23834538, 23428467, 24292782, 26870593, 29747531, 31629315, 32646663, 33453427, 34134365, 34597261, 35191915, 36064366, 36355635, 34991849, 32191692, 29350689, 27315999, 25597187, 23653990, 22175503, 22267137, 23696656, 24832106, 24473511, 23186685, 22581699, 23584722, 25582377, 27092291, 27291515, 27054218, 28195854, 31215185, 34098201, 34212891, 31341265, 27844571, 25719437, 24774321, 24240690, 24683046, 26972700, 30392606, 33435431, 35940476, 38676969, 41055348, 41257449, 38974843, 36120658, 34068211, 31924035, 28658640, 25368154, 23805468, 23709083]
41349B3709083l96871j395470j549435r60448j85908J160941L045748L844442
41341B7272082K420468K44797m59129J79416M12482M5747O11577K509170M238171
41332C7474781M829259M897930M582644K614073j155258m072008l547575o49669
41324D4974177J238098R69002P31845K350542M578794N220989M420727M091714
41316F8575888M733210M708526K899420M15027j213853k301769m102384o281555
41308F7432510o957300n429769l423017k876873l519994l615121k483303j164429
41300C7962704p33858r69248q84226R7591J746815L314725L984577L419644K115619
41291E0054343R86595M30943k4939j010106k333032k900188j809872L52788J617526
$$ y = [23709083, 23312212, 21916742, 20367307, 19406859, 19220951, 20381892, 23427640, 27272082, 29692550, 29937347, 29478218, 29657634, 30070116, 30115863, 30727440, 33236610, 37474781, 42304040, 47201970, 51784614, 54398687, 53243429, 49171421, 45623846, 44974177, 46212275, 47181277, 47913122, 50263664, 54842458, 60063447, 64484174, 68575888, 73309098, 78017624, 80917044, 81332071, 80118218, 77816449, 73714065, 67432510, 60475210, 55045441, 51622424, 48745551, 45225557, 41610436, 39127133, 37962704, 37228846, 36259598, 35375372, 35472963, 37219778, 40534503, 44519080, 47938724, 50054343, 51040938, 51471881, 51446942, 50436836, 48103804, 45203616, 43393744, 43746532, 45364058]
41282D5364058O00793j651474k572983j116293R54925J373770Q6351j273551j836579
41273C9929017k040112k084221j450340k32971L52830o19090k649064m404953
41265B6801096m773744l325709p33711J186226J035495l21136o93269M12625J217278
41256B0805151N71366l76372l70420n4322l10241l22600P22020J473412M25674
41247B2563668r60646m9532K462652K980512L44979k318282k173240l13698Q34670
41238B3371083J309112K538424M299589N402338O401258Q958465J2751209J5265765
41230H0297243J4701138J1180702N251016k432706r457904j2209757r673571n242994
41222G2413167l203481m324321o205522o978756o892919o631721n963747m556834
$$ y = [45364058, 45964851, 44313377, 41740394, 40624101, 41579026, 42952796, 43039147, 41765596, 39929017, 37888905, 35804684, 34354344, 34121373, 34474203, 33855113, 31206049, 26801096, 22027352, 18701643, 17967932, 19154158, 20189653, 19868517, 19175248, 19587873, 20805151, 21376517, 21000145, 20629725, 20575403, 20265162, 19942562, 20664582, 22137994, 22563668, 21603022, 21553490, 24016142, 26996654, 27341633, 25023351, 22850111, 22536413, 23371083, 24680195, 27218619, 31518208, 36920546, 43321804, 52280269, 65031478, 80297243, 94998381, 106179083, 111430099, 108997393, 99539489, 87329732, 77656161, 72413167, 69209686, 64885365, 58679843, 51701087, 44808168, 38176447, 32212700, 27655866]
41214B7655866k890047j667043j002761o60642n35832n10153l56816j95916n42498
41205A9294158j439812k021308j509561k72366P38871J240078J525482J436284
41197A8991826N05545q19254j297567p14221m69637j519611k663349k099962j44058
41188I769712J015420K05093j383205j974878j203211J15410J188426J607340
41180I340107J281466O81115N75272R67173Q69869k88173j642157j958684j194046
41171H631942k42757M01739Q97517J293945J390373J227097J011622O85941J69986
41162A5467405k02101j26793Q4100M7004M4837L91194N03104k87502j305616j224600
41152A3391032j26222M86632j30180j134462j705597k015385k103957j312149
$$ y = [27655866, 24765819, 23098776, 22096015, 21435373, 20899541, 20389388, 20032572, 19836656, 19294158, 17854346, 15833038, 14323477, 14051111, 14789982, 16030060, 17555542, 18991826, 19497371, 18678117, 17380550, 16666329, 16196692, 14677081, 12013732, 9913770, 9769712, 10785132, 10990225, 9607020, 7632142, 6428931, 6544341, 7732767, 9340107, 10621573, 11302688, 11877960, 12845133, 13715002, 13426829, 11784672, 9825988, 8631942, 8389185, 8790924, 9688441, 10982386, 12372759, 13599856, 14611478, 15297419, 15467405, 15265304, 15138511, 15222611, 15269615, 15314452, 15705646, 16208750, 15921248, 14615632, 13391032, 13264810, 13751442, 13621262, 12486800, 10781203, 8765818, 6661861, 5349712]
41144E349712L18993J449237J293850Q75012J241064J583467O13875j042755j501867
41135A0180588k38596J469465K467732K677120K308541J571385J172253J764000
41127B3372488K788064L038312K359635J546341O90969p75395k317468k434503
41119B8268443j131915m66467j674584l326938l500108k365670j248290l90761
41111A4163710O56996J369368Q55284l23818p16531j70509J70559n0433k3083
41102A5931543M14932L37581m37689p70461k58006k95910j779204k921137j127746
41093I093903L243923O586643N940248K244591r21177j360086k55782r4144j382685
41084B3095434k348867j766307p44453q77228j710983j593999m94309m6767p08136
$$ y = [5349712, 5668705, 7117942, 8411792, 9286804, 10527868, 12111335, 12725210, 11682455, 10180588, 9941992, 11411457, 13879189, 16556309, 18864850, 20436235, 21608488, 23372488, 26160552, 29198864, 31558499, 33104840, 33795809, 33020414, 30702946, 28268443, 27136528, 26670061, 24995477, 21668539, 18168431, 15802761, 14554471, 14163710, 14820706, 16190074, 17045358, 16721540, 16005009, 15834500, 16005059, 15954626, 15931543, 16346475, 16684056, 16246367, 15475906, 15217900, 14921990, 13142786, 10221649, 9093903, 12337826, 18924469, 24864717, 27109308, 26188131, 24828045, 24572263, 24478119, 23095434, 20746567, 18980260, 18235807, 17358579, 15647596, 14053597, 13559288, 13512521, 12804385]
41075A2804385r25049J10185Q22771k43053j836121j707130J05911J590856J736777
41066A2459532J268031P14804k27095j248162j224297l0994R64650Q74264M35720
41057A3986453N21098P44390L96986k34936l50050K97524J400285K382549K262592
41048B1406891L21408k472959l890763l104720j737369j319544j099507K16518
41040H319955J842302J953946N70795o06313q20269p57693o40025J43413J375724
41031A1381835J925935J647526J561813J806317J311346L3715n31893R2107L58933
41022A9587634n82817j203241k34168Q83441K88467j040698p36686J188058K521659
41013B0671649K303856J606474J018726p9147j379179j275424M36035J578656
$$ y = [12804385, 11879336, 11989521, 12812292, 12569239, 10733118, 9025988, 9131899, 10722755, 12459532, 13727563, 14442367, 14215272, 12967110, 11742813, 11711819, 12676469, 13550733, 13986453, 14507551, 15251941, 15648927, 15413991, 15063941, 15361465, 16761750, 19144299, 21406891, 21728299, 19255340, 15364577, 12259857, 10522488, 9202944, 8103437, 8319955, 10162257, 12116203, 12686998, 12080685, 11260416, 10502723, 9862698, 10006111, 11381835, 13307770, 14955296, 16517109, 18323426, 19634772, 19668487, 19136594, 19228701, 19587634, 19004817, 17801576, 17567408, 18450849, 18739316, 17698618, 16961932, 18149990, 20671649, 22975505, 24581979, 25600705, 25521558, 24142379, 22866955, 23302990, 24881646]
41005B4881646N78690j227593j674977q52500n29699j315955j978609j383690
40997A6497313P8095J096246P94143n50351j780100j944990j202313l33968M61479
40988A3115554J501413K390096K051475M00844j152306j482396r76987l82182
40980A5465511L31369J080807J000818o7513o36470L13898J345097N46167j338628
40971A8041056j955825j027678n32800j172795j240571K84115J875060J913391
40963A6183953J058573P24265Q03123N08627J26584J63322j62284j638831l036270
40954A4731062k438801k78513J021917M81957l76024l04436j67293j016933k004701
40945I648235j695500m33429K24830j9326R7246J132062J813683R11688p03015
$$ y = [24881646, 25460336, 24232743, 22557766, 21705266, 21175567, 19859612, 17881003, 16497313, 16575408, 17671654, 18465797, 17915446, 16135346, 14190356, 12988043, 12654075, 13115554, 14616967, 17007063, 19058538, 19459382, 18307076, 16824680, 15847693, 15465511, 15796880, 16877687, 17878505, 17810992, 17174522, 17488420, 18833517, 19379684, 18041056, 16085231, 15057553, 14524753, 13351958, 12111387, 12395502, 14270562, 16183953, 17242526, 17966791, 18769914, 19278541, 19405125, 19568447, 19406163, 17767332, 14731062, 12292261, 12013748, 13035665, 13517622, 13141598, 12837162, 12669869, 11652936, 9648235, 7952735, 7519306, 7744136, 7724810, 7822056, 8954118, 10767801, 11679489, 10976474]
40936A0976474r68586N96443K067618J473029o98898k104935j420011K72668J149180
40927A1342982Q63552M92323Q14764J484553J790565J526406R93892O09682N94128
40918B0512847P29643M85147k76792q86751o40443J89598P58591J010104J848609
40909B3730553L701146N545849N843172M205984J907714P95851J535960K648415
40901D9914644J654960k156638o384991p820144n955479l145470j358455k56009
40893B4492418J139804K587965L528206M410562N544264N570700K957425j292301
40885D8939043m191419m210639k773930k069776k662521l674631m134568l506182
40877B1715377j804802J19585J058752P73142L36719P90010K067371L629108N374308
$$ y = [10976474, 10007888, 10604331, 12671949, 14144978, 13446080, 11341145, 9921134, 10193802, 11342982, 12206534, 12698857, 13513621, 14998174, 16788739, 18315145, 19309037, 19918719, 20512847, 21242490, 21727637, 21450845, 20564094, 19923651, 20113249, 20871840, 21881944, 23730553, 27431699, 32977548, 38820720, 43026704, 44934418, 45730269, 47266229, 49914644, 51569604, 49412966, 43027975, 35207831, 29252352, 26106882, 24748427, 24492418, 25632222, 28220187, 31748393, 36158955, 41703219, 47273919, 50231344, 48939043, 44747624, 40536985, 37763055, 35693279, 33030758, 29356127, 25221559, 21715377, 19910575, 20030160, 21088912, 21862054, 22198773, 22988783, 25056154, 28685262, 34059570]
40868C4059570P255615Q582717Q544072P211057N404014L667788J831175n01658
40860G6054350l334677o045013p595049p256606n395529l342568k280892k382657
40852C8421359k981604l203134k475612j048005j16093p18434k238726k756039
40844B2883712j303285R48343K249885K236798J698528J298582J604741L673113
40836C5290417P960899J2513344J3725303R961411M022931J127729L990351R885807
40828I8478192J2849920R162844P04967p290939j1403829j2176058j1570998j0138044
40820F8616055p584887m671534k835836k409840k540721k598015k540459k256864
40812D1177899j741702j585906k004947j716652O46134M035623N533880L740495
$$ y = [34059570, 41315185, 49897902, 58441974, 65653031, 71057045, 74724833, 76556008, 76054350, 72719673, 66674660, 59079611, 51823005, 46427476, 43084908, 40804016, 38421359, 35439755, 32236621, 29761009, 28713004, 28596911, 27878477, 25639751, 22883712, 21580427, 22528770, 24778655, 27015453, 28713981, 30012563, 31617304, 35290417, 43251316, 55764660, 69489963, 79451374, 83474305, 84602034, 88592385, 98478192, 111328112, 120490956, 121195923, 113904984, 102501155, 90325097, 78754099, 68616055, 61031168, 56359634, 53523798, 51113958, 48573237, 45975222, 43434763, 41177899, 39436197, 37850291, 35845344, 34128692, 34774826, 38810449, 44344329, 48084824]
40804D8084824K41036k642638m151256m641904m290552l142911j499678M86531
40796B8443452K809531M725739M855378K797595j91681k637701m080442m506868
40788C2215003l769203k282211j205575j106109j346822j417732j691249k090441
40780A7305661j418934P53633K747416K770616J334079K18949j04426m28182q78867
40771B2299945p99416k29341J17003K13537O55955J388203J839202K191876L244027
40762C0920991N143873P370364R541248J0985014J0222603O686975K492724L88694
40754H3752486Q4310j177545m329583p231473q191221q126563q134685p395977
40746C9249749n186872k920218k121166j894666n52190J394747K113122J547769
$$ y = [48084824, 48325860, 45683222, 41531966, 36890062, 32599510, 29456599, 27956921, 28443452, 31252983, 35978722, 40834100, 43631695, 43440014, 40802313, 36721871, 32215003, 28445800, 26163589, 24958014, 23851905, 22505083, 21087351, 19396102, 17305661, 15886727, 16640360, 19387776, 22158392, 23492471, 23711420, 23606994, 23178812, 22299945, 21500529, 21271188, 21388191, 21601728, 22257683, 23645886, 25485088, 27676964, 30920991, 36064864, 43435228, 52976476, 63961490, 74184093, 80871068, 83363792, 83752486, 83836796, 82659251, 78329668, 71098195, 62906974, 54780411, 46645726, 39249749, 34062877, 31142659, 29021493, 27126827, 26574637, 27969384, 30082506, 31630275]
40738C1630275J298050J655088J059232j136313l294199l669771k624996j829042
40730B3088324k098530k746466k586158j121392R42867K212523K005460J259086
40722B0955714J532403L074324M466572M292948K564595K92733j715184l173284
40714C2290821l866058l554802k425742j238623p14372p95057p30871K734J073913
40705B0041943J754150J761280J294419M44350q73032k394487l459766l615548
40697A4953309k895845j543841L1559J076627R54942q2361j141342j693688j723490
40688G935870j084885K62733J434439J326821L63757J33243Q66035Q97895n34416
40679A1601492j689558r36570M80056J78215j782023l079815k467083r69499J83537
$$ y = [31630275, 32928325, 34583413, 35642645, 34506332, 31212133, 27542362, 24917366, 23088324, 20989794, 18243328, 15657170, 14535778, 15478645, 17691168, 19696628, 20955714, 22488117, 25562441, 30029013, 34321961, 36886556, 37179289, 35464105, 32290821, 28424763, 24869961, 22444219, 21205596, 20491224, 19696167, 18965296, 18968030, 20041943, 21796093, 23557373, 24851792, 25296142, 24423110, 22028623, 18568857, 14953309, 12057464, 10513623, 10545182, 11621809, 12576751, 12494390, 11353048, 9659360, 7935870, 6850985, 7113718, 8548157, 9874978, 10238735, 10371978, 11238013, 12135908, 11601492, 9911934, 8975364, 9455420, 9633635, 7851612, 4771797, 2304714, 1335215, 1518752]
40670A518752R87407J701974K021013J799235J534543J593205J667524J282786
40662A4106439K88051j136750k382897k598222j705189q08891o90304n08714P19420
40653E282943J980933J415789n93244j509879j71402J659414J959112R86774K32929
40644A1243369K20264M20199L52445j50525r75563j400116o21355R19807J831080
40635A1839605J798020J912440K402576J832746k82382j876269j139745M92727
40627A6979718L82950j172004j296878J153872L981667M738722L469084J637197
40619B9874328k3288j525581k618474k902472k453595j607011n41225M30627P06808
40610A9340117J49935m16775j06341Q74845J560950J635289J999141L893852P784812
$$ y = [1518752, 2506159, 4208133, 6229146, 8028381, 9562924, 11156129, 12823653, 14106439, 14394490, 13257740, 10874843, 8276621, 6571432, 5762541, 5072237, 4563523, 5282943, 7263876, 8679665, 8086421, 6576542, 6405140, 8064554, 10023666, 11010440, 11243369, 11463633, 11883832, 12236277, 12085752, 11110189, 9710073, 9088718, 10008525, 11839605, 13637625, 15550065, 17952641, 19785387, 19503005, 17626736, 16486991, 16979718, 17362668, 16190664, 14893786, 16047658, 20029325, 24768047, 28237131, 29874328, 29851040, 28325459, 25706985, 22804513, 20350918, 18743907, 18202682, 18633309, 19340117, 19490052, 19073277, 18966936, 19841781, 21402731, 23038020, 25037161, 28931013, 36715825]
40601C6715825J2978320J7667479J9151807J5011776N513032m881393r774973
40594I2381873o188034K171580P832637O145733j235324r007317j3264076j3741079
40586F5095993j2340032j0653034q880424o494024l560887j143785j67553k50644
40578B1605610l21435j69927m67522j301422j840418j719630j601498j878338
40570A2305420j915527j200232k06744N46520J247969J888660J790541R87784
40562A5444391R27567K639743N218254P250983Q564708R137634P612735L008562
40554E9804577k814566o590751p329174o689654n999169m985219l446033k015837
40546A9934174q97968K75096R50209p1170k355122l719167l093653j741118q98127
$$ y = [36715825, 49694145, 67361624, 86513431, 101525207, 107038239, 102156846, 92381873, 86193839, 88365419, 96198056, 102343789, 101108465, 92101148, 78837072, 65095993, 52755961, 42102927, 33222503, 26728479, 23167592, 22023807, 21856254, 21605610, 21284175, 21114248, 20646726, 19345304, 17504886, 15785256, 14183758, 12305420, 10389893, 9189661, 8982917, 9529437, 10777406, 12666066, 14456607, 15444391, 16371958, 19011701, 24229955, 31480938, 40045646, 49183280, 56796015, 59804577, 56990011, 50399260, 43070086, 36380432, 30381263, 25396044, 21950011, 19934174, 19036206, 19311302, 20261511, 20190341, 17835219, 14116052, 11022399, 9281281, 8383154]
40537H383154p3591J265591K088491J297678m29129j553766j395842j11K404857
40528A1987332M711685N073988L155045J151846J233107L029274N051796P422472
40520D2816545J1371352J6692122K1324911K3009362K0214097J2593463K398209
40513A50420061n488847p358671m573620j970696k633535n963102j0244306j4378655
40505I7808629j6821756j5704386j1434609p232481n568553n444793m515928k581906
40497B8504217j384767j793049k798968l041862k161795p77820N8862m06779j793555
40488A4404484k712930k231093q45732L65580R45952R10308K07755q32084j199696
40479I012544l77786O67225P20968J34273J87100R00215R41286j11788q97763
$$ y = [8383154, 8309563, 9575154, 11663645, 12961323, 12532194, 10978428, 9582586, 9582475, 11987332, 16699017, 21773005, 24928050, 26079896, 27313003, 30342277, 35394073, 42816545, 54187897, 70880019, 92204930, 115214292, 135428389, 148021852, 150420061, 144931214, 137572543, 132998923, 131028227, 128394692, 122431590, 112187284, 97808629, 80986873, 65282487, 53847878, 46615397, 41046844, 35602051, 31086123, 28504217, 27119450, 25326401, 22527433, 19485571, 17323776, 16545956, 16604818, 16198039, 14404484, 11691554, 9460461, 8614729, 8980309, 9926261, 10836569, 11044324, 10212240, 9012544, 8634758, 9301983, 10022951, 10157224, 10344324, 11244539, 12185825, 12074037, 11176274]
40470A1176274l49030N90884M32012m82578m61715Q40975J625087L64602j951250
40461A1785261k926938j702047J79091Q43142J17625q73300j319243j158568l92334
40452D552689J003723K422303K747924J552204k79845j432723j394303o79923
40444H492049j67730l29217q03813p25695J52161Q28709K60669q76990p05940
40435F124203J230392K969264K534790M48365j161079j266058n92984j5348L94836
40426A0666381P70654J081018J512143K265585K855455K529483J482786O35815
40418B3799320O3807j134067k986090l982835l121673j529408r03426j133230
40410I072398q05330L93743J252411J002814L42817J13712J01146j85331l94236
$$ y = [11176274, 10827244, 11418128, 11850140, 11367562, 10905847, 11746822, 13371909, 13736511, 11785261, 8858323, 7156276, 7335367, 8178509, 8296134, 7422834, 6103591, 4945023, 4552689, 5556412, 7978715, 10726639, 12278843, 11998998, 10566275, 9171972, 8492049, 8324319, 7995102, 7191289, 6465594, 6617755, 7446464, 7707133, 6830143, 6124203, 7354595, 10323859, 12858649, 13307014, 12145935, 10879877, 10286893, 10271545, 10666381, 11437035, 12518053, 14030196, 16295781, 19151236, 21680719, 23163505, 23799320, 23863127, 22729060, 19742970, 15760135, 12638462, 11109054, 10205628, 9072398, 8267068, 8660811, 9913222, 10916036, 11258853, 11372565, 11473711, 11288380, 10894144]
40401A0894144J11894R84879J050826k16746j945994k764109k152612p80696K95354
40392E476940N73566L09005j0822j85872k48916j07465M33160J212648J557138
40383I009382Q80259n46834j645780j516345l39223Q21162J112322O55681J84397
40374H615021J43213L54778M37385K52640n3367k05199j1155L20714J58593q39150
40364I173473j954291j877211k14115J845509K658269J678008k40608j671920
40356I397114j585322n7147J586479J821819N56693p48903r65400o06469o41247
40347H757617q08925k14054R21740J434057J017100N84666P41724J080229J206493
40338A4720647J312130J379457R23823r764n99692m90067l26377n75711q31568
$$ y = [10894144, 11006038, 11990917, 13041743, 12824997, 10879003, 8114894, 5962282, 5181586, 5476940, 6050506, 6359511, 6348689, 6162817, 5913901, 5806436, 6239596, 7452244, 9009382, 9889641, 9342807, 7697027, 6180682, 5841459, 6662621, 7774943, 8430624, 8615021, 8758234, 9113012, 9550397, 9803037, 9749670, 9544471, 9533316, 9854030, 10012623, 9173473, 7219182, 5341971, 5127856, 6973365, 9631634, 11309642, 11069034, 9397114, 7811792, 7754645, 9341124, 11162943, 11719636, 10970733, 10005333, 9398864, 8757617, 7948692, 7734638, 8656378, 10090435, 11107535, 11692201, 12433925, 13514154, 14720647, 16032777, 17412234, 18336057, 18326293, 17726601, 17236534, 16910157, 16334446, 15502878]
40329A5502878q43824j135758j848568k039091j058715K80450Q63227P43899N44979
40320A1009477L23694O2063K73276R16578P91280n04798j127357N65143K998459
40311A5307815L178786J087389k93280N46209J785403J571740O47668M27310O15233
40302B4874273M00922L40172J195285K101314J735079M95367k19547l14207q60769
40293B9747889j979392k495960j742273l66981P39218J194625P54552o59214k302507
40284B2889957k928282k114796o66654M09595O97339J68116r65920j992205k040036
40275A3457114j049354P4164M95459K17443k90805o85096p51902l72304J45500
40266A1240219J18970o42694j277898p63610O07116J250944K23621j297529j255183
$$ y = [15502878, 14659054, 13523296, 11674728, 9635637, 8576922, 8857372, 9720599, 10464498, 11009477, 11333171, 11395234, 11668510, 12585088, 13376368, 12871570, 11744213, 12309356, 15307815, 18486601, 19573990, 19280710, 19826919, 21612322, 23184062, 23831730, 24259040, 24874273, 25275195, 25615367, 26810652, 28911966, 30647045, 31142412, 30922865, 30608658, 29747889, 27768497, 25272537, 23530264, 23163283, 23902501, 25097126, 25851678, 25192464, 22889957, 19961675, 17846879, 17180225, 17589820, 18287159, 18455275, 17489355, 15497150, 13457114, 12407760, 12481924, 12977383, 13194826, 12904021, 12218925, 11467023, 11094719, 11240219, 11359189, 10716495, 9438597, 8674987, 9282103, 10533047, 10756668, 9459139, 8203956]
40257H203956N82834K156341J828239N45314K67809J084101J424945P37712J15042
40248A6946293J78184K38337K8018L07082R15948K73473j835532k918701j093113
40239A3039989J877375L055081K482796K310721K783270K109744Q1571j200589
40231B6539958o28775N55130J352400K366417L566186L188086M41582k620622
40223C4760362l612436k717280j580620p38566J73673Q22405N76869j97941p18407
40214B6768059j018088j403838j514509j157872j083038j501154j001650J179323
40206A9267233K871296J417537k071834l659817k022546k24567j055478l039935
40198A1481889k903252l42274J862865J786443L38944p25770j073361j404475
$$ y = [8203956, 8786790, 10943131, 12771370, 13316684, 13584493, 14668594, 16093539, 16831251, 16946293, 17124477, 17362814, 17390832, 17697914, 18613862, 18887335, 17051803, 14133102, 13039989, 14917364, 17972445, 20455241, 22765962, 25549232, 27658976, 27740547, 26539958, 25911183, 26466313, 27818713, 30185130, 33751316, 36939402, 37380984, 34760362, 31147926, 28430646, 26850026, 26111460, 26285133, 27107538, 27684407, 27486466, 26768059, 25749971, 24346133, 22831624, 21673752, 20590714, 19089560, 18087910, 19267233, 22138529, 23556066, 21484232, 17824415, 15801869, 15577302, 14521824, 11481889, 8578637, 8236363, 10099228, 11885671, 12224615, 11498845, 10425484, 9021009]
40190I021009j877656j848157q97739N04760J429693J318151M03062m66494m13934
40181G172695P32139K083739K327477J072285n81323j238554q50381n79479j064302
40172I074296j607274j359900n40014N3823J38267k3143j86998j55767K99395
40163E692685R64652J087066L23626o91294j260536j468831j503762j010302o3679
40154B069625J69043q74456j602627k35049K128714K540905M17303j476718r34716
40145B202024Q13119J295011K14783q05787p36458J16559J097792J570937Q94620
40136F662600p19967j816156j285900J53048J152292J709932K577466L317553
40128A1750868K724969J032768q0378J00852N50461N15025O52713J439824J958761
$$ y = [9021009, 7143353, 5295196, 4397457, 4902217, 6331910, 7650061, 8053123, 7586629, 7172695, 7904834, 9988573, 12316050, 13388335, 12807012, 11568458, 10718077, 10138598, 9074296, 7467022, 6107122, 5567108, 5620931, 5759198, 5736055, 5549057, 5393290, 5692685, 6657337, 7744403, 8068029, 7376735, 6116199, 4647368, 3143606, 2133304, 2069625, 2238668, 1364212, -238415, -473464, 1655250, 4196155, 4613458, 3136740, 2202024, 3015143, 4310154, 4524937, 3719150, 2982692, 3099251, 4197043, 5767980, 6662600, 5942633, 4126477, 2840577, 2993625, 4145917, 5855849, 8433315, 11750868, 14475837, 15508605, 15428227, 15529079, 16079540, 16594565, 17247278, 18687102, 20645863]
40119B0645863J345076K70734j94795k96566r34234j964744k432863k089788j513701
40110A2834982j002735m61148j61095m67037r01792o34263J09096K89554k16927
40101I388635m10996P0054L87791K89708J073857L710395O993372Q732369Q115311
40092C8350496N852631K729798o56601l255098m215879m144508m353769m829390
40084B5477680m311979k593036j240006j433270k365050k615600k056668j424592
40076G437479q83139j50167M94141M56564j39639n72525m99558p9314O04520J391111
40066H059473J528108L12835j639790k624766j681809K94097J501567R69328o73983
40057F045060j790068j122635R90368K808460K921368J653188L97504r8026j55195
$$ y = [20645863, 21990939, 22261673, 22066878, 21770312, 20836078, 18871334, 16438471, 14348683, 12834982, 11832247, 11371099, 11210004, 10742967, 9841175, 9206912, 9316008, 9605562, 9388635, 8977639, 9047693, 9435484, 9725192, 10799049, 14509444, 21502816, 30235185, 38350496, 44203127, 46932925, 46276324, 43021226, 38805347, 34660839, 30307070, 25477680, 21165701, 18572665, 17332659, 15899389, 13534339, 10918739, 8862071, 7437479, 6554340, 6404173, 6898314, 7354878, 7215239, 6642714, 6143156, 6063842, 6668362, 8059473, 9587581, 9900416, 8260626, 5635860, 3954051, 4248148, 5749715, 6719043, 6045060, 4254992, 3132357, 4122725, 6931185, 9852553, 11505741, 11903245, 11805219, 11650024]
40048A1650024j61332j8950L66415Q04370J144773J274107Q30416k98370j204550
40039A4386903o73395J125957K686084L267226L824908N124983O035375M898723
40031D0676764J969294q32655k370679l234592m142591m610901l797299j933280
40023B1724061k05645N92494Q83408J770204L715546N664397N704659L018963
40015D2868087r37529l743588m460516m143530l930334l628914k706131j696441
40007A7621104j538189j970436j801836p58399N8661j80326r41317j339278j319200
39998G830784j171118o91988K84376J128192J160478P29322N57103M27015l07266
39989I946898j187701j030496J34960R50459Q26615O96223J173986J460473Q81795
$$ y = [11650024, 11488692, 11469742, 11836157, 12640527, 13785300, 15059407, 15889823, 15591453, 14386903, 13713508, 14839465, 17525549, 20792775, 24617683, 29742666, 35778041, 40676764, 42646058, 41813403, 39442724, 36208132, 32065541, 27454640, 23657341, 21724061, 21518416, 22110910, 22994318, 24764522, 28480068, 34144465, 39849124, 42868087, 41930558, 38186970, 33726454, 29582924, 25652590, 22023676, 19317545, 17621104, 16082915, 14112479, 12310643, 11552244, 11610905, 11430579, 10489262, 9149984, 7830784, 6659666, 5967678, 6252054, 7380246, 8540724, 9270046, 9827149, 10254164, 9946898, 8759197, 7728701, 7863661, 8814120, 9640735, 10336958, 11510944, 12971417, 13853212]
39980A3853212J11336j57465m07897r70031q71406M28798J427614O40486p51484
39971A3303163n94983O21215N08085j085000j614907j4433J644757J877931K394592
39962A7040420M951407P768712P663128M513578J123076o65559j377376j814645
39954C9202741j929754j966375k658275l755720l990401l033530k002485j510703
39946A8355498q10991L24839N05467j130875k870199k286306L27697K082392J143501
39937A5641023j150702k292440j608850m46505l501k259M11481J161851J197038
39928A2907136l8001j492271j415527M60064K203187J823442j26640j071810K69750
39919A3519330K180451K277164N98429q50605j022229p02646n69865j69635O14613
$$ y = [13853212, 13964548, 13807083, 13399186, 12429155, 11557749, 11986547, 13414161, 14054647, 13303163, 12708180, 13329395, 13837480, 12752480, 11137573, 11123140, 12767897, 14645828, 17040420, 21991827, 29760539, 37423667, 41937245, 43060321, 42394762, 41017386, 39202741, 37272987, 35306612, 32648337, 28892617, 24902216, 21868686, 19866201, 18355498, 17544507, 17869346, 18374813, 17243938, 14373739, 12087433, 12415130, 14497522, 15641023, 14490321, 12197881, 10589031, 10142526, 10139025, 10136766, 10548247, 11710098, 12907136, 12869135, 11376864, 9961337, 10421401, 12624588, 14448030, 14321390, 13249580, 13519330, 15699781, 17976945, 18575374, 17724769, 16702540, 15999894, 15430029, 15260394, 15875007]
39910A5875007P18732l89488j419676r92251K80581Q37122N24845L88264O58155
39901A6481291O33817L26987N23200J140151J086860J551j207693j722248j442355
39892A5821561l04650J491453K586395J619240m99782j432586q48597p32562j638453
39883A6062019j355076J266777L809783L781599K366851K056778K396835J245109
39875C1630675r75805j772540q77929n92952j610754j831720k41104J055400J94330
39866B4977601j479225j665892n33289P9763l50068p90127p31176p34050j049519
39857A7724018j088767m64828L38968O33228M14850L75963J075358K119030K398710
39848B3526530J449586K50613Q6069R00256J573933J593393J444151J433360J224944
$$ y = [15875007, 16593739, 16204251, 14784575, 13792324, 14072905, 14910027, 15434872, 15823136, 16481291, 17115108, 17442095, 17965295, 19105446, 20192306, 20193857, 18986164, 17263916, 15821561, 15516911, 17008364, 19594759, 21213999, 20714217, 19281631, 18433034, 17700472, 16062019, 14706943, 15973720, 19783503, 23565102, 25931953, 27988731, 30385566, 31630675, 30654870, 28882330, 28004401, 27411449, 25800695, 23968975, 23727871, 24783271, 24977601, 23498376, 21832484, 21299195, 21378958, 21028890, 20238763, 19507587, 18773537, 17724018, 16635251, 16170423, 16509391, 17142619, 17557469, 17933432, 19008790, 21127820, 23526530, 24976116, 25226729, 25312798, 26213054, 27786987, 29380380, 30824531, 32257891, 33482835]
39839C3482835O41197j19104j156707k673668m004078m049623k867234j587546
39831A7666072o21061N69095J679445J430132l6135n16997J212800L351989L632179
39822B8367519K540268K071390K255397J174449j755145m548809n132573l663859
39814B1308637j858975r70046r43909j003139o18730m4325O4736m53788j102529
39805A4377932j476570j532671j005393M35618K041244K209480O59850q08242
39797A4901248q00690l47890r80527j937649j306166P09090J919420J508307J073000
39788A4738143J897897L165881L647830L437644K965480J759065m58977k442848
39780B8710115k668651j502894q97703j955170l676926m263945l075744j085592
$$ y = [33482835, 34124032, 34004928, 32848221, 30174553, 26170475, 22120852, 19253618, 17666072, 17045011, 17614106, 19293551, 20723683, 20687548, 20170551, 21383351, 24735340, 28367519, 30907787, 32979177, 35234574, 36409023, 34653878, 30105069, 24972496, 21308637, 19449662, 18479616, 17535707, 16532568, 15913838, 15869513, 15934249, 15480461, 14377932, 12901362, 11368691, 10363298, 10798916, 12840160, 15049640, 15709490, 14901248, 14100558, 13752668, 12772141, 10834492, 9528326, 10237416, 12156836, 13665143, 14738143, 16636040, 19801921, 23449751, 26887395, 29852875, 31611940, 31152963, 28710115, 26041464, 24538570, 23640867, 21685697, 18008771, 13744826, 10669082, 9583490]
39772I583490L19393P27814P94537J051852J114565M39795n98974j145991j104900
39763A1181581j031745q88516q997J470012K257580J551729J55825p01365r19748
39754A3066356j159736j534820j551463j026936k49589O55107J832398L164008
39746A3195325M140509M317969L578964K028504J9050j752805k579066k331038
39738B0617412j585763j112452j244583j638209j574560o39677Q16370K025237
39730A5663775K595269K710357K552353J991247J088142M54750N89958J021290
39722B8667141O72286p62869k213915k370482j303697n02620j070253k264994
39714A8850597k419135j193130o3633k22407q77396n23238P02280J194753L32093
$$ y = [9583490, 9902883, 10630697, 11425234, 12477086, 13591651, 14031446, 13432472, 12286481, 11181581, 10149836, 9261320, 9252323, 10722335, 12979915, 14531644, 14687469, 13986104, 13066356, 11906620, 10371800, 8820337, 7793401, 7543812, 8198919, 10031317, 13195325, 17335834, 21653803, 25232767, 27261271, 27280321, 25527516, 22948450, 20617412, 19031649, 17919197, 16674614, 15036405, 13461845, 12822168, 13638538, 15663775, 18259044, 20969401, 23521754, 25513001, 26601143, 27055893, 27645851, 28667141, 29339427, 28576558, 26362643, 23992161, 22688464, 22185844, 21115591, 18850597, 16431462, 15238332, 15174699, 14952292, 14074896, 13551658, 14253938, 15448691, 15780784]
39705A5780784n72910k11494R01099J313172O59357n7696Q3251Q90702J442597
39696B0228862J104717J77075l93297j56093J05970n74856j576567j080654J178298
39687A9013455K732658J248069k107231l779161k241935L32175J250150N75557
39679A7023737J62412N96984P40724k0418p34982n43824j32989o12534j640783
39670A4838327j781297o19069N21115L62843n68250p25357K33307Q97417M2920
39661A3201956j572450k032886o59093J180824J828113J213918M99779M21729
39653A4081890Q24961J504712K343380K544358J135401j115940j728687K24656
39645A9814731K069427P21214k736255m132299j961418O45615O73961o94723o81925
$$ y = [15780784, 15207874, 14996380, 15897479, 17210651, 17870008, 17812312, 17895563, 18786265, 20228862, 21333579, 21510654, 21117357, 20961264, 21067234, 20492378, 18915811, 17835157, 19013455, 21746113, 22994182, 20886951, 17107790, 14865855, 15198030, 16448180, 17023737, 17186149, 17783133, 18523857, 18503439, 17768457, 17224633, 17091644, 16479110, 14838327, 13057030, 12437961, 12959076, 13321919, 12753669, 12028312, 12261619, 13159036, 13201956, 11629506, 9596620, 8937527, 10118351, 11946464, 13160382, 13660161, 14081890, 14906851, 16411563, 18754943, 21299301, 22434702, 21318762, 19590075, 19814731, 21884158, 22605372, 19869117, 15736818, 13775400, 14421015, 15094976, 14400253, 13718328]
39636A3718328N54025O96432o24272j404710o04431P14933J642834K394504K767636
39627A9855279K005929P33762O94357J798456J790522r1422j550909q42437M08617
39618B4802154N8529r68321n51419P50911O99001o72142j232754o24130q07851
39609B1453978k353451l119327j683367L72485R97530N06326L11816M11764r6332
39600A6801422r95901j130209j65626J030112J484957Q60886l98227j106028l14970
39591A6066416J178398J402164L7607p13918O72515K447020K062603P7651q64257
39582B2366199l43857n83859k304543l095881j209468J416682J861650L43989
39574A8450912m99988M59941J772312J925662J022033j58116j094568j170339
$$ y = [13718328, 14272353, 14968785, 14344513, 12939803, 12335372, 13050305, 14693139, 17087643, 19855279, 21861208, 22594970, 23289327, 25087783, 26878305, 26786883, 25235974, 24393537, 24802154, 24860683, 23892362, 23340943, 24091854, 24790855, 24118713, 22885959, 22261829, 21453978, 19100527, 15981200, 14297833, 14670318, 15667848, 16174174, 16485990, 16897754, 16801422, 15805521, 14675312, 14509686, 15539798, 17024755, 17885641, 17487414, 16381386, 16066416, 17244814, 18646978, 18684585, 17970667, 18643182, 21090202, 23152805, 23230456, 22366199, 22022342, 21438483, 19133940, 16038059, 14828591, 16245273, 18106923, 18450912, 17950924, 18410865, 20183177, 22108839, 23130872, 22972756, 21878188, 20707849]
39566B0707849J73517K293771L461289K827638J456571P74056P95879O66247K65992
39557C3422809K60372Q37816J394557J515525J446984J379579R86095J24439n28993
39548D0839183k29569O19113P26745l90085j571681j381516N7604J279510J404246
39539D1353550J039509J066873J344264J137881K40039r61823k061043k657100
39531D0502150k293729j112061j22269L950l3237P19977J846027K316013K408117
39522D4234938L139683L871987K572711r02323l765834l748305k030311j281418
39514D2091128k012768k544017j800420m80758K11517k99466j785376l130942
39506C0248898k929354j182574K48912j9302r57964q26210J81370P01894O92902
$$ y = [20707849, 20881366, 23175137, 26636426, 29464064, 30920635, 31694691, 32490570, 33156817, 33422809, 33683181, 34520997, 35915554, 37431079, 38878063, 40257642, 41243737, 41368176, 40839183, 40609614, 41228727, 41955472, 41565387, 39993706, 38612190, 38669794, 39949304, 41353550, 42393059, 43459932, 44804196, 45942077, 46182116, 45220293, 43159250, 40502150, 38208421, 37096360, 36974091, 36978041, 36944804, 37664781, 39510808, 41826821, 44234938, 47374621, 51246608, 53819319, 52916996, 49151162, 45402857, 43372546, 42091128, 40078360, 37534343, 35733923, 35253165, 35464682, 35165216, 33379840, 30248898, 27319544, 26136970, 26385882, 26366580, 25408616, 24582406, 24763776, 25465670, 26158572]
39497B6158572J003215J094536k99802k383170k763633j039981N50331O18218
39489B2938286K86910N86247P67524M65884J041207L028013M463570L819213K657413
39480D0054267K985794L598703J863150j845345m419675m413744l424445k950944
39472C1447761k469993j341569m16765n61903j099926r42966l07538k19423q68614
39463B3219064j334165p61555O62717J841660J773678N83807n59949p70790l38600
39454B4315867O5797N29979J522807K824904L734142M039048L837645K654673
39446D3524862p7100l573276n840933n665811l770744j778241o79449n15068q84097
39437B0740143j379699j828972k244086k394820j736630k23707J149390J304577
$$ y = [26158572, 27161787, 28256323, 27956521, 25573351, 22809718, 21769737, 22320068, 22938286, 23225196, 23811443, 24578967, 25044851, 26086058, 29114071, 33577641, 37396854, 40054267, 43040061, 46638764, 48501914, 46656569, 42236894, 37823150, 34398705, 31447761, 28977768, 27636199, 27219434, 26657531, 25557605, 24614639, 24307101, 24087678, 23219064, 21884899, 21123344, 21786061, 23627721, 25401399, 25985206, 25425257, 24654467, 24315867, 24381664, 24911643, 26434450, 29259354, 32993496, 37032544, 40870189, 43524862, 43447762, 39874486, 34033553, 28367742, 24596998, 22818757, 22139308, 21624240, 20740143, 19360444, 17531472, 15287386, 12892566, 11155936, 10932229, 12081619, 13386196]
39429A3386196L89120n25471q32000p58714n80911l06726p7749j03177k13401
39420A0377167j24634J7809L9041L38281J175244J684571Q20471p78156j191575
39411A2358219K45260K035966K638432K378364K502767L166354L332248K365986
39403C1023596R05473K0719o9693j29628p24343j220319m65475J576257L607285
39394C4523872M606810M743936M280349K781264L66695j435722j568431j364134
39386D6934639k906334n929952q052138p858774o106018l997464k009027m89926
39378I585006K69272P76872J599920J851948K53846k108531k246079P29205L984420
39369A4695879M456041K381621J88461o82635m10905O59978K463755M480723N702986
$$ y = [13386196, 13775316, 13249845, 12417845, 11659131, 11078220, 10771494, 10693745, 10590568, 10377167, 10252533, 10270342, 10309383, 10647664, 11822908, 13507479, 14327950, 13549794, 12358219, 12603479, 14639445, 17277877, 19656241, 22159008, 25325362, 28657610, 31023596, 31929069, 31949788, 31880095, 31750467, 31026124, 29805805, 29340330, 30916587, 34523872, 39130682, 43874618, 48154967, 50936231, 51302926, 49867204, 48298773, 46934639, 44028305, 38098353, 30046215, 22187441, 16081423, 12083959, 10074932, 9585006, 9854278, 10631150, 12231070, 14083018, 14336864, 12228333, 9982254, 10711459, 14695879, 19151920, 21533541, 21722002, 21039367, 20628462, 21288440, 23752195, 28232918, 33935904]
39360C3935904N442001L819837J604636m10138k145552m036946n653042n425546
39352B7131154k934183m80712n11500k184471k779743j956906j740031k413500
39344A2130108j866519K78297J375560L8932j504770j219197m03712p60684j117795
39335F950220J82777J965185K230655J573737J653439J964479J202378L97393
39327A8120263J457640L587333M239533K905801J151559k99998j692907k326361
39319B7142863j504570o29460j316727k267715j342394J10571j030740l936046
39311A5225782m221728p07818K467738J903453o59922j875430j471189j099093
39303I561793j041649m98597M85132J337239K013291K431329K105377J282231
$$ y = [33935904, 39377905, 43197742, 44802378, 44392240, 42246688, 38209742, 32556700, 27131154, 24196971, 23716259, 23204759, 21020288, 18240545, 16283639, 14543608, 12130108, 10263589, 10541886, 11917446, 11956378, 10451608, 9232411, 8828699, 8068015, 6950220, 7132997, 9098182, 11328837, 12902574, 14556013, 16520492, 17722870, 18120263, 19577903, 23165236, 27404769, 30310570, 31462129, 31162131, 29469224, 27142863, 25638293, 25008833, 23692106, 21424391, 20081997, 20192568, 19161828, 15225782, 11004054, 10296236, 12763974, 14667427, 14007505, 12132075, 10660886, 9561793, 8520144, 8021547, 8506679, 9843918, 11857209, 14288538, 16393915, 17676146]
39295A7676146J049264J607551K002581K033106K464635K859849J578696j233177
39287C0038651l146684l028928k605187l166989l366477j984073l80570j82627
39279A2177116p36721q78500j069160j682338j410559K44926J099970l81369j939549
39270E423816q09064J593255J747159m30906j786129j036177n3641r3543j68084
39261D386686L51735N41528Q3442L6779O33501N75984o32747j693214j661043
39252B622651j231529j066049n95013N87688J637311J685003R79994J64249m71897
39243D312408n99664J6571O20996P9242j193313j411583q9093J036463N53585
39234C325612o31922r04215k52437K35233J78112q7221n80509j459765k116056
$$ y = [17676146, 18725410, 20332961, 22335542, 24368648, 26833283, 29693132, 31271828, 30038651, 26891967, 23863039, 21257852, 18090863, 14724386, 12740313, 12359743, 12177116, 11440395, 10561895, 9492735, 7810397, 6399838, 6644764, 7744734, 7363365, 5423816, 4614752, 6208007, 7955166, 7524260, 5738131, 4701954, 4648313, 4554770, 4386686, 4738421, 5279949, 5363391, 5400170, 6033671, 6609655, 5976908, 4283694, 2622651, 1391122, 325073, -269940, 317748, 1955059, 3640062, 4620056, 4784305, 4312408, 3712744, 3729315, 4350311, 4429553, 3236240, 1824657, 1735564, 2772027, 3325612, 2693690, 1789475, 1537038, 1772271, 1950383, 1863162, 1282653, -177112, -2293168]
39225b293168j662926k48524J016605J460357J479826J688146J997460J804406
39217E242182Q28084m80121j358732j436171r04857j41736N16960O93673K27959
39208C187241l58150l24630J07630j19721j148079j576666m15777J273006J779986
39199B404840R87709l0206q87660j840491k388699j636573N9889J312782J545480
39190d72929J287989Q37674J23518k87930K47467R33078L88541q94426r47700
39181A215282M77955J229060J1176j680036j982886j235922p72933o36299k8126
39172c402729R57873J464475J138591L28170l76336k44470R94495K168242J596965
39163D625276l23380j059089N29793K281567J793070j92617j278974r62886n51023
$$ y = [-2293168, -3956094, -4204618, -3188013, -1727656, -247830, 1440316, 3437776, 5242182, 6070266, 5590145, 4231413, 2795242, 1890385, 1748649, 2265609, 2959282, 3187241, 2829091, 2504461, 2612091, 2492370, 1344291, -232375, -648152, 624854, 2404840, 3392549, 3362343, 2474683, 634192, -1754507, -3391080, -3331191, -2018409, -472929, 815060, 1652734, 1776252, 1488322, 1735789, 2668867, 3057408, 2162982, 1215282, 1693237, 2922297, 2933473, 1253437, -729449, -1965371, -2738304, -3374603, -3402729, -2444856, -980381, 158210, 486380, 110044, -134426, 860069, 3028311, 4625276, 4301896, 3242807, 3772600, 6054167, 7847237, 7654620, 6375646, 5412760, 4861737]
39154D861737m86908j07723L68851q6361j231886j548588n41217O87455J369231
39145C284591J843634K066010J143530q81063k274937j658597J71005J318286
39137E012459R63613k12978j121007j128417l29607N38154P75774N38401N20323
39128E556715P57721M52844p79783k200940k801789k270890r04172P14252J692157
39119B16115J387624M66176N04259J836510K650902J250127j386295k573557j318009
39110C033852N14978P29319n71351j550752j132693l8244M69382Q7509m64454
39101A077546m21212K60841R26706Q79689J24007n82573o23831l30535m34809
39092H75829q02915m96470O33883J338606P00009l13094j65657Q69985J100221
$$ y = [4861737, 4374829, 4267106, 4635957, 4549596, 3317710, 1769122, 1227905, 1915360, 3284591, 5128225, 7194235, 8337765, 7456702, 5181765, 3523168, 3694173, 5012459, 5976072, 5763094, 4642087, 3513670, 3184063, 3722217, 4497991, 5036392, 5556715, 6314436, 6767280, 5987497, 3786557, 984768, -1286122, -2190294, -1476042, 216115, 1603739, 2069915, 2574174, 4410684, 7061586, 8311713, 6925418, 4351861, 3033852, 3548830, 4278149, 3706798, 2156046, 1023353, 985109, 1454491, 1542000, 1077546, 656334, 917175, 1843881, 2723570, 2847577, 2265004, 1641173, 1310638, 875829, 72914, -423556, 210327, 1548933, 2248942, 1935848, 1770191, 2640176, 3740397]
39083C740397O0674q25879n90827r0091j97330j23048J109102K583662K549077
39074H215737J067966M7235P05669K296346L323253K847731O75573k369565m235170
39065A2574775l235609l89053J253170L70758r53144m55488Q54394L94624j677823
39056H736604k386365m51732J560496R45835j152288j507840M96828K345922K341303
39047A0928763J613808J614103J942053K033619L058322O168012J0211351J3419661
39039E0989692J6360567K0443571K3695029K1123099J0521768m067083j5926703
39032A23139940k1295419k0665234j6473655j1322144p386042n603902n301139
39025C5092405n250384m758791l554418j736198l36020n72854j814795j797122
$$ y = [3740397, 3801071, 2975192, 2384365, 2294274, 2096944, 1973896, 3082998, 5666660, 8215737, 9283703, 9330938, 10036607, 12332953, 15656206, 18503937, 19179510, 16809945, 12574775, 9339166, 8950113, 10203283, 10574041, 9620897, 9165409, 10019803, 10414427, 8736604, 6350239, 5898507, 7459003, 8404838, 7252550, 5744710, 6241538, 8587460, 10928763, 12542571, 14156674, 16098727, 18132346, 21190668, 27358680, 37570031, 50989692, 67350259, 87793830, 111488859, 132611958, 143133726, 139066643, 123139940, 101844521, 81179287, 64705632, 53383488, 45997446, 40393544, 35092405, 29842021, 25083230, 21528812, 19792614, 19456594, 18883740, 17068945, 15271823]
39017A5271823J78574J984577J923133J382720K367536M120676M657719M296961
39009C6183719M777594N662862M705514J653978j210607k557882l323164m169862
39001D1722152m366736l896973m045132m853159m444327k144106l585K50806l06246
38992A7912694r452O79512O32588N85977J907177L808708M011768J855641r51457
38983C0433156k519414k464368j651122j251663j811954k629843k562239j760439
38975A3782114j515907j968008j619946m5306Q51007j77060j344841n92827R25323
38966H294549Q09216l21468K91600K842841M484297L924631L389240N031166Q223863
38957C6969935J1823316J6346949K1518286K3584141J8219005N973948p299641
$$ y = [15271823, 15450397, 17434974, 19358107, 20740827, 23108363, 27229039, 31886758, 36183719, 40961313, 46624175, 51329689, 52983667, 51773060, 49215178, 45892014, 41722152, 37355416, 33458443, 29413311, 24560152, 20115825, 17971719, 17968134, 18218940, 17912694, 17903242, 18582754, 19215342, 19801319, 21708496, 25517204, 29528972, 31384613, 30433156, 27913742, 25449374, 23798252, 22546589, 20734635, 18104792, 15542553, 13782114, 12266207, 10298199, 8678253, 8632947, 9483954, 9306894, 7962053, 7369226, 8294549, 9103765, 8782297, 9073897, 11916738, 16401035, 20325666, 23714906, 28746072, 36969935, 48793251, 65140200, 86658486, 110242627, 128461632, 134435580, 127135939]
$$ [...]
##END NTUPLES=NMR SPECTRUM
##END=
