##TITLE=31Pdec_DE-162rm_1d
 , 64 sc
 8.7.2026
##JCAMPDX= 6.0         $$ Bruker NMR JCAMP-DX V2.0
##DATA TYPE= NMR SPECTRUM
##DATA CLASS= NTUPLES
##ORIGIN= UXNMR, Bruker Analytische Messtechnik GmbH
##OWNER= root
$$ XWIN-NMR		Version 3.5
$$ Wed Jul  8 13:18:47 2026 Russian Standard Time (UT+4h)  she@DPX200
##.OBSERVE FREQUENCY= 81.013821
##.OBSERVE NUCLEUS= ^31P
##.ACQUISITION MODE= SIMULTANEOUS
##.ACQUISITION SCHEME= undefined
##.AVERAGES= 64
##.DIGITISER RES= 17
##SPECTROMETER/DATA SYSTEM= spect
##.PULSE SEQUENCE= zgpg30
##.SOLVENT NAME= DMSO
##.SHIFT REFERENCE= (INTERNAL, DMSO, 0, 197.392)
##AUDIT TRAIL= $$ (NUMBER, WHEN, WHO, WHERE, WHAT)
$$ ##TITLE= Audit trail, XWIN-NMR		Version 3.5
$$ ##JCAMPDX= 5.01
$$ ##ORIGIN= Bruker BioSpin GmbH
$$ ##OWNER= she
$$ F:/spectra/data/she/nmr/P31/2/pdata/1/auditp.txt
$$ ##AUDIT TRAIL=  $$ (NUMBER, WHEN, WHO, WHERE, WHAT)
(   1,<2026-07-08 13:17:38.95 +0400>,<she>,<DPX200>,
      <created by zg, POWCHK disabled, PULCHK disabled
       configuration hash MD5:
       00 E9 B6 7A A2 85 ED C7 34 08 36 98 17 FE 4E 26
       data hash MD5: 32K
       4C 80 17 8B 01 19 81 84 E5 82 5A 2B 30 0B 68 64>)
(   2,<2026-07-08 13:17:41.59 +0400>,<she>,<DPX200>,
      <Start of raw data processing
       efp BC_mod = 2 LB = 1.5 FT_mod = 6 PKNL = 1 PHC0 = 2010.201 PHC1 = -39.7018 SI = 64K 
       data hash MD5: 64K
       05 94 8C 54 75 DE 1F 92 62 81 FA B1 92 6A 4F 99>)
(   3,<2026-07-08 13:18:07.00 +0400>,<she>,<DPX200>,
      <pk PHC0 = -120.8422 PHC1 = 313.8001 
       data hash MD5: 64K
       E2 B4 D1 47 72 4D D8 C8 A2 DA 0A D2 3A 27 B0 19>)
(   4,<2026-07-08 13:18:13.09 +0400>,<she>,<DPX200>,
      <abs ABSG = 5 
       data hash MD5: 64K
       4B F9 CC 5F 63 BA E4 0A BD 14 C4 3C 36 40 59 3A>)
$$ ##END=
$$ 
$$ hash MD5
$$ B8 3B ED B5 FF 5C C3 F1 9A F9 D6 44 C2 F5 5F 6C
##$RELAX= 
##$RELAX= 
##$RELAX= 
##$RELAX= 
##$RELAX= 
##$RELAX= 
##$RELAX= 
##$RELAX= 
$$ Bruker specific parameters
$$ --------------------------
##$DU= <F:/spectra>
##$EXPNO= 2
##$NAME= <P31>
##$PROCNO= 1
##$TYPE= <nmr>
##$USER= <she>
##$AMP= (0..31)
100 100 100 100 100 100 100 100 100 100 100 100 100 100 100 100 100 100 
100 100 100 100 100 100 100 100 100 100 100 100 100 100 
##$AQSEQ= 0
##$AQ_mod= 1
##$AUNM= <au_zg>
##$AUTOPOS= <>
##$BF1= 81.014009
##$BF2= 200.13
##$BF3= 200.13
##$BF4= 200.13
##$BF5= 200.13
##$BF6= 200.13
##$BF7= 200.13
##$BF8= 200.13
##$BYTORDA= 1
##$CFDGTYP= 0
##$CFRGTYP= 5
##$CHEMSTR= <none>
##$CNST= (0..31)
1 1 145 1 1 1 1 1 1 1 1 1 1 1 1 1 1 1 1 1 1 1 1 1 1 1 1 1 1 1 1 1 
##$CPDPRG= <waltz16>
##$CPDPRG1= <>
##$CPDPRG2= <waltz16>
##$CPDPRG3= <>
##$CPDPRG4= <mlev>
##$CPDPRG5= <mlev>
##$CPDPRG6= <mlev>
##$CPDPRG7= <mlev>
##$CPDPRG8= <mlev>
##$CPDPRGB= <>
##$CPDPRGT= <>
##$D= (0..31)
0 1 0 0 0 0 0 0 0 0.06 0 0.03 2e-05 3e-06 0 0 0.0002 0 0 0 0 0 0 0 0 0 
0 0 0 0 0 0 
##$DATE= 1783502258
##$DBL= (0..7)
120 120 120 11 120 120 24 19 
##$DBP= (0..7)
150 150 150 150 150 150 150 150 
##$DBP07= 0
##$DBPNAM0= <>
##$DBPNAM1= <>
$$ [...]
##$SUBNAM3= <"">
##$SUBNAM4= <"">
##$SUBNAM5= <"">
##$SUBNAM6= <"">
##$SUBNAM7= <"">
##$SUBNAM8= <"">
##$SUBNAM9= <"">
##$SW= 400.765351723535
##$SWIBOX= (0..15)
0 1 3 0 0 0 0 0 0 0 0 0 0 0 0 0 
##$SW_h= 32467.5324675325
##$TD= 32768
##$TD0= 1
##$TE= 0
##$TE2= 300
##$TE3= 300
##$TEG= 300
##$TL= (0..7)
0 120 53 12 22 120 120 120 
##$TP= (0..7)
150 150 150 150 150 150 150 150 
##$TP07= 0
##$TPNAME0= <>
##$TPNAME1= <>
##$TPNAME2= <>
##$TPNAME3= <>
##$TPNAME4= <>
##$TPNAME5= <>
##$TPNAME6= <>
##$TPNAME7= <>
##$TPOAL= (0..7)
0.5 0.5 0.5 0.5 0.5 0.5 0.5 0.5 
##$TPOFFS= (0..7)
0 0 0 0 0 0 0 0 
##$TUNHIN= 0
##$TUNHOUT= 0
##$TUNXOUT= 0
##$USERA1= <user>
##$USERA2= <user>
##$USERA3= <user>
##$USERA4= <user>
##$USERA5= <user>
##$V9= 5
##$VALIST= <valist>
##$VCLIST= <CCCCCCCCCCCCCCC>
##$VD= 0
##$VDLIST= <DDDDDDDDDDDDDDD>
##$VPLIST= <PPPPPPPPPPPPPPP>
##$VTLIST= <TTTTTTTTTTTTTTT>
##$WBST= 1024
##$WBSW= 4
##$XGAIN= (0..3)
0 0 0 0 
##$XL= 0
##$YL= 0
##$YMAX_a= 29110
##$YMIN_a= -20843
##$ZGOPTNS= <>
##$ZL1= 120
##$ZL2= 120
##$ZL3= 120
##$ZL4= 120
##$ABSF1= 197.3918
##$ABSF2= -203.3724
##$ABSG= 5
##$ABSL= 3
##$ALPHA= 0
##$AQORDER= 0
##$ASSFAC= 0
##$ASSFACI= 0
##$ASSFACX= 0
##$ASSWID= 0
##$AUNMP= <proc_1d>
##$AZFE= 0.1
##$AZFW= 0.5
##$BCFW= 0
##$BC_mod= 2
##$BYTORDP= 0
##$COROFFS= 0
##$CY= -3
##$DATMOD= 1
##$DC= 0
##$DFILT= <>
##$DTYPP= 0
##$F1P= 0
##$F2P= 0
##$FCOR= 1
##$FTSIZE= 65536
##$FT_mod= 6
##$GAMMA= 0
##$GB= 0
##$INTBC= 1
##$INTSCL= 9.790993e-09
##$ISEN= 30
##$LB= 1.5
##$LEV0= 0
##$LPBIN= 0
##$MAXI= 10000
##$MC2= 0
##$MEAN= 0
##$ME_mod= 0
##$MI= 50
##$NCOEF= 0
##$NC_proc= -8
##$NLEV= 6
##$NOISF1= 182.463
##$NOISF2= 159.3651
##$NSP= 0
##$NTH_PI= 0
##$NZP= 0
##$OFFSET= 197.3918
##$PC= 4
##$PHC0= 1889.359
##$PHC1= 274.0983
##$PH_mod= 1
##$PKNL= yes
##$PPARMOD= 0
##$PSCAL= 0
##$PSIGN= 0
##$REVERSE= no
##$SF= 81.014063255964
##$SI= 65536
##$SIGF1= 159.3651
##$SIGF2= -187.1042
##$SINO= 113.3802
##$SIOLD= 16384
##$SREGLST= <1H.CDCl3>
##$SSB= 0
##$STSI= 65536
##$STSR= 0
##$SW_p= 32467.5324675325
##$SYMM= 0
##$S_DEV= 0
##$TDeff= 32768
##$TDoff= 0
##$TI= <>
##$TILT= no
##$TM1= 0
##$TM2= 0
##$TOPLEV= 0
##$USERP1= <user>
##$USERP2= <user>
##$USERP3= <user>
##$USERP4= <user>
##$USERP5= <user>
##$WDW= 1
##$XDIM= 65536
##$YMAX_p= 455644643
##$YMIN_p= -338161091
$$ End of Bruker specific parameters
$$ ---------------------------------
##NTUPLES= NMR SPECTRUM
##VAR_NAME=  FREQUENCY,     SPECTRUM/REAL,   SPECTRUM/IMAG
##SYMBOL=    X,             R,               I
##VAR_TYPE=  INDEPENDENT,   DEPENDENT,       DEPENDENT
##VAR_FORM=  AFFN,          ASDF,            ASDF
##VAR_DIM=   65536,         65536,           65536
##UNITS=     HZ,            ARBITRARY UNITS, ARBITRARY UNITS
##FACTOR=    0.49542278885378, 1,            1
##FIRST=     15991.5117654749, 0,            0
##LAST=      -16476.0207020576, 0,           0
##MIN=       -16476.0207020576, -338161091,  0
##MAX=       15991.5117654749, 455644643,    0
$$ Real data points
##PAGE= N=1
##DATA TABLE= (X++(R..R)), XYDATA
$$ [...]
42003 4635623 8540661 11066717 12706682 13416519 12904672 11691907 10879817 10598540 9680167
41994 9680167 7546658 5538487 5298947 6402976 6871891 5809454 4095984 2340101
41986 2340101 -204565 -3780704 -6497837 -6090695 -2877061 384706 1557477 954733
41978 954733 164264 361131 2111787 5452371 9222616 11297469 10627082 8536606 7133426
41969 7133426 7088648 7923941 9480842 11499503 12535044 11474725 9868150 10272416 12034062
41960 12034062 11488725 7324507 2898731 1453913 1754445 1145589 668533 3473439 9186024
41951 9186024 13610556 14080077 11906819 9226086 6561435 4295545 3546775 4208610 4529673
41942 4529673 4033974 4665611 7548932 10696222 11709899 11071183 10962371 12229558 14165848
41933 14165848 15938121 16550079 14744433 10799883 7302456 6337660 7014743 7533087 8293501
41924 8293501 10575434 13246350 13735212 11998008 10678569 11042083 11346900 9955134 7715082
41915 7715082 6151824 5260982 4516279 4561289 6233927 8745092 10382420 10706943 10738922
41906 10738922 10949406 10287019 7838379 4784902 3672432 5539807 8603484 10480180
41898 10480180 11030225 11742751 12673768 11970815 9096723 6623323 7243700 10159514 12155667
41889 12155667 11588694 9650646 8114464 7579382 7992173 9373158 11503667 13639867
41881 13639867 14785455 14079046 11529091 8816237 8248332 9899327 10983262 9588790
41873 9588790 7934697 9860181 15683678 21707671 24594943 24132530 21730567 18521384
41865 18521384 15561748 14011210 14088642 14821953 15237406 14989310 13975451 12442526 11208727
41856 11208727 10633120 9929269 8821896 8873351 11215198 14018357 14775011 14183245 14619569
41847 14619569 15398940 13419587 8626862 4698454 3516568 3237050 3187507 5961281 12036378
41838 12036378 16722327 16240910 13421930 13169337 15046439 15060297 12854261 11950261 13497978
41829 13497978 14768219 14377078 14693158 17666788 21513217 23215793 22247380 20620085
41821 20620085 20754205 23845093 28823523 32712376 33661627 33742554 36979205 44481891 53263209
41812 53263209 59886611 63388091 64523082 64221512 63228634 61510898 57724550 50952841
41804 50952841 42935321 36493053 31730598 26379854 20373446 17059323 18275541 20684076
41796 20684076 19393021 13987830 8794936 7600474 9828490 12089617 12390730 12101686
41788 12101686 13617776 16482851 17202370 13891973 9698383 9343218 12829456 15303826
41780 15303826 13500222 9644762 7905646 9252592 11363659 12003726 11024926 10145280
41772 10145280 11759344 16784210 22903877 26348005 26145009 24967432 25009762 25186941 23801441
41763 23801441 21788719 21170694 21895063 22558246 23131710 24543893 26225314 26469573 25109874
41754 25109874 23828238 23759360 24527510 25765949 27895756 30908569 33641009 34958128
41746 34958128 35128706 35690171 38042566 41929241 45281011 46335801 46073719 47298926
41738 47298926 50811544 54150328 55252957 55623591 58022642 62361968 66141397 68120847
41730 68120847 69208233 70130192 70579695 70663291 71060486 71609136 71685421 72026891 73996925
41721 73996925 76754510 77481283 75140870 71803970 69234765 66370146 61728530 56383924
41713 56383924 52417285 49639326 46191234 41975389 39278643 39626678 41653128 42815362
41705 42815362 42196398 40834165 39877310 39239472 38069354 36141031 34605411 35258399 38770367
41696 38770367 43530027 46713536 47103974 46677550 48498261 52795730 56269704 56238218 54423032
41687 54423032 54805916 58098366 60621533 59258436 55354742 52400607 51619884 51582987 50813416
41678 50813416 48779578 45245754 40720272 36979766 35165230 33803626 30749387 26753996
41670 26753996 24890809 26438516 29526447 32093487 34034261 35983291 38108414 40791946
41662 40791946 44543229 48493281 50851713 51504538 52030014 52345213 49928195 43969056
41654 43969056 37888956 35443083 36107186 36787124 36592104 36990935 38098871 38040077 36167785
41645 36167785 34063399 32484664 29670776 24134199 17689907 14156671 15450810 19695278
41637 19695278 22826643 21818192 17054070 11977549 9835781 10471837 10924528 9290244
41629 9290244 6923888 6297909 7885181 10329912 12772032 15158359 16431671 14708846
41621 14708846 10402218 7319432 8456983 11506101 11160753 6119744 1101763 664322
41613 664322 3496921 5096808 4264896 3905642 6140014 9744784 12530789 13458749 12023779
41604 12023779 8367442 4749965 4027248 5444108 4826232 703125 -2631071 -670677
41596 -670677 5164449 10041382 12387501 14325814 16585045 17190920 15514847 13948535
41588 13948535 14420629 16093783 17796730 20221865 24006660 27530286 28537678 26912537
41580 26912537 24333890 21945696 19686330 17454018 15759230 15153084 15469038 15704685
41572 15704685 14930073 13764994 14338025 17599570 21153411 21545550 18730137 16223264
41564 16223264 16311631 17316363 16798093 15398273 15543374 17692084 19998541 20952580 20339579
41555 20339579 18049975 14110000 10080349 8521334 10331351 13776601 16622278 18095026
41547 18095026 18300986 17130884 14963508 13659521 15302645 19700559 24016210 25325858
41539 25325858 23158027 19314078 15812649 13687952 13417739 15225858 18225995 20061303
41531 20061303 18742622 15091242 12461622 13465875 17369594 21134659 22673066 22567439
41523 22567439 22769801 24223283 26049167 26817386 26161608 24950853 24230759 24552698 26201706
41514 26201706 29177266 32603211 35070465 36301973 37750601 40701301 44548905 48008592
41506 48008592 51070425 54059647 55535787 53661576 49917893 48939421 53489541 61427784
41498 61427784 68844351 74459356 79547561 85364091 92757917 103079376 117047458 133206325
41490 133206325 149673058 167207411 188434042 213852454 240461277 264510182 283596332
41483 283596332 295514343 297368130 287730081 268851014 245233851 220201671 194710615
41476 194710615 169166763 145270121 125584485 111511652 101960495 94239376 86386867
41469 86386867 78441613 71445007 65992030 62306673 60715167 60657533 59879127 56583680
41461 56583680 52476177 51516281 54763764 58399752 58437309 55970236 55724784 60150548 67155429
41452 67155429 73699072 79485104 86259858 95077610 105672749 117787213 131711674 147580515
41444 147580515 165248496 185166937 208424002 234990020 262051804 284801334 299116202
41437 299116202 303185011 296773053 280190553 254991990 224976817 194886310 167672286
41430 167672286 143825945 123326197 106832548 94433386 84723027 76360324 69539512
41423 69539512 64586070 60072510 54225702 47803707 43484439 42172289 41865505 40761676
41415 40761676 39513188 39293451 39414237 38520770 36849168 35415807 33920415 31606765
41407 31606765 29679215 30384305 33387243 35324166 33901107 30739809 29098509 30182409
41399 30182409 32822122 35456351 37000595 36768711 35155810 33904961 34374097 36009878
41391 36009878 37741538 40149515 44537821 50222717 54689934 56654420 57260074 57894921
41383 57894921 58618683 59603929 62549578 69240803 79382896 90849010 101596886 110763488
41375 110763488 118682203 126730050 136673387 149372377 164355451 180902328 198709133
41368 198709133 216865691 233026700 244604914 250532958 251478118 249124048 245872066 244203800
41360 244203800 245022978 246897777 247692746 246416224 242787259 235974558 225069946 210232114
41352 210232114 192167341 171175743 148188962 126149002 108463161 96002692 86992013
41345 86992013 79618963 73117493 66549361 58805147 50460144 43755502 39737452 36711810
41337 36711810 32330402 26121116 19486237 14457150 12736783 14258682 16165090 15235606
41329 15235606 12256273 11755697 15934029 21136526 22537722 20290905 18149879 17519778
41321 17519778 16438739 13928162 11624534 10545398 9498219 7803036 6772467 7078282
41313 7078282 7161644 5924669 4749226 5011312 5794121 6246577 7942407 11859990 14813217
41304 14813217 12803201 7275713 3943007 5033654 6816592 6115652 5141276 7121842
41296 7121842 10490598 11270912 9298050 7998791 8836045 9961193 10298663 10957005 11820727
41287 11820727 10649837 7246351 4989704 5817029 6831688 5160515 3594137 7063476
41279 7063476 14697102 20083193 19838742 17649723 18166651 20440779 20181386 16370870 12484728
41270 12484728 11639502 12970379 13294794 11014123 7638697 5773955 6111387 7038497 7495845
41261 7495845 9009223 13257131 18368175 20262997 18078461 15572286 15934326 17806449
41253 17806449 18421628 18276503 19681964 22142937 22670304 20460030 18108047 17639542 17986401
41244 17986401 17368978 15956861 14833417 14004261 12987859 12354989 13180616 15353557 17533057
41235 17533057 18705080 19049474 19172462 18931503 17430558 14391160 11197403 9698826
41227 9698826 9824121 9625579 8386616 8175544 10800119 14550491 16252172 15847632 16275242
41218 16275242 18783732 21073703 20769189 18259118 14980810 11154498 6880449 3795543
41210 3795543 3704508 6294576 9437939 11117275 10417998 7799295 5205442 4642118 5730257
41201 5730257 5925381 3953138 1488052 550701 1158842 2798101 5970968 10293829 13158528
41192 13158528 12965469 12123725 13880985 17351688 18998758 18422641 19065062 22862373 27515933
41183 27515933 30047421 30350931 30002761 29738391 29369370 28546224 26721435 23966019 22411398
41174 22411398 24876687 31068712 36926283 38830082 36985601 33893807 31338501 29957340
41166 29957340 29929346 30593057 30661949 29921920 29456450 29536039 29121449 28204711 28183979 28600519
41156 28600519 26366655 20542013 15236625 14612220 17034491 17839658 16410304 16217888
41148 16217888 18317465 19357542 16970546 13257454 11236100 10886986 10686083 10635523 11581488
41139 11581488 13122505 14104436 14130472 13303111 11721018 10325360 10637252 12267426 12390342
41130 12390342 9514007 6199677 5739004 7376728 7687793 6180549 6265019 9845032 13710114
41121 13710114 13204827 8029298 2454547 281122 1203768 2279732 1725565 520227
41113 520227 672369 2610518 4601511 4698752 3009271 1706566 2668342 5346663 7384259
41104 7384259 7411410 6728563 7641299 10327094 12281633 11299761 8246087 6081886 6616532
41095 6616532 9098467 11635682 12909480 12665520 11796843 12051914 14301965 16730069 16207529
41086 16207529 12254051 8232071 7376627 8766163 8823966 6102280 2723307 1196241
41078 1196241 1689653 3037288 4863991 7418458 9977850 10822720 9158629 6415203
41070 6415203 5028817 5950831 7854548 9095741 9879700 11565739 14038218 15206285
41062 15206285 13745768 11095182 9626463 9835462 10783074 12436268 15420500 18550609
41054 18550609 19050129 16250463 13214165 13178102 15697434 17978912 18873986 19245433 18900354
41045 18900354 16114040 11112237 7448217 7856253 10300011 10542985 7769056 4938017
41037 4938017 3784507 2685847 563814 -135195 3235094 9124728 13462285 14709395
41029 14709395 14608308 14565882 14200769 13500035 13602755 14860647 16522224 18856273 22991510
41020 22991510 27909696 30562378 30441684 31127543 35081788 39434720 39762876 36148918
41012 36148918 32358192 30277361 28507969 25997403 23865239 23247163 23670137 23975154
41004 23975154 23171395 20484306 16278142 12648110 11376753 11802553 12448965 13705256
40996 13705256 16397294 18678874 17610542 13598024 10053462 8693719 8529063 9451774
40988 9451774 12634911 16510821 16845564 12941978 9905500 12011054 17064872 20346583
40980 20346583 21222202 22351264 24657713 26975829 29282066 32493522 35639970 36465882
40972 36465882 34618045 31680094 28595600 25655914 24401952 26553736 31102182 35161981
40964 35161981 37865135 40919038 45029421 48212441 48376652 45725011 41933822 38371973
40956 38371973 35575520 33363317 31267699 29500951 28838342 28693558 26844841 22929397
40948 22929397 20601230 23333760 29042373 32196715 30969667 28830448 28811507 29838499
40940 29838499 29837217 29150672 29049446 29395586 29754744 30923419 33443231 35896469 36245820
40931 36245820 34037248 30421344 26972399 24937267 24401247 23935022 22464184 21315485
40923 21315485 22407284 24716134 25372230 24319494 24380853 26006509 26011432 23197530 20993500
40914 20993500 21696959 22074789 18639788 14062626 13491223 16584290 18408599 17298826
40906 17298826 16581541 18338580 20427465 20846289 20657301 20683156 19070862 14776227 10743775
40897 10743775 10667108 14053910 17029770 17299155 16270445 16493240 18490882 20336221 19759043
40888 19759043 16653118 13438560 12418420 13086091 13166731 12039687 11302461 11613720 11089697
40879 11089697 8071674 3869958 1182125 936107 2376493 5348253 10330956 16232766
40871 16232766 20157728 20271694 17879832 15865726 15704153 16725731 17789907 18602098
40863 18602098 19243806 19363541 18611373 17489772 16853965 16498005 15113744 12085268 8661542
40854 8661542 6784389 7225772 9368457 12209048 14796324 16111439 15497191 13304934
40846 13304934 10669886 8740516 8290201 9448277 11304905 12497277 12874785 13747315
40838 13747315 15560896 16372753 14213613 10302713 7993942 8628018 10291563 10904506
40830 10904506 10664683 10768911 11354865 11768474 11807008 11775656 12046437 13111057 15191481
40821 15191481 17317975 17891663 16895276 16513183 18610185 22372650 25371351 26291178 25657314
40812 25657314 24427630 22979010 21373782 19808050 18647795 18243014 18512331 18698877
40804 18698877 18179687 17680048 18737155 21417357 23533785 23088707 20874109 19635187
40796 19635187 21002966 24167820 27326458 29496242 30922740 32487113 34868753 37864854
40788 37864854 40573620 42534665 44299410 46329710 47839763 47757465 46712960 46810495 48812506
40779 48812506 50371214 48046528 41014362 32137979 25327825 22460712 23052807 25913766
40771 25913766 29819741 32790593 32613418 29431763 26844515 28558205 33853664 37992330
40763 37992330 37789417 35467486 35770119 39940894 44062716 43701760 39250754 35745943
40755 35745943 37407821 43279861 49152453 53290280 58399226 67116827 77466424 85024851
40747 85024851 88660462 91212157 94262280 95310380 91659189 84660869 77774066 71931708
40739 71931708 65427144 57686798 50554461 45704536 42898287 41243350 40412968 40079558
40731 40079558 39851447 40629257 44437330 51516640 58610607 61795314 60827857 59506156
40723 59506156 61804040 68723948 78865631 90500325 102118389 111941877 118510253 122009090
40715 122009090 124128824 126224383 128105610 128712548 127121777 122458648 113761325 100988578
40707 100988578 85897887 71134708 58586427 49083848 43039055 40246671 39315165 38511260
40699 38511260 37271733 35936373 34069399 30338382 24451908 18203587 14060143 13275284
40691 13275284 15431310 18942274 21882148 23301178 24015875 25417876 27711456 30371127
40683 30371127 33838031 38900494 44456171 48190765 50019230 52401857 56138751 58424011
40675 58424011 57008198 54016931 52941743 53429618 52201512 48377904 44546243 42312435
40667 42312435 39957090 35806101 31550524 30197901 31832894 33359448 32427450 30231355
40659 30231355 29758007 31982802 34997328 37079442 39078855 42213324 44608069 42880924
40651 42880924 37491121 33458300 34229846 37559644 39776190 41610394 46411815 54263425
40643 54263425 61949388 68361060 75912899 85951847 96289849 104519858 110702728 115086111
40635 115086111 115816862 111212794 102718004 93592227 85637186 78606933 71701744 64191057
40627 64191057 55611287 46905051 40585147 38227533 38255279 37536591 34855054 31599770
40619 31599770 29279991 27678543 25752986 23450983 21955301 22187276 23436784 23966307
40611 23966307 23171291 22440998 23034677 23688214 21824239 17209374 12854521 11657918 13386329
40602 13386329 15713427 17043118 17228939 16477025 15066616 13942987 14161916 15234285
40594 15234285 14917034 11615914 6865278 4358825 5874966 9042738 10448412 10275958
40586 10275958 11615169 15058182 16991763 14774726 10706764 8191570 6509827 3203906
40578 3203906 -156137 492930 4643514 6696824 3739564 -438197 -977956 2055757
40570 2055757 5439705 7134444 6339411 2387750 -3195577 -5874625 -2718525 3578949
40562 3578949 8013096 9060377 8443783 6874198 3615239 -363526 -2197202 -438380
40554 -438380 3645203 8102154 11821516 14353246 16005094 17811093 19946030 20888658
40546 20888658 19630754 17580322 16487417 15841641 14519714 13516017 14174721 14896970
40538 14896970 12999236 9324378 7533819 8785108 10484517 10774821 10968400 12513048
40530 12513048 14425858 15159308 14898155 14818881 15728273 18040298 21233665 22929534 20752623
40521 20752623 15761490 11767305 10492915 9771746 7476305 4669892 3372885 3480676
40513 3480676 3743939 4014921 4640213 5057765 4880051 5348543 7968199 12239203 15952023
40504 15952023 17310401 16238431 14510534 14956797 19078501 24746612 27755373 26441504
40496 26441504 23217412 20852288 19317955 17549862 16112047 16071366 16820782 17211776 17754735
40487 17754735 19618250 22256765 23994273 24412187 24498914 25058507 26562325 29833833 35076932
40478 35076932 40703649 44773979 47151126 48797277 49842174 50382242 52519289 59043867
40470 59043867 69852840 81694542 91687041 99075347 103268890 102700795 97009650 88543487
40462 88543487 80025731 71905567 63687682 56945513 54779016 58043147 63855115 68620621
40454 68620621 71204013 71921100 69592764 61982155 49618946 37168379 29426116 26846163
40446 26846163 26328317 25445539 24115738 22803096 21417418 20212332 19834346 20124134 20580325
40437 20580325 22095037 26073587 31501195 35321989 36412678 36632403 37165821 37052879
40429 37052879 36932871 40617024 49844795 60174636 65632720 65469643 62799474 58657478
40421 58657478 51970894 44217861 38921559 36234947 32731363 27550442 24358494 25555971
40413 25555971 28476981 29490082 28440359 26591935 23343368 18089281 13031390 10897479
40405 10897479 11286713 12035717 12895849 15046294 17985715 19885335 20700201 22363842 25923694
40396 25923694 30571458 35358598 39908140 43748023 47109844 52115892 60635459 70821227
40388 70821227 78538774 83034736 88487953 98462970 111301726 123310841 134634555 148715645
40380 148715645 166153187 181959545 189897818 187871080 178186607 164115799 147755075
40373 147755075 130573813 114401120 101382571 93343203 90962277 92924417 96049599
40366 96049599 97061033 94429043 88216783 78702652 66384640 53316771 42781200 36523135
40358 36523135 33108754 30076599 27152953 26145204 27848108 30311767 30629451 27821469
40350 27821469 23530000 20092200 18216208 16720660 14620661 12931536 13497383 16196813
40342 16196813 18698713 19342451 18632557 17045544 13362723 7127470 1260173 -423300
40334 -423300 2249130 6160447 9320014 12139645 14421302 14495046 12508679 11604248 13901162
40325 13901162 17486542 19409421 19844638 21016111 23307417 24881227 24566625 22977927
40317 22977927 20878899 18098183 14192610 9196648 3879966 -131772 -1208472 586442
40309 586442 3565015 6756382 10605124 14461645 15807658 14119575 13145185 15954374
40301 15954374 19331202 17352328 10093711 4139641 3629222 5424555 5300163 4693053
40293 4693053 7637552 13760663 18571491 19584480 18334747 16576172 14005721 10387224
40285 10387224 7053371 5115505 4194702 3983380 5290040 8325220 11461025 13141881
40277 13141881 13930802 15092761 15878213 14039623 9116742 3689839 732992 653598 1682384
40268 1682384 2523822 3551388 5417441 7581839 9002864 9835705 11417350 14327796
40260 14327796 17257598 18388235 17413551 15509552 13661465 11961468 10558873 10221763
40252 10221763 11302003 12709000 12691713 10620918 7614377 5449586 5135405 6470828
40244 6470828 8689625 11380808 14671113 18354315 21095152 21238671 18749506 15744533
40236 15744533 14510390 15411620 17384526 19937094 23465876 27625562 30733453 31499651
40228 31499651 30567662 29596517 29322231 29237160 28784277 27995368 26928172 25133025 22008850
40219 22008850 17597951 12956761 9548650 7919518 7155180 6329112 6265424 8466569 11920915
40210 11920915 12886172 9438285 4770428 3533290 5555738 6128408 2879200 -712457
40202 -712457 -276394 3444004 6049259 5492290 3804091 3273223 3726758 4203232 4994547
40193 4994547 6613837 8101780 7943382 6249857 4889891 5450795 7711879 10173396
40185 10173396 11695780 12493430 13572621 15243004 16521445 16407502 15402094 14944230
40177 14944230 15480912 16273528 17375482 20252403 25222347 29456965 29564505 26053214
40169 26053214 23252641 24176964 27199399 28994673 29242987 30426919 33697323 37328710
40161 37328710 39593756 40978055 42366564 42671947 40035792 34681185 28965719 24813954
40153 24813954 22388330 21141425 20800327 21078757 21566044 22388837 24296313 27758975 32339774
40144 32339774 36790347 39295112 38310832 34390818 30741884 30380476 32817200 35186639
40136 35186639 36492002 38434375 41617493 43670210 42679512 40241172 39052675 39263811
40128 39263811 39535289 40194270 42488463 45470293 46455314 44395404 40339093 34851094
40120 34851094 27826414 20963453 17185366 16500367 15210146 10859911 5791491 4014456
40112 4014456 6302763 10126866 12870872 13310801 11378317 8546673 7378645 8641728
40104 8641728 9775687 8300216 5851736 6361792 10690828 15762322 19128797 21657032
40096 21657032 24870151 28085234 29689436 29612115 29035726 28731511 28835588 29273888 29426346
40087 29426346 28491434 27197873 27770105 30688315 32758467 30515307 24933717 20566522
40079 20566522 20055887 21533233 21708437 19525377 16103290 12953125 11410840 12382858
40071 12382858 15224098 17650237 17817069 15847286 12722329 8930679 5219810 3192565
40063 3192565 3398402 3875596 2616607 769102 1064085 3317031 4100446 1509872 -1945314
40054 -1945314 -2295183 1559162 7302086 11601200 12387648 10288630 8558096 10041163
40046 10041163 13511174 14846750 12599762 9941238 9615593 9766661 7457520 3969805
40038 3969805 2840578 3878510 3335635 73551 -2428559 -1331894 1570877 2811371
40030 2811371 1764108 424287 393721 1612574 2738082 1660400 -2859488 -8873964
40022 -8873964 -11998411 -9752231 -4055834 1376002 4550092 5250302 3777493 1456021
40014 1456021 658770 2114660 3341540 1844003 -1191322 -2645706 -1985273 -1344110 -1418130
40005 -1418130 -220217 3276466 6584541 6354367 2535323 -1372485 -1979144 702516
39997 702516 3656034 4387449 3650171 3956295 5706985 6554329 5212677 3828384 4930889
39988 4930889 7760646 9778970 10380568 10554450 10135215 8579369 7694709 9861727 13521107
39979 13521107 14404822 12123485 11517275 15676550 21432289 24508440 25826682 29013382
39971 29013382 34013302 37503377 38672753 40407203 44554951 49549530 53478687 56519851
39963 56519851 59160383 60396520 59089495 55408616 49878736 42717663 35284450 30428907
39955 30428907 29636114 30825166 30595580 28013779 24743607 22044399 19424927 16349308
39947 16349308 13665830 12557887 12916025 13548061 13650974 13367741 12873564 11563893 8753847
39938 8753847 5105971 2585693 2389439 3366474 3432613 2405628 2155663 3515288 4492681
39929 4492681 2925420 15563 -764570 1649072 4387877 4839347 4630566 7384247 13207095
39920 13207095 17883245 18142267 15667386 14475989 15839969 17810216 18958551 20090600
39912 20090600 21926237 23328213 23034289 21699049 20975292 21668821 23932641 27998362
39904 27998362 33077454 36615214 36809306 35415891 35795188 38234214 39667360 38484394
39896 38484394 36920091 37343564 38679751 38725243 38074099 38774740 40091609 39041043 35500262
39887 35500262 33682451 37052209 43895732 49674357 52235501 52732398 52431150 50987688
39879 50987688 47913277 43771492 39298655 34722323 30610165 28071246 27048078 25455327
39871 25455327 21550193 16726167 14227967 14826887 15427012 12926446 8168621 4592221
39863 4592221 3808254 4461298 5317683 7200044 10871227 14771120 16548323 15975969 14758067
39854 14758067 13953493 13242483 12655631 13368421 16190406 20211127 23424586 24224372 22390373
39845 22390373 19372032 17415102 17419535 17783374 16399399 13495640 11114351 10123160 9752276
39836 9752276 10164047 12910701 17761438 21425034 21296712 18880709 17594544 18424730 19668951
39827 19668951 19950798 19524013 19350767 20691119 24797447 31161518 36907804 39875224
39819 39875224 41325005 43355609 44782517 42586564 36782068 30428601 24932710 19050664
39811 19050664 13043577 9765181 9949635 9896982 6144441 -150310 -5453675 -7849028
39803 -7849028 -6833376 -2254231 3640260 5893409 2344366 -2404513 -2317685 2157143
39795 2157143 5450595 5133132 4336844 5880775 8386164 9427757 8977783 8141555 7312717
39786 7312717 7122629 8725716 11576077 13133585 12323713 11234424 11837608 13121692 13338126
39777 13338126 13166376 14336063 16416688 17322357 16277640 14242357 11940199 9439764
39769 9439764 7410243 6861931 7467432 7702696 7041973 6821952 8425971 11391492 13793115
39760 13793115 14144913 12729163 11260081 11272697 12771006 14548141 15600040 15644221 14450730
39751 14450730 11824489 8672711 7012982 8055512 10819962 13246432 14181511 13940721
39743 13940721 13712736 14860691 17875321 21366194 22981110 22058435 20543416 20633572 22545054
39734 22545054 25364861 28771288 32533128 35307970 35600700 33504860 30233487 26444802
39726 26444802 22283922 18459340 15782533 14015625 12577411 11999766 13214228 15774394
39718 15774394 18407531 21044305 24471193 27975180 29279107 27322840 23611573 20409928
39710 20409928 19015728 20026344 23447894 27717507 30162976 29521290 27069747 24724272
39702 24724272 23251504 22857932 23850292 25587760 26238183 25047389 23879233 25165144
39694 25165144 29118995 34093771 38653430 41955098 43226498 42687308 42186677 42954885
39686 42954885 43332819 40960152 36858306 34671440 35510510 36325899 34549809 31784885
39678 31784885 30910091 31493214 30649219 27414810 23635253 20762241 18190415 15103929
39670 15103929 11964080 9572928 8297700 8739161 11442593 15174616 17198164 16384082
39662 16384082 14599144 13876113 13829933 13389818 13320984 14662447 15940010 14934675 12814395
39653 12814395 13328723 17433238 21712976 23255149 23325768 24503559 26603495 27786672
39645 27786672 27908536 28030853 27630084 25102282 20860461 17515449 16687208 17499858 18503134
39636 18503134 19350353 20163428 20812965 21455102 22605582 24156118 25200797 25020301 23327576
39627 23327576 19742323 14478128 9549065 7430956 7908285 7957572 5729663 3134738
39619 3134738 3171105 5848894 8299521 8321668 6413392 4505213 3860988 4401813 5441517
39610 5441517 6783486 8903745 11607289 12848074 10281189 4497173 -604306 -1612573
39602 -1612573 1200508 5229466 8618267 10636108 10535492 8462398 6909512 8633545
39594 8633545 12804037 15486011 14646852 12573951 12208642 13076120 12669680 10521225 8699851
39585 8699851 8690305 9681976 10071643 9269450 7865062 7104659 8119684 10422749 11322293
39576 11322293 8506044 3419449 174514 409729 1281497 -89685 -2221798 -1632655
39568 -1632655 1747845 4411629 4164732 2340824 813708 -397397 -1472606 -1204932
39560 -1204932 1225214 4594231 7400055 9867255 12597906 14642978 14820022 13845493
39552 13845493 13202512 12853355 12127449 11903760 13400705 15410256 15629286 14806415 16647087
39543 16647087 22864646 30960340 38015158 44137252 50411535 55585699 57277544 55492555
39535 55492555 52691974 50615811 48849843 46725120 45188974 45980083 49305652 52853192
39527 52853192 53497270 50286509 45475982 42100623 40902668 40403655 39379285 37846863
39519 37846863 35975338 33864111 32434957 32501720 32621725 30197126 25551783 22441135
39511 22441135 22993544 24461716 23163935 19777666 18100449 19820464 23308888 26871791
39503 26871791 30258993 32959380 33799624 32993823 32482398 33334868 34481561 34916353 35603336
39494 35603336 37858596 40749975 41623109 39338307 36123995 35541541 38486946 41714373
39486 41714373 41089074 36174433 30487349 27093090 25620237 24484684 24099037 25722265
39478 25722265 28157379 28209046 24703957 20239495 18376579 20198114 23889224 26747068
39470 26747068 27433130 27000133 27715813 30402199 33421102 34861302 34798645 34441639 34179714
39461 34179714 33863732 33854675 34015645 32790586 29482730 26448492 26313141 27575271 26028083
39452 26028083 20620626 14975655 12710178 14096901 17799264 22657180 26634694 27233517
39444 27233517 24878630 23345944 24844444 26945403 26441990 23986246 22318375 21685032
39436 21685032 19996402 16669509 13597481 12425590 12792558 13188702 12241078 9604640
39428 9604640 6740874 6071431 8222354 11122108 13027366 14997289 18639930 22916705
39420 22916705 25635401 27165048 29941726 34537637 38745815 40750957 41053266 40962237
39412 40962237 41146573 42040202 43816117 45382353 44973695 42332283 39032457 36291567
39404 36291567 33790961 31021819 28408076 26502102 25112797 23651379 21487080 18008651
39396 18008651 13621790 10667890 11570336 15451678 18217621 17069745 13789270 12447823
39388 12447823 14706169 18449313 20434113 19141942 15319831 10937009 8034569 7884753
39380 7884753 10288647 13244109 13843336 10667474 5684970 2794025 3756907 6446672
39372 6446672 7916139 7967733 8171923 8466900 7147588 4145239 1973686 2705860 5668714
39363 5668714 8757328 10499522 10237182 8007737 5344966 4811566 7404365 11250850
39355 11250850 13900038 15060790 15965825 16740281 15811817 12048914 6743535 3140850
39347 3140850 3857968 8442686 13650463 16666903 17692340 18468327 18931394 17278790 13531290
39338 13531290 10808176 11782604 15290364 17821313 17442780 15109089 13002740 12844770
39330 12844770 15183328 19024362 22270592 23264940 21826068 18762967 15233763 12658950
39322 12658950 11773532 11171341 8473426 4011343 1595537 3929117 8678151 11150574
39314 11150574 9852630 7158337 5240907 4049501 3419737 4539542 8116224 12587859
39306 12587859 15334035 15092405 12790229 10615561 10326933 11668606 12427384 10864050
39298 10864050 7965644 6345027 7107185 9016999 10762698 12668359 15690105 19694765
39290 19694765 23324827 25196127 25166656 24685933 25360535 26634098 25914211 22176533 18226485
39281 18226485 17325815 18447894 17698732 14339624 12107626 13492513 15793948 15051131
39273 15051131 11717013 9747681 11108052 13641476 14155177 11840126 8711055 7895570
39265 7895570 11125864 16701460 20379406 19608752 16572622 15786670 19020929 23913981
39257 23913981 27269482 28098357 27295393 25912181 24475104 23100038 21612881 19892664
39249 19892664 18205633 16798413 15331292 13322864 10969905 8870169 7190924 5825326
39241 5825326 4964354 4580331 3815272 2165469 959134 2056362 5020805 7288811 7585384
39232 7585384 7462261 8603837 10210023 10354343 8730078 6565828 4705919 3395361
39224 3395361 3368688 5278392 8014573 9323989 8684789 8333902 10733417 15874230 21680514
39215 21680514 26238980 28882653 29824499 29796601 29811406 30358422 30831601 30420573 29450149
39206 29450149 29006890 29244364 29089964 27937945 26482154 25095309 22532112 17782496
39198 17782496 12710248 10950527 13777316 18643706 22634163 25948459 30644638 36980420
39190 36980420 42816470 46377930 47840054 47846032 46023120 41928471 36546748 31712828
39182 31712828 28241443 25418649 22464587 19997102 19567378 21556251 23841315 23361244
39174 23361244 19431883 14843262 12937896 14173891 16488507 18338008 19825466 21163178
39166 21163178 22012457 22669327 23911931 24915879 23387989 19138168 15623630 15994274
39158 15994274 19097923 21717794 23537542 26917291 32196036 36539639 38098598 38307644
39150 38307644 38720100 38245629 35588817 32324660 30899515 30756458 29193711 25719374
39142 25719374 23002251 23176943 25302053 27116977 27588397 26933651 25661122 24647584
39134 24647584 24983969 26569933 27698056 27162526 26090939 26443796 28127127 28904071 27097370
39125 27097370 23203718 18736845 14661847 11413026 9427757 8817515 8948625 8987874 8642135
39116 8642135 8005885 7098531 6082040 5604949 6270420 7847853 9546092 10976772 12246167
39107 12246167 13116744 12882596 11493065 10218755 10529154 12513392 15068654 17640888
39099 17640888 20956661 25491096 29843547 31827992 31377275 31106078 32873035 34547408
39091 34547408 32008423 24606671 16803207 13199331 13301910 12958119 10129341 6985785
39083 6985785 6257672 7849377 10031359 12074469 14066669 15291007 14685050 12614597
39075 12614597 10663305 9585117 8631889 7114647 5677161 5603208 7328257 9857076
39067 9857076 11472898 11182879 9670467 8399222 7534692 5626699 2060343 -1240635
39059 -1240635 -2003927 -848143 -461714 -1568919 -1673118 1512603 7008114 11987231 15028988
39050 15028988 16659961 17404459 16749202 14139041 10177639 6502659 4503832 3997164
39042 3997164 3260981 915786 -2228734 -3891780 -2934640 -387013 2245453 4486598
39034 4486598 6164193 6447919 4754341 1909054 -703399 -2757674 -4795832 -6691505
39026 -6691505 -7271808 -5615373 -2286618 828166 2068688 1888429 2909582 6827876
39018 6827876 11194690 11270039 6186788 1298039 2206982 7680081 11167254 8947086 3851157
39009 3851157 425442 -605948 -1242346 -1790806 -499786 2682814 4560303 2145878
39001 2145878 -3418563 -7777472 -8090827 -5737102 -3902658 -3608930 -3429399 -2570801 -2219764
38992 -2219764 -3264683 -4508757 -4441608 -3405593 -2439248 -1196223 945940 2569143 1554124
38983 1554124 -1269146 -2217694 841249 5987489 9715183 10198651 7614201 3251099
38975 3251099 -618024 -1746880 -233826 1355915 1292516 774475 1523451 2847648 2936108
38966 2936108 1925843 1460765 1686990 942104 -1343449 -3319121 -2953054 -301366 3103436
38957 3103436 6059104 8090516 8778850 7668387 4821509 1049579 -2396947 -4247700
38949 -4247700 -3647606 -753208 2862684 4839972 3901487 1417519 416475 2338705
38941 2338705 5281941 6347048 5166727 3758985 3257084 2741794 1646600 1173082 2123403
38932 2123403 3111714 2675199 1944308 3254423 6776798 10477401 13183809 15825336 19403233
38923 19403233 23283141 26058440 27132715 27032920 26752471 26799678 26329501 23652781 18625416
38914 18625416 14073583 13268843 15885611 18064760 17051015 14315603 13086052 13936389
38906 13936389 14361767 12470622 9671491 9040648 11627061 15265055 17262358 17573535
38898 17573535 18451748 21169542 24401353 26477359 28045738 31165995 36380845 42307911
38890 42307911 48217341 55551944 66227975 80302416 96002763 111513651 125979257
38883 125979257 138782568 148404362 152638205 150452306 143510475 134961960 126250656 115872526
38875 115872526 102002581 85651136 70212090 58323220 50194942 44633926 40402133
38868 40402133 36521684 32435051 28305974 24531607 20818096 16390837 11293167 6938260
38860 6938260 5069531 6172510 8722727 10101990 8925216 6468979 4804939 3616352
38852 3616352 748675 -3556344 -5544091 -2843989 1795291 4183804 4092441 3778650 2918462
38843 2918462 -585534 -5284036 -6456301 -2588556 2592111 5930282 8732488 12937343
38835 12937343 17170683 19304468 19913580 20356552 20035354 18466573 17620493 18977709 20359519
38826 20359519 19079367 16380849 15080221 14497768 12087165 9179316 10250156 15965953
38818 15965953 21224137 21482877 17738636 13823249 11701153 11083744 11204894 11086344 9791461
38809 9791461 7994141 7918960 10614405 14783504 19253404 24749161 31891360 39256166
38801 39256166 45286213 50914730 58435240 68499486 79843452 91408970 103102084
38794 103102084 114533600 124231756 130277951 131210262 126630514 117524180 105661434 92278467
38786 92278467 77907462 63826763 52548030 45729895 42172289 39022042 34786849 30302204
38778 30302204 26941975 24809218 22749437 19440037 14364696 8322939 3214734 893853
38770 893853 1814234 4722821 7723225 9699502 10800550 11679783 12541549 13158102 13411134
38761 13411134 13007876 10889514 6382523 1329570 -816585 620798 1857748 -461920
38753 -461920 -4228069 -4846306 -2404887 -1819143 -5254902 -8541770 -7153271 -2358090 1368345
38744 1368345 2401593 2204251 1517760 26671 -1151237 -244800 2026593 3102030 2378167
38735 2378167 1569565 1292061 300367 -1511555 -2453444 -2214680 -2662528 -4172064 -4097668
38726 -4097668 -813953 3248968 4929240 4677659 5106328 6891592 8912666 11295155
38718 11295155 15295856 20559259 25181501 28385318 30667311 31477357 29650488 26566849
38710 26566849 25900893 29002206 33004803 34935748 35242990 35339144 34132240 30059742 25069316
38701 25069316 22909875 23560808 22768122 18037028 12196788 9373529 9749726 10618384 11030274
38692 11030274 12379923 14593249 14736760 10822282 5247053 2533523 4148828 7199723
38684 7199723 8339843 7360508 6026326 4651687 1726529 -3099717 -7538857 -9151614
38676 -9151614 -8070141 -5942646 -3166281 932676 5507557 8063154 7652910 6403607
38668 6403607 6642496 7855235 7928897 6344214 4370930 2703717 895936 -813150 -1029375
38659 -1029375 715012 2819614 3545074 3167746 3229707 4325712 5760758 7065637 8563628
38650 8563628 10139764 10522999 8697467 5630548 3601331 3638286 4446979 4367415 3642752
38641 3642752 3795878 5117904 5942007 4582495 1152416 -2646687 -4723697 -3725137 -269740
38632 -269740 2803284 2966975 1239769 1200152 4111366 7106238 7468452 6359294 6073177
38623 6073177 5742610 3046136 -1057333 -3043325 -2032034 -619592 -88706 1516509
38615 1516509 5255057 8564418 8666216 6132363 3008657 -333902 -4142621 -6941371
38607 -6941371 -6877993 -4449401 -1833456 -339711 -115185 -1147888 -2733435 -3167179 -1945195
38598 -1945195 -1086712 -2159792 -3267068 -1569617 2183026 4612243 4740319 4939470 6655774
38589 6655774 8178381 7532422 5141305 2537765 455361 -665713 -28440 2329455
38581 2329455 4813677 5745076 4774293 2432759 -592382 -3292844 -4649916 -4691960 -4357759
38572 -4357759 -4118105 -3749508 -3375280 -3351351 -3267253 -2757819 -3061344 -5418369 -7823161
38563 -7823161 -6382848 -976460 3424159 2972127 -113793 -1225245 318269 1719892
38555 1719892 1840634 2193817 3235815 3236791 1519376 -69218 -164463 -202230 -2190144 -5539190
38545 -5539190 -7650959 -7043170 -4775562 -3050467 -3143966 -4594710 -5965282 -6374467 -6331094
38536 -6331094 -6921215 -8297750 -9323832 -8676720 -6006400 -2097664 1740214 4387349
38528 4387349 5252350 4195199 1633315 -930764 -1274992 1353616 4675902 5656610 4472965
38519 4472965 4232995 6208350 7851927 7034381 5665492 6459697 8075852 6936011 2885648
38510 2885648 -690708 -2289888 -4049188 -7280220 -9723026 -8902353 -5542085 -1884891
38502 -1884891 1103894 3077429 3088242 1256223 -88762 668914 1631555 -38951 -3566373
38493 -3566373 -5052092 -2364790 2470263 5850736 5973658 3528608 402514 -1909780
38485 -1909780 -3228791 -4083174 -4257553 -3080770 -1520699 -2109236 -5490426 -8936571 -10222356
38476 -10222356 -11088509 -14147921 -17951377 -18723385 -16285817 -14290549 -14347348 -13924901 -11184459
38467 -11184459 -8077934 -6698362 -5917801 -4266052 -3353744 -5177326 -7876243 -7663914
38459 -7663914 -4223632 -1126191 -1064352 -3277295 -5784753 -7762986 -9114154 -9506168 -8646817
38450 -8646817 -6516823 -3098051 1178316 4780910 6050036 4949544 2933743 1136749
38442 1136749 -379157 -1783326 -3020396 -4210945 -5567519 -6888743 -7803732 -8235291
38434 -8235291 -7998928 -6662402 -4752052 -4138108 -5727601 -7563344 -7028795 -4350850 -1843633
38425 -1843633 -113993 2403640 5913956 7977333 6888282 4257757 2786143 2883995
38417 2883995 2841109 1366120 -1123522 -3048279 -2909769 -829906 847411 -322083 -3828374
38408 -3828374 -6693858 -7418403 -7679588 -9273433 -11191897 -11176763 -8887860 -6065553 -4425498
38399 -4425498 -4595081 -6327721 -8624381 -10182034 -10477239 -9899282 -8685059 -6872545 -5377184
38390 -5377184 -5340611 -6032004 -5511937 -4016006 -4107346 -6283642 -7312563 -4932982 -1446059
38381 -1446059 55583 537526 2780761 6325351 8553206 9518982 11440719 13694946
38373 13694946 12503004 6348520 -1566213 -7126467 -8911455 -7517068 -4146333 -814473
38365 -814473 413802 -626800 -2629012 -5130128 -8191581 -10114705 -8605581 -4582667
38357 -4582667 -1718571 -1562416 -2190297 -2251979 -2705583 -3440641 -2237024 838996 1881942
38348 1881942 -1050677 -3891559 -1943799 3131332 5590852 3362552 -168485 -1257363
38340 -1257363 680041 4177531 7235907 7727352 4899666 776277 -1734363 -1958139
38332 -1958139 -1182637 -148507 1088873 1566409 209131 -1960944 -2690099 -1617562 -601635
38323 -601635 -969394 -2250484 -3495933 -4063589 -3370618 -1788642 -1480869 -4205622 -8389609
38314 -8389609 -10539947 -9558126 -7486914 -6076090 -5251771 -5352473 -7866340 -12434628 -15427277
38305 -15427277 -13645945 -8410807 -4262377 -3981427 -6009790 -6714770 -4576865 -1886328
38297 -1886328 -2061604 -5429211 -8859271 -10189070 -11183468 -14216317 -17579908 -17097755 -11941925
38288 -11941925 -5849667 -2448768 -2183321 -4013778 -6905897 -8844807 -7657355 -4267107
38280 -4267107 -2284401 -2911688 -3280860 -1631382 -724370 -3205880 -6504915 -6150502 -2338303
38271 -2338303 692045 763776 -527821 -1634808 -2747832 -3515490 -2645184 -540169 671563
38262 671563 552909 954535 2333513 2557758 859087 -37644 1965658 4524653 4031382
38253 4031382 1033115 -588624 877037 3244828 4166573 3835558 3362690 2858227 2334888
38244 2334888 2731481 4510994 6310184 6436251 5133108 4121465 4190171 4313776 3106825
38235 3106825 421225 -2379973 -3223099 -885532 3411833 6461737 6264606 4472461
38227 4472461 4307529 6207574 7324932 5787407 3510898 3473114 5650001 7431195 7263719
38218 7263719 6055419 5298701 5582109 6984079 9196820 10817010 10065232 7024282 4018376
38209 4018376 2912387 2987484 2435742 1091763 381727 961488 1849033 2152062 2420951
38200 2420951 3440235 4391829 3471699 475854 -2285877 -2410668 -201191 1777789 1569251
38191 1569251 -728220 -4029899 -7233827 -8875466 -7611216 -4187062 -1577637 -1602279
38183 -1602279 -2251729 -121806 4861612 8928578 8875133 5530861 2289228 1240341 1568751
38174 1568751 1404823 506565 534015 2476500 4665721 4727584 3153070 2712165 3848030
38165 3848030 3414858 -373248 -4462859 -5107190 -3211954 -2138573 -2058996 -794039 820677
38156 820677 -521217 -4475661 -6628684 -5624458 -5844685 -10432450 -15818934 -16557769 -12460211
38147 -12460211 -7399933 -3509030 -290880 2220791 3214718 3322255 4057421 5448178
38139 5448178 6552309 7629754 9545159 11716288 12800954 12764520 12431656 11956215 11503560
38130 11503560 12000626 13082905 12061867 7737594 3580807 3642001 6460364 6935912 3684024
38121 3684024 335606 -693103 -1487123 -4476875 -8580693 -11266593 -11832064 -11069550 -9839142
38112 -9839142 -9230246 -10115036 -11513354 -11392978 -9791543 -8749480 -8406064 -6143259 -1067897
38103 -1067897 3638851 5004551 4301445 4234478 4393016 2741553 184404 62321 3309410
38094 3309410 7115627 8800252 8587345 7867613 6845508 5202028 3800335 4226034 6791190
38085 6791190 9818999 11100178 9791709 6746955 3230525 -94461 -2685273 -3544717
38077 -3544717 -2285210 -435441 -288195 -2254238 -4552556 -5702938 -5927662 -5662985 -4268018
38068 -4268018 -1247935 2334832 4740696 5161960 3822845 1478344 -359219 227539
38060 227539 3701179 8033929 10483123 10077645 7833869 5303593 3758386 4076213 6239435
38051 6239435 9042958 10998117 11454087 10590192 8826317 6647042 4496533 2491003
38043 2491003 723314 -104119 699194 2345786 2956974 1976680 958913 1149853 1567834
38034 1567834 719945 -749784 -635367 1968149 5566468 7910399 7955525 6453211 5341949
38025 5341949 6358300 9612336 13507524 16131915 16391324 14023933 9573084 4584739
38017 4584739 782226 -1335588 -2241103 -1895488 -100936 1648537 1003472 -1642672 -2728583
38008 -2728583 -309815 2809611 2869182 377057 -1042122 86455 1786677 2220625 1895391
37999 1895391 1964055 2469568 2942414 3294597 3592727 3914809 4580026 5707323 6762987
37990 6762987 7396928 8214580 9709217 11168143 11904517 12663335 14108615 14785417 12820458
37981 12820458 9279423 7471510 8762240 11140514 12119654 10995230 8045521 3918975
37973 3918975 579586 533466 3716400 6779048 6788722 4385951 2219758 1630309 2127146
37964 2127146 2891308 3282297 2713232 1515986 1378472 3495232 6586598 8195088 8069929
37955 8069929 8935983 13136765 19198546 22814045 21498409 17513942 15326336 16480854
37947 16480854 18338590 18218586 17089582 17668235 19987848 21034321 18747712 14537999
37939 14537999 11346014 10519973 11112226 11299612 10135485 8589542 8800807 11485906 14449575
37930 14449575 14854078 12595891 9947733 8199443 6585776 4574946 3062434 2707291
37922 2707291 3028257 3961666 6482046 10552983 13945767 14341927 11723519 8033469 5511761
37913 5511761 5636707 8096431 10277738 9554556 6763909 5460274 6944883 8433920
37905 8433920 7488092 5643287 5475591 6404571 6333096 5816784 7311477 11035169 14684966
37896 14684966 17035830 18997329 21111996 22800166 24480732 27884329 33631886 40821179
37888 40821179 49634991 61740883 76712816 90243086 97846456 99067990 96412376 91325004
37880 91325004 83265998 72335843 60867173 51832978 46489423 43865035 42017167 39522031
37872 39522031 36029284 31811151 27330679 23585851 22189920 23851629 26699095 27482504
37864 27482504 25191834 22454179 22290167 24209381 24893708 22580884 19280375 17976304
37856 17976304 18611970 18073075 14167298 8634916 5511859 6823839 10618449 13235998
37848 13235998 12743404 9918524 6889998 5705588 7464186 11366138 14618013 14663172
37840 14663172 11955230 9386905 8458074 7375748 4092693 26484 -1204353 1495056
37832 1495056 5217334 6814107 6427392 6211985 6914572 7318142 6397535 4397106 1995212
37823 1995212 -107647 -888860 32005 957734 -493778 -3915311 -5926564 -4621619 -2359349
37814 -2359349 -2317157 -3778405 -3306471 112133 3714524 4841060 3899437 2930041 3038697
37805 3038697 3887400 4287333 2856661 -521697 -3629405 -3816931 -1194247 1717226 3514952
37796 3514952 4861936 5681387 4372631 1079817 -1107540 -261477 1420579 1096993 -337536
37787 -337536 -70253 2082312 3929534 4553358 4687763 4326768 3118717 2620995 4793469
37778 4793469 8221143 9193507 7091939 5466728 6678896 8439916 7277131 3038011
37770 3038011 -1820314 -5533809 -7873485 -9124142 -9759534 -10084247 -9303671 -6407214 -2717704
37761 -2717704 -1386818 -2893072 -3283965 797809 6980246 9666189 6637658 571304
37753 571304 -5232352 -9599107 -11952457 -11181491 -7378486 -2762168 535797 2463879
37745 2463879 3920901 4899487 4931965 4356174 3631397 1864833 -2364535 -8436567 -13247606
37736 -13247606 -14230146 -12211389 -10306167 -10194991 -10635185 -9905942 -8371993 -7448566 -6915296
37727 -6915296 -5093071 -1732883 1021200 1216968 -708197 -3045876 -4760670 -5347349
37719 -5347349 -4276038 -2244721 -1825242 -4642564 -8323179 -8559525 -4486184 87051
37711 87051 1469479 122224 -1280390 -1985274 -3273148 -5209473 -5520390 -2238882 3730342
37702 3730342 9304469 11960348 11570899 10040499 9367480 9803435 9911608 8606770 6679518
37693 6679518 5649820 5580577 5253483 4492977 4745562 6603090 8178018 7409299 5139873
37684 5139873 4100696 5045113 5785999 4513281 2332153 1503045 2522610 4301557 6251312
37675 6251312 8488614 10298885 10109080 7416673 3712597 1082554 516928 1593534
37667 1593534 2903733 2680584 142997 -3246439 -4793169 -3570516 -1714709 -1917484
37659 -1917484 -4155786 -5856153 -5048449 -2342032 338360 2029326 3167284 4292060
37651 4292060 5156946 5309837 5070311 5408414 6786409 8451855 9136705 8316790 6523906
37642 6523906 4539169 2695198 1070865 -61816 -439943 -423470 -1000709 -2850066 -5382058
37633 -5382058 -6932340 -6132610 -3192412 181418 2243406 2820504 3560084 6154171 9848724
37624 9848724 11262887 7941863 2071316 -1135526 393631 2931981 2175201 -770529
37616 -770529 -1542194 597611 2101611 1512860 2012288 5790840 9845486 10302074 7795274
37607 7795274 5186335 2661118 -871832 -3654541 -3079033 -686909 -337192 -1766209
37599 -1766209 -919961 2939892 5491160 3953166 738436 -1241902 -2353252 -3025502
37591 -3025502 -1359205 2784987 5386547 3984536 2399367 5111242 9521767 9016723
37583 9016723 2386783 -4891742 -8357925 -8770372 -8338302 -7287227 -5431267 -3574054
37575 -3574054 -1821448 811005 3966325 5601991 5042697 3932890 3226488 1817986
37567 1817986 -640617 -2178340 -1433129 106308 657674 946769 2272570 3424925 2248385
37558 2248385 -346555 -529335 3818193 10195754 13862472 12323742 7079310 1593174
37550 1593174 -1730818 -2532247 -1353821 1128026 3448163 3560664 1186126 -1104396
37542 -1104396 -1020487 62146 -764433 -2910101 -2467184 2119020 7696112 10992171 12618727
37533 12618727 14545927 16236328 16030321 14542436 13675887 13288197 11698654 9029634
37525 9029634 7466804 8362654 11270883 15549963 20637521 25002393 27399514 29316895
37517 29316895 33669106 40716593 47848579 53972776 61338119 71970555 85205970 100528731
37509 100528731 120264054 147199773 181754767 223866826 274930228 333659687 391131089
37502 391131089 434396766 455644643 454881095 434393530 395934031 345141084 293430112
37495 293430112 250626248 217485812 188919014 162765978 141428849 126012763 113671818
37488 113671818 101661859 90413004 81137889 73110250 64864962 56092770 47154402 38606966
37480 38606966 32128403 29594632 29851685 28669858 23730214 17705417 14449757 14078949
37472 14078949 14182470 14102611 14947481 16353569 16463346 15069897 14099142 14670539 15788553
37463 15788553 16080824 14880807 11681278 6717972 2149149 321389 609375 384301
37455 384301 -538975 707282 5156610 9434700 10117122 8423836 8016260 9576807 10416243
37446 10416243 8948755 6799396 6026275 6450047 6756107 6639290 6426961 5575359 3381609
37437 3381609 1039157 928489 2932902 3371807 -225262 -4419084 -3074595 4544956
37429 4544956 12256776 14789805 13676735 12926517 12345669 9402707 5415617 4488976 6769259
37420 6769259 8085000 7065019 7469170 11439192 14997644 13333688 7180073 730694
37412 730694 -3989298 -7202850 -8051833 -5135823 477688 6025989 10484774 14693570
37404 14693570 18521476 20449036 19971607 18377042 16960200 15835566 14348870 11582236
37396 11582236 7022027 1781823 -1721222 -2469378 -2183934 -2808841 -4020298 -4588635 -4507877
37387 -4507877 -3946270 -1914694 1569459 3596701 1611844 -2494174 -4550800 -3619830
37379 -3619830 -2255243 -1819244 -991092 927008 2574247 3174722 3808817 5137255 6290226
37370 6290226 6903312 7960756 9603100 10164817 8552778 5998562 4528811 4973580 6930588
37361 6930588 9300437 10661523 10637457 10769954 12158886 12659413 9201674 3009582 -776464
37352 -776464 274389 2681549 2039916 -1543847 -4964386 -6631274 -7040029 -6574121 -5258018
37343 -5258018 -3800286 -2948097 -2465153 -2043573 -2193360 -2997862 -3287736 -2469668 -1881103
37334 -1881103 -2833678 -4632834 -6134523 -7825885 -10367134 -12307053 -11645544 -9081155
37326 -9081155 -7461211 -8127173 -9621755 -9959948 -8607319 -6248531 -3992806 -2821004
37318 -2821004 -2723385 -2540619 -1538847 -569158 -583082 -813707 24157 1372269 1532861
37309 1532861 438027 -334673 -517828 -2017329 -5796910 -9419887 -9268514 -4775737 837774
37300 837774 4234248 5392435 6594271 8551224 9190686 7043329 4221157 4005731 6259866
37291 6259866 7792133 7194817 6348105 6414240 5646365 3056469 1242103 2657737 5269944
37282 5269944 5281383 2768478 1128069 1740871 2787895 3176075 3980984 5367216 5401176
37273 5401176 3250530 979629 657460 1619094 1973551 1266165 400461 158214 800600
37264 800600 2091590 3011617 2438555 476973 -1997587 -5059124 -9265453 -13409511 -15058755
37255 -15058755 -14061417 -13153383 -13802773 -13663120 -9960833 -3664372 1706048 4065850 3592293
37246 3592293 868313 -3332456 -6968518 -7888104 -6357587 -4796828 -4797725 -5772298 -6627614
37237 -6627614 -7295541 -8178246 -9244052 -10190065 -10668573 -10015830 -7651287 -4252641 -1736372
37228 -1736372 -1289952 -1860945 -1472302 55406 711868 -845236 -2926910 -2631530 141402
37219 141402 2187042 1194009 -1206194 -2001614 -921769 176070 959565 2708709 4938641
37210 4938641 5188427 2965765 842104 258844 -762154 -3758270 -6626170 -7068859 -6609562
37201 -6609562 -7466716 -7413554 -2472114 5810212 10756959 9281984 5805436 5360520 6633233
37192 6633233 5162992 784132 -2313024 -2080300 -1130036 -2001927 -3117500 -1455705 2504459
37183 2504459 4936941 3502191 48979 -2125619 -2213293 -1833574 -2065599 -2511400 -3191953
37174 -3191953 -5090357 -7870540 -9084836 -7323193 -4547775 -3225193 -2551008 -219240
37166 -219240 3082154 4394215 3568373 3792104 6061882 6937070 3965867 83007 -533403
37157 -533403 1310163 1365291 -1483094 -3836112 -2865387 328260 2913577 3407593 1885809
37148 1885809 -872176 -3610920 -5298267 -6054769 -6436107 -6106438 -4656676 -3228259 -3317101
37139 -3317101 -4190427 -3682647 -1473477 799096 2576973 4567297 5637176 3191258
37131 3191258 -2003938 -5047378 -3335323 -548113 -1130248 -3577658 -3150548 634650
37123 634650 3706739 3938051 3541558 4609839 6188285 6919494 7356408 8096126 8068752
37114 8068752 6238191 3309207 799819 17271 2188063 7155616 11425381 10584842
37106 10584842 5101348 777036 1425110 3871811 2901087 -1282103 -3963411 -2725859
37098 -2725859 372477 2819317 4213272 4530569 3110014 561347 -583855 1472316
37090 1472316 5637174 9081108 9623187 6985517 3009957 586938 875020 1676376 251617
37081 251617 -2507721 -3056577 -579858 1346798 -345209 -4095972 -6284671 -5978928 -4932134
37072 -4932134 -4192103 -3171790 -1595448 -179075 707885 1451683 2190411 2768038 3688853
37063 3688853 5680699 8108717 9247675 8643853 7959436 8674992 9922970 9679056 7626875
37054 7626875 5659305 5320308 5561095 3744307 -1166568 -6951980 -10080147 -9211901 -6368405
37045 -6368405 -4555552 -4709009 -5297903 -4508959 -2196204 273133 1538982 1376675 566543
37036 566543 -116880 -726869 -1877597 -3661475 -5172896 -5463089 -4758764 -4156922 -4027702
37027 -4027702 -3359584 -1196856 1635432 2987201 1688901 -1101851 -3028424 -2543322
37019 -2543322 319467 4341761 7673905 8783443 7976114 7557300 9200552 11402850
37011 11402850 11145758 8120017 5292137 4600550 4259878 1824396 -2023144 -4935040
37003 -4935040 -6679195 -8721671 -10778171 -10756709 -8225754 -5221645 -3121428 -1274878
36995 -1274878 518303 839726 -665492 -1766991 -630536 1450356 2165908 1569808 1413649
36986 1413649 2243541 3084444 3215200 2583700 1242073 -133177 -213921 810831 359823
36977 359823 -2963207 -6080806 -4731157 357473 3806394 2525225 -729108 -1753682
36969 -1753682 -43467 2114414 3313680 3566227 2716587 647104 -1663626 -3157080
36961 -3157080 -4204942 -5430093 -5645072 -3005623 1813646 5543003 5952445 4096603
36953 4096603 2294564 1194138 -149777 -2166246 -3973322 -4516127 -3655648 -2071090
36945 -2071090 -593496 296408 608571 481504 -427680 -2813515 -6505313 -9679638 -10131406
36936 -10131406 -7589162 -4242751 -2689883 -3725440 -6226858 -8482588 -9188386 -7882370
36928 -7882370 -5308362 -3104455 -2413194 -2973311 -4057549 -5628407 -7516671 -8097345 -5574565
36919 -5574565 -779539 3004625 3726215 2728366 2440406 3282572 4072489 4386156 4904360
36910 4904360 5868384 6626194 6673904 6136857 5255268 4152354 2961963 1561187 -477112
36901 -477112 -2982214 -4689481 -4497204 -2910952 -1474006 -1075101 -1480653 -2093108 -2480322
36892 -2480322 -2624743 -3156399 -4528192 -5519143 -4122980 -1054648 -440873 -4780454 -10713051
36883 -10713051 -12787383 -10610050 -8733244 -9402174 -9344548 -5294384 549650 3115510
36875 3115510 635803 -4065051 -7266442 -7328132 -4808392 -1524791 626684 997903 219183
36866 219183 -1262496 -3574627 -5948623 -6509643 -4611967 -1967693 -256197 997190
36858 997190 2829398 4540701 4575257 2555012 -963445 -5361541 -9039647 -9414201 -6134932
36849 -6134932 -2822994 -2916888 -5016987 -5420249 -4201908 -4840604 -7879266 -9281208 -6486355
36840 -6486355 -2467882 -1504204 -3511485 -4970478 -3655721 -212431 3585789 6081065
36832 6081065 6282870 5003258 4589237 6031953 7352117 6281928 3274578 187170
36824 187170 -2551891 -5227365 -6582829 -5121043 -2057622 -79025 663393 2303712
36816 2303712 4832677 5344542 2858343 576459 1119131 2136007 -372949 -5952092
36808 -5952092 -10033925 -9742318 -6479696 -2861650 64194 1948179 2111219 835874
36800 835874 -5795 853618 2239491 2112254 215263 -1898306 -2765797 -1917083 391818
36791 391818 3092909 4415321 3443221 1536882 1089269 2767705 4905933 5683614 4931325
36782 4931325 3575332 2297934 1328390 996261 1927970 4729913 9330657 14255177 16983447
36773 16983447 16057142 12815719 9973587 8412998 6722927 4172671 2271680 2210329
36765 2210329 2496348 1215787 -436266 422613 3490605 4723260 1820008 -2090706
36757 -2090706 -2338236 1135912 3956469 3126426 137521 -2043907 -2646650 -2500047 -1790395
36748 -1790395 -537640 -208323 -2305695 -5393063 -6001859 -3385399 -1259569 -3200844
36740 -3200844 -7845758 -10784791 -10365446 -9135961 -9541186 -10728617 -10534609 -8450574 -5040495
36731 -5040495 -178036 5855162 10453434 10540731 6602584 2730551 1960120 3392830 4825466
36722 4825466 6151654 8219784 9801212 8537322 4820000 2046534 2107899 2861757 1665960
36713 1665960 -395337 -146572 2783245 5412072 5820597 5483699 6187386 6840306 5188967
36704 5188967 1417120 -1922562 -3039324 -2351320 -1146975 -354204 -524638 -1530116 -2100280
36695 -2100280 -931615 1548653 3681028 4896518 6133489 7670893 8192835 6852394
36687 6852394 4866382 3856805 3607157 2763959 1045973 -663509 -2056594 -3746125
36679 -3746125 -5720382 -6687766 -5522464 -2652386 514760 3076225 5006323 6339660
36671 6339660 6733628 6147701 5471925 5734715 6605145 6457952 4483267 2149137 1698244
36662 1698244 3457049 5573337 6369476 6005047 5682040 6090465 6863711 6827005 4743431
36653 4743431 765760 -2792100 -3366424 -1184897 851806 830559 -45389 157404 1092433
36644 1092433 1036775 -218793 -1273710 -1605136 -2326250 -4124680 -5935431 -6543301 -6630487
36635 -6630487 -8029050 -10882495 -12519569 -10065555 -4043934 1703806 4173840 4166027 4149386
36626 4149386 4542129 4148573 3379323 4040198 5686829 5349392 2119579 -915569 -1267302
36617 -1267302 -922526 -2954892 -6379744 -7673410 -6117756 -4112106 -2712684 -529645
36609 -529645 2515679 3757600 1573510 -1777519 -2805425 -877525 1655150 2389757
36601 2389757 824181 -1918500 -4361480 -5835180 -6699810 -7379384 -7565557 -6811502 -5281904
36592 -5281904 -3228393 -552265 2239955 3838283 4220155 5524930 8844138 11515115
36584 11515115 10373870 6746868 4839306 5464319 5172017 2184671 -754690 -1114287
36576 -1114287 -607359 -1910216 -3990459 -3745483 -769511 2313341 3474599 2934594 1689701
36567 1689701 326702 -931761 -2400874 -4750948 -7506208 -8473034 -6127746 -2115432
36559 -2115432 45939 -1344785 -4687032 -6984361 -6481842 -3858826 -1542950 -1436334
36551 -1436334 -2844461 -3286679 -1662231 481555 1348196 1146912 972995 837453 313408
36542 313408 194929 1841096 5215433 8871056 11683040 13589203 14801598 15122619 13994516
36533 13994516 10861654 5837376 241027 -4094909 -6217590 -6153598 -3917374 272583
36525 272583 4850673 7619548 7880327 6385809 3408666 -867742 -4163234 -3636297 -527558
36516 -527558 255301 -3043163 -6170362 -5378643 -3215881 -4092310 -7057105 -7734072 -5607402
36507 -5607402 -4174846 -4406531 -3191098 987103 5191822 6217251 4248436 1171463
36499 1171463 -1680822 -3011305 -1942341 -326080 -1718899 -6407903 -10218212 -10093593
36491 -10093593 -8091954 -7478488 -7462782 -5145657 -1158309 376081 -2488475 -6884176
36483 -6884176 -8906485 -7800223 -5323952 -2784908 -467778 889538 200661 -1954492
36475 -1954492 -3073816 -1721072 245422 25683 -2165549 -3527666 -2875245 -1876873 -1634305
36466 -1634305 -1044028 -64946 -1451712 -6379979 -10821978 -9987243 -4882150 -549384 1225199
36457 1225199 2981052 5442854 5264323 620976 -4933272 -6860953 -5301393 -3820137
36449 -3820137 -4360132 -5816588 -6384064 -5149518 -2065526 1837607 4510628 4530808 2702718
36440 2702718 1282752 1692431 3399204 4908207 5569950 6166964 7325231 7753556 5607664
36431 5607664 1877971 113735 1475973 2636260 879534 -1363567 -496540 2071406
36423 2071406 2248590 232148 -80810 1852798 2303090 -59282 -1952270 -1179450 544949
36414 544949 1975854 4403738 7418398 7837671 5351036 4079150 5636656 5963386 2571918
36405 2571918 -552474 176975 1404497 -1322765 -5745924 -7163800 -6586830 -7681457
36397 -7681457 -8697578 -5245457 488583 1215394 -4793567 -11555788 -14449827 -14899129
36389 -14899129 -15004235 -13846764 -11039019 -8578369 -7153181 -5177086 -2969499 -3143758
36381 -3143758 -5325439 -5497375 -2583701 -717191 -2516327 -5014203 -5345918 -5776994 -9037091
36372 -9037091 -12434515 -11273528 -5923075 -1409658 -1227683 -4530971 -8144194 -8905743
36364 -8905743 -5566862 -670719 1050461 -1818357 -5372541 -5857661 -4686667 -5389672
36356 -5389672 -7996533 -9787437 -9809007 -9085824 -7608435 -4763577 -2122760 -2263673 -4752664
36347 -4752664 -6267289 -5046138 -2807008 -1948070 -2914205 -4583200 -5493424 -4598211 -2369652
36338 -2369652 -1001047 -1981055 -3875469 -4231665 -3143326 -2827183 -3988228 -4991953 -4819497
36329 -4819497 -4510321 -5007040 -5559454 -5220006 -4413929 -4075149 -4317250 -4640989 -4429243
36320 -4429243 -2707863 1388869 7076994 11723728 13047727 11032876 7235472 3040142
36312 3040142 -654820 -2847984 -2883636 -1557683 -764473 -1536476 -2969841 -3591269 -3240922
36303 -3240922 -2651104 -1438234 1833593 6733481 9571156 6852721 -172344 -6121563
36295 -6121563 -6740625 -2216929 4440522 10176365 12692572 10984882 6669258 3263719
36287 3263719 2612133 3061187 2328335 790749 351094 1254153 2033504 2028828 2050695 2676395
36277 2676395 3455270 3849260 3688139 2609627 141436 -3416417 -6800316 -8473410 -7280514
36268 -7280514 -3157066 2037087 5082560 3987010 -11442 -3594972 -4312310 -2183943
36260 -2183943 828141 2416791 1779163 436886 492840 1877777 2601207 1997929 1795512
36251 1795512 3096156 4474488 4605553 4672990 6066258 7575534 7469393 6852276 8036152
36242 8036152 10635799 12302374 12525928 12477197 11629870 8217717 3243793 388345 1042468
36233 1042468 2627029 2797475 2023908 709872 -2629928 -7945195 -11509576 -10440723
36225 -10440723 -7362342 -7194509 -10403864 -12664661 -10782393 -5916179 -799449 3322458
36217 3322458 6086233 6815433 5649471 4530371 5334574 7435303 8368592 6813892 3926506
36208 3926506 1653196 686643 500053 543174 498549 -177036 -1732559 -3057928 -2382089
36199 -2382089 437126 3423033 5010600 5902188 7275107 8306562 7293710 4670322
36191 4670322 2877276 3143297 4215053 4665586 4721320 5045605 5258132 4836224 4453314
36182 4453314 5137934 6577404 7335450 6634121 5108599 3689969 2353301 480387 -1583659
36173 -1583659 -2030541 492389 4583959 6955413 6142598 4205332 3907129 5438815 7115915
36164 7115915 7966508 7838068 6084009 2498324 -1027984 -2281323 -2016469 -3009577 -5733947
36155 -5733947 -7595648 -7003869 -5589667 -5317082 -5663620 -5047494 -3328361 -1653604 -1171558
36146 -1171558 -2587975 -5356018 -6850689 -4610817 -226738 1574332 -952462 -3998471
36138 -3998471 -3530076 -500115 1691048 2408585 3208914 3870365 2706364 38034 -2130386
36129 -2130386 -3632406 -6015143 -8734842 -8738702 -4726628 832115 4991473 7320047 8442476
36120 8442476 7871887 5192643 2052147 1037452 2940222 6312038 9378194 11388478
36112 11388478 12258970 11850217 10030786 7263912 4789278 3798958 4213735 4628096 3834321
36103 3834321 2111974 702897 439164 1220494 2249925 2385731 1065188 -580054 -593365
36094 -593365 969466 1355630 -1284183 -4748146 -5247099 -2375447 619730 1355495 679837
36085 679837 93248 -775910 -2826123 -5369527 -7056175 -8017349 -9516411 -11645134 -12489451
36076 -12489451 -9925329 -4022612 2403273 5914297 5616351 4001262 3982582 5453709
36068 5453709 5878634 4041933 1566041 294808 -162151 -1221002 -2970571 -4495210
36060 -4495210 -5751482 -7391395 -8807349 -8074345 -4618256 -799651 493909 -428682
36052 -428682 -177121 3251263 7326399 7923688 5065171 3551663 6885447 12428163 14649578
36043 14649578 12191069 9129621 9199157 11424751 12653417 12229863 12027626 12874999 13245236
36034 13245236 11584760 8246392 4656631 1848729 376921 445429 1133258 414090 -2712926
36025 -2712926 -6518041 -8285234 -7538005 -6039666 -4733150 -2875577 -864587 -1291039
36017 -1291039 -5149896 -9117452 -9536324 -7733240 -7879836 -10331625 -11352730 -9819549
36009 -9819549 -9481096 -12591991 -15557372 -14115901 -9573003 -6139498 -4611235 -2906896
36001 -2906896 -1172033 -1739313 -4497193 -6490535 -6378986 -5774253 -5811975 -5679788 -5051292
35992 -5051292 -4934402 -5489750 -5727838 -5742069 -6463943 -7012865 -5400918 -2151346 190913
35983 190913 1539871 4344749 8370114 9861515 7770507 6449181 9353359 13871237
35975 13871237 15675767 14826954 13871286 12904466 10749550 8669151 8358395 7900605 4364029
35966 4364029 -611362 -2518936 -862607 359574 -683492 -1118532 1376104 4864892
35958 4864892 6445928 5931806 4453468 2362345 494887 792610 3215946 4110776 290263
35949 290263 -6488621 -11417185 -12146227 -10391087 -8748618 -8042132 -7728887 -7123634 -5801292
35940 -5801292 -3922419 -2547947 -2906017 -5050171 -7642557 -9152167 -9002354 -7634600
35932 -7634600 -5783367 -3767830 -1515425 601341 1289801 -513892 -3878600 -6144930
35924 -6144930 -5593821 -3340606 -1936948 -2511306 -4061075 -5243725 -5691966 -5252839 -3146842
35915 -3146842 850278 4756403 5445454 2004397 -2922330 -5943871 -6318718 -5666313 -5250279
35906 -5250279 -5100544 -5254760 -5854860 -5972203 -4456677 -2501798 -3222132 -7540109 -12304134
35897 -12304134 -13850020 -11828137 -8122208 -3870527 314174 2710396 1883773 -736003
35889 -736003 -2062644 -1086733 494681 1165051 1139310 1110591 1400169 2442633 4272640
35880 4272640 5431364 4327471 1991518 1506781 4052224 7262633 8378171 7521649
35872 7521649 6784986 7154077 7512492 6295924 3390415 347788 -1279677 -1815258 -3023395
35863 -3023395 -5480999 -7547437 -7861221 -7472513 -7917217 -8460703 -7375752 -4977707 -2978911
35854 -2978911 -1562349 265331 1944385 1888027 510575 -260009 -414897 -1594053 -3280130
35845 -3280130 -2850868 -32969 2371757 3155593 4257400 6282977 6543039 3673867 361746
35836 361746 -1085295 -2120417 -3965977 -4182214 -1201963 1178111 -1245776 -6067079
35828 -6067079 -7410526 -4526664 -1900815 -1520135 -548950 2802033 6124589 7022636 6518711
35819 6518711 6519614 6895787 6634828 5598325 4151194 3113449 4322894 8626454 13144348
35810 13144348 13716325 10652691 8679744 10198668 12131687 10983244 7514372 4211756
35802 4211756 1330778 -1746086 -3788923 -3465305 -2052638 -1592558 -1782680 -1309626 -764906
35793 -764906 -1284862 -1489067 833990 4339402 4789080 767315 -3893791 -4554572 -898418
35784 -898418 3420476 4947007 3099973 -564902 -4462890 -7905674 -10279348 -10322172 -7455184
35775 -7455184 -3743455 -2780845 -5583581 -8829491 -8511518 -4508826 -252982 1375643
35767 1375643 402731 -1403238 -2545933 -2783624 -3084455 -4320754 -5502036 -4468294 -1343020
35758 -1343020 356528 -1979782 -6035529 -7468139 -5828727 -4319081 -4022259 -2430525
35750 -2430525 1199808 3046035 -8903 -5133325 -6998272 -4832020 -2372306 -1420035
35742 -1420035 559137 5383440 10067728 10268776 6168561 2283378 1673018 2552507 1371185
35733 1371185 -2288922 -5338661 -5244062 -2928617 -1008031 -187123 1157728 3869169 6121956
35724 6121956 5793448 3782275 3154211 4868616 6181390 4413638 970428 -269637
35716 -269637 1859512 4350069 4238469 2279102 992349 582108 -908906 -3809480 -5684323
35707 -5684323 -4760158 -2575485 -1787562 -2515579 -2546408 -734487 1394798 1572782 -914121
35698 -914121 -5183431 -9855254 -13383667 -14084653 -11209472 -6346692 -2920851 -3376003 -6775764
35689 -6775764 -9737523 -9931141 -8154717 -6724892 -6625231 -7055656 -7146893 -6760180 -5678906
35680 -5678906 -3523113 -989188 126859 -903689 -2370743 -1888880 904756 4105136
35672 4105136 5580292 4750729 2837077 1761766 2254157 2907993 2128167 1063264 2666075
35663 2666075 6948703 9524099 7062196 2380287 1047153 3870045 6263799 5100004
35655 5100004 2486216 1556625 1832140 959278 -1375272 -3912444 -6666369 -10570729 -14930487
35646 -14930487 -17624711 -17748469 -16129115 -13237140 -8520271 -2323692 3075264 5316615
35638 5316615 4190739 1440013 -1251356 -3555753 -5796753 -7284531 -6121133 -1538767
35630 -1538767 3937662 6330271 4790478 2724678 3230062 5028316 4759997 2052134
35622 2052134 -117329 417341 2932221 5857705 8462241 10049611 9742281 7913025
35614 7913025 5974242 4003535 547751 -4318691 -7928438 -8435999 -7311706 -6727269
35606 -6727269 -6416290 -5351063 -4757813 -6485328 -9310723 -9985941 -7757077 -4935653 -2897523
35597 -2897523 -590716 2298442 3797515 2783884 1099529 608114 248848 -1723242
35589 -1723242 -4182078 -4360236 -1752052 1529424 3735411 4649370 4200140 2214352 -396534
35580 -396534 -2232402 -3340457 -4667954 -5546782 -3994314 -38493 3517937 4583900
35572 4583900 3947101 2874621 854456 -2439324 -4948477 -4595940 -2727745 -2490709 -4187516
35563 -4187516 -4883124 -2853918 34045 1267894 1023263 1188665 2304045 2975759 1915701
35554 1915701 -572725 -3168447 -4916498 -5808294 -6228093 -6228727 -5799420 -5707499 -7017066
35545 -7017066 -9148071 -9493992 -6311149 -1382146 1762864 2062117 1794980 3291415 6454272
35536 6454272 9763552 11959990 12160749 10029079 6787036 4705352 4636002 5159189 4825826
35527 4825826 3862831 2971756 2179255 1932626 3403372 6096350 7006762 4319891 470603
35518 470603 -943739 -103004 -4469 -1393158 -1950584 -594195 683355 186995 -974106
35509 -974106 -1013546 87020 1566911 3404621 5445139 6618431 6390255 5604408 4724042
35500 4724042 2800688 -474984 -3313193 -4068595 -3559433 -3434386 -3594436 -3181861 -2787012
35491 -2787012 -3264201 -3360670 -1295856 1779472 2825598 1460462 518077 1567435 2946897
35482 2946897 3403072 4475997 6986557 7861239 3874833 -2801172 -6437397 -4975906
35474 -4975906 -2028131 -1050765 -955961 628807 2614215 2094614 -640179 -2072174 -339319
35465 -339319 2773345 5244771 7379905 9607721 10205448 7469924 2708920 -1109757
35457 -1109757 -2684466 -2378617 -182966 3577349 6299148 5234227 1772599 306168
35449 306168 2009095 3101118 885039 -1777904 -658945 3693728 7158389 7711669
35441 7711669 6601735 4850056 1969329 -1935432 -5657585 -8723654 -11451656 -13179168
35433 -13179168 -12750797 -10787397 -9099689 -7805316 -5589924 -3001039 -2539669 -4669841
35425 -4669841 -6539981 -5963394 -4264478 -3758775 -4590942 -5593664 -6303349 -6533913 -5686831
35416 -5686831 -3946878 -2517244 -1523522 231918 2209776 1591234 -2109655 -4634411
35408 -4634411 -2171829 3146470 6188200 5476309 3357205 1121345 -1721069 -3987514
35400 -3987514 -3271049 -272435 1492983 1196168 1843345 4564813 5941511 3521400 453465
35391 453465 1253979 5360663 8461959 8774941 8409665 8965931 9104841 7115697 3612336
35382 3612336 785318 211557 1755399 3629693 3573027 1142604 -1176492 -442509 2955009
35373 2955009 5247787 3579624 -634078 -3393852 -2589083 4143 1020470 -918836
35365 -918836 -4176273 -6164897 -5809463 -3948226 -2055710 -1138101 -1414202 -2328088 -3100365
35356 -3100365 -3899130 -6004680 -9823598 -13142620 -12794926 -8259235 -2515591 788185
35348 788185 82332 -3781110 -8219050 -10004774 -7738077 -3796362 -2039772 -3106750
35340 -3106750 -4017205 -2930778 -1573530 -1620665 -1512231 820245 4274752 6247467 6228639
35331 6228639 5085722 2496257 -1728179 -5038254 -4400211 -637985 2653450 4014061
35323 4014061 4639233 4589480 2546817 -400885 -984755 1072813 2029296 -57391 -2165750
35314 -2165750 -1165150 1563250 3096482 3612337 4865045 6361632 6540580 6116871 6742000
35305 6742000 7408842 5681763 2032559 -336206 -55908 857438 289141 -1610329 -3699270
35296 -3699270 -5285029 -5911770 -5631584 -5710581 -7227292 -8983588 -8908312 -7536844 -7591880
35287 -7591880 -9655729 -10867961 -8966764 -5358458 -2898553 -2593105 -3799149 -5708190
35279 -5708190 -6959050 -5521833 -1051946 3668795 5451956 4093720 1576305 -1052381
35271 -1052381 -4070495 -7033759 -8485117 -7817115 -5926853 -4001066 -2927691 -3681288
35263 -3681288 -6663210 -10448962 -12614308 -12215925 -10376715 -8259585 -5799933 -2874551
35255 -2874551 -367876 788274 734061 88878 -930542 -2027441 -2360395 -1738230 -1746230
35246 -1746230 -4242706 -8569800 -11431795 -10209617 -5842183 -1842562 -780274 -2298959
35238 -2298959 -4399753 -5819038 -6636668 -6993607 -6141292 -3227919 1253782 5248480 6489440
35229 6489440 4146525 -506682 -4824851 -6591912 -5740038 -4344092 -4510188 -6242944
35221 -6242944 -7778921 -7910440 -7207551 -6643098 -5837803 -3591219 75690 3366558 4499963
35212 4499963 3483066 1750001 496252 -99802 -227482 305425 1879745 4341909 6719034
35203 6719034 7730601 6695631 4096184 1246852 -695474 -1386324 -1021131 160245
35195 160245 1665142 2345746 1059902 -1940937 -4826381 -5825142 -4772110 -2836192 -1264405
35186 -1264405 -803210 -1697304 -3405889 -4618919 -4434839 -3477175 -3154498 -3974968 -5375952
35177 -5375952 -6944876 -8616257 -9643486 -8822468 -6285826 -3787203 -2371001 -906969
35169 -906969 1976613 5476328 7446872 6982064 4861576 2063905 -610831 -1867950
35161 -1867950 -701122 2064483 4577917 6305896 7795975 8163757 5432456 284693
35153 284693 -3289109 -3066372 -1919450 -3256447 -5159261 -3164923 1791414 3112211
35145 3112211 -2312284 -8918532 -9420935 -3974162 1266613 2755389 2389782 2388060 2009219
35136 2009219 555009 -229674 952400 2309215 1676380 -31870 -563731 -18736 -167010
35127 -167010 -1170825 -1791914 -2259410 -3996033 -6535830 -7609666 -6751815 -6074187 -6621560
35118 -6621560 -6605053 -4527521 -1628279 438132 2224081 4849096 7499931 8637639
35110 8637639 8314568 7384278 5864507 4106034 3917782 5923985 7271885 5131578 1462246
35101 1462246 701403 3124951 4426324 2283204 -637432 -1426896 -917565 -995779 -1288973
35092 -1288973 -1041363 -1498268 -3569385 -5373003 -5100892 -4400464 -5652711 -7469043 -6568731
35083 -6568731 -3227617 -1033305 -1425840 -2259169 -2175923 -2614620 -4222458 -4714895 -2397620
35074 -2397620 739467 1787474 986948 736875 1805414 2841418 3004535 2895267 2849948
35065 2849948 2053849 -69668 -2470437 -3064485 -732102 3177478 5559671 4479384
35057 4479384 1354361 -722464 -794631 -739788 -1895651 -2916823 -2103367 -135546 1189369
35048 1189369 1643414 2069317 2205266 1262015 181182 888589 3098765 4113515 2575270
35039 2575270 575910 865152 3246689 5055066 4533774 2593172 1424775 2183040 4146374
35030 4146374 5838861 6745036 7571913 8671569 8978990 7383933 4537462 1971383 -186246
35021 -186246 -2836371 -5199322 -4701883 -664245 3656232 4337571 1100329 -3065774 -5599762
35012 -5599762 -6071989 -5015591 -3114269 -1476052 -931678 -806087 224725 2004325 3194210
35003 3194210 3803365 5425208 8219557 9667616 7841805 4468448 2906498 3937349
34995 3937349 5374604 5285091 3630772 887681 -2773672 -6285220 -7494210 -5476156
34987 -5476156 -2092680 -111289 -283523 -1167014 -1448985 -1536507 -2776454 -5541116 -8273285
34978 -8273285 -8656422 -6083323 -2628494 -796691 -659569 -492059 41164 -545118 -2293851
34969 -2293851 -2680818 -517668 1237870 -643641 -4388281 -5236581 -2379436 -258244
34961 -258244 -2175547 -5963979 -7709251 -6920157 -5486165 -3580451 164562 5037806
34953 5037806 7786906 6395534 2528496 -491232 -1028831 97456 1394709 2489968
34945 2489968 4054547 6076881 6834389 4619801 423215 -2633725 -3141983 -3119366 -4829393
34936 -4829393 -7459818 -8536530 -7260350 -4466441 -438684 4743761 9275343 10747059
34928 10747059 9354558 7660297 6856267 5526892 2618400 -667061 -2788894 -3560883
34920 -3560883 -2968432 -509404 2877135 4335787 2562623 204756 538445 2736620
34912 2736620 2841964 -835804 -5534296 -7622114 -6644419 -5044530 -4974284 -6295794 -7358910
34903 -7358910 -7053722 -5817295 -4636898 -3524036 -1765626 317184 1030455 -555525
34895 -555525 -2992509 -3987866 -3102006 -1964074 -2020415 -2921836 -3135026 -1554490 1467435
34886 1467435 4242521 4976872 3305920 670463 -932633 -521850 1310951 2923974
34878 2923974 2872283 1342382 255078 1133293 3085177 4073462 3972165 4623550 6659417
34869 6659417 8399392 8763385 9024427 10016112 9598374 5374571 -1137562 -5544300 -5449694
34860 -5449694 -2309157 1175488 3370477 3542029 1695636 -722624 -1583249 -356238
34852 -356238 1278493 1480730 135335 -1382199 -1543768 86961 2134149 2320856 102910
34843 102910 -2128937 -1707019 1053090 3752034 5389816 6878526 8329524 8251756 6024526
34834 6024526 3157506 1207155 -17213 -1338177 -2607298 -3026048 -2133793 -55960
34826 -55960 2327901 3494039 2860527 2158886 3545105 6393110 8045597 7864478 7860614
34817 7860614 8519617 7053353 1818262 -3970990 -5734321 -3372674 -837946 -457099
34809 -457099 -398047 1858811 5620972 7609850 5660542 1139984 -2173347 -1635023 1690050
34800 1690050 4206000 3453997 68 -4086713 -7274336 -8762242 -8205439 -6304141
34792 -6304141 -4701780 -4336526 -4550402 -4340027 -3505361 -2049047 307516 3261366 5803415
34783 5803415 7706143 9812937 12070030 12860344 11423578 9403063 8629849 8735879 8323217
34774 8323217 7118542 5551548 3647949 1899255 1750928 3512705 5239156 5416241
34766 5416241 5050163 5067666 3709605 -517178 -4891537 -5114007 -1311790 1988666 1814854
34757 1814854 -407014 -2018142 -2062041 -630170 1845600 3866690 3810444 2286286 1497254
34748 1497254 1915431 1768771 50038 -2336867 -4619361 -6668997 -7126278 -4087376 1285406
34739 1285406 4642692 3395976 -415112 -3328726 -4204955 -3589399 -1881354 101821
34731 101821 725297 -552285 -2310907 -3265464 -3458896 -2618432 149001 3756453 5034786
34722 5034786 3192824 1793634 3847112 7192039 7576646 4543539 1222738 -479377
34714 -479377 -1401811 -2478049 -3419963 -4038162 -4708271 -5406747 -5731661 -5598438 -4785944
34705 -4785944 -2646403 407310 2230144 1384896 -750119 -1914126 -1904814 -1960717 -2538874
34696 -2538874 -3642448 -6005724 -9626193 -12146112 -11071209 -6892076 -2030514 2186856
34688 2186856 5333596 6174566 4117481 1388708 670237 1207542 290010 -2050206 -3137370
34679 -3137370 -2058249 -469288 954754 3277235 6133253 7340260 6444418 5473185
34671 5473185 5440186 5282468 4918278 5812313 7482503 7182796 4629378 3396264 5583924
34662 5583924 8565864 9421817 9215219 9895840 10061716 7525850 3844397 2249333 2280751
34653 2280751 283500 -5106886 -11173272 -14899862 -16054743 -16316130 -17203513 -18907978
34645 -18907978 -19805537 -17555080 -11945148 -5861352 -2122355 -484619 735222 1613960
34637 1613960 1356524 749227 1291474 2645155 3351643 3377119 3530300 3107971 836189
34628 836189 -2315818 -4006244 -3843958 -3008991 -964908 3971512 10438822 13972018 12331742
34619 12331742 7983891 4143836 1390807 -326513 339340 3551204 6220286 5602677
34611 5602677 3319371 2760082 3668611 2567176 -1898390 -7307343 -11415094 -14591717
34603 -14591717 -17198617 -17369326 -13609616 -7938137 -3965664 -2463038 -1097946 1444517
34595 1444517 3369582 2670616 262326 -1360855 -1469074 -1237641 -1051338 270648 3248137
34586 3248137 6459303 8172262 7928176 5879121 2034837 -2762418 -6298729 -6715329
34578 -6715329 -4190016 -258690 3498186 5500948 4625479 1997706 791601 2463881
34570 2463881 4519757 3978550 1678547 669620 1482928 2003681 1441649 1140932 1403220
34561 1403220 827391 -542228 -577300 1264087 2482535 1286585 -657248 -929488 304958
34552 304958 1469230 2286250 3475910 5151653 7102969 9359595 11169631 11003027 8966545
34543 8966545 7419108 7506969 6986163 3635780 -901842 -3302224 -3296435 -3383734 -4565380
34534 -4565380 -5325961 -4834083 -4484210 -5663569 -7897569 -9778962 -10361484 -9382932 -7352556
34525 -7352556 -5548849 -4891730 -4910809 -4685835 -4238576 -3928989 -3351884 -2282104 -1754140
34516 -1754140 -2362076 -2393144 74246 3814185 5702009 5063481 4167794 4337900 4332325
34507 4332325 3141782 1725225 928173 -49959 -1880784 -3639660 -4223465 -3639163 -2074331
34498 -2074331 488607 2820594 2596076 -691920 -4570817 -6475539 -6163373 -4284342
34490 -4284342 -737587 3845440 6936737 6650655 4178302 1742897 -536375 -3539480
34482 -3539480 -6141397 -6096765 -3607511 -1477900 -1418014 -2142725 -1596745 389931 2052441
34473 2052441 1309895 -2450106 -7132032 -8917574 -6012716 -1184737 1124098 195443
34465 195443 -319725 2437884 6619143 8030871 5184110 675728 -1951824 -1665110 -299032
34456 -299032 -164560 -1656484 -3226936 -3433826 -2437969 -1360386 -951075 -1345242 -2242282
34447 -2242282 -2600435 -1199804 1335173 2138959 -541698 -4321456 -5123119 -2436186 129150
34438 129150 -193480 -2105883 -2755426 -1269440 1481026 4665829 7220253 7230247 3778887
34429 3778887 -1167148 -4525638 -5412938 -5100370 -4123177 -1582964 2280405 4865498 3965127
34420 3965127 796044 -1135571 -54540 2185516 2406175 -378466 -4191823 -6510458
34412 -6510458 -6801180 -6424760 -6532187 -6832820 -6554376 -5837568 -5469082 -5510398 -5017387 -3363610
34402 -3363610 -1294711 -185143 -416789 -927466 -411929 1375749 3672032 5710602 7289578
34393 7289578 8496869 9396648 10107005 10764884 11218306 11136455 10639138 10353876 10480437
34384 10480437 10267349 9004474 7228293 6224861 6359987 6513853 5339764 2760044
34376 2760044 155013 -766103 502633 2539256 3093953 1419663 -687435 -702375 1922428
34367 1922428 5347664 7349897 7017374 4690257 1321761 -1692960 -2881031 -1815890
34359 -1815890 -14415 -236716 -4154763 -10141935 -13767675 -11742104 -5797237 -1460457
34351 -1460457 -2127867 -5481314 -6919455 -5249190 -3077705 -2484911 -2895881 -3285757 -3940715
34342 -3940715 -5147715 -6085584 -6114010 -5740178 -5432454 -4823442 -3817196 -2971087 -1989559
34333 -1989559 381139 3780916 5396138 3447954 105534 -1069549 407647 2040723
34325 2040723 2167806 1501439 1089036 823617 335437 -157845 -342075 -152995 548424
34316 548424 1865489 3523204 5327918 7525279 9859554 11013555 10238682 8830289
34308 8830289 8378174 8106791 5908728 1862850 -1370428 -2022305 -1272769 -1338707 -3114150
34299 -3114150 -6128601 -9062952 -9652328 -6030514 526752 5661605 6218571 3557145
34291 3557145 1411055 1414284 2119772 1740450 329781 -688359 -183861 1475513 2509086
34282 2509086 1575440 -111790 329559 3585853 6529326 6052203 3431705 2666800 4928667
34273 4928667 7230967 7031608 5650693 5770778 7402830 8150813 6466134 3019921 -475210
34264 -475210 -2383808 -1791161 405260 1627462 527177 -782874 604870 4000079
34256 4000079 6022463 5853389 6225688 8174239 8507758 4991083 786579 6541 1151804
34247 1151804 -486490 -5078689 -7890436 -6677221 -4418048 -3541021 -2294171 881559
34239 881559 3709864 3936387 3298400 4104814 4706125 2190512 -2549085 -6152647 -7330365
34230 -7330365 -6418931 -2498054 4537068 10440670 10220527 5085418 1277646 1939438 4538009
34221 4538009 6380264 7590839 7676471 4402239 -1685898 -6048417 -6093241 -4624912 -4876316
34212 -4876316 -5855035 -5540227 -5005221 -5663270 -5512443 -2383607 1253681 1100007 -2660605
34203 -2660605 -5934072 -6808484 -7159981 -8413280 -9372761 -8748450 -6983661 -5032755 -3467431
34194 -3467431 -2855283 -2946713 -1740393 2296660 7243505 9427869 8123673 6046580 5036564
34185 5036564 3996579 1769544 -666723 -2220032 -3700012 -6056742 -8033974 -7401378
34177 -7401378 -3955847 34991 2152461 1665474 -759549 -4122202 -7260967 -8502922
34169 -8502922 -6527769 -2442731 75162 -1448779 -4731005 -5221443 -2264480 96458
34161 96458 -659532 -1915994 -694317 1219061 393602 -2340619 -3208904 -1388970 548300
34152 548300 1419582 2471670 3697126 3254716 1272210 580848 2628876 5736926 8203907
34143 8203907 10019723 10692901 8767521 4834094 1960964 1662363 2158775 1794701 1115026
34134 1115026 219923 -2458909 -6634033 -8591406 -5743147 -242107 4274826 6909076
34126 6909076 7945608 5998107 327588 -5790009 -7608457 -4068477 2011391 7504738
34118 7504738 10243341 8577966 3065534 -2496234 -4983768 -6078021 -9353801 -14167265
34110 -14167265 -16094922 -13190870 -8194351 -4292996 -2124023 -1486096 -2546377 -4186319
34102 -4186319 -4179422 -2467246 -1645966 -2675176 -2657700 1054223 6560565 9599432 8777139
34093 8777139 6311360 4289634 2605343 813284 -44747 1277675 3971909 5571458
34085 5571458 4853731 3419535 3572964 5222578 6263478 5917217 5751327 6653276 6936458
34076 6936458 5200801 3250315 3582715 5130627 4609851 1825080 361469 2311879
34068 2311879 5253681 5835366 3972300 1749252 85539 -1391034 -2349442 -1861181 -261287
34059 -261287 718645 -104723 -2106955 -3586212 -3366506 -1920078 -1102886 -2273435 -4555115
34050 -4555115 -5767464 -5243154 -4548135 -4885105 -5123982 -3541527 -549147 1721828 2100368
34041 2100368 1313882 396401 -539745 -1622288 -2304936 -1865598 -531637 448791 9389
34032 9389 -1652547 -3417784 -4562570 -5220074 -5329786 -3942404 -527687 3444337 5540398
34023 5540398 5129631 3929758 3480555 3408084 2973326 3035890 4958298 8055807 9670628
34014 9670628 8032635 4122620 470940 -1154423 -688802 722615 1551394 694854 -1826494
34005 -1826494 -4928715 -7456659 -8976224 -9421060 -8468512 -5993119 -2898504 -427722
33997 -427722 1597922 4671372 8934734 11710229 10169377 5051427 236456 -1332236
33989 -1332236 9967 2170008 3403438 2740978 314123 -1982478 -1900838 195221 1466795
33980 1466795 580583 -501544 6030 827240 311463 -244490 1071215 2796481 2005835
33971 2005835 -625934 -1484639 229722 1192942 -706485 -3141788 -3056720 -820135 1274171
33962 1274171 2495677 3493430 4055419 3214388 1102025 -724021 -684322 1510574 4330132
33953 4330132 5173065 2900953 -182146 -411612 2789836 6147908 6607234 4307995 995473
33944 995473 -2251610 -4569478 -4795624 -3141684 -1813956 -2352322 -3614319 -3662484 -2159152
33935 -2159152 364356 3776656 7194917 8369529 6353959 3431679 2326211 2779029
33927 2779029 2960276 2822127 3519124 4670335 5018002 5050350 6094116 7287379 6471884
33918 6471884 3964868 2290564 1815210 -77479 -4317859 -7610420 -6532837 -2274578
33910 -2274578 683212 -408343 -4207192 -7002723 -5761892 -540002 5013664 6500178
33902 6500178 3237626 -936781 -2293907 -1516097 -1907609 -4280979 -5876670 -4552291
33894 -4552291 -1984405 -1499175 -3872601 -6762978 -7918782 -7442441 -6582411 -5659718 -4210917
33885 -4210917 -2365316 -756622 663347 2404829 3989525 4071364 2452055 848504
33877 848504 1047722 3145662 5984350 8262174 8758721 6772944 3206615 167295 -1299259
33868 -1299259 -2040739 -2768217 -2707107 -1253367 677626 2311048 4311306 6693646 7276528
33859 7276528 4695452 1487290 1092923 2586537 1741975 -2714392 -7246862 -8468200
33851 -8468200 -6813874 -4220611 -1195059 1974531 3567890 2404824 40027 -1107431
33843 -1107431 -776804 -126407 1011622 3790083 7503719 9481174 8659323 7592124 9380618
33834 9380618 13242741 14888178 11878691 7251215 6184568 9480179 12456300 10944701
33826 10944701 6274226 2762357 2158443 3048093 4475815 6825095 9068287 8403211
33818 8403211 3904031 -1658562 -4951072 -5414619 -4461485 -3031350 -1257328 716797
33810 716797 2849222 5240329 7279261 7868866 7181922 6757881 6940444 5832137 2180837
33801 2180837 -2111973 -4111317 -3519354 -2472585 -2334327 -2513147 -2270506 -2006035 -2399426
33792 -2399426 -3340680 -4071828 -3879386 -2680868 -1304626 -787724 -875786 151795 3275975
33783 3275975 6845826 8033591 6078960 2994120 874481 -410433 -2202029 -4521584
33775 -4521584 -5775140 -5153859 -4247860 -5261482 -8045263 -10182100 -10083493 -8548192 -6823564
33766 -6823564 -4938524 -3090443 -2694869 -3902923 -3630847 975007 7735307 11133848
33758 11133848 8825490 3663755 -769910 -3472291 -4469471 -3621981 -2328432 -3029417
33750 -3029417 -5119341 -4491517 563869 6029378 7489341 5922949 4780304 3899449
33742 3899449 780878 -3593235 -5180287 -3171538 -1476348 -2952553 -5799437 -7100893
33734 -7100893 -6845841 -6560109 -6368413 -5583979 -4638552 -4320548 -3966727 -2303359 167943
33725 167943 1198646 -407837 -2937523 -3416442 -945947 2330339 3979999 4191377 4682580
33716 4682580 5247534 3729040 139245 -1696788 1382704 7414676 11561231 11567929 8669668
33707 8669668 4418733 -191900 -3015095 -1852024 1929685 3849904 1666324 -2047081
33699 -2047081 -3930055 -4204950 -5282898 -7769046 -10015013 -10827314 -10661397 -10179149 -9038920
33690 -9038920 -6592578 -3241916 -655995 -384453 -2125808 -3769584 -3558280 -1702513
33682 -1702513 629329 2924367 4775979 4752482 1752482 -2870744 -6470230 -8236046
33674 -8236046 -9181249 -9228942 -7010430 -3132809 -753801 -1267717 -1756412 983244 5449342
33665 5449342 7129282 4628991 1561056 1810969 4741513 6231543 3668316 -1270240
33657 -1270240 -4887641 -5627864 -5089720 -5097230 -5162298 -3826530 -1542680 -548387 -1906721
33648 -1906721 -4021277 -4377070 -1900133 2365818 6022628 6990495 5497241 4110741
33640 4110741 4665600 5773675 4975565 2625683 1288378 1565402 1404439 50285 -284804
33631 -284804 1986052 5109572 6624523 6675510 6854171 7444481 7699874 7374981 6115006
33622 6115006 2799465 -2337969 -6144477 -5605025 -1976657 377593 -771490 -3304708
33614 -3304708 -3906602 -1865272 681753 1326090 -164778 -1745394 -1644790 -817138 -1612259
33605 -1612259 -3899845 -4610808 -2168804 893248 1610963 727724 509249 298091 -2085803
33596 -2085803 -5351872 -5319508 -1120643 2825657 2562308 -521121 -2356885 -1406931 920553
33587 920553 3239171 5058420 5590737 4087552 1394590 -460555 -456938 609627 1352320
33578 1352320 851010 -1238560 -4386875 -6938435 -7324593 -5835981 -4202138 -3099656
33570 -3099656 -1272215 2103455 5342692 6028179 4336060 2811796 2647116 2026369 -837892
33561 -837892 -4560433 -6098521 -4527316 -1571531 1042520 2742522 2789265 213379 -4083348
33552 -4083348 -7066238 -6694158 -4106792 -1726482 -507570 -249917 -1287699 -4076853
33544 -4076853 -7672114 -10178248 -10635380 -9542468 -7879059 -6447255 -5659634 -5072929 -3622075
33535 -3622075 -1115321 1126680 1884858 1448377 557465 -891579 -2763232 -3446506 -1552320
33526 -1552320 1777941 4069869 4606261 4561621 4440045 3363487 911667 -2143801 -5035300
33517 -5035300 -7256516 -7730458 -5774458 -3096102 -2576912 -4368857 -5339623 -3460693 -728916
33508 -728916 -229977 -2015141 -3793740 -4507567 -5044165 -5873821 -6051903 -4853164 -2982156
33499 -2982156 -1764634 -2095899 -4360496 -8292027 -12418505 -14596570 -13993026 -12153084
33491 -12153084 -11297070 -11694346 -11560400 -9684143 -7176650 -5876888 -5709853 -4797687 -2047631
33482 -2047631 1533081 4182143 4810915 2918560 -1228774 -5458312 -6440276 -3314517
33474 -3314517 431175 560554 -3014889 -6741547 -8255479 -8391385 -8309203 -7194616 -4003286
33465 -4003286 310828 3784333 5537441 5605973 3751416 107837 -3443958 -4329510 -2176749
33456 -2176749 382338 404433 -2429258 -6021585 -8420823 -9340677 -9329784 -8618894 -7441742
33447 -7441742 -6591956 -6420211 -5639850 -2589669 2183270 6047744 7405608 7205150 6709694
33438 6709694 5463874 2725633 -550261 -2769859 -3641269 -3487948 -1814981 1459788
33430 1459788 4298686 4403797 2366280 747968 293518 -630790 -2845819 -5027021 -5964149
33421 -5964149 -5933561 -5210674 -3297354 -452972 1858216 2975844 3932318 5526657 6980315
33412 6980315 7208154 5969433 3230406 -908490 -5061375 -7320684 -8055514 -9818558
33404 -9818558 -13178451 -14839884 -11854154 -5919290 -1188927 857346 1766384 2209619
33396 2209619 828041 -2594620 -5419161 -5063752 -2228920 235671 966559 1123325 1885397
33387 1885397 2490714 1767162 645690 1373799 4136071 6255041 5566051 2949457 328991
33378 328991 -2027210 -4292515 -4940724 -2718041 268922 754338 -715954 -474759 2381236
33369 2381236 4413626 3017531 -387664 -3717609 -7201556 -10942106 -12839168 -11746218
33361 -11746218 -10059195 -10189287 -10677003 -8979322 -6261876 -5881999 -8152359 -9983492
33353 -9983492 -9340014 -7221226 -5461259 -5029253 -6237342 -8342830 -9242056 -7725695 -5656564
33344 -5656564 -5761518 -7759689 -9003879 -8473526 -7469499 -6484116 -4262431 -554421 2686501
33335 2686501 3836743 3492083 2937300 2236675 722276 -1689856 -4324456 -6206109 -6571487
33326 -6571487 -5633764 -4623627 -4294274 -3950753 -2946874 -2210603 -2719873 -3305793 -2015050
33317 -2015050 756371 2648718 2843057 3097505 4879398 7173433 7778362 5736620 2176988
33308 2176988 -641378 -1492932 -1987407 -5061334 -10589975 -14211645 -12512421 -7696266
33300 -7696266 -4353527 -3110229 -1161704 1735262 2327853 -395653 -2669064 -995721
33292 -995721 3166271 5522970 3512969 -2518626 -10308498 -16322237 -17566282 -14435583
33284 -14435583 -10295201 -7377360 -5017798 -2553694 -1117503 -1065037 -415640 1965023
33276 1965023 3934743 3257636 1275139 696711 1150074 -221089 -4448765 -9599970 -13647246
33267 -13647246 -16240427 -17585493 -17455925 -15765081 -13042815 -10160375 -8162601 -7974631
33259 -7974631 -9500597 -11375056 -12245121 -11923372 -10962408 -9832368 -8838472 -7922242 -6294509
33250 -6294509 -3467401 -861883 -741979 -3029273 -4975946 -4726660 -3250488 -1875461
33242 -1875461 -283081 1568530 1963852 68651 -1955729 -1967448 -1272028 -2232281 -3784434
33233 -3784434 -2529076 2240295 7578977 10875808 12101177 11948682 10377355 7638816
33225 7638816 4587258 1214839 -3279052 -8144689 -10471838 -8143016 -2608991 2121881
33217 2121881 3025380 545456 -2016855 -1815805 366448 857216 -2331129 -6663397 -8049286
33208 -8049286 -5675371 -2168362 313632 1984061 3556216 4653693 4675035 3785489 2606007
33199 2606007 1986103 3005295 5788959 8385758 8481715 6411736 4832223 5181052 6289795
33190 6289795 6997409 8146329 10863200 14422067 17164099 18438280 18361034 16600963 12864464
33181 12864464 8129224 4099080 1533439 9158 -904110 -1261273 -1519851 -2608992
33173 -2608992 -4719051 -6729861 -7580216 -7880871 -9245757 -11818780 -13362070 -11605044
33165 -11605044 -7058336 -2569172 -287096 -52557 -594190 -947580 -525270 651280 1219009
33156 1219009 -413450 -3315971 -4114217 -1245274 2453461 3344342 1858399 1326886 2794329
33147 2794329 3918175 3057802 1461783 404340 -1214092 -4541621 -7828630 -8114790
33139 -8114790 -5199428 -1866125 -152089 723135 2037662 2863778 1433014 -1392144
33131 -1392144 -2212528 556860 4209635 5244149 4057693 3868904 5650911 7054120
33123 7054120 6619887 5885819 5949772 4854970 724166 -4540842 -7241333 -6314232 -3704728
33114 -3704728 -1621568 -1408176 -3523977 -6201910 -5668344 -561916 5140121 6643284
33106 6643284 4541699 3071122 3398151 3065954 1784751 2768422 7143380 11464756 12740314
33097 12740314 12181197 11792836 10798092 8244238 6146290 6677200 8271513 7800580 5227272
33088 5227272 3026161 2055785 1218273 768590 2658884 6901993 10135434 9257131 5264185
33079 5264185 2205163 2662835 5160051 6354872 5383803 4989736 7684692 11844550 13325739
33070 13325739 10602022 6191854 2737673 35204 -2927349 -5080188 -4400018 -1059007
33062 -1059007 2047748 1666818 -3309683 -10672489 -15769414 -15018638 -9526518 -4131645
33054 -4131645 -2215287 -2805942 -3333674 -3146596 -2861667 -2107467 -121101 2243470 3012541
33045 3012541 1445682 -1099916 -2261576 -206169 4779893 9544373 10299320 6574388
33037 6574388 1634869 -1884060 -4982952 -9624814 -14919803 -17975357 -17349539 -13814923
33029 -13814923 -8749633 -3638710 -298353 344180 -641640 -1532128 -1731275 -1266680 200015
33020 200015 2436245 3897748 3455515 1869418 357607 -869330 -1379374 218040 3902408
33011 3902408 7056744 7875438 8012928 9225029 9462048 5850681 135264 -2879411 -1840437
33002 -1840437 -36092 -127742 -1304840 -2021791 -2144727 -1696089 -543390 -64554 -2154170
32993 -2154170 -5719974 -7040636 -4634058 -1086893 975205 1980859 3235734 4430683
32985 4430683 5067995 6031216 7774683 8786476 7783393 6026902 5684219 6916778 8018903
32976 8018903 7560167 5306787 1962856 -1046333 -2382284 -2058103 -1094558 177319 2085665
32967 2085665 3872905 4001163 2670198 1854862 2045916 1280811 -1344319 -3517769 -2890724
32958 -2890724 -589058 436493 -796990 -3045512 -5188540 -6855006 -7464868 -6553675
32950 -6553675 -4896343 -4071482 -4974909 -7212213 -9296454 -9191098 -5922346 -1126759 2510094
32941 2510094 4823774 8071483 12318077 13594727 8934003 1289309 -3407264 -3081196
32933 -3081196 -698440 812435 1875014 3912208 5909674 4872296 -617157 -7914222
32925 -7914222 -11904535 -9887578 -4803365 -2258165 -4161492 -7196156 -8104263 -7765259
32917 -7765259 -8275377 -8645546 -6465727 -2300594 861608 1862425 2033064 1964452 756013
32908 756013 -1241853 -1889630 -407483 1196643 896679 -864967 -2340720 -2682038 -2212938
32899 -2212938 -1679424 -1737050 -2139439 -1381060 1380847 3976632 2776116 -2668957 -8303810
32890 -8303810 -10006756 -7917835 -5052214 -2834673 135671 5113810 10641863 13692963
32882 13692963 12843068 9619830 6584628 4584548 2529450 -370313 -3329890 -5359755
32874 -5359755 -6718991 -8104159 -9297387 -9543647 -8359645 -5106756 865637 8246559
32866 8246559 13404154 14078286 12365929 11780469 12391400 11643767 9170310 7292769 6682794
$$ [...]
##END NTUPLES=NMR SPECTRUM
##END=
