##TITLE=31Pdec_DE-162k_TFA
 DMSO-d6_CCl4, 64 sc
 15.7.2026
##JCAMPDX= 6.0         $$ Bruker NMR JCAMP-DX V2.0
##DATA TYPE= NMR SPECTRUM
##DATA CLASS= NTUPLES
##ORIGIN= UXNMR, Bruker Analytische Messtechnik GmbH
##OWNER= root
$$ XWIN-NMR		Version 3.5
$$ Wed Jul 15 13:30:49 2026 Russian Standard Time (UT+4h)  she@DPX200
##.OBSERVE FREQUENCY= 81.013821
##.OBSERVE NUCLEUS= ^31P
##.ACQUISITION MODE= SIMULTANEOUS
##.ACQUISITION SCHEME= undefined
##.AVERAGES= 64
##.DIGITISER RES= 17
##SPECTROMETER/DATA SYSTEM= spect
##.PULSE SEQUENCE= zgpg30
##.SOLVENT NAME= DMSO
##.SHIFT REFERENCE= (INTERNAL, DMSO, 0, 197.392)
##AUDIT TRAIL= $$ (NUMBER, WHEN, WHO, WHERE, WHAT)
$$ ##TITLE= Audit trail, XWIN-NMR		Version 3.5
$$ ##JCAMPDX= 5.01
$$ ##ORIGIN= Bruker BioSpin GmbH
$$ ##OWNER= she
$$ F:/spectra/data/she/nmr/P31/2/pdata/1/auditp.txt
$$ ##AUDIT TRAIL=  $$ (NUMBER, WHEN, WHO, WHERE, WHAT)
(   1,<2026-07-15 13:29:45.35 +0400>,<she>,<DPX200>,
      <created by zg, POWCHK disabled, PULCHK disabled
       configuration hash MD5:
       00 E9 B6 7A A2 85 ED C7 34 08 36 98 17 FE 4E 26
       data hash MD5: 32K
       E7 81 C0 AC 8E AE 0D 91 D7 3B 9E 07 90 EA 4D 63>)
(   2,<2026-07-15 13:29:47.65 +0400>,<she>,<DPX200>,
      <Start of raw data processing
       efp BC_mod = 2 LB = 1.5 FT_mod = 6 PKNL = 1 PHC0 = 1970.789 PHC1 = 151.6991 SI = 64K 
       data hash MD5: 64K
       B2 65 30 32 65 22 28 89 C1 C9 8F BD EE BA B8 D0>)
(   3,<2026-07-15 13:30:10.09 +0400>,<she>,<DPX200>,
      <pk PHC0 = -37.29575 PHC1 = 9.2 
       data hash MD5: 64K
       C6 7B D1 74 AE 85 EC C7 1D EA BD A1 48 5D CC A3>)
$$ ##END=
$$ 
$$ hash MD5
$$ E6 03 DF 8C 4E A3 CE 88 6B 3D 26 A6 7F C2 79 1C
##$RELAX= 
##$RELAX= 
##$RELAX= 
##$RELAX= 
##$RELAX= 
##$RELAX= 
##$RELAX= 
##$RELAX= 
$$ Bruker specific parameters
$$ --------------------------
##$DU= <F:/spectra>
##$EXPNO= 2
##$NAME= <P31>
##$PROCNO= 1
##$TYPE= <nmr>
##$USER= <she>
##$AMP= (0..31)
100 100 100 100 100 100 100 100 100 100 100 100 100 100 100 100 100 100 
100 100 100 100 100 100 100 100 100 100 100 100 100 100 
##$AQSEQ= 0
##$AQ_mod= 1
##$AUNM= <au_zg>
##$AUTOPOS= <>
##$BF1= 81.014009
##$BF2= 200.13
##$BF3= 200.13
##$BF4= 200.13
##$BF5= 200.13
##$BF6= 200.13
##$BF7= 200.13
##$BF8= 200.13
##$BYTORDA= 1
##$CFDGTYP= 0
##$CFRGTYP= 5
##$CHEMSTR= <none>
##$CNST= (0..31)
1 1 145 1 1 1 1 1 1 1 1 1 1 1 1 1 1 1 1 1 1 1 1 1 1 1 1 1 1 1 1 1 
##$CPDPRG= <waltz16>
##$CPDPRG1= <>
##$CPDPRG2= <waltz16>
##$CPDPRG3= <>
##$CPDPRG4= <mlev>
##$CPDPRG5= <mlev>
##$CPDPRG6= <mlev>
##$CPDPRG7= <mlev>
##$CPDPRG8= <mlev>
##$CPDPRGB= <>
##$CPDPRGT= <>
##$D= (0..31)
0 1 0 0 0 0 0 0 0 0.06 0 0.03 2e-05 3e-06 0 0 0.0002 0 0 0 0 0 0 0 0 0 
0 0 0 0 0 0 
##$DATE= 1784107784
##$DBL= (0..7)
120 120 120 11 120 120 24 19 
##$DBP= (0..7)
150 150 150 150 150 150 150 150 
##$DBP07= 0
##$DBPNAM0= <>
##$DBPNAM1= <>
##$DBPNAM2= <>
##$DBPNAM3= <>
##$DBPNAM4= <>
##$DBPNAM5= <>
##$DBPNAM6= <>
##$DBPNAM7= <>
##$DBPOAL= (0..7)
0.5 0.5 0.5 0.5 0.5 0.5 0.5 0.5 
##$DBPOFFS= (0..7)
$$ [...]
##$SUBNAM2= <"">
##$SUBNAM3= <"">
##$SUBNAM4= <"">
##$SUBNAM5= <"">
##$SUBNAM6= <"">
##$SUBNAM7= <"">
##$SUBNAM8= <"">
##$SUBNAM9= <"">
##$SW= 400.765351723535
##$SWIBOX= (0..15)
0 1 3 0 0 0 0 0 0 0 0 0 0 0 0 0 
##$SW_h= 32467.5324675325
##$TD= 32768
##$TD0= 1
##$TE= 0
##$TE2= 300
##$TE3= 300
##$TEG= 300
##$TL= (0..7)
0 120 53 12 22 120 120 120 
##$TP= (0..7)
150 150 150 150 150 150 150 150 
##$TP07= 0
##$TPNAME0= <>
##$TPNAME1= <>
##$TPNAME2= <>
##$TPNAME3= <>
##$TPNAME4= <>
##$TPNAME5= <>
##$TPNAME6= <>
##$TPNAME7= <>
##$TPOAL= (0..7)
0.5 0.5 0.5 0.5 0.5 0.5 0.5 0.5 
##$TPOFFS= (0..7)
0 0 0 0 0 0 0 0 
##$TUNHIN= 0
##$TUNHOUT= 0
##$TUNXOUT= 0
##$USERA1= <user>
##$USERA2= <user>
##$USERA3= <user>
##$USERA4= <user>
##$USERA5= <user>
##$V9= 5
##$VALIST= <valist>
##$VCLIST= <CCCCCCCCCCCCCCC>
##$VD= 0
##$VDLIST= <DDDDDDDDDDDDDDD>
##$VPLIST= <PPPPPPPPPPPPPPP>
##$VTLIST= <TTTTTTTTTTTTTTT>
##$WBST= 1024
##$WBSW= 4
##$XGAIN= (0..3)
0 0 0 0 
##$XL= 0
##$YL= 0
##$YMAX_a= 8628
##$YMIN_a= -8902
##$ZGOPTNS= <>
##$ZL1= 120
##$ZL2= 120
##$ZL3= 120
##$ZL4= 120
##$ABSF1= 0
##$ABSF2= 0
##$ABSG= 0
##$ABSL= 0
##$ALPHA= 0
##$AQORDER= 0
##$ASSFAC= 0
##$ASSFACI= 0
##$ASSFACX= 0
##$ASSWID= 0
##$AUNMP= <proc_1d>
##$AZFE= 0.1
##$AZFW= 0.5
##$BCFW= 0
##$BC_mod= 2
##$BYTORDP= 0
##$COROFFS= 0
##$CY= -3
##$DATMOD= 1
##$DC= 0
##$DFILT= <>
##$DTYPP= 0
##$F1P= 0
##$F2P= 0
##$FCOR= 1
##$FTSIZE= 65536
##$FT_mod= 6
##$GAMMA= 0
##$GB= 0
##$INTBC= 1
##$INTSCL= 9.790993e-09
##$ISEN= 30
##$LB= 1.5
##$LEV0= 0
##$LPBIN= 0
##$MAXI= 10000
##$MC2= 0
##$MEAN= 0
##$ME_mod= 0
##$MI= 50
##$NCOEF= 0
##$NC_proc= -7
##$NLEV= 6
##$NOISF1= 182.463
##$NOISF2= 159.3651
##$NSP= 0
##$NTH_PI= 0
##$NZP= 0
##$OFFSET= 197.3918
##$PC= 4
##$PHC0= 1933.493
##$PHC1= 160.8991
##$PH_mod= 1
##$PKNL= yes
##$PPARMOD= 0
##$PSCAL= 0
##$PSIGN= 0
##$REVERSE= no
##$SF= 81.014063255964
##$SI= 65536
##$SIGF1= 159.3651
##$SIGF2= -187.1042
##$SINO= 113.3802
##$SIOLD= 16384
##$SREGLST= <1H.CDCl3>
##$SSB= 0
##$STSI= 65536
##$STSR= 0
##$SW_p= 32467.5324675325
##$SYMM= 0
##$S_DEV= 0
##$TDeff= 32768
##$TDoff= 0
##$TI= <>
##$TILT= no
##$TM1= 0
##$TM2= 0
##$TOPLEV= 0
##$USERP1= <user>
##$USERP2= <user>
##$USERP3= <user>
##$USERP4= <user>
##$USERP5= <user>
##$WDW= 1
##$XDIM= 65536
##$YMAX_p= 376046441
##$YMIN_p= -102717880
$$ End of Bruker specific parameters
$$ ---------------------------------
##NTUPLES= NMR SPECTRUM
##VAR_NAME=  FREQUENCY,     SPECTRUM/REAL,   SPECTRUM/IMAG
##SYMBOL=    X,             R,               I
##VAR_TYPE=  INDEPENDENT,   DEPENDENT,       DEPENDENT
##VAR_FORM=  AFFN,          ASDF,            ASDF
##VAR_DIM=   65536,         65536,           65536
##UNITS=     HZ,            ARBITRARY UNITS, ARBITRARY UNITS
##FACTOR=    0.49542278885378, 1,            1
##FIRST=     15991.5117654749, 0,            0
##LAST=      -16476.0207020576, 0,           0
##MIN=       -16476.0207020576, -102717880,  0
##MAX=       15991.5117654749, 376046441,    0
$$ Real data points
##PAGE= N=1
##DATA TABLE= (X++(R..R)), XYDATA
$$ [...]
45665 1347170 1580772 1901805 2340523 2100097 540491 -1785284 -3463375 -3515626 -2095415
45656 -2095415 -92454 1503932 1946044 1070468 -394076 -1244344 -941289 -186125 -22686
45647 -22686 -515672 -813895 -520833 -288836 -603910 -611110 911213 3571310 5438631 5406490
45637 5406490 4511775 4295320 4737074 4778235 4216459 3772879 3506499 2581406 867399
45628 867399 -506462 -796658 -806131 -1608567 -2935548 -3782153 -4002844 -4167188 -4097616 -2773927
45618 -2773927 71346 3172216 4947397 4886832 3417358 1104605 -1377108 -2974185
45610 -2974185 -2882939 -1549087 -383200 -178497 -256963 431465 1736004 2453705 1972775
45601 1972775 1045465 603124 400457 -489645 -2080729 -3164939 -2764779 -1286274 109787
45592 109787 830402 1111723 1316050 1583174 2107699 3114266 4273564 4568463 3232804
45583 3232804 777479 -1296113 -1949345 -1571538 -1342697 -1808332 -2354699 -2059217 -746488
45574 -746488 942662 2289229 3014258 3121493 2562956 1323764 -194975 -1184279 -1143003
45565 -1143003 -550588 -406446 -923174 -1180248 -514588 333579 376789 272490 1609264
45556 1609264 4096717 5112357 3037064 -306791 -2022288 -1973216 -2411218 -4246312 -5776860
45547 -5776860 -5343849 -3335209 -953489 1234878 2597106 1979568 -590705 -2967271
45539 -2967271 -3278353 -2449857 -2675208 -3955876 -4085436 -2048601 440579 1331101 668311
45530 668311 -148328 -353513 -79277 535660 1390710 1950443 1695688 986640 760771 1328412
45520 1328412 2004447 2003552 1261219 271620 -499330 -861707 -847930 -647501 -487318 -450835
45510 -450835 -522565 -878867 -1886679 -3536155 -5046183 -5517876 -5072273 -4826486 -5405567
45501 -5405567 -5966222 -5314317 -3631337 -2163361 -1237823 250455 2859720 5138430 5171822
45492 5171822 3076029 861999 -16225 79021 218593 301506 672658 1147771 1219353 933096
45482 933096 860924 1181643 1272224 419098 -1254460 -2744523 -3039255 -1985716 -320670
45473 -320670 1034531 1636351 1667211 1725488 2415512 3766371 5017475 5403641 5192993
45464 5192993 5324981 5838309 5514370 3659557 1421955 396639 513933 435720 -341386
45455 -341386 -1053118 -1171883 -969700 -478909 701179 2179106 2695095 1878600 893352
45446 893352 682696 823726 938470 1813594 3736642 4882440 3218298 -486096 -3363662
45437 -3363662 -4062174 -3925110 -4342837 -4661787 -3597843 -1529433 -215790 -640573 -1941019
45428 -1941019 -2410919 -1191151 981678 2580667 2861186 2415564 1998918 1401269 171906
45419 171906 -1119640 -1550655 -1559224 -2544806 -4512591 -5587250 -4593404 -2885328 -2591165
45410 -2591165 -3920733 -5277525 -5362884 -4070159 -1839097 610200 2086322 1681758 -82137
45401 -82137 -1671080 -2224321 -2152835 -2024405 -1630917 -448669 1479362 3390636 4323220
45392 4323220 3862120 2667471 2025929 2431774 2919456 2385945 1152056 295300 -224247
45383 -224247 -1432468 -3221285 -3833719 -2208320 284268 1460473 940675 100565 -77281
45374 -77281 62756 -61602 -306074 -155473 621628 1859987 3068120 3565802 3040172
45365 3040172 2006548 1260849 918934 571920 356392 1055896 2835959 4601540 5156121
45356 5156121 4519129 3540480 2623634 1531372 251784 -721853 -1105203 -1258273 -1694329
45347 -1694329 -2528976 -3560770 -4523754 -5095401 -5027171 -4471219 -3823204 -3062929 -1747107
45338 -1747107 5398 1120436 842393 -39442 -170784 364110 174964 -1119870 -1995219
45329 -1995219 -1209446 113994 -207701 -2503137 -4854973 -5519474 -4625948 -3356386 -2521192
45320 -2521192 -2363598 -2885538 -3730492 -4239145 -4061667 -3289855 -1796451 738732 3627183
45311 3627183 4906333 3353164 368974 -1242851 -349883 1571681 2591087 2383045
45303 2383045 1761194 1109268 169981 -927062 -1302833 -283565 1586449 2763709 2008769
45294 2008769 -495832 -3299763 -4932123 -4957647 -3912764 -2586609 -1619742 -1456025 -2082928
45285 -2082928 -2777370 -2619597 -1493644 -265681 236399 158018 321023 1207508 2466915
45276 2466915 3295835 3130160 2100431 977039 534073 792805 1029170 713690 253058
45267 253058 461731 1386767 2129531 2010468 1494069 1532704 2210987 2631722 2235889 1635513
45257 1635513 1715917 2327736 2500491 1824567 985385 853040 1579412 2691413 3500694
45248 3500694 3264410 1626341 -718940 -2391581 -2792098 -2626895 -2541952 -2066476 -772148
45239 -772148 279153 -419973 -2595183 -4354650 -4616480 -4067980 -3506940 -2674863 -1369906
45230 -1369906 -384812 -307754 -389721 222373 906172 558776 -367920 -401685 460206 425685
45220 425685 -1450862 -3701098 -4414404 -3731982 -3164285 -3024824 -2011293 548937 3333222
45211 3333222 4605099 4373879 4069202 4415314 4609947 3700371 1904663 153591 -1031400
45202 -1031400 -1632438 -1587865 -870162 107413 846695 1426613 2135015 2485929 1409200
45193 1409200 -1318046 -4421353 -6201358 -5856147 -3707352 -823531 1326330 1629535
45185 1629535 351435 -1013349 -1334574 -852293 -271603 419804 1538320 2702167 3178519
45176 3178519 2963814 2624798 2180161 1057194 -710423 -2047171 -1961748 -663626 673215
45167 673215 943903 -120607 -1754213 -2599687 -1816655 -10026 1199326 668818 -1398116
45158 -1398116 -3999860 -6254530 -7619418 -7754351 -6725868 -5224566 -4074861 -3347367
45150 -3347367 -2257274 -272539 1798763 2336910 778802 -1464084 -2449094 -1774913 -589198
45141 -589198 188488 677821 1077032 1096602 820426 1043418 2022597 2825790 2728151 2296052
45131 2296052 2121376 1567522 153893 -834869 -34807 1318813 665242 -1958270 -3634887
45122 -3634887 -2781982 -1363104 -1719276 -3184581 -3587673 -2713950 -2268781 -3093525 -4283933
45113 -4283933 -4872145 -4816273 -4279615 -3250701 -2086342 -1369448 -978610 -178498 1121370
45104 1121370 2004233 1786054 973272 549449 711098 774442 270366 -186502 573465 2695487
45094 2695487 4562491 4328017 2224223 451639 412763 1080772 866503 6122 -286758
45085 -286758 -313351 -1686452 -4621640 -7189651 -7845210 -7268902 -6849947 -6554905 -5507194
45076 -5507194 -3909844 -2988994 -3167292 -3471422 -2996373 -2087920 -1604563 -1559649 -1133621
45067 -1133621 62390 1277719 1452074 518263 -525943 -868618 -766234 -919033 -1394420
45058 -1394420 -1723715 -1840284 -2178749 -2725845 -2655977 -1317859 805323 2503842 2979173
45049 2979173 2314863 1098526 -60836 -774074 -949482 -647849 171667 1521218 2886110
45040 2886110 3260306 2131625 321424 -569253 350580 2468697 4312044 4830829 4158332
45031 4158332 3317370 3143087 3407068 3192083 2239103 1483802 1810107 2695047 2931436
45022 2931436 2557675 2936055 4522840 5702095 4824780 2624690 1254346 1241614 970098
45013 970098 -576702 -2135872 -2098859 -892921 -158337 -290153 -210908 674874 1628134
45004 1628134 1763457 1026863 -171547 -1385102 -2042805 -1802153 -1121006 -642970 -47069
44995 -47069 1377358 2991100 3159406 1821534 1089613 2281947 3801554 3381379 1306367
44986 1306367 -292661 -580755 -577284 -932035 -1096683 -860636 -921786 -1406561 -1348226 -388923
44976 -388923 266240 -482090 -1964209 -2727350 -2496072 -2143849 -2134479 -2035444 -1576075 -1339701
44966 -1339701 -2011990 -3281721 -3917307 -3069789 -1307931 2751 344318 475220 948171
44957 948171 1031807 -49910 -1451169 -1526904 -90858 1455021 2254253 2869921 3752760
44948 3752760 4278408 3972894 3464600 3381980 3351476 2998090 2977053 3932447 5163235 5414924
44938 5414924 4448018 2838146 816301 -1574849 -3646356 -4594525 -4630324 -4517126 -4237498
44929 -4237498 -3217947 -1659063 -443892 207590 803255 1306901 1076267 237856 -185349
44920 -185349 80636 8753 -1087782 -2504342 -3394769 -3932472 -4340053 -3851409 -1903702
44911 -1903702 363982 1214696 604707 72414 481422 1202397 1628184 2102962 2843470
44902 2843470 3152588 2487605 1344513 191605 -1549215 -4195402 -6130858 -5137232 -1526331
44893 -1526331 1540416 1458586 -1153386 -3764953 -4806863 -4369138 -3052116 -1471394 -467710
44884 -467710 -508096 -921466 -712238 -14231 248026 -59886 -278368 -492777 -1596808 -3419430
44874 -3419430 -4209535 -2800456 -248549 1469704 1483195 76374 -2135447 -4033797 -4029005
44865 -4029005 -1674015 1304070 2854566 3050820 3469969 4592765 5295361 4793533 3600680
44856 3600680 2356078 1044521 -173698 -459850 755089 2988920 5269743 6928612
44848 6928612 7639285 7305466 6182958 4703384 3143542 1819355 1218763 1220379 684042
44839 684042 -1023258 -2466269 -1644485 982401 2742732 2425930 1853165 2848851 4368239
44830 4368239 4169844 2189752 518061 544074 1655190 2586135 2738578 2079305 782862
44821 782862 -683953 -1623816 -1442694 81407 2416568 4049104 3538787 1369003 -152417
44812 -152417 358935 1609738 1636945 633734 327360 1184692 1953023 1805258 1269108
44803 1269108 858595 301815 -471322 -869262 -648872 -298694 -8261 667071 1702169
44794 1702169 2313768 2346971 2815632 4239013 5360057 4500675 1682993 -1336943 -2741862
44785 -2741862 -1887972 508871 2812540 3592312 2843359 1703485 827344 -77376 -850765
44776 -850765 -403337 1444504 2894745 2323244 618711 -157543 200029 80511 -1188760
44767 -1188760 -2471067 -2835815 -2730118 -2726308 -2678162 -2725124 -3589631 -4949115 -4921250 -2508779
44757 -2508779 424053 1145159 -438587 -1715821 -747886 1546960 2810916 1833956 -687033
44748 -687033 -3207159 -4570187 -4584818 -3941430 -3570536 -3839896 -4296007 -4174929 -3124975
44739 -3124975 -1467368 182783 1536404 2777751 3955789 4427920 3396161 1062843
44731 1062843 -1269959 -2486771 -2573015 -2010689 -914435 674903 2161439 2820226 2621196
44722 2621196 2007172 1121703 -48689 -1016095 -1116250 -421955 466682 1486800 3049288
44713 3049288 4823308 5610984 4861263 3492949 2696944 2586429 2563356 2407317 2350210
44704 2350210 2473363 2630926 2745135 2788322 2748956 2880368 3541048 4468263 4739004 3884325
44694 3884325 2550613 1643746 1390678 1673951 2501203 3431211 3350264 1861088 288425
44685 288425 142992 1063002 1552561 1339500 1445751 2096851 2382835 2261777 2968116 4574283
44675 4574283 4904775 2311798 -1657929 -3924168 -3440492 -1613733 210918 1929588
44667 1929588 3487221 4293291 4305792 4329787 4572195 4030759 2187403 412872 527905
44658 527905 2346738 3785098 3454537 2154775 1386795 1201734 403824 -1349806 -2654268
44649 -2654268 -2031287 51790 1538870 1047183 -851078 -2670607 -3685792 -4205914 -4651489
44640 -4651489 -4919202 -4614084 -3612446 -2365021 -1625025 -1652830 -1775673 -1266425 -699654
44631 -699654 -1590469 -4227461 -6740970 -7231441 -6174612 -5518231 -5776721 -5522553 -3875949
44622 -3875949 -1921591 -933745 -494096 501980 1859984 2450934 2129016 1900872 2146745
44613 2146745 1912684 409404 -1662385 -2835920 -2387777 -727700 1170672 2264499
44605 2264499 1888177 362611 -1081646 -1541949 -1425481 -1713765 -2544738 -3255030 -3671933
44596 -3671933 -4370482 -5375141 -5573954 -4158218 -2038209 -936548 -1344448 -2249803 -2783842
44587 -2783842 -3129358 -3529602 -3362321 -1938490 297105 2166749 3162887 3684071 3848077
44578 3848077 2903467 362013 -2711799 -4319307 -3644650 -2101081 -1804647 -3110961 -4185175
44569 -4185175 -3228765 -695811 1184162 881414 -1004658 -2767873 -3405737 -3141545 -2653175
44560 -2653175 -2283749 -1896618 -1224515 -380902 1780 -557657 -1596350 -2142574 -2143143 -2767463
44550 -2767463 -4743271 -6960019 -7519203 -5854642 -2997295 -13947 2725707 4667063
44542 4667063 4727609 2604192 -302584 -2153619 -2560297 -2482020 -2483159 -2035274 -771431
44533 -771431 429433 388433 -624683 -956633 345659 2188882 2835628 2305474 2414452
44524 2414452 4225971 6396921 6785647 5156761 3362273 2968020 3567800 3603873 2149597
44515 2149597 -428615 -3030529 -4613230 -4720659 -3624432 -1946134 -111012 1704453
44507 1704453 3212619 3972962 3768217 2810953 1682793 1299686 2529962 5153525 7411335
44498 7411335 7503098 5624919 3682550 2909243 2820921 2757808 3047375 3759705 3574749 1383965
44488 1383965 -1583806 -2751161 -1196337 1546412 3589231 4308826 3804028 2204983
44480 2204983 158021 -1097689 -1011511 -473638 -605392 -1294272 -1573518 -1055576 -309472
44471 -309472 25800 -2887 249128 1388771 3214282 4458323 3789076 1421176 -701730
44462 -701730 -768734 1158144 3525381 4843242 4419547 2293358 -616627 -2699877 -3055758
44453 -3055758 -2622018 -2952425 -3953157 -3985033 -2375745 -517861 158387 109878 544840
44444 544840 1297523 1269039 572338 625913 1855817 2708233 1715971 -419385 -1797978
44435 -1797978 -1826349 -1689507 -2465494 -3787397 -4630709 -4637058 -4184194 -3692428 -3436602 -3680625
44425 -3680625 -4313766 -4489533 -3372914 -1394624 -79418 -251539 -985808 -909839 -86540
44416 -86540 219542 -542051 -1523849 -1936151 -2218955 -3085886 -4071097 -3988231 -2618581 -1001255
44406 -1001255 61885 934142 2193213 3453108 3810630 3148703 2319311 2071822 2356250
44397 2356250 2730597 2855729 2337837 720587 -1689917 -3306092 -2477799 550711 3601096
44388 3601096 4848264 4509344 3777382 2921028 1531502 115845 -142141 614637 665196
44379 665196 -903234 -2890696 -3955763 -4578034 -5729921 -6723317 -6199372 -4635569 -3854170
44370 -3854170 -4174627 -4083492 -2965806 -2091841 -2209939 -2151747 -963488 330672 553906
44361 553906 468208 1287099 2279682 1896685 559771 146116 893679 952562 -678335 -2653990
44351 -2653990 -3382509 -3094846 -2976919 -3402292 -3907837 -4081280 -3695412 -2629569 -1325465
44342 -1325465 -738377 -1238002 -2056525 -2291023 -1880097 -1129035 24572 1544263 2606185
44333 2606185 2225839 441247 -1695685 -3177953 -3652263 -3184991 -1980579 -363139 1313841
44324 1313841 2814291 3960194 4536165 4431659 3831870 3162173 2803553 2709335 2196929
44315 2196929 453736 -2339570 -4663623 -5060073 -3796331 -2520702 -2311200 -2745001 -2893336
44306 -2893336 -2446906 -1698861 -1147968 -1319245 -2295618 -3273520 -3280168 -2381529 -1338623 -136412
44296 -136412 1856538 4038590 4480158 2520565 92339 -692370 -160852 -22536 -727586
44287 -727586 -1449998 -1974582 -2801147 -3599533 -3303350 -1973363 -1145353 -1864371 -3389906
44278 -3389906 -4241520 -3736606 -2267372 -838526 -512017 -1507273 -2620901 -2279024 -401991
44269 -401991 1453233 1991793 1506878 1073976 1145037 1342511 1136631 360985 -608201 -994280
44259 -994280 -278061 1182456 2511643 3276144 3702138 4036052 4192975 3987027 3227330
44250 3227330 1728722 -185854 -1370459 -803871 1158385 3150686 4315503 4700931
44242 4700931 4353692 3145208 1632186 917511 1180020 1293680 464143 -577335 -623398
44233 -623398 465306 1900627 3069737 3854170 4295623 4537342 4768251 4780423 3976685
44224 3976685 2281185 664810 259125 1168232 2477837 3144787 2633143 1109722 -625214
44215 -625214 -1754383 -2269511 -2781002 -3331787 -3095458 -1699180 -108038 596062 814256
44206 814256 1841242 3819612 5231153 4678438 2521616 335480 -905250 -1634339 -2739520
44197 -2739520 -4251481 -5351753 -5546421 -5254649 -4970068 -4401874 -3067636 -1381111 -359415
44188 -359415 -370970 -933593 -1643915 -2407355 -2756865 -2041591 -621803 123246 -485511 -1475202
44178 -1475202 -1484608 -285161 1356508 2519433 2358949 429247 -2467260 -4468297 -4448216
44169 -4448216 -3059084 -1433773 278166 2249065 3744380 3800537 2695554 1625210
44161 1625210 1198434 1244308 1752936 2806626 3664492 3125949 1095345 -1056507 -1981678
44152 -1981678 -1619360 -838516 -396873 -449769 -698150 -855922 -1047083 -1515657 -1874273 -1330190
44142 -1330190 -127941 75009 -1723155 -3990150 -4139954 -1764594 857469 1633181 870910
44133 870910 208864 350740 648407 426872 -64068 -66345 664666 1454765 1419792 498955
44123 498955 -554822 -1254085 -1881062 -2657144 -3121787 -2914592 -2522314 -2468606 -2336890 -1566720
44113 -1566720 -777947 -1148622 -2623477 -3850850 -3962252 -3462433 -3249317 -3619853 -4374244
44104 -4374244 -5082337 -5054895 -3766689 -1550041 610172 2036919 2763482 3212520 3921815
44095 3921815 5137896 6070763 5217470 2369794 -416171 -1158863 -629219 -1030851 -2446496
44086 -2446496 -2702520 -892706 1182922 1846965 1845521 2638906 3937469 4345402 3437419
44077 3437419 1913034 406591 -759434 -1212271 -889569 -375874 -212845 -270477 -158066
44068 -158066 396350 1820230 4350928 7022959 8190365 7667412 7089646 7381991 7288718
44059 7288718 5548916 3137698 1792842 1425582 813269 119082 729154 2784742 4688825
44050 4688825 5243984 4833939 4252200 3650800 3024012 2678559 2738276 2841090 2633247 2140571
44040 2140571 1618808 1400029 1679583 2089161 1958124 1485119 1895572 3608704 5069300
44031 5069300 4605854 2785637 1505797 1297946 1244017 1252868 2350203 4368644 5296069
44022 5296069 3831689 1204724 -462794 -517010 278100 1045196 1121216 32448 -1790857
44013 -1790857 -2904702 -2405952 -1130651 -543925 -1003503 -1954489 -3226685 -4992281 -6699956
44004 -6699956 -7214409 -6129825 -4082300 -1686590 903626 3126450 3755652 2345845
43996 2345845 359224 -178235 903591 1764265 1072235 -228660 -387254 593565 1035038
43987 1035038 128122 -851687 -366212 1328826 2748932 3143140 2947417 2605614 1905262
43978 1905262 561018 -1206306 -2855388 -3953053 -4402932 -4487465 -4600718 -4813183 -4941486
43969 -4941486 -5058437 -5353256 -5354032 -4154769 -1843456 243690 1332546 2209128 3479398
43960 3479398 4029100 2713681 661676 18482 852281 1234359 230957 -1146754 -2035601
43951 -2035601 -2706800 -3075700 -2287128 -559278 443246 87457 -105276 968667 1899985
43942 1899985 792473 -1819859 -3724396 -3899991 -3136311 -2413761 -2130227 -2549129 -3672828
43933 -3672828 -4829089 -5383815 -5583794 -5830778 -5656512 -4507752 -3064088 -2503737 -2712865
43924 -2712865 -2478839 -1365207 -175802 480328 867408 1088243 449311 -1566820 -4305192
43915 -4305192 -6386437 -6885165 -5941006 -4517095 -3609311 -3428616 -3358424 -2808530 -1837969
43906 -1837969 -809414 59450 517089 287581 -297592 -369114 209355 404947 -413205
43897 -413205 -1286550 -1028557 -21380 507753 351458 171467 81197 -121857 241044 1973734
43887 1973734 4188174 4980678 4027885 2839583 2262974 1584794 592025 586773 2313295
43878 2313295 4395772 5035304 4164015 2912931 2002747 1633005 1877278 2114094 1115728
43869 1115728 -1116492 -2619150 -1907538 -219107 237261 -487499 -437056 1009744 2187091
43860 2187091 1654321 24625 -1227831 -1490714 -934740 237623 1743591 3079716 3967166
43851 3967166 4463174 4388469 3321692 1522131 190229 263771 1313682 2014595 1472652
43842 1472652 -36740 -1287593 -1052305 593430 1865303 947383 -1645205 -3174537
43834 -3174537 -1662591 1875712 4735859 5441814 4678273 3873027 3791026 4345050 4926002
43825 4926002 4809897 3772497 2311959 882172 -796676 -2978858 -4704790 -4422159
43817 -4422159 -2020457 678393 1952885 1988314 2075934 2675896 3147344 3076700 2901211
43808 2901211 3096410 3487446 3675196 3635173 3527912 3253567 2583023 1562575 474707
43799 474707 -465294 -1038079 -763908 748825 2958616 4307694 3549890 1207762 -701628
43790 -701628 -591072 1274993 3347238 4318541 3762802 1798221 -1025733 -3525116 -4406853
43781 -4406853 -3405614 -1499144 181402 1171665 1322991 464954 -1072403 -2282827 -2498679
43772 -2498679 -2065231 -1414215 -199148 1726766 3198524 2978506 1753917 1353266 1965401
43763 1965401 1762260 -309544 -2916031 -4246491 -4178021 -3636422 -3075381 -2729339 -3219045
43754 -3219045 -4424883 -4555509 -1989769 2246084 5263730 5459285 3681144 1510086
43746 1510086 -183559 -919806 -342614 1150609 2431669 2733976 2126582 892749 -722981
43737 -722981 -2157302 -2892947 -3222068 -3646606 -3617707 -2242760 -346402 -116380 -2040834
43728 -2040834 -3802197 -3262009 -1183781 247694 377137 3014 -684195 -2201974 -4123883
43719 -4123883 -5060316 -4464674 -3187332 -2049881 -952476 412947 1933473 3381582
43711 3381582 4538778 4873276 3874032 1845651 -280626 -1880250 -2697046 -2320065 -752447
43702 -752447 668319 400374 -1033715 -1467212 -329624 173402 -1811699 -4913096 -6281641
43693 -6281641 -5168311 -3062219 -1025424 1042555 2624304 2271817 -164124 -2589001
43685 -2589001 -3003543 -1752829 -504286 78612 511030 1006432 1119708 676795 -35712
43676 -35712 -980375 -2257861 -3198420 -2630194 -508838 1527134 1835031 496674 -1125919
43667 -1125919 -2040090 -2204391 -1924393 -1554967 -1697017 -2762605 -4041995 -3915139 -1566808
43658 -1566808 1824889 4109857 4226332 2833027 1065650 -691938 -2616133 -4608512
43650 -4608512 -6192426 -7045576 -7161949 -6593004 -5536218 -4594986 -4214389 -3706176 -1760600
43641 -1760600 1474976 3730248 3135242 840462 -313486 444337 1075040 60190 -1402159
43632 -1402159 -1605158 -1091251 -1426576 -2235201 -1591343 838200 3034030 3347081 2354997
43623 2354997 1474309 1174391 1309022 1951888 2923511 3392709 2891984 2047534 1500115
43614 1500115 824908 -566096 -2094615 -2669756 -2323868 -2179816 -2888321 -3893533 -4210665
43605 -4210665 -3361557 -1722948 -492517 -994711 -3326351 -5894772 -6930566 -6225777 -4783226
43596 -4783226 -3172301 -1137866 1375694 3777039 5420592 5901395 4907287 2685047
43588 2685047 568681 -36300 608309 811499 -300035 -1698183 -1965246 -962907 510471
43579 510471 1863513 2822584 3070545 2568107 1871839 1497697 1232448 564871 -485714
43570 -485714 -1402581 -1723353 -1185752 233192 1885690 2460999 1162859 -1186332 -2768601
43561 -2768601 -2519781 -924823 785498 1774941 1956469 1629744 974466 -91474 -1477413
43552 -1477413 -2484884 -2301726 -1084961 -13826 45722 -623140 -1456897 -2545449 -3908452
43543 -3908452 -4518707 -3316301 -1067752 50874 -960159 -2736113 -3359053 -2505744 -1285717
43534 -1285717 -739553 -1217281 -2656368 -4592878 -6091279 -6366693 -5471493 -3983307 -2250408
43525 -2250408 -441381 916956 1145764 192855 -1258264 -2402709 -2624180 -1489146 753190
43516 753190 2701651 2805195 1186294 -335462 -499067 -100654 -596681 -1982518 -3063112
43507 -3063112 -3334602 -3340148 -3228478 -2301338 -470785 922890 617527 -846334 -1790114
43498 -1790114 -1498918 -792280 -493362 -165174 1173409 3480602 5398048 5562983 3892887
43489 3892887 1432982 -756551 -2157281 -2420288 -1235134 983776 2877558 3413606
43481 3413606 3166710 3552941 4875507 5967224 5790526 4462057 2543888 392994 -1374957
43472 -1374957 -1885322 -1188006 -490592 -406872 20814 1467762 2502298 1238070 -1669225
43463 -1669225 -3432950 -2629633 -789583 -189787 -1338751 -3050433 -3844561 -2783877 -20279
43454 -20279 2840506 3820434 2706886 1417307 1667199 2995924 3728139 3187926 2157300
43445 2157300 1565833 1480956 1276765 387403 -1023220 -2106980 -2369338 -2443591 -3067949
43436 -3067949 -3535650 -2508519 -541959 -92450 -2133447 -4343261 -4086720 -1968262 -641606
43427 -641606 -913219 -1099958 -49676 1281425 1734647 1760088 2436841 3690995 4310093
43418 4310093 3239851 489100 -2740316 -4628736 -4067895 -1680763 904115 2720484
43410 2720484 3772559 3948924 2840396 887360 -487123 -526559 -16114 157262 413544
43401 413544 1476435 2617087 2189708 -58459 -2246811 -2386916 -623615 1033040 1006990
43392 1006990 -316986 -1475251 -1809536 -1831330 -1883101 -1479604 -497986 -64240 -1157249
43383 -1157249 -2863803 -3327464 -2257004 -1127147 -838319 -708396 -234841 -290975 -1592826
43374 -1592826 -3204017 -3779668 -3427508 -3106552 -2885936 -2143615 -1025624 -313542 -50356
43365 -50356 364934 797618 505137 -185451 209900 2116479 3775911 3248075 814801
43356 814801 -1472996 -2180304 -1642230 -1040141 -1066300 -1444026 -1271480 93767 2128720
43347 2128720 3301428 2566580 557694 -1169363 -1919906 -2267332 -2682041 -2553634 -1089829
43338 -1089829 1254172 2930036 2899263 1638699 438587 48023 212575 284803 -26521
43329 -26521 -458785 -512540 44073 845763 1137968 483611 -728844 -1606291 -1557955 -682255
43319 -682255 509150 1472924 1795729 1376258 631988 270971 615731 1244584 1445304
43310 1445304 962312 244653 63275 888821 2449074 3829987 4188765 3446051 2185319
43301 2185319 1008523 311915 525329 1855801 3534317 4007308 2529926 246860 -963921
43292 -963921 -609349 30014 -413041 -1918224 -3425157 -4099742 -3875768 -3036738 -1769656
43283 -1769656 -292086 803092 713750 -787088 -2834469 -4088789 -3925993 -2720250 -1023544
43274 -1023544 882182 2419456 2564811 1018400 -984887 -1872775 -1432602 -543648 306131
43265 306131 1082333 1120209 -382056 -2483607 -2764965 -366897 2561027 3581350 2947230
43256 2947230 2396602 2036327 563249 -1715995 -2466724 -622763 1790006 2292158 1018283
43247 1018283 -199188 -699391 -1260290 -2079336 -2319797 -1769892 -1392595 -1734714 -2014097
43238 -2014097 -1448519 -508940 -52489 50994 535258 1452889 2153669 2293347 2051153
43229 2051153 1465948 369861 -934859 -1659375 -1476934 -999298 -986686 -1386402 -1458462
43220 -1458462 -733724 363703 908854 543073 95385 795903 2686826 4274082 4248003
43211 4248003 3166288 2691395 3362572 4048951 3694158 2616755 1655939 905340 41972
43202 41972 -638409 -370215 1050445 3008831 4774920 5962935 6365101 5885831 4818358
43193 4818358 3859505 3566573 3757319 3542885 2228734 406754 -205262 1322632 3498381
43184 3498381 3623308 921045 -2455475 -4035314 -3698416 -2952350 -2503760 -1855364 -818094
43175 -818094 68053 687459 1683273 3316740 4902349 5673780 5474836 4432662 2740816
43166 2740816 955814 -275405 -977900 -1594656 -1925901 -1303481 32889 902591 889666
43157 889666 855137 1229966 1199424 480904 464579 2143804 4059915 4146867 2951322 2985163
43147 2985163 4995582 6876950 6673043 4884091 3058400 1629864 247794 -831309
43139 -831309 -921013 30412 1434057 2716729 3344918 2756507 1053412 -652701 -1329736
43130 -1329736 -1110712 -641876 136204 1621272 3300856 3992839 3397525 2461988 1970079
43121 1970079 1575306 588906 -903538 -2140572 -2518452 -2035779 -1204467 -670405 -600469
43112 -600469 -396533 543357 1750273 2006492 988296 -37378 391200 2271512 4305741
43103 4305741 5358157 5305655 4753354 4371007 4330053 4080340 2919536 1004638 -622386
43094 -622386 -1322491 -1638480 -2344372 -3326241 -4036195 -4407032 -4436589 -3491621 -1246569 1083160
43084 1083160 1905150 1577147 2021526 3795866 5193395 4862388 3678166 2974528 2400951
43075 2400951 999883 -705406 -1383920 -941268 -231000 698300 2220045 3338053 2428723
43066 2428723 15730 -1306816 -484274 381197 -773084 -2794065 -3002329 -977165 1201987
43057 1201987 2001412 1912348 1887849 1950717 1836567 1762503 1833786 1527038 526570 -438307
43047 -438307 -326906 842545 1929601 1961579 1103045 301626 262218 914272 1734910 2330331
43037 2330331 2550528 2187629 965600 -958857 -2758485 -3573658 -3354290 -2804617 -2521957
43028 -2521957 -2447096 -2169231 -1523799 -802793 -465225 -593648 -576387 394481 2183876 3317546
43018 3317546 2318877 -500917 -3141257 -4011439 -3421968 -2650370 -2078533 -991963 930844
43009 930844 2762253 3315852 2532013 1403395 699528 266441 -292722 -664339 -24145
43000 -24145 1789606 3737986 4606977 4434715 4424595 5321349 6408751 6547497 5768943
42991 5768943 5101153 4982531 4779580 4065185 3359945 2970164 1996892 -395093 -3217638
42982 -3217638 -4457827 -3564860 -1897297 -562741 801223 2541068 3658763 3106457
42974 3106457 1555890 631670 802260 1109329 690637 -446020 -1925794 -3263288 -3782661
42965 -3782661 -3289186 -2689689 -2931421 -3517186 -3292077 -2566629 -2878000 -4343657 -4930436
42956 -4930436 -3228513 -603770 552688 -257495 -1634266 -2388921 -2357681 -1615546 -288625
42947 -288625 843498 690251 -874926 -2687709 -3438847 -2831340 -1660123 -1033675 -1340450
42938 -1340450 -1753208 -1082143 692985 2318139 2981507 3289695 3905813 4165652 3198670
42929 3198670 1797106 1730479 3285542 4774419 4729548 3602071 2961735 3752625 5620437
42920 5620437 7383776 7943540 7125420 5678008 4198403 2469592 435705 -773500
42912 -773500 34416 2147047 3400273 2842977 1831332 2040955 3381135 4519842 4745294
42903 4745294 4547132 4669116 5164877 5374320 4640438 3048133 1335376 8521 -1007078
42894 -1007078 -1563685 -921268 1011708 2759946 2797431 1583193 831794 1100393 1537007
42885 1537007 1738324 2083013 2205656 1125795 -679201 -1324594 -389285 215642 -733177
42876 -733177 -1844894 -1596307 -849219 -1040685 -1478207 -686794 736840 1121972 877660
42867 877660 1991205 4456230 5769408 4497948 2129114 537253 -429102 -1634111
42859 -1634111 -2512521 -1836661 156566 1834891 2181863 1783166 1807969 2611722 3424971
42850 3424971 3157264 1516252 -600208 -1936709 -2065017 -1567057 -1223907 -1365939 -1837376
42841 -1837376 -2148682 -1799167 -909463 -378263 -931437 -2212407 -3302568 -3790792 -3651034
42832 -3651034 -2508317 -132538 2411333 3265720 1755981 -924864 -3161196 -4195436
42824 -4195436 -3853006 -2143659 233024 1825258 1709639 515823 -317795 -9850 1156609
42815 1156609 2434893 3124124 2732675 1171513 -1040963 -2846649 -3147093 -1717531 164526
42806 164526 626700 -642306 -1700000 -725446 1360727 1868346 -240549 -3255913 -5133420
42797 -5133420 -5534878 -5014401 -3650765 -1486119 618945 1580467 1076878 -564077 -2746107
42788 -2746107 -4396151 -4355478 -2812081 -1570796 -2008007 -3380294 -3987917 -3340600 -2198809
42779 -2198809 -1057217 256634 1737207 3000841 3887389 4485817 4629257 3998573 2626651
42770 2626651 846694 -953050 -2104881 -1814208 -281372 895311 376088 -1252142
42762 -1252142 -2359934 -2366848 -1896386 -1309828 -469479 181448 -200930 -1345820 -1854438
42753 -1854438 -1134166 -165186 175001 362443 1050020 1730810 1629047 1126610 1082910 1222539
42743 1222539 560392 -643936 -776664 770017 2252658 1571742 -952406 -2881059 -2630004
42734 -2630004 -1090439 -20419 145298 124357 188681 -113874 -854510 -1451155 -1621563
42725 -1621563 -1653179 -1506795 -626698 929090 2050598 1851989 716227 -422013 -1147266
42716 -1147266 -1471581 -1497383 -1726966 -2806995 -4266338 -4463037 -2680516 -365595 707040
42707 707040 539410 58932 -691766 -1925934 -2672525 -1969967 -880282 -1143256 -2161539
42698 -2161539 -1706349 325620 1392301 135288 -1645088 -1815081 -565066 937027
42690 937027 2520125 4165271 4990535 4764734 4889961 6113573 6738802 5162189 2921565
42681 2921565 2808269 4709150 5799412 4552423 2165465 42724 -1681991 -2711266
42673 -2711266 -2085090 -129838 1019579 124224 -1351373 -1381565 -153592 619288 251434
42664 251434 -473796 -925791 -1327945 -1874340 -2174692 -1811303 -932343 -191925 -291643 -1324978
42654 -1324978 -2337524 -2006379 -204092 1560687 1822429 883809 231917 607282 1451973
42645 1451973 2053952 2305964 2267324 1863293 1323133 1182004 1425802 1240991 118572
42636 118572 -1305220 -2113808 -2405759 -2982898 -3963691 -4547414 -4199525 -3250442 -2073973
42627 -2073973 -489754 1497732 3060540 3427334 2999214 2772515 2886223 2616145 1730933
42618 1730933 880415 452383 1077 -737797 -1108182 -492536 598678 1151799 937034
42609 937034 402261 -346322 -1461265 -2288905 -1472384 1331212 4466590 5758732 4889827
42600 4889827 3747192 4199388 5865872 6526229 4715694 1394479 -1260085 -2204512 -2017089
42591 -2017089 -1444095 -583305 367557 773863 641558 1052381 2558705 3840649 3122471
42582 3122471 605352 -1629995 -2080244 -1203015 -345787 -260896 -845942 -1481311 -1341415
42573 -1341415 -106106 1324708 1455742 -141406 -2291491 -3561183 -3623677 -3097059 -2631822
42564 -2631822 -2498204 -2592167 -2459184 -1592527 46451 1973635 3595933 4350438 3674822
42555 3674822 1557454 -913506 -2366412 -2659644 -2818584 -3355176 -3600483 -2986501 -1927802
42546 -1927802 -904939 238425 1282739 987132 -1294867 -3999786 -4730348 -3076259
42538 -3076259 -918583 10651 -250065 -819386 -1392108 -2199521 -3239796 -4119021 -4420257
42529 -4420257 -4013503 -3221399 -2684308 -2714090 -2800827 -2172737 -831207 428503 1018523
42520 1018523 1039424 690283 -176034 -1586195 -2980791 -3631431 -3346330 -2509974 -1566588
42511 -1566588 -655803 329321 1430753 2336357 2487960 1680672 478454 -276361 -380242
42502 -380242 -389585 -781225 -1317777 -1372117 -612392 772441 2278615 3347997 3647630 3355432
42492 3355432 3127335 3592685 4780817 6008942 6348291 5330150 3328306 1240763 -221393
42483 -221393 -857280 -709434 114855 1187099 1755830 1435882 686829 210072 66041
42474 66041 -181080 -631005 -877887 -576804 321674 1791711 3592652 4972004 5235637
42465 5235637 4726802 4463655 4497835 3459582 445738 -3161569 -4713414 -3184956 -370151
42456 -370151 1100592 515414 -568087 -544622 290624 398614 -787835 -2120455 -2384476
42447 -2384476 -1896899 -1862713 -2730581 -4004602 -5244289 -6186513 -6072856 -4143934 -1070128
42438 -1070128 1256106 1852348 1597397 1543130 1382280 457925 -712739 -1196101 -1332047
42429 -1332047 -2250413 -3801780 -4285424 -2608587 152940 1814479 1280676 -505745 -1473015
42420 -1473015 -271582 2396383 4334535 4079356 2375073 1015307 617351 327693 -514710
42411 -514710 -1469857 -1893664 -1814859 -1568661 -1294328 -1181509 -1579403 -2441438 -3184888 -3481715
42401 -3481715 -3681099 -4038923 -4014829 -2871217 -735868 1321657 2166372 1465510 2182
42392 2182 -807302 -156601 1262694 2057209 1831193 1459609 1648522 2136671 2582089 3188833
42382 3188833 3885913 3898666 2934421 1871024 1346093 635497 -838497 -1810969 -686234
42373 -686234 1752273 3051337 2507887 1995668 2964599 4414879 4709033 3862756 2859647
42364 2859647 1867640 519019 -757304 -1058069 -388705 338958 538570 345881 -12571
42355 -12571 -442894 -721673 -722722 -739961 -920479 -647189 687407 2468105 3359422 3062904
42345 3062904 2662607 2989294 3482372 3149269 2063411 1306729 1612044 2481795 2720957
42336 2720957 1767699 425848 49939 882651 1559356 608561 -1862662 -4363487 -5515721
42327 -5515721 -4881711 -2845619 -509882 676220 232415 -551168 -153485 1003776 1185556
42318 1185556 107002 -549453 172836 970133 406160 -903056 -1585819 -1791626 -2495121
42309 -2495121 -3361130 -3232822 -2410061 -2429043 -3359641 -3217396 -832070 2184482 3408318
42300 3408318 2579264 1539416 1765043 2899752 3471126 2365229 -244355 -2947148 -4237283
42291 -4237283 -3898872 -2982706 -2297614 -1601508 -661763 -227803 -1016493 -2280183 -2527946
42282 -2527946 -1526380 -503181 -294587 -372149 -56434 303179 28008 -704674 -1119950
42273 -1119950 -839492 66685 1580889 3430567 4569714 4052706 2540816 1889595 2784581
42264 2784581 3690864 2851792 577775 -1402013 -2308737 -2784783 -3155633 -2659391 -899704
42255 -899704 1086261 2064269 2165306 2319241 2672212 2584906 1951427 1472196 1521564 1584698
42245 1584698 1058047 1454 -1082229 -1670039 -1313069 59655 1712391 2563688 2337556
42236 2337556 1714791 1140111 230425 -1155757 -2016124 -1257856 660384 2006477 1716854
42227 1716854 431916 -479500 -388493 245051 538063 -33788 -1229481 -2204691 -2248361
42218 -2248361 -1485937 -707177 -440829 -433109 -193243 196935 194937 -292019 -564427 -68310
42208 -68310 572872 103532 -1634766 -3162941 -3059592 -1701317 -550710 -23637 882825
42199 882825 2724630 4450210 4677719 3408952 1847386 1037332 1237276 2085032 2710769
42190 2710769 2171586 550697 -722600 -419738 915254 1719220 1412519 708192 156147
42181 156147 -450550 -1101053 -1145563 -320039 633192 864834 340273 -468492 -1149261 -1255316
42171 -1255316 -380565 1125069 2092721 1770451 727673 101855 390349 1357924 2537550
42162 2537550 3281224 2894819 1422240 -105692 -830788 -1066043 -1514241 -1977386 -1631795
42153 -1631795 -215513 1838501 4046316 5795211 6139893 4867064 3426356 3379768 4018590
42144 4018590 3174748 711317 -593747 1387606 5142524 7396105 6896779 4853420
42136 4853420 2448666 -199537 -2735834 -4070976 -3820520 -3085464 -3086903 -3701642 -3875945
42127 -3875945 -2963205 -1226163 544338 1547247 1484735 852915 403516 166992 -556531
42118 -556531 -2082266 -3756295 -4745684 -4884237 -4441278 -3662114 -2984704 -3072913 -3921547
42109 -3921547 -4373817 -3359214 -1378787 93299 597254 1121155 2337239 3352271 2891182
42100 2891182 1197066 -64341 251554 1524153 2221048 1579651 190814 -786293 -599354
42091 -599354 765681 2679620 4098857 4182889 3166012 2362716 2766276 3794786 4059464
42082 4059464 3290425 2651849 2962977 3547011 3400269 2711804 2421430 2794446 3257284
42073 3257284 3275756 2623599 1169640 -723267 -1934464 -1755613 -1143457 -1706239 -3464869
42064 -3464869 -4757716 -4504267 -3402247 -2564477 -2137452 -1851731 -1931903 -2666887 -3703007
42055 -3703007 -4373453 -4246348 -3071266 -978696 908032 1076010 -479637 -1840042 -1407344
42046 -1407344 239143 1504363 1914271 2103527 2419048 2634545 2523380 1783702 62025
42037 62025 -1963600 -2402102 -419009 2041617 2395574 728999 -766199 -1194168 -1656141
42028 -1656141 -2568401 -2628734 -1179271 384934 627660 -68975 -709609 -1294188 -1981077
42019 -1981077 -1901420 -305181 1870635 2941667 2562190 1856772 1904083 2924666 4427631
42010 4427631 5332348 4559814 2415325 811663 1188707 2732988 3519203 2785353 1178631
42001 1178631 -417880 -1083172 271114 3546322 6383924 6224354 3450862 908655
41993 908655 249103 458568 303300 330460 1483100 3221878 4312053 4549983 4507647
41984 4507647 4215367 3285888 2018269 1323084 1582234 2295777 2797162 2748242 2056893
41975 2056893 922426 -17578 -84302 770058 1936833 2804257 3245185 3511980 3838928
41966 3838928 4150912 4130327 3634209 2910393 2134093 959043 -849368 -2404258 -2253153
41957 -2253153 -309424 1676157 2259784 2101941 2608971 3439887 2859536 549578 -1450807
41948 -1450807 -1192381 964450 3383800 5387085 7228444 8449285 7850975 5373834
41940 5373834 2802508 1934514 2714596 3737090 4004863 3536545 2700737 1776810 1058285
41931 1058285 720075 572911 407218 427266 809345 1066777 611314 -167092 -243268 620611
41921 620611 1735960 2830323 4360962 6164004 7104557 6820522 6634215 7738907 9534781
41912 9534781 10904042 12043322 13520935 14497670 13864393 12569486 12554240 13500592 13117511
41903 13117511 11100770 10189436 12019896 14235952 13671495 10745245 8456919 8112765
41895 8112765 8467960 8625789 9298370 10898374 12458564 13156952 13339951 13288002 12368825
41886 12368825 10364310 8501283 8012181 8348563 7863438 5851939 3041651 433507
41878 433507 -1388725 -1935484 -791706 1723941 4350586 5660633 5003542 2830324 379504
41869 379504 -1056183 -930085 373173 2194705 4204315 6125857 7263808 6964618 5526305
41860 5526305 4028740 3099486 2388039 1491606 792982 848035 1331042 1273119 304996 -870089
41850 -870089 -1305504 -705085 556957 1878322 2744416 2980802 2947377 3299757 4406734
41841 4406734 6097729 7900597 9228809 9441111 8270902 6347618 4812671 4220785
41833 4220785 4256081 4624215 5534134 6991631 8375704 9244586 9844842 10187659 9471759
41824 9471759 7464415 5768777 6288688 8599697 10191219 9437856 7163948 5111774
41816 5111774 4073037 3880763 4101710 4206810 3969276 4097229 5513859 7669914 8756166
41807 8756166 8115253 7099127 6698411 5780808 3117273 37482 -814945 1014854 3244216
41798 3244216 3811738 2932157 2018332 1872229 2367567 2879418 2506699 661412 -2002697
41789 -2002697 -3742003 -3256049 -871793 1855970 3390593 3173288 1949070 1234064 1934025
41780 1934025 3356314 4006483 3382660 2474001 2410994 3167626 3825274 3721948 3062709
41771 3062709 2567378 2684150 3157968 3429217 3368289 3268156 3141584 2660085 1961559 1710754
41761 1710754 1963097 1895039 1264405 1014971 1436419 976283 -1449586 -3895995 -3343198
41752 -3343198 30452 2796831 2819058 1708765 1993536 3770862 5363533 5786887 5203594
41743 5203594 3986726 2607545 1718248 1350073 768957 -44543 240554 2382690 4942572
41734 4942572 5931207 5471642 5462436 6953589 9143281 10803610 11484998 11257753 10293007
41725 10293007 8950784 7646621 6500474 5486844 4752612 4366922 4069140 3757438 3867561
41716 3867561 4713865 5778934 6157147 5372737 3441267 758805 -1622812 -2435199 -1596782
41707 -1596782 -411064 283919 1141077 2621968 3587410 3004728 1947433 2075574 2955574
41698 2955574 2954883 2234206 2506164 3943725 4763260 4201008 3528764 3458042 2910592 1492673
41688 1492673 980137 2687564 5045526 5623490 4374073 3114967 2720339 2611693 2441569
41679 2441569 2554355 2984063 3401063 3938754 4906581 5841733 5945879 5352271 4979945
41670 4979945 5259023 5881745 6575777 7164511 7099780 6036909 4866708 5171306 7471924
41661 7471924 10685211 13302825 14491691 14211942 13013515 11684077 10577775 9545369
41653 9545369 8917043 9729764 12053159 13966784 13642109 11851906 10784009 10845107 10628116
41644 10628116 9854549 9945164 11169635 11600068 10040061 8035141 7614349 8749618 10549124
41635 10549124 13286447 17295696 21117748 22891155 22817322 22295994 21392217 19336654 16937727
41626 16937727 15943269 15990086 14665155 11076182 7142402 4705251 3550260 3170000 4210687
41617 4210687 6723541 8933546 9543795 9732943 10968067 12171899 11268711 8631744 6608004
41608 6608004 5990402 5295128 3625624 2070926 1756652 2362085 3263596 4546442 6049637
41599 6049637 6781720 6268371 5482510 5586796 6569610 7766863 8823032 9464910 9259338
41590 9259338 8338381 7467483 6670154 4831024 1617951 -1263406 -2026767 -1207517 -658802
41581 -658802 -708798 70835 2403500 5128166 6673771 6517793 5000176 2848130 1203298
41572 1203298 1071213 2265384 3611902 4406288 4830699 4802832 3617973 1347936 -454156
41563 -454156 -407331 968545 2120032 2627246 3466040 5185033 6843223 7183059 6265392
41554 6265392 5375498 5498620 6376524 7092280 7104157 6432033 5282297 4101366 3734759
41545 3734759 4625407 5764638 5448743 3494398 1694179 1425910 1906618 1818103 1519493
41536 1519493 2102555 3151263 3453515 3484862 4858923 7207406 8090748 6775516 5715269
41527 5715269 6886737 8721494 8573518 6661682 5371321 5671094 6511797 7244952 8338039
41518 8338039 9693863 10354321 10268557 10591314 11637526 12039956 10692977 8383111 6767344
41509 6767344 6627376 7664553 9058681 9621043 8355339 5693139 3479617 2944537 3241092
41500 3241092 2722628 1110136 -463541 -1143321 -1078250 -551007 632310 2549050 4581440
41491 4581440 5883940 6150476 5584797 4348408 2527153 675501 -166752 498320 1776727
41482 1776727 2141155 1096745 -442447 -1520143 -2145567 -2594228 -2541439 -1668688 -542590
41473 -542590 50665 270396 739754 1207226 874470 25336 69353 1638161 3702270
41464 3702270 5015400 5476483 5543399 5240336 4514409 3914557 4110951 5079618 6292908
41455 6292908 7333482 7886748 7636026 6736783 5997162 6010009 6360763 6131068 4941553
41446 4941553 3216349 1794500 1514478 2621799 4232848 4984833 4627114 4305509 4809314
41437 4809314 5364080 4873766 3533920 2257708 1242158 287041 -69785 790916 2022518
41428 2022518 1992209 698821 75193 1352104 3311333 3915584 2814753 1419582 1062485
41419 1062485 1902614 3383674 5035336 6689676 8204903 9158561 8972623 7493516 5266013
41410 5266013 2991723 1007274 -369995 -530038 628539 2021384 2534804 2568154 3176640
41401 3176640 3882242 3051071 773376 -527486 629476 2567675 3002600 2430381 2978433
41392 2978433 4681682 5214041 3370553 740262 -705454 -1044391 -1535095 -2576606 -3598518
41383 -3598518 -4172562 -4206063 -3504160 -2032733 -376445 748328 1271830 1561320 1682129
41374 1682129 1413906 834159 327411 3516 -495479 -1516914 -2865556 -3713572 -3091335
41365 -3091335 -848873 1751333 2920509 2191820 961993 784472 1610953 2326270 2555055
41356 2555055 3002189 4086663 5156841 5306598 4325242 2602053 670485 -862128 -1455149
41347 -1455149 -1113781 -444339 14827 235244 341744 269089 66836 128664 684465 1295826
41337 1295826 1263170 476528 -349274 -234536 1228190 3262772 4172367 2860530 356138
41328 356138 -860333 430046 2750608 3881707 3635995 3641700 4667895 5476606 4654349
41319 4654349 2563743 863124 700722 1923166 3571197 4548575 4104499 2318589 200449
41310 200449 -988631 -642323 854855 2423437 2920089 1942500 293165 -652695 -312547
41301 -312547 598895 1105941 1137677 1311657 1875205 2373336 2300356 1648174 718207 -333315
41291 -333315 -1579816 -2979027 -4048066 -4102521 -3012811 -1530050 -488474 170287 1072283
41282 1072283 2278014 3284156 4170464 5623179 7368914 7819535 6282675 4478825
41274 4478825 4384656 5263294 4712716 2522207 1357904 2945001 5487558 6218243 5058349
41265 5058349 3962540 3536395 2476641 329869 -1309394 -1169164 -298667 -443180 -1396983
41256 -1396983 -1423669 84575 1814416 2509790 2457793 2484597 2543440 2217672 1952289 2627274
41246 2627274 4039425 4861606 4331033 3130592 2213107 1496419 347947 -1113767 -1925405
41237 -1925405 -1372319 302641 2194943 3399391 3556717 3126726 2975027 3379677 3713521
41228 3713521 3472729 3170872 3514597 4021654 3448985 1648840 30439 -177808 665646
41219 665646 1395399 1496554 1162841 511769 -402488 -1069610 -894279 -142392 201017 -244222
41209 -244222 -652134 -123447 996010 1559490 1303459 1341367 2538775 3952798 3802955
41200 3802955 1960387 415791 745858 2013539 2116656 590298 -1144692 -2005612 -2291782
41191 -2291782 -2392573 -1905685 -622929 791472 1834190 2837327 3825738 3786988 2174228
41182 2174228 225463 -507107 -216477 2402 401880 2131209 4696446 5916401 4962419
41173 4962419 3684129 3952129 5116206 5353847 4464150 3830953 4211240 5105928 6204231
41164 6204231 7980724 10451788 12430439 12721011 11501976 9959543 8934521 8488879
41156 8488879 8546233 9217623 10278508 10860532 10234406 8842253 8035577 8554415 9638400
41147 9638400 10027144 9567010 9251663 9698565 10222861 9739348 8199819 6726671 6405031
41138 6405031 7187429 8053224 8276448 8518811 10318607 14117513 18114801 19838451 18876280
41129 18876280 17250022 16862509 17454134 17601371 16861738 15969311 15382122 14716724 13593399
41120 13593399 12197127 10900937 9970614 9650206 9849296 9706383 8281604 5972291 4505396
41111 4505396 5031283 6737493 7856386 7631334 6717699 5949076 5442452 4987573 4714961
41102 4714961 4990415 5841665 6826394 7529117 7992899 8462038 8759542 8253439 6662056
41093 6662056 4682655 3478882 3552464 4314672 4685614 3952617 2302425 851143 830523
41084 830523 2172069 3172633 2389747 742825 633379 2758503 5032072 5347073 4235390
41075 4235390 3629109 3889287 3681967 2495757 1540574 1763271 2386575 2177946 1186276
41066 1186276 387453 284968 655325 1167401 1482334 1157538 267313 -190835 570925
41057 570925 1683343 1309156 -906854 -2898407 -2360295 492915 3054411 3239156 1672715
41048 1672715 602109 1045779 1840096 1667477 1072954 1506075 2840290 3278373 2027505
41039 2027505 709875 1189706 2992222 4152185 4041717 3889757 4615339 5618739 6034989
41030 6034989 5873477 5292247 3862361 1479036 -743269 -1499540 -871372 -70352 118063
41021 118063 -138098 -532809 -1079974 -1627971 -1601328 -576122 1151225 2723594 3331653
41012 3331653 2762057 1594995 777762 753439 1105429 1259887 1283848 1619700 2269673 2790046
41002 2790046 3047242 3430255 4173534 4885781 4980814 4361091 3504676 2943718 2686710 2173250
40992 2173250 999343 -259071 -355894 1182246 3308500 4598525 4764684 4442805 3873312
40983 3873312 2724708 1148446 2874 -244148 -27127 238589 819887 1916157 2916012
40974 2916012 3092626 2681773 2613707 3254838 3849534 3265803 1218497 -1124650 -1873260
40965 -1873260 -217300 2479693 3967520 3583734 2757540 2906244 3783122 4402376 4603875
40956 4603875 4778874 4771145 4195996 3508500 3659791 4754151 5920932 6490911 6577804 6630953
40946 6630953 7148721 8588855 10648721 11848368 10954884 8812404 7557664 7853435 8203018
40937 8203018 7445108 6543547 6957313 8311243 8963945 8349841 7510544 7408600 7758854
40928 7758854 7759332 7311792 7155395 7957075 9366283 10047419 8962340 6666562 4846826
40919 4846826 4420434 4718747 4828616 4921662 5618627 6745557 7576307 7825923 7584986
40910 7584986 6773710 5594884 5008750 5580841 6253975 5688879 4662222 5456201 8580860
40901 8580860 11817103 13258567 13682807 14671392 15731326 15040280 12384132 9548565 7858390
40892 7858390 6894439 5922592 5236350 5479822 6593679 8064233 9541227 10682685 11018633
40883 11018633 10552263 9995966 9853953 9753990 9315036 9181550 10264250 12090078 12892736
40874 12892736 11662920 9450536 8211277 8797185 10512204 12286190 13665004 14673587
40866 14673587 15319477 15636694 16022026 17073994 18896725 20761416 21796757 22098589 22877497
40857 22877497 25242041 28973966 32834508 36031305 38959498 42393194 46485070 51068198
40849 51068198 56686361 64643067 75840955 90013083 106432583 125188266 147499274
40842 147499274 174899430 208281386 247307466 289742913 330575542 362055390 376046441
40835 376046441 368232239 341259909 303795702 265709748 233252330 207967279 189101531
40828 189101531 176077993 168787276 166783620 169261922 175534134 184541551 193657584 198764581
40820 198764581 196358466 185780926 169283395 150045832 130379010 111631003 94979308
40813 94979308 81428117 70946798 62340984 54541544 47707676 42511797 38668385 35071751
40805 35071751 31404555 28558100 26999916 25692963 23470274 20745008 18764377 17617488
40797 17617488 16244728 14312972 12766984 12280551 12400850 12745161 13881500 16130308
40789 16130308 18310403 18717541 16970572 14099102 11199083 8821349 7321290 6803467
40781 6803467 6744147 6490580 6169410 6381402 7009706 7166589 6490849 5695531 5499001 5727595
40771 5727595 5934689 6268285 7044620 7830172 7723552 6571985 5315480 4876412 5052992
40762 5052992 4852733 3804137 2552290 2007966 2237644 2601108 2811381 3214836 3884831
40753 3884831 4163847 3643118 3086775 3657159 5438054 7359329 8424493 8422391 7654314
40744 7654314 6703876 6346744 6853042 7365864 6791457 5363804 4457275 4735418 5464710
40735 5464710 5915177 6345306 7062299 7570327 7515202 7667832 8937602 10850972 11952173
40726 11952173 11530151 10265531 9355021 9517599 10564244 11426442 10936652 9075378 7093798
40717 7093798 6012634 5559383 5045639 4512825 4281054 4158896 4041799 4525548 5781495
40708 5781495 6553682 5701226 4220260 4152456 5781468 7570542 8740460 10090300 12106492
40699 12106492 14118964 15803369 17755249 19912795 21129112 21186120 21594704 23314462
40691 23314462 25203911 25974451 26209688 26938090 27535324 26907980 25851487 26247276 28315971
40682 28315971 30403754 31263181 30965304 29733612 27484143 24600623 21795323 19112947
40674 19112947 16281226 13978749 13376274 14299899 15124240 14656677 13007210 10651034 8017408
40665 8017408 6078971 5807679 6679167 7071867 6444409 5684150 5056000 3621541 1369082
40656 1369082 70218 877292 2614385 3690125 4217152 4777142 4544706 2585236 37962
40647 37962 -1078713 -729477 -553150 -983352 -740053 645364 1724390 1161487 -582975
40638 -582975 -2218505 -3044412 -2793110 -1212168 1368992 3813986 5202443 5556580 5233369
40629 5233369 4382733 3434242 3242591 4055566 4956534 4949826 4039527 2697064 987670
40620 987670 -957182 -2188984 -1725352 94433 1957667 3248925 4481157 5909776
40612 5909776 6642261 5742513 3720436 2183398 2066862 2810379 3429093 3790069 4286445
40603 4286445 4640919 3970446 2219407 651393 353826 953551 1561833 2291972 3666096
40594 3666096 4941752 4586622 2613240 983603 1100234 2133017 2580748 2271335 1743390
40585 1743390 740304 -1154594 -2951105 -2931381 -904782 1451361 2603556 2483969 1774671
40576 1774671 982357 441351 255819 -17028 -765835 -1315613 -592919 1020168 1792862
40567 1792862 1072445 229466 406105 781646 376732 275624 2114200 5010975 6173879
40558 6173879 4663725 2607080 2129817 2818009 3120403 2753412 2384470 1955583 832623
40549 832623 -809525 -2006900 -2214445 -1550537 -213854 1253378 1507490 -346136 -3012305
40540 -3012305 -3959022 -2481435 -532008 -30808 -699901 -1270027 -1346552 -842325 1072142
40531 1072142 4546599 7342963 6797926 3570463 1384451 2460951 5036590 6365728
40523 6365728 6454888 7230270 9172167 10727807 10677941 9286391 7031671 3889520 466383
40514 466383 -1517804 -932843 1196868 2667633 2317087 683872 -1190812 -2865353 -4373537
40505 -4373537 -5552986 -5840055 -4768676 -2664013 -673149 210754 139004 52745 374007
40496 374007 660480 710812 1166336 2363116 3253873 2516739 552890 -658205 138749
40487 138749 2187918 4019742 5152116 5921558 6370767 6234002 5740490 5528394 5700010
40478 5700010 5640371 4905346 3709614 2377419 918234 -543307 -1476786 -1566500 -1224531
40469 -1224531 -963077 -588224 339949 1459368 1828486 1286961 807235 1105502 1524978
40460 1524978 899437 -815045 -2398881 -2752772 -1886465 -533558 681497 1494084 1826043
40451 1826043 1745377 1535334 1563075 1980409 2562772 2873251 2633357 1918793 909323 -468333
40441 -468333 -2355184 -4354553 -5501552 -5143507 -3605763 -1685616 212685 2007199
40433 2007199 3327578 3710826 3432336 3462383 4338914 5545943 6238336 6176169 5721174
40424 5721174 5291538 5054942 4837250 4174534 2823774 1333317 602465 682647 602452
40415 602452 -295600 -1440461 -1859948 -1300858 -24026 1804227 3751926 4787460 4314451
40406 4314451 3150271 2448250 1999548 839456 -651042 -780734 995781 3087083 3923305
40397 3923305 3900557 4245713 4951052 5060894 4441898 4019468 4400795 5248366 5950008 6013646
40387 6013646 4833926 2082786 -1348660 -3613243 -3678558 -2421059 -1491747 -1392138 -1201409
40378 -1201409 -124453 1304821 1947893 1664858 1485904 1984213 2222718 1091882 -751830
40369 -751830 -1442434 -435024 778372 943613 757481 1358838 2215066 1970763 823971
40360 823971 446218 1563341 3036421 3605129 3325728 2878269 2536276 2395676 2757434
40351 2757434 3635262 4457258 4713846 4370742 3360347 1418499 -1090097 -2872338 -2862808
40342 -2862808 -1277615 857104 2691308 3716210 3669242 2904431 2347758 2499129 2902279
40333 2902279 3042774 3163628 3596818 3886181 3329756 2002289 621348 -183399 32048
40324 32048 1469815 3403718 4293108 3586749 2792645 3562060 5164484 5215778 2746352
40315 2746352 -744601 -3231948 -3872898 -2783446 -597487 1331222 1574958 169386
40307 169386 -1333556 -1798223 -1656782 -1764839 -2048086 -1816749 -661518 1376680 3739551
40298 3739551 5148350 4490906 2405784 926889 919254 979165 -274466 -1965739 -2255188
40289 -2255188 -1011746 256467 710908 1011975 1890227 3044566 3629784 3090171 1500948
40280 1500948 -316936 -1209336 -848534 -199464 -178671 -302334 467694 2010784 3308653
40271 3308653 4102218 5005642 6068221 6574652 6395821 6168474 5812656 4289831 1485886
40262 1485886 -984182 -1855622 -2093351 -3489777 -5994956 -7689310 -7225821 -5231439 -3224823
40253 -3224823 -2034052 -1544619 -1326454 -1045172 -551220 46587 437723 445564 301442 403239
40243 403239 712220 570196 -609633 -2522670 -4191430 -4994515 -4967761 -4025326 -1767093
40234 -1767093 1366568 3619145 3699614 2599369 2440266 3700022 4820233 4561810 3414197
40225 3414197 2397782 1763661 1370007 1165763 719794 -583898 -2221908 -2595391 -1260281
40216 -1260281 92418 -62776 -964930 -1067202 -571489 -729744 -1330068 -874194 895922
40207 895922 2552501 3267028 3765383 4493075 4494254 3068947 1320163 938579 2146814
40198 2146814 3703948 4369438 3650788 1732110 -473033 -1588962 -924615 775842 2237391
40189 2237391 3028463 3518437 3847317 3706626 3059970 2367367 1919616 1404412 352102
40180 352102 -1197584 -2574696 -2928984 -1871646 148562 2124912 3250214 3363150 2700265
40171 2700265 1535549 240156 -634445 -726658 -239149 319406 696117 994084 1345460
40162 1345460 1773551 2333884 3104931 3973798 4601209 4665832 4089012 3068959 1988328
40153 1988328 1214075 856939 778211 929937 1540816 2713981 3903340 4174686 3220424
40144 3220424 1913117 1520629 2368389 3558323 4073017 3797664 3189244 2320239 900175
40135 900175 -756658 -1493933 -478270 1720255 3573183 3936534 2787984 1034250 -51648
40126 -51648 434754 2332178 4538138 6048291 6556434 5886687 3685858 458999 -1842894
40117 -1842894 -1616742 164220 838776 -625090 -2411523 -2383261 -721500 627997 291191
40108 291191 -1471082 -3361794 -4006709 -2871040 -891561 252597 41134 -236195 753080
40099 753080 2645158 4126759 4756974 5106596 5565904 6040207 6522334 6911510 6427596
40090 6427596 4326936 1312502 -769782 -969418 -250509 -183451 -1192277 -2361811 -2544954
40081 -2544954 -1488818 -194841 -129397 -1644057 -3275997 -3152105 -1010823 1698173 3488981
40072 3488981 3839265 2756225 555252 -1614342 -2118303 -462842 1990858 3504153
40064 3504153 3711857 3459140 3407411 3425727 3127047 2463692 1763537 1362392 1167192 671458
40054 671458 -321890 -1181171 -1209153 -812894 -1109168 -2241625 -2963366 -2257194 -592928
40045 -592928 866874 1548583 1412035 367362 -1498713 -3581623 -5248809 -6261611 -6365467
40036 -6365467 -5260946 -3587582 -2988680 -4167997 -5600266 -5343833 -3572321 -2039769
40028 -2039769 -1522301 -1301025 -959619 -1023605 -1624061 -2075193 -2188255 -2567403 -3082703 -2537378
40018 -2537378 -665390 937232 980122 403783 863921 2279449 3355785 3784643 4236282
40009 4236282 4575493 3904685 2425508 1510609 1520051 1189662 -57167 -714217 671073
40000 671073 3081687 4258503 3741699 3104930 3287277 3292960 2008357 -1807 -1407996
39991 -1407996 -1974372 -2436521 -2949667 -2808510 -1756384 -530979 330611 1421170 3463410
39982 3463410 5838301 6984735 6228627 4484439 3010376 2139603 1537463 1082506 930589
39973 930589 1045677 1224614 1459389 1883245 2501485 3273790 4168007 4746320 4127839 2025072
39963 2025072 -512062 -2205540 -3140396 -4203494 -5065003 -4162726 -1174774 1842386 2734433
39954 2734433 1686518 355270 -535234 -1410748 -2269706 -2410314 -1618009 -350194 1201073
39945 1201073 2986844 4109879 3416987 1348655 -180884 -198000 302681 207496 -216116
39936 -216116 -346765 -339873 -288219 449704 1950724 2958668 2694881 2278567 2873720 3591953
39926 3591953 3068679 2061447 2169122 2667969 1376351 -1380693 -2595226 -1053931 791128
39917 791128 751948 172062 1281974 3290197 3624038 1936577 354196 143513 380570
39908 380570 -13944 -830337 -1495005 -1905486 -1928207 -1311549 -485958 -341860 -813893 -692495
39898 -692495 709358 2559884 3595227 3437566 2458374 1106473 -143282 -810011 -901828
39889 -901828 -981022 -1386009 -1771536 -1659937 -1047557 -307531 70051 -414035 -1813410 -3257196
39879 -3257196 -3585447 -2675179 -1511669 -808212 -345654 123871 342052 412967 1150239
39870 1150239 2695993 3655027 2711864 573301 -819995 -697619 -16402 138057 -390205
39861 -390205 -1214151 -1683910 -845497 1530558 3698446 3255266 378275 -1735995 -825650
39852 -825650 1304329 1254456 -1199096 -2910995 -1863780 351380 1304053 1031546 1114259
39843 1114259 1844160 2274285 2450567 3483607 5260486 5997946 4809536 3214103 3032100
39834 3032100 3888313 4042201 2966538 1778714 1463029 1928147 2759408 3733129 4395495
39825 4395495 4126673 2987990 1786587 1029609 521818 262808 892304 2645261 4493155
39816 4493155 5092998 4305601 3113310 2233226 1573326 1139309 1670679 3733734 6475680
39807 6475680 8068175 7675797 6463435 6140034 6888597 7536374 7605148 8014964 9321592
39798 9321592 10401426 9897464 8234397 6974847 6546043 5892959 4352873 2652033 1791382
39789 1791382 1918838 2560193 3082802 2716326 1057502 -1113291 -2362056 -2236229 -1548398
39780 -1548398 -904113 -90780 748396 702577 -397651 -1309612 -1210828 -1076833 -2007602 -3158777
39770 -3158777 -2869110 -1256507 -75680 -169669 -547718 -84897 1179805 2697329 4180476
39761 4180476 5276594 5415935 4563835 3526683 3044288 2980689 2724830 2053925 1363183
39752 1363183 1268864 2061186 3331025 4192049 4140991 3586770 3256549 3295155 3292288 2914713
39742 2914713 2076200 793952 -573068 -1191911 -458487 1270572 3025047 4023796 3853599
39733 3853599 2522408 944832 596157 1710795 2504374 1409919 -475035 -661752 1329970
39724 1329970 3504687 4303923 4239245 4288352 4386219 4248957 4267659 4678555 4935568 4690798
39714 4690798 4393849 4235518 3581910 2207331 975294 438295 -143292 -1449227 -2868152
39705 -2868152 -3641585 -4073875 -4384440 -3606461 -1304059 623220 -82156 -2706278 -4234510
39696 -4234510 -3233812 -1117101 531100 1772551 2865373 2984756 1591854 -270079
39688 -270079 -1271470 -1434735 -1399134 -960434 354112 1807744 1925656 415270 -1387658
39679 -1387658 -2069218 -1374565 108908 1668702 2611584 2390140 1117982 -292731 -901266
39670 -901266 -604244 -41208 291724 589789 1309109 2384427 3199833 3406616 3397731 3624462
39660 3624462 3737969 3027492 1648167 609914 236538 -550305 -2641320 -4940453 -5217728
39651 -5217728 -2793943 564132 2763201 3592810 4210034 5016384 4972837 3010294 -553928
39642 -553928 -4184965 -6309173 -6244210 -4423233 -1997806 -47562 1003947 1239306 796516
39633 796516 -80138 -778276 -742495 -183846 236079 447812 931029 1501324 1148984 -416748
39623 -416748 -2054341 -2782875 -3122577 -3790465 -4011928 -2725438 -944756 -991789 -3201571
39614 -3201571 -5153469 -4795954 -2859907 -1346061 -930900 -988970 -1176557 -1616259 -1956116
39605 -1956116 -1492410 -242036 899771 1116194 310930 -1084388 -2517122 -3636952 -4480321
39596 -4480321 -5147469 -5237848 -4159720 -2262902 -988426 -1322467 -2543193 -3053829 -2162616
39587 -2162616 -631029 242035 -203956 -1365881 -1785788 -738075 519282 -48274 -2535072
39578 -2535072 -4633542 -4410932 -2487906 -755464 -42896 -40563 -500752 -1231591 -1579236
39569 -1579236 -1132002 -445464 -94520 307388 1123268 1611400 1125620 544945 990021
39560 990021 1884588 2003468 1732319 2250198 2955079 2094254 16873 -617822 1490803
39551 1490803 4475129 5999648 5948524 5409078 4597995 3107795 1164789 -502013 -1409461
39542 -1409461 -1303546 -172619 1244009 1853706 1565827 1358300 1691206 1899754 1425990
39533 1425990 435639 -1067212 -3298350 -5416238 -5739771 -3961773 -1781732 -730975
39525 -730975 -829216 -1849592 -3915741 -5953347 -5797408 -3392306 -1863667 -3480136 -6344092
39516 -6344092 -7313997 -6563963 -6519776 -7450359 -7240658 -5183784 -3003709 -1849842 -915646
39507 -915646 364045 1099798 821022 582168 1147424 1664094 1199058 270047 -193762
39498 -193762 -282862 -428077 -215772 961324 2598806 3434677 2908342 1605906 431519
39489 431519 -139111 -83020 429443 1111937 1399882 469492 -1981550 -4712425 -5427791
39480 -5427791 -3105226 498188 2459615 1618685 -748180 -2756305 -3465290 -2866767 -1451430
39471 -1451430 37465 1145465 2064361 2969499 3366455 2845075 2017124 1670126 1360961
39462 1360961 63277 -2007502 -3511537 -3840857 -3537975 -2880803 -1526788 166032 907653
39453 907653 169564 -954524 -1136583 -260722 836944 1297409 763944 -213914 -353748
39444 -353748 841143 1995386 1559735 269206 167410 1286180 1478017 -7367 -1087777
39435 -1087777 -14003 2149303 3639373 4683342 6193466 7246533 6095703 3031062
39427 3031062 282421 -718289 -504888 -216506 -361632 -843990 -1199413 -875187 80354
39418 80354 958887 1507537 2324933 3454707 3606624 1877266 -623626 -2093028 -2211281
39409 -2211281 -1728004 -700303 1262772 3526681 4872047 5220099 5473383 5816471 5594325
39400 5594325 4757274 4019008 3616854 3246385 3149983 3852048 4783794 4607001 3082770
39391 3082770 1327498 135660 -555950 -470806 1056351 3495366 5099264 5149777 4762393
39382 4762393 4681467 3819803 1211520 -1844358 -3165571 -2545607 -1749972 -1948730 -2537059
39373 -2537059 -2604442 -2378288 -2673711 -3593705 -4416455 -4591595 -4354853 -4211505 -4116997 -3577085
39363 -3577085 -2541639 -1680231 -1493675 -1604079 -1329622 -547940 438672 1357220 1724133
39354 1724133 871401 -879682 -1787645 -732349 847709 685841 -916031 -1401122 88566
39345 88566 1229472 -30456 -2403050 -3162681 -1792414 -22553 929207 1396762 1902973
39336 1902973 2372434 2747726 3114192 3040813 1826155 -378126 -2482873 -3632119 -3778103
39327 -3778103 -3128637 -1891336 -692709 -357274 -891526 -1339782 -1002782 -239160 244412
39318 244412 268998 -77284 -925633 -2143269 -2776426 -1846366 326828 2306433 3107642
39309 3107642 2903889 2093360 629713 -1170911 -2102070 -1469011 -522854 -1130371 -3059111
39300 -3059111 -4056249 -3034811 -1687489 -1971618 -3242257 -3317946 -1649069 173344 851025
39291 851025 850066 1253079 2237764 2979108 2387289 28359 -2943620 -4116880 -2198497
39282 -2198497 1113551 2824203 2073533 567185 -260795 -793407 -1670692 -2484142 -2789744
39273 -2789744 -2943600 -3089351 -2659362 -1754504 -1661788 -2931629 -4153433 -3810165 -2307928
39264 -2307928 -1034551 -431092 -169632 -213398 -415563 -26523 1076990 1647817 959915
39255 959915 391457 1457918 3282050 4018588 3964026 4871453 6543191 6658440 4246120
39246 4246120 1039200 -1157922 -2359546 -2995896 -2732877 -1787808 -1594384 -2724364 -3502050
39237 -3502050 -2201869 291553 1461861 275721 -1882495 -3086247 -2707393 -1527647
39229 -1527647 -718102 -699239 -780930 -174844 727106 859031 315153 503805 1948858 3115161
39219 3115161 2386671 354315 -978461 -734252 172708 607905 449948 285849 595235
39210 595235 1268311 1549834 692895 -948046 -1883358 -1106119 573258 1359174 356709
39201 356709 -1840797 -4015070 -5128971 -4664543 -3018768 -1512455 -1310327 -2232161 -3035474
39192 -3035474 -2792589 -1599029 -138064 905471 1133783 772608 773293 2021514 4217987
39183 4217987 5880102 5701870 3819509 1641210 471513 361881 389857 24058 -195052
39174 -195052 330353 1054048 965204 306118 470277 1884100 3113630 2776113 1427448
39165 1427448 631442 818572 1102134 827681 254951 -218647 -636440 -1149522 -1636145
39156 -1636145 -1754243 -1176512 17054 1043154 1025768 169410 -371789 -203031 -366108
39147 -366108 -1590727 -2811191 -2521128 -890773 691137 1612332 2230411 2521154 2061563
39138 2061563 1237609 1003296 1351307 1322380 607226 -154392 -713369 -1403824 -1823002 -923138
39128 -923138 1044098 2157894 1203578 -767918 -2043743 -2340084 -2464436 -2850180 -3338351
39119 -3338351 -3722743 -3738143 -3043824 -1736303 -329279 979645 2180078 2549009 1275026
39110 1275026 -641700 -780627 1542166 4090803 4782837 4311684 4234611 4091990 2533164
39101 2533164 143463 -1270723 -1630942 -2390827 -3546923 -3295254 -1101845 1044082 1306511
39092 1306511 293809 -231819 366262 1511045 2577384 3255971 3404532 3144212 2627383
39083 2627383 1535680 -436047 -2465324 -2955977 -1376568 1053249 2774631 3218132
39075 3218132 2668180 1838522 1753528 2931929 4415024 4714423 3931936 3631894 4335548
39066 4335548 4718557 3857346 2570117 1634920 442642 -1250735 -1912939 -420521 1600918
39057 1600918 1714554 145334 -854450 -656483 -931096 -2512821 -3814420 -3204908 -1332302
39048 -1332302 5681 252755 306133 934331 1901637 2525525 2537813 2258926 1998093 1433638
39038 1433638 4512 -1957391 -3180264 -3036521 -2432451 -2330339 -2158966 -875414 979624
39029 979624 1783981 1204554 567912 754899 1101242 658186 -681841 -2564349 -4434947
39020 -4434947 -5157955 -3735406 -904045 1233563 1723556 1703195 2298930 2972224 2814721
39011 2814721 2193279 1965103 2048874 1938709 1840057 2159673 2532208 2440820 2223106 2430873
39001 2430873 2753602 2593146 2149359 1916296 1702947 1271614 1328205 2534649 3966314
38992 3966314 4020235 2741421 1889137 2616116 4224555 5278590 4908720 3069571 660533
38983 660533 -577167 528857 3074190 4931939 5090687 4108800 2530842 454883 -1254293
38974 -1254293 -1199127 457011 1805990 1972167 2442134 4451852 6629923 6918220 5663841
38965 5663841 4855928 5007800 4878746 4047343 3619353 4036330 4117918 3120612 2212162 2764952
38955 2764952 4240631 4949014 4218531 2723966 1206048 23451 -369831 218904 861773
38946 861773 205288 -1636159 -2870654 -2184191 -240796 1524509 2705136 3648329 4162126
38937 4162126 3759757 2886835 2600168 2959645 2945455 2243032 1912771 2717323 3812210
38928 3812210 3841629 2510080 345978 -2196421 -4439496 -5128969 -3688993 -1412068 -152307
38919 -152307 -80726 72246 806273 1315489 1184255 1083929 1320905 1056101 -239210 -1589288
38909 -1589288 -1716243 -780928 -45670 -180700 -668891 -766718 -506123 -637811 -1682283
38900 -1682283 -3066027 -3510679 -2586498 -1375622 -935086 -767996 -28005 374346 -1181742
38891 -1181742 -3875052 -4663044 -2514341 -240815 -603393 -2462353 -2826168 -1297341 -42408
38882 -42408 -154889 -658689 -979696 -1861518 -3308716 -3773005 -2304786 61488 1883281
38873 1883281 2865491 3079201 2114936 134063 -1418461 -1420227 -585392 -238566 -308759 235549
38863 235549 1512918 2618053 3139204 3538238 4031250 4227233 4032387 3870786 3713768
38854 3713768 2890665 1379649 379268 764394 1572534 1042099 -1044048 -3058532 -3667950
38845 -3667950 -3271051 -2874080 -2519196 -1781786 -1177986 -1703654 -2968007 -3130791 -1233505
38836 -1233505 1461786 3201409 3885939 4480092 5020229 4603096 3170341 1908429 1552173
38827 1552173 1395157 562803 -522820 -662428 539181 2225201 3292643 3432557 3151174
38818 3151174 2975832 2800550 2164915 1132706 443769 508821 735286 405916 -171737
38809 -171737 -147372 471851 746514 107655 -1015892 -1894339 -2157705 -1816610 -1294681 -1272816
38799 -1272816 -1749781 -1610242 -183550 1188386 693734 -998979 -1316298 312535 1295526
38790 1295526 -315118 -2888705 -3742825 -2927714 -2369706 -2404495 -1632018 153058 1233575
38781 1233575 469965 -1231970 -2336016 -2181741 -862564 1043707 2385861 2383310 1895304
38772 1895304 2471534 3959934 4497679 3207271 1381338 441736 206195 -102016 -552800
38763 -552800 -1069348 -1915031 -2684710 -2233405 -742741 -357659 -2227286 -4281441 -3915200
38754 -3915200 -1842367 -962848 -1958196 -2568683 -1353591 333950 863542 630977 652432
38745 652432 627824 -63111 -676828 -93936 1156349 1365648 -87556 -2114627 -3459766
38736 -3459766 -3892402 -3839350 -3585797 -2971812 -1540415 840677 3272819 4294151 3520871
38727 3520871 2152775 1193835 22044 -2175677 -4316904 -4403740 -2391162 -409593 98676
38718 98676 -111975 54436 259039 -168469 -560365 299092 2282152 3978597 4414806
38709 4414806 3859798 3116204 2720926 2688875 2487669 1468605 -244753 -1656896 -2119263
38700 -2119263 -2106068 -2186897 -1890403 -519287 1380415 2468038 2345825 1832630 1588159
38691 1588159 1468440 1270417 1116003 917647 339327 -491846 -996842 -1017406 -925053 -795280
38681 -795280 -377607 -35143 -672056 -2317628 -3716918 -3860394 -3118107 -2311866 -1451908
38672 -1451908 -93098 1632853 3015397 3444782 2744409 1373634 590828 1575801 3800602
38663 3800602 5071710 3988746 1717654 452286 670095 941033 166968 -1044277 -1332391
38654 -1332391 -204581 1480827 2349595 1859387 882821 586891 760941 133706 -1379896
38645 -1379896 -1996360 -521003 1648380 2355928 1731245 1735727 3039243 4149385 3828462
38636 3828462 2761234 2231466 2357327 2374323 1887728 1222335 961934 1388678 1975957
38627 1975957 1578474 -155140 -1801194 -1681932 -275590 288113 -605432 -957166 961599
38618 961599 3950926 5341587 4311716 2479501 1556870 1570507 1469201 696029 -148684
38609 -148684 3801 1425913 3160413 4150791 4525030 5000732 5223455 3981073 1363667
38600 1363667 -733467 -1107133 -967692 -1947175 -3452910 -3622808 -2317276 -1364669 -1843736
38591 -1843736 -2750562 -2758736 -1958097 -1196635 -721042 -276797 90738 159974 211061 950457
38581 950457 2704092 4928436 6559114 6853365 5999146 4851293 3985349 3235287 2337208
38572 2337208 1594655 1398002 1416177 968558 67151 -629001 -854054 -962173 -1052526 -707488
38562 -707488 113124 675566 398684 -440757 -1368186 -2447331 -3750639 -4624894 -4310175
38553 -4310175 -3106268 -2156828 -2006131 -1972551 -1164243 302457 1391686 1290015 254470
38544 254470 -694623 -914223 -910250 -1739813 -3538714 -4992141 -4682957 -2805833 -1026996
38535 -1026996 -594966 -1075700 -1129331 -52390 1791478 3625141 4750237 4602738 3052226
38526 3052226 835133 -820637 -1305267 -1068896 -799515 -604964 -352031 -375209 -1206075
38517 -1206075 -2668267 -3771662 -3630322 -2240034 -407012 811043 758646 -248393 -1028336
38508 -1028336 -663340 442993 1053942 637094 -85765 -177431 467985 1252969 1522045
38499 1522045 902971 -455380 -1730471 -1982539 -1090367 312791 1908389 3969721 6309985
38490 6309985 7805089 7558931 5925575 3831134 1743427 -81124 -1109185 -1197945 -1165026
38481 -1165026 -1724974 -2339799 -2113024 -1298142 -717649 -152259 1156897 2553310 2280596
38472 2280596 163420 -1645219 -1426978 -111817 292996 -556586 -1383050 -1349357 -751990
38463 -751990 18634 892353 1412072 791421 -795415 -1743805 -585926 2178668 4396721
38454 4396721 4468279 2815180 951662 -411575 -1647581 -2785599 -2933355 -1726807 -439689
38445 -439689 -533455 -1561372 -1754359 -527718 915305 1561383 1749239 1943899 1776189
38436 1776189 1129367 987100 2103986 3659919 4304678 3889918 3152885 2316388 1139939
38427 1139939 -96388 -798969 -947205 -773510 20764 1580058 2839674 2580881 1406660
38418 1406660 1151448 2168462 2753913 1791982 537505 841555 2633813 4233766 4583514
38409 4583514 4230748 4354828 5473686 6955661 7451041 6100005 3573353 1490188 561630
38400 561630 -105228 -1496653 -3147535 -3715178 -2665071 -809769 533704 493028 -879465
38391 -879465 -2607161 -3564456 -3598558 -3533580 -3873247 -4163286 -3996719 -3794285 -3899157 -3686987
38381 -3686987 -2473741 -652964 1015717 2540390 3962617 4245841 2531465 122061
38373 122061 -653689 385317 1123287 539383 204480 1427580 2838479 2473605 924985
38364 924985 423432 1434507 2115499 1080684 -977347 -2666683 -3460111 -3410243 -2516541
38355 -2516541 -1148043 -350321 -919495 -2397662 -3452119 -3182203 -1902159 -757215 -597924
38346 -597924 -1145830 -1412366 -982301 -390185 17185 776890 2133061 2988166 2307834
38337 2307834 1087903 1341101 3183808 4608265 4460227 3906340 4202687 4683062 4203057
38328 4203057 3236190 2975178 3242530 2928918 2002622 1498843 1710829 1844733 1476448
38319 1476448 1053039 842805 581239 335214 600212 1303779 1766082 1907211 2428892
38310 2428892 3470188 4205000 4304304 4716268 6188904 7840413 8122386 6721859 4714636
38301 4714636 3182188 2407844 2223669 2452315 2937403 3482927 3816219 3598605 2699693
38292 2699693 1430989 123538 -1412004 -3345131 -4817450 -4498095 -2472542 -559836
38284 -559836 -164040 -752183 -1188605 -1572458 -2645068 -4137165 -5042134 -5159520 -5112574
38275 -5112574 -5042449 -4510867 -3611731 -2934185 -2341203 -1011040 1050617 2688656 3163378
38266 3163378 2969018 2647987 1892778 509100 -717405 -1022124 -801883 -809567 -774046 124646
38256 124646 1691346 2678613 2364959 1376852 801438 1097360 2032704 3169759 4177891
38247 4177891 4980081 5696895 6190663 5736640 3649753 431151 -2106342 -2268517 -84917
38238 -84917 2582353 3555721 2106544 -566468 -2520853 -2733743 -1609626 -106683 1128683
38229 1128683 1712624 1393001 603640 630318 2288628 4567790 5535923 4696513 3500200
38220 3500200 3235932 3454138 3125883 2380554 1981304 1692496 590047 -1018138 -1336281
38211 -1336281 717998 3959922 6233327 6676252 6106641 5644208 5646399 5779418 5504607
38202 5504607 4496056 2975141 1629081 993478 1071496 1681421 2702688 3584354 3199583
38193 3199583 1056691 -1558716 -2609026 -1622258 -195990 79945 -536044 -632661 404984
38184 404984 1780590 2386703 1993846 1340691 1295414 1959442 2639696 2868608 3231688 4627129
38174 4627129 6783186 8397818 9097055 10342177 13592395 18211567 22310839 25553098
38166 25553098 30121697 38599387 51319499 65713458 77583868 83081431 80573312 71518929
38158 71518929 59472307 47833401 38346069 31284001 26233919 22395863 18815141 15052875
38150 15052875 11532765 8849267 6915718 5207453 3676973 2862238 2997902 3516127
38142 3516127 3733888 3732620 4149558 5159768 6042019 5913356 4715153 3297990 2574425
38133 2574425 2672311 2879050 2368007 1031214 -389824 -1062737 -864001 -221586 649365
38124 649365 1768453 2614879 2247185 780064 -130437 661745 1914499 1631444 193904
38115 193904 -99369 1129580 1235972 -1474986 -4662282 -4894548 -2401557 -458625 -627088
38106 -627088 -1229567 -710793 93236 11357 -298105 263421 1200005 1400680 1112946 1320953
38096 1320953 1860837 1774475 1148692 1018111 1523918 1642803 891934 -46792 -697566 -1458673
38086 -1458673 -2340361 -2266612 -565847 1708635 3000841 3243326 3540253 4180247 4191701
38077 4191701 3026099 1596670 1095943 1495279 1856193 1665869 1187977 759223 450752
38068 450752 377036 661658 943022 480400 -951590 -2652541 -3750521 -4058413 -3929665
38059 -3929665 -3585667 -2959961 -2073485 -1253140 -942542 -1322166 -2027192 -2376397 -2192634
38050 -2192634 -2212275 -3104460 -4232069 -4321318 -3497590 -3473732 -5108245 -6927044 -7080827
38041 -7080827 -5792016 -4559965 -3755343 -2666375 -1482275 -1310013 -2086547 -2251483 -999541
38032 -999541 647940 1599734 2069046 2455502 2298341 1419161 924310 1795874 3297305
38023 3297305 3985810 3683280 3319656 3399106 3788342 4531566 5590112 6040988 4854027
38014 4854027 2525745 828390 724585 1402588 1550094 751314 -623324 -2105187 -3206248
38005 -3206248 -3301872 -2013862 284835 2558103 3831219 3971590 3747773 3899222 4206755
37996 4206755 3901660 2942067 2170098 2005016 1753264 592220 -1482562 -4008326 -6399710
37987 -6399710 -7510404 -6152239 -3014849 -830174 -1236695 -2475620 -1810794 641917
37979 641917 2455290 2623679 2380823 2334573 1339561 -1016468 -3020027 -3184290 -2312700
37970 -2312700 -1874420 -1750768 -1113746 -384040 -552061 -1225032 -1117503 -256604 -58237
37961 -58237 -1076129 -2166433 -2425584 -2757131 -4567791 -7509430 -9536989 -9242093 -7416508
37952 -7416508 -5953296 -5633067 -5589490 -4860534 -3696745 -2950633 -2799097 -2758112 -2568486
37943 -2568486 -2258058 -1559288 -191549 1289398 1832820 1214785 192503 -755367 -1857125
37934 -1857125 -2946286 -3017903 -1537563 610387 2194924 3048482 3720515 4253672 4095709
37925 4095709 3012281 1490921 302212 -63301 276911 667230 618455 511969 1143665
37916 1143665 2526584 3767034 4208876 3951273 3123803 1632489 -1814 -556005 499632
37907 499632 2253143 3512815 3951016 3643883 2446624 512818 -1430087 -2997227 -4465137
37898 -4465137 -5617536 -5501020 -4210649 -3563464 -4675810 -6078882 -5861093 -4650250 -4531111
37889 -4531111 -5689767 -6253256 -5216274 -3467494 -1853173 -205291 1350589 1932371
37881 1932371 1364901 688006 690757 1187317 2039158 3455234 4886772 5149362 4213525
37872 4213525 3401538 3170069 2241633 -189900 -2846093 -4006119 -3505327 -2079340 -41449
37863 -41449 2134594 3136997 2245839 609594 -276306 -554242 -1082844 -1431280 -555131
37854 -555131 1070974 1875645 1613322 1616846 2529934 3444632 3633759 3592979 3740023 3382950
37844 3382950 1843004 -238871 -1472161 -1093574 590851 2493933 3169026 1775252
37836 1775252 -775888 -2225460 -1159521 1481293 3438725 3360333 1758326 192618
37828 192618 -188039 387554 617946 -300620 -1481897 -1324286 383720 2219759 3113360
37819 3113360 3462290 3804442 3600837 2340035 929200 690971 1469716 2025859 2076681
37810 2076681 2628703 4183338 5776674 6148567 5037491 3101562 1365879 889393 2001655
37801 2001655 3544024 3844195 2891745 2524731 3827295 5462449 5647622 4819028 4787402
37792 4787402 5697627 5631425 3555000 1113394 594944 2102709 3836946 4681123 5320331
37783 5320331 6667333 8110857 8016097 5778134 2798480 1139835 1451276 2611747 3306965
37774 3306965 3307803 2954788 2155480 708361 -757693 -1155717 -298770 895020 1618806
37765 1618806 1791034 1362203 42428 -1797522 -2871507 -2400083 -1194525 -569194 -647078
37756 -647078 -532049 199072 1029889 1364599 1083833 319808 -590562 -929619 -127004 1310529
37746 1310529 1930890 693869 -2013154 -4719341 -5960560 -5173467 -3010896 -859065
37738 -859065 294799 581083 674162 746293 437388 -299798 -925313 -954767 -419259 382805
37728 382805 1165820 1620306 1547589 1207748 1179621 1640380 1989693 1441605 41914 -980230
37718 -980230 -163173 2517214 5115482 5573712 4169047 3140953 3531136 3666580 1765439
37709 1765439 -1157719 -2611684 -2094847 -1289891 -1060464 -399795 1291107 2942875 3663120
37700 3663120 4034288 4461724 3881472 1608741 -840341 -1537809 -891587 -790386 -1531532
37691 -1531532 -1530594 -71012 1489994 1755852 1094543 672202 709868 524925 -295743 -1444114
37681 -1444114 -2250350 -2053461 -614355 1389592 2633388 2414230 1446729 921169 935086
37672 935086 459385 -1067222 -2762300 -3378555 -2933201 -2532474 -2677738 -2659162 -1970954
37663 -1970954 -1411685 -1930610 -2971420 -3053533 -1782130 -196065 842309 1456825 1804106
37654 1804106 1546010 809431 648610 1795816 3585481 4697939 4472482 3192767 1773730
37645 1773730 1405966 2575878 4077113 4041293 2396372 1100631 1366858 2101444 2008480
37636 2008480 1658169 2035458 2453788 1782786 725902 823634 1837700 2197272 1663015
37627 1663015 1477215 2039752 2513787 2751907 3477507 4275470 3551211 1129989 -1029521
37618 -1029521 -1522131 -1177363 -1215874 -1404827 -1090025 -579129 -336669 -9368 688043 1214186
37608 1214186 1243801 1294690 1437441 758934 -812757 -1674857 -1020362 -685382 -2545825
37599 -2545825 -5115296 -5079428 -1893753 1354504 1855914 -30641 -2200434 -3392448 -3569373
37590 -3569373 -3031801 -2197350 -1597556 -1332724 -952583 -358118 -301246 -1365569 -2760939
37581 -2760939 -2828876 -851600 2062963 4148006 4796034 4822490 4986498 4948047 4155977
37572 4155977 3099711 2668229 2556704 1571643 -359526 -1782516 -1750229 -1003485 -455210
37563 -455210 251469 1686149 3215446 3868246 3844211 3955732 4202286 4094736 3815290
37554 3815290 3778489 3488834 2145225 102390 -1472123 -2128804 -2189056 -1676644 -546041
37545 -546041 319249 -151081 -1486512 -2088449 -1447363 -643242 -576066 -1029270 -1561878 -1901179
37535 -1901179 -1300865 907230 3696054 4798987 3430263 1257582 83232 -82283
37527 -82283 41775 492378 1384544 1940472 1467261 521394 18695 -89624 -205870 109745
37517 109745 1467597 3201095 3828628 2914413 1546360 922560 1144611 1454894 1154574
37508 1154574 197686 -884653 -1645031 -2237684 -2954129 -3383988 -2716459 -930999 1048851
37499 1048851 2462271 3138424 2840622 1419990 -95695 21227 1940548 3739300 3901346
37490 3901346 3091401 2538736 2045098 895354 -442857 -1029912 -944587 -647297 166453
37481 166453 1514965 1987522 629351 -809776 252155 3479254 5980407 6277477 5564386
37472 5564386 4853797 3409378 850413 -1402491 -2054340 -1679521 -1353765 -944383 42066
37463 42066 1096367 1388271 912555 29251 -1162944 -2111475 -1584503 702364 3106627
37454 3106627 3798717 2768609 1241035 35721 -504885 -33509 1032851 1151396 -470292
37445 -470292 -2310216 -2332841 -801989 235870 -202637 -1400899 -2848387 -4854791 -7043793
37436 -7043793 -8012707 -7152447 -5526748 -4347614 -3654372 -3004874 -2399074 -1900663 -1231463
37427 -1231463 -307743 583557 1530870 3022280 4814426 5809672 5637047 5281412 5386318
37418 5386318 5086227 3662366 2320305 2681700 4007154 3766051 1190753 -1351610 -1294617
37409 -1294617 957986 2796312 2646580 1307806 236526 -333206 -1068854 -2081860 -2682747
37400 -2682747 -2529865 -2218169 -2305494 -2272544 -1144940 982605 2748965 3031145 2124763
37391 2124763 1175141 871156 1014235 1034654 611983 44096 212143 1774929 4071841
37382 4071841 5293835 4315835 2080882 550751 444861 695402 141638 -974923 -1523108
37373 -1523108 -962070 177853 1082572 1464751 1541356 1540129 1513512 1584246 2010398 2734354
37363 2734354 3112035 2595970 1656028 1380873 1917247 1944899 248457 -2604194 -4761150
37354 -4761150 -5037537 -3875997 -2630654 -2403621 -3257797 -3962077 -2874112 136098 2939349
37345 2939349 3242975 1215388 -985295 -1993529 -2128134 -1638102 -67371 1942831 2238198
37336 2238198 62873 -2120405 -1647077 546390 1344533 98574 -721294 255246 1022546
37327 1022546 -669849 -3915471 -6075898 -6282205 -5660673 -4878539 -3520098 -1831904 -1172602
37318 -1172602 -2085354 -3260869 -3273349 -2423312 -1894908 -1727896 -857684 876326 1966283
37309 1966283 1116957 -799983 -1613844 -575808 704194 418694 -1055798 -1697548 -448154
37300 -448154 1582913 2600166 2054886 781508 -195441 -485706 -301488 -139980 -472429
37291 -472429 -1422108 -2626176 -3412655 -3144952 -1683171 201497 1203990 864995 310003
37282 310003 773002 1583109 881218 -1465021 -3174681 -2573727 -896240 -282948 -628707
37273 -628707 -146602 1595185 3128685 3476318 3303533 3442966 3828460 4264918 4803277
37264 4803277 4903847 3692629 1675061 770468 1816043 3320186 3571958 2683045 1511397
37255 1511397 -28985 -2102328 -3550181 -3161055 -1686703 -861915 -839588 -307931 1101321
37246 1101321 2284418 2538085 2280835 1778022 828355 -3252 397338 1654836 1758639
37237 1758639 -180085 -2522986 -3478360 -3473343 -3878489 -4598931 -4532477 -3610954 -2712397 -1979596
37227 -1979596 -862879 290893 282945 -1048269 -2304435 -2361513 -1719164 -1529705 -2106532
37218 -2106532 -2925527 -3453940 -3418568 -2709166 -1556867 -581671 -288534 -629432 -1206408
37209 -1206408 -1696815 -1991069 -2182078 -2496669 -2948791 -3040499 -2221835 -759808 304825
37200 304825 319495 -218178 -337475 260855 1022736 1238132 585027 -818320 -2478288
37191 -2478288 -3651313 -3794929 -3119451 -2543175 -2829917 -3679531 -3851682 -2431254 82924
37182 82924 2262752 3349097 3918885 4738574 5496565 5273028 3985617 2663689 2289777
37173 2289777 2909880 3855537 4278491 3520769 1681002 -71607 -487459 209599 470874
37164 470874 -542792 -1827802 -1959398 -947778 57002 405306 451296 676820 1116829
37155 1116829 1602742 1938999 1874661 1455731 1325943 2078475 3326943 4012190 3677415
37146 3677415 2899950 2426724 2457767 2866934 3508629 4072056 4149512 3734472 3275931 3070879
37136 3070879 3034968 3216013 3948840 5148555 5964204 5642588 4446117 3302658 2816367
37127 2816367 3001107 3636122 4307962 4283677 3013469 911490 -775482 -1079807 -129517
37118 -129517 1152291 1928410 1983727 1598997 1047970 291282 -696650 -1333653 -600108 1797543
37108 1797543 4617018 5899679 4684027 1719519 -1380975 -3352957 -3797069 -3108533
37100 -3108533 -2179636 -1850179 -2305682 -3007108 -3235198 -2618828 -1256656 357154 1521529
37091 1521529 1801274 1421071 910512 348442 -592040 -1757308 -2337231 -2045553 -1913705
37082 -1913705 -3080511 -4964285 -5548697 -3752243 -840550 947231 693174 -767181
37074 -767181 -2261110 -3329177 -3907478 -3827534 -3143903 -2530830 -2725083 -3596990 -4212835
37065 -4212835 -3901677 -2933373 -2046446 -1651830 -1710302 -2071561 -2539802 -2723305 -2249140 -1255801
37055 -1255801 -423900 -321448 -763624 -920883 -111281 1477866 2908875 3470909 3467614
37046 3467614 3693884 4106076 3628233 1740412 -274851 -528755 1153741 2964767 3287998
37037 3287998 2366189 1561268 1721033 2671555 3628656 3640470 2311386 645473 415121
37028 415121 1892865 2926619 1396470 -1845669 -3778897 -2861154 -591223 758483
37020 758483 700888 272652 262833 580673 871883 1001880 1042548 1096307 981913 138250
37010 138250 -1654060 -3508515 -4196434 -3796138 -3594934 -4011288 -3793691 -2076133 -134352
37001 -134352 177167 -901347 -1335533 -111981 1528369 1872094 758760 -547628 -871969
36992 -871969 -182032 498610 65727 -1558832 -3339772 -4276527 -4264139 -3550521 -2049647
36983 -2049647 42311 1540270 1321745 -55530 -801209 45544 1867938 3651398 4834115
36974 4834115 4955605 3690725 1680856 391109 588006 1546359 2061159 1651225 607081
36965 607081 -454580 -926953 -783349 -816293 -1502433 -1809742 -382546 2058907 3064805
36956 3064805 1664433 -322400 -944882 -552598 -430233 -380609 757882 2977632 4965097
36947 4965097 5691123 5038369 3335044 1311892 52294 27881 642937 1410000 2642575
36938 2642575 4075162 4107423 2006658 -205900 -33016 2031661 3390856 3196361 2973451
36929 2973451 3497633 3576335 2509570 1523079 1775057 2682423 3165771 3020914 2198819
36920 2198819 276657 -2376006 -4338494 -5021302 -5379181 -5779794 -4856745 -1931333 996418
36911 996418 1601716 485167 21555 705270 867662 -194562 -1078967 -713204 -28923
36902 -28923 -274521 -997821 -865478 206054 821676 -104141 -2019122 -3336256 -3065097
36893 -3065097 -1668946 -375898 107624 -25563 -372240 -832311 -1322544 -1481791 -937588
36884 -937588 391516 2253560 3916287 4290898 3073383 1745682 2314918 4756026 6855375
36875 6855375 7042967 6098832 5357448 4660686 3302907 1805707 1215751 1396928 1451546
36866 1451546 1190192 810212 -139918 -1863011 -3031275 -2267122 -528463 -41245 -978457
36857 -978457 -1287758 -29460 1244016 1069168 83816 -478439 -638486 -908586 -1060253
36848 -1060253 -820982 -682943 -933046 -925453 -398385 -419505 -1689418 -2815502 -1848191 940671
36838 940671 3313158 3905096 3418718 2942171 2422984 1285858 -344299 -1630390 -1809667
36829 -1809667 -695235 1204118 2797938 3018906 1717219 -110570 -1216399 -1230402 -737432
36820 -737432 -225643 664423 2385394 4176754 4409958 2633890 445563 -408824 -29467
36811 -29467 525208 1223276 2479069 3118750 1249846 -2400861 -4265201 -2284167 1225990
36802 1225990 2561826 1144198 -669204 -1270243 -1305189 -1841635 -2842995 -3642202 -3685638
36793 -3685638 -2695908 -1054389 107683 174303 94895 987734 2041405 1395942 -875637
36784 -875637 -2471603 -2134028 -1541888 -2774907 -5102020 -5839679 -3928540 -1188753 101127
36775 101127 -294386 -1023977 -1307649 -1659122 -2481784 -2894942 -1737020 577028 2182859
36766 2182859 1985258 879750 259863 183277 -92036 -484126 -309252 157625 -226508
36757 -226508 -1635182 -2809530 -2889092 -2544050 -2564394 -2345994 -883876 1291291 2403292
36748 2403292 1685900 409024 320933 1660636 3158146 3686543 3378455 3055964 3005102
36739 3005102 2727514 1806800 556535 -374733 -717567 -670579 -569235 -743270 -1423911
36730 -1423911 -2446478 -3242198 -3404509 -3019641 -2224333 -921729 619364 1405041 665403
36721 665403 -1144241 -2935557 -4188643 -4795632 -4225138 -2088283 579140 1956582 1675601
36712 1675601 1271796 1963591 3071849 3305947 2672144 2225004 2538076 3272633 3898609
36703 3898609 4140607 3969438 3707987 3885456 4505382 4734934 3777532 1807984 -311234
36694 -311234 -1884128 -2562293 -2128293 -705766 1036210 2392245 3191779 3559854 3463340
36685 3463340 2922176 2297571 1830801 1202323 121076 -933053 -1208926 -730177 -154069
36676 -154069 293411 976484 1895703 2356673 1901204 986073 336809 45041 -244711 -527924
36666 -527924 -369407 320733 871279 520139 -611860 -1539000 -1527841 -973421 -924934 -1900706
36656 -1900706 -3507654 -5101651 -6274817 -6583579 -5441028 -2825461 152389 1923202
36648 1923202 1794931 481170 -584967 -342445 1188301 2897375 3387665 2195371 338433
36639 338433 -550232 243215 1923618 3179371 3624290 3988334 4793608 5275060 4266152
36630 4266152 2063144 410997 170594 60742 -1211351 -2458798 -1373701 1902629
36622 1902629 4572753 4959206 4487848 4840979 4991216 2958434 -579584 -2646771 -1788635
36613 -1788635 294608 1197416 421955 -912023 -1731062 -1666477 -864465 107026 532439
36604 532439 244766 -125169 128978 937795 1464587 941879 -437171 -1497864 -1290576
36595 -1290576 -339486 -69526 -818679 -1369205 -1012885 -920655 -2240466 -3744159 -3093095
36586 -3093095 -125415 2863130 4158110 4233574 4019187 3327046 1807102 49342 -1243300
36577 -1243300 -2110563 -2537108 -1941612 -456769 382665 -505025 -2046566 -2495832 -1893938
36568 -1893938 -1505942 -1293476 155487 2955959 4939632 4247119 1797151 91654 144279
36559 144279 698958 408449 -258794 153053 1851477 3235021 2806677 1068348 -125111
36550 -125111 97390 705369 366094 -762501 -1386307 -834112 160655 426082 -270478
36541 -270478 -943713 -489835 912908 1776774 1087049 -159974 -23532 1751596 3194100
36532 3194100 2615881 686907 -703264 -784995 -166422 501702 882055 394628 -1306052
36523 -1306052 -3283612 -4018943 -3440017 -3114954 -3911771 -4521095 -3252517 -713668 475253
36514 475253 -1163606 -3867866 -4338225 -1425856 2504328 4241169 3241110 1674662
36506 1674662 1241064 1310101 748453 175025 984869 2868136 3968459 3440745 2383321
36497 2383321 1983892 2016778 1622117 526998 -976051 -2355866 -2765292 -1634708 172024
36488 172024 826818 -177416 -1172642 -521277 1236012 2347966 2119257 1133741 -35145
36479 -35145 -1024232 -1073830 334951 2327286 3399630 3371723 3356200 3708676 3439135 2160283
36469 2160283 1235082 1943191 3419292 3692898 2434760 1451442 2299760 4365372 5802224
36460 5802224 5773911 5047828 4547978 4162326 3414572 2711582 2958570 3899451 3860925 1797219
36450 1797219 -1061268 -2443535 -1578030 319860 1794181 2350652 1992421 796914 -580180
36441 -580180 -950030 111660 1513757 1773529 566091 -1166797 -2187320 -1744195 -16238
36432 -16238 1738233 2038102 746250 -679936 -953175 -328638 349645 1083926 2108664
36423 2108664 2487127 844475 -2434713 -4980707 -4765706 -1879783 2049272 5216884
36415 5216884 6315810 5093468 2849922 1507032 1579900 1787737 1127472 378980 784873
36406 784873 2110378 3093334 3278444 3263560 3378457 3223607 2538573 1616294 756509 74496
36396 74496 -93713 584980 1646584 2073174 1666912 1482695 2428183 3954831 4654365
36387 4654365 3860828 2276795 1232928 1566808 2919124 3863498 3059524 613280 -1947144
36378 -1947144 -3285932 -3489932 -3406038 -3310710 -2922156 -2376739 -2228554 -2403949 -2099557 -1157075
36368 -1157075 -722382 -1719322 -3144972 -2960806 -755678 1446504 1521123 -282972 -1841895
36359 -1841895 -1671705 -165242 1456716 2503595 2950341 3017124 3085428 3543792 4241517
36350 4241517 4405008 3491799 1868760 329235 -711820 -1164948 -869715 82063 887614
36341 887614 706006 -156434 -449783 380225 1346220 1147970 -101426 -915381 -235108
36332 -235108 1171744 1441694 -225629 -2494210 -3397141 -2733656 -2221023 -3078198 -4358013
36323 -4358013 -4354027 -2922185 -1394695 -667820 -589223 -1032872 -2168943 -3421742 -3494935
36314 -3494935 -2055374 -353861 510702 999960 2017847 3279887 3851032 3691592 3523405
36305 3523405 3493471 3091346 2286131 1705393 1624319 1698972 1816558 2269372 2801566 2426487
36295 2426487 811887 -809487 -897271 481890 1672372 1354619 -61005 -1082064 -771984
36286 -771984 512638 1750123 2197601 1709866 592662 -487691 -681257 426665 2279936
36277 2279936 3799529 4455749 4527557 4243830 3269234 1445572 -407619 -1032431 30841
36268 30841 2115971 4172533 5462663 5726387 5184365 4413970 3868969 3494820 3062415
36259 3062415 2757705 3036132 3889837 4656621 4686827 3937108 2799937 1605654 496533
36250 496533 -356824 -734005 -722305 -914174 -1834145 -3041203 -3285359 -2003726 -235323
36241 -235323 653501 775413 1206989 1891772 1601401 356967 146200 2043415 4006816
36232 4006816 3260326 72392 -2641585 -3058751 -1942265 -586720 623542 1198447 151083
36223 151083 -2280374 -4041963 -3713999 -2513635 -2563898 -3941943 -4777171 -3832673 -1763791
36214 -1763791 -33591 386860 -554070 -1828719 -1726248 538136 3583764 5216890 5068084
36205 5068084 4773010 5307195 5483828 3943240 1561505 518245 1368305 2429619 2222323
36196 2222323 1263079 827927 914362 477977 -718293 -1613596 -1367192 -558850 -466638 -1586837
36186 -1586837 -3219039 -4241795 -4017947 -2713280 -956548 784050 2353963 3346966
36178 3346966 2899465 745132 -1819101 -3008602 -2584054 -1761610 -1086747 102341 1606026
36169 1606026 1516805 -1245114 -4867393 -6754703 -6784664 -6726578 -7156737 -7001900 -5900781
36160 -5900781 -4941137 -4790009 -4824912 -4475463 -3919948 -3206101 -2219631 -1710566 -2609387 -4004258
36150 -4004258 -3707902 -1405552 716080 1221135 1197871 1701958 1648479 -43534 -2064872
36141 -2064872 -2490178 -1520495 -470547 659224 2401572 3705541 3010258 778982 -1303922
36132 -1303922 -3064721 -5367422 -7377827 -7041719 -4424860 -1983531 -1041612 -438992 651671
36123 651671 1055755 -99070 -1592532 -2078946 -2046061 -2288757 -2053363 -465580 1461667
36114 1461667 2110718 1658841 1415417 1488548 991176 118824 21329 615525 465316 -754098
36104 -754098 -1474169 -725960 201760 -67263 -362479 1628967 5659997 8572493 8215745
36095 8215745 6155902 5311399 5983719 5920308 3940769 1609979 864646 1599961 2558198
36086 2558198 3333986 4214361 4869185 4590222 3463780 2233178 1370573 1163568 2022852
36077 2022852 3562243 4182570 3084289 1962058 2816267 4620844 4457094 1861757 -453687
36068 -453687 -617230 208862 519333 858697 2078827 3333215 3574176 3375974 3550603
36059 3550603 3542573 3028817 3477882 5825757 7913593 6901535 3509366 1177964 1295652
36050 1295652 1916360 1357331 398418 111839 -180672 -1409138 -2728787 -2416949 -85939
36041 -85939 2911708 4837734 4876368 3579833 2253130 1517322 699129 -774052 -2040665
36032 -2040665 -2081227 -1691277 -2357303 -3412290 -2550691 428076 2688220 2209177 558486
36023 558486 356455 1626859 2464761 2184761 1888791 2465490 3671988 4903386 5511003
36014 5511003 4658393 2207950 -387202 -1312687 -541262 224556 -286979 -1707078 -2881742
36005 -2881742 -3042621 -2158107 -900263 -214275 -299050 -281963 447478 1141346 934364 611307
35995 611307 1681802 3859101 5019518 3926572 1637096 -182921 -1070919 -1410759 -1481563
35986 -1481563 -1518476 -1713863 -1577340 -325693 1508983 2048387 469580 -1713201 -2766179
$$ [...]
##END NTUPLES=NMR SPECTRUM
##END=
