##TITLE=31Pdec_DE-162_oil2
 DMSO-d6+CCl4, 64 sc
 10.7.2026
##JCAMPDX= 6.0         $$ Bruker NMR JCAMP-DX V2.0
##DATA TYPE= NMR SPECTRUM
##DATA CLASS= NTUPLES
##ORIGIN= UXNMR, Bruker Analytische Messtechnik GmbH
##OWNER= root
$$ XWIN-NMR		Version 3.5
$$ Fri Jul 10 14:31:30 2026 Russian Standard Time (UT+4h)  she@DPX200
##.OBSERVE FREQUENCY= 81.013821
##.OBSERVE NUCLEUS= ^31P
##.ACQUISITION MODE= SIMULTANEOUS
##.ACQUISITION SCHEME= undefined
##.AVERAGES= 64
##.DIGITISER RES= 17
##SPECTROMETER/DATA SYSTEM= spect
##.PULSE SEQUENCE= zgpg30
##.SOLVENT NAME= DMSO
##.SHIFT REFERENCE= (INTERNAL, DMSO, 0, 197.392)
##AUDIT TRAIL= $$ (NUMBER, WHEN, WHO, WHERE, WHAT)
$$ ##TITLE= Audit trail, XWIN-NMR		Version 3.5
$$ ##JCAMPDX= 5.01
$$ ##ORIGIN= Bruker BioSpin GmbH
$$ ##OWNER= she
$$ F:/spectra/data/she/nmr/P31/2/pdata/1/auditp.txt
$$ ##AUDIT TRAIL=  $$ (NUMBER, WHEN, WHO, WHERE, WHAT)
(   1,<2026-07-10 14:30:34.82 +0400>,<she>,<DPX200>,
      <created by zg, POWCHK disabled, PULCHK disabled
       configuration hash MD5:
       00 E9 B6 7A A2 85 ED C7 34 08 36 98 17 FE 4E 26
       data hash MD5: 32K
       93 CB E0 C7 03 61 A2 90 4C 95 0C C5 0A D6 E5 6A>)
(   2,<2026-07-10 14:30:37.76 +0400>,<she>,<DPX200>,
      <Start of raw data processing
       efp BC_mod = 2 LB = 1.5 FT_mod = 6 PKNL = 1 PHC0 = 1918.2 PHC1 = 195.0978 SI = 64K 
       data hash MD5: 64K
       7F 64 44 F9 02 73 96 53 72 0B AD A9 D0 99 DD 75>)
(   3,<2026-07-10 14:30:55.48 +0400>,<she>,<DPX200>,
      <pk PHC0 = 1.978776 PHC1 = -12.19998 
       data hash MD5: 64K
       D8 BE 8B 54 04 5D 09 87 EE 78 40 6E EF 63 15 53>)
(   4,<2026-07-10 14:31:01.26 +0400>,<she>,<DPX200>,
      <abs ABSG = 5 
       data hash MD5: 64K
       A9 9A F7 9E C4 8D 5D C9 FF 13 2D 35 CC 24 5C F1>)
$$ ##END=
$$ 
$$ hash MD5
$$ 19 B8 6A 08 56 02 4E 29 40 E5 B1 1A A9 2A 4A 1A
##$RELAX= 
##$RELAX= 
##$RELAX= 
##$RELAX= 
##$RELAX= 
##$RELAX= 
##$RELAX= 
##$RELAX= 
$$ Bruker specific parameters
$$ --------------------------
##$DU= <F:/spectra>
##$EXPNO= 2
##$NAME= <P31>
##$PROCNO= 1
##$TYPE= <nmr>
##$USER= <she>
##$AMP= (0..31)
100 100 100 100 100 100 100 100 100 100 100 100 100 100 100 100 100 100 
100 100 100 100 100 100 100 100 100 100 100 100 100 100 
##$AQSEQ= 0
##$AQ_mod= 1
##$AUNM= <au_zg>
##$AUTOPOS= <>
##$BF1= 81.014009
##$BF2= 200.13
##$BF3= 200.13
##$BF4= 200.13
##$BF5= 200.13
##$BF6= 200.13
##$BF7= 200.13
##$BF8= 200.13
##$BYTORDA= 1
##$CFDGTYP= 0
##$CFRGTYP= 5
##$CHEMSTR= <none>
##$CNST= (0..31)
1 1 145 1 1 1 1 1 1 1 1 1 1 1 1 1 1 1 1 1 1 1 1 1 1 1 1 1 1 1 1 1 
##$CPDPRG= <waltz16>
##$CPDPRG1= <>
##$CPDPRG2= <waltz16>
##$CPDPRG3= <>
##$CPDPRG4= <mlev>
##$CPDPRG5= <mlev>
##$CPDPRG6= <mlev>
##$CPDPRG7= <mlev>
##$CPDPRG8= <mlev>
##$CPDPRGB= <>
##$CPDPRGT= <>
##$D= (0..31)
0 1 0 0 0 0 0 0 0 0.06 0 0.03 2e-05 3e-06 0 0 0.0002 0 0 0 0 0 0 0 0 0 
0 0 0 0 0 0 
##$DATE= 1783679434
##$DBL= (0..7)
120 120 120 11 120 120 24 19 
##$DBP= (0..7)
150 150 150 150 150 150 150 150 
##$DBP07= 0
##$DBPNAM0= <>
##$DBPNAM1= <>
$$ [...]
##$SUBNAM3= <"">
##$SUBNAM4= <"">
##$SUBNAM5= <"">
##$SUBNAM6= <"">
##$SUBNAM7= <"">
##$SUBNAM8= <"">
##$SUBNAM9= <"">
##$SW= 400.765351723535
##$SWIBOX= (0..15)
0 1 3 0 0 0 0 0 0 0 0 0 0 0 0 0 
##$SW_h= 32467.5324675325
##$TD= 32768
##$TD0= 1
##$TE= 0
##$TE2= 300
##$TE3= 300
##$TEG= 300
##$TL= (0..7)
0 120 53 12 22 120 120 120 
##$TP= (0..7)
150 150 150 150 150 150 150 150 
##$TP07= 0
##$TPNAME0= <>
##$TPNAME1= <>
##$TPNAME2= <>
##$TPNAME3= <>
##$TPNAME4= <>
##$TPNAME5= <>
##$TPNAME6= <>
##$TPNAME7= <>
##$TPOAL= (0..7)
0.5 0.5 0.5 0.5 0.5 0.5 0.5 0.5 
##$TPOFFS= (0..7)
0 0 0 0 0 0 0 0 
##$TUNHIN= 0
##$TUNHOUT= 0
##$TUNXOUT= 0
##$USERA1= <user>
##$USERA2= <user>
##$USERA3= <user>
##$USERA4= <user>
##$USERA5= <user>
##$V9= 5
##$VALIST= <valist>
##$VCLIST= <CCCCCCCCCCCCCCC>
##$VD= 0
##$VDLIST= <DDDDDDDDDDDDDDD>
##$VPLIST= <PPPPPPPPPPPPPPP>
##$VTLIST= <TTTTTTTTTTTTTTT>
##$WBST= 1024
##$WBSW= 4
##$XGAIN= (0..3)
0 0 0 0 
##$XL= 0
##$YL= 0
##$YMAX_a= 5886
##$YMIN_a= -15249
##$ZGOPTNS= <>
##$ZL1= 120
##$ZL2= 120
##$ZL3= 120
##$ZL4= 120
##$ABSF1= 197.3918
##$ABSF2= -203.3724
##$ABSG= 5
##$ABSL= 3
##$ALPHA= 0
##$AQORDER= 0
##$ASSFAC= 0
##$ASSFACI= 0
##$ASSFACX= 0
##$ASSWID= 0
##$AUNMP= <proc_1d>
##$AZFE= 0.1
##$AZFW= 0.5
##$BCFW= 0
##$BC_mod= 2
##$BYTORDP= 0
##$COROFFS= 0
##$CY= -3
##$DATMOD= 1
##$DC= 0
##$DFILT= <>
##$DTYPP= 0
##$F1P= 0
##$F2P= 0
##$FCOR= 1
##$FTSIZE= 65536
##$FT_mod= 6
##$GAMMA= 0
##$GB= 0
##$INTBC= 1
##$INTSCL= 9.790993e-09
##$ISEN= 30
##$LB= 1.5
##$LEV0= 0
##$LPBIN= 0
##$MAXI= 10000
##$MC2= 0
##$MEAN= 0
##$ME_mod= 0
##$MI= 50
##$NCOEF= 0
##$NC_proc= -8
##$NLEV= 6
##$NOISF1= 182.463
##$NOISF2= 159.3651
##$NSP= 0
##$NTH_PI= 0
##$NZP= 0
##$OFFSET= 197.3918
##$PC= 4
##$PHC0= 1920.179
##$PHC1= 182.8978
##$PH_mod= 1
##$PKNL= yes
##$PPARMOD= 0
##$PSCAL= 0
##$PSIGN= 0
##$REVERSE= no
##$SF= 81.014063255964
##$SI= 65536
##$SIGF1= 159.3651
##$SIGF2= -187.1042
##$SINO= 113.3802
##$SIOLD= 16384
##$SREGLST= <1H.CDCl3>
##$SSB= 0
##$STSI= 65536
##$STSR= 0
##$SW_p= 32467.5324675325
##$SYMM= 0
##$S_DEV= 0
##$TDeff= 32768
##$TDoff= 0
##$TI= <>
##$TILT= no
##$TM1= 0
##$TM2= 0
##$TOPLEV= 0
##$USERP1= <user>
##$USERP2= <user>
##$USERP3= <user>
##$USERP4= <user>
##$USERP5= <user>
##$WDW= 1
##$XDIM= 65536
##$YMAX_p= 342926638
##$YMIN_p= -123145187
$$ End of Bruker specific parameters
$$ ---------------------------------
##NTUPLES= NMR SPECTRUM
##VAR_NAME=  FREQUENCY,     SPECTRUM/REAL,   SPECTRUM/IMAG
##SYMBOL=    X,             R,               I
##VAR_TYPE=  INDEPENDENT,   DEPENDENT,       DEPENDENT
##VAR_FORM=  AFFN,          ASDF,            ASDF
##VAR_DIM=   65536,         65536,           65536
##UNITS=     HZ,            ARBITRARY UNITS, ARBITRARY UNITS
##FACTOR=    0.49542278885378, 1,            1
##FIRST=     15991.5117654749, 0,            0
##LAST=      -16476.0207020576, 0,           0
##MIN=       -16476.0207020576, -123145187,  0
##MAX=       15991.5117654749, 342926638,    0
$$ Real data points
##PAGE= N=1
##DATA TABLE= (X++(R..R)), XYDATA
$$ [...]
7488C72054l75330j017938J0307M81493K5252J21992O09692r1695j481551j292642
7478b638366M24197R85498m36873j368455l26352O28314m04755j600366j82875
7469d920033K982194M396375K750861J58366j314639j946474k545651k369333
7461b808334m70969J798315J637532j390428l903352k435213K046530N047392
7453d78527L939667O15417j743760k483096k721028k618907j562450q5646N88621
7444f549709N56723R12551J666844J713334P20329m83499j206762j206557k01583
7435d078329J424357K142462J248875M29997J230460J986249J37703l092016l810957
7426b381199j302516Q89727M70327o13475j01354J001959Q20374j62882n09393
$$ plain form
7488 372054 -3276 -1021214 -1010907 -529414 -504162 -382170 227522 135827 -1345724 -2638366
7478 -2638366 -2214169 -1228671 -1665544 -3033999 -3360351 -2732037 -3136792 -4737158 -4920033
7469 -4920033 -1937839 2458536 5209397 5367763 4053124 2106650 -439001 -2808334
7461 -2808334 -3279303 -1480988 156544 -1233884 -5137236 -7572449 -5525919 -478527
7453 -478527 3461140 4076557 2332797 -150299 -2871327 -5490234 -7052684 -7138330 -6549709
7444 -6549709 -5992986 -5080435 -3413591 -1700257 -979928 -1463427 -2670189 -3876746 -4078329
7435 -4078329 -2653972 -511510 737365 1167362 2397822 4384071 4521774 1429758 -2381199
7426 -2381199 -3683715 -2793988 -2323661 -2937136 -3038490 -2036531 -1216157 -1379039 -1888432
7417a888432k67598R0414J140396K782909K983102N98635k107205k208142j99494
7408I24585R69248Q9741j213835j063675P37129K928446L688321J939080j220090
7399G778950l225183k960490j754556q75217P5478J276672J461126J66023q89375
7390A053428m39603L95906N82423J108008K292099J958810p57616k525332m93172
7381C174951K466099J598647k338401m354256k870352r61352k41003J113260L490449
7372A078042M189701K330076Q75534J588411K003393K1586k032045j041599J853644
7363A0866743K944313Q80401k691793n839421p251188n807296j733160K502999
7355f128402M296666L397892J248874r96015k611097k836996j731543m40937M29797
$$ plain form
7417 -1888432 -2156030 -2065616 -925220 1857689 4840791 5439426 3332221 1124079 924585
7408 924585 1893833 1983574 769739 -293936 443193 3371639 7059960 8999040 7778950
7399 7778950 4553767 1593277 -161279 -1036496 -961018 315654 1776780 1942803 1053428
7390 1053428 613825 1009731 1592154 2700162 4992261 6951071 6193455 3668123 3174951
7381 3174951 5641050 7239697 4901296 547040 -2323312 -3284664 -3525667 -2412407 1078042
7372 1078042 5267743 7597819 8473353 10061764 12065157 12086743 10054698 9013099 10866743
7363 10866743 13811056 14691457 11999664 6160243 -1090945 -6898241 -8631401 -6128402
7355 -6128402 -1831736 1566156 2815030 1819015 -792082 -3629078 -5360621 -5801558 -5371761
7346e371761J423297K374642J874294j21952j266890k17479R92744K06161j204741
7337a311685p63191O17118K984k404597l089571n02310K656197L407316K148387
7328G60648R49706K47506r40335k602802l326708k213159j74368R61396L88486
7319e949630p73771p22758Q04325K095621J706976M58443K46271J315207K008086
7310A188770J301887L12708O07395J803608J832614l60462l020329l128638Q0965
7301F18518L727012M190423J278982j544412j376829P66229J562365m69377l465544
7292E287367m506780k501034J105746L744023L728546J320983j864657m229135
7284B085059m801166l204718k05490J880778R74630j961662l386093j461610J440782
$$ plain form
7346 -5371761 -3948464 -1573822 300472 178520 -1088370 -1305849 -313105 -106944 -1311685
7337 -1311685 -2074876 -1457758 -1454774 -3859371 -6948942 -7451252 -4795055 -1387739 760648
7328 760648 1710354 1957860 1017525 -1585277 -4911985 -7125144 -7299512 -6338116 -5949630
7319 -5949630 -6723401 -7446159 -6641834 -4546213 -2839237 -2380794 -2134523 -819316 1188770
7310 1188770 2490657 2803365 3410760 5214368 7046982 6686520 3666191 537553 618518
7301 618518 4345530 8535953 9814935 8270523 6893694 7659923 9222288 8752911 5287367
7292 5287367 780587 -1720447 -614701 3129322 6857868 8178851 6314194 2085059
7284 2085059 -2716107 -5920825 -6126315 -4245537 -3270907 -5232569 -8618662 -10080272 -8639490
7275h639490J900606k0480j276168k95014J218569J260842L90583M48853J510240
7266c501459J650945k48522k692911l335248j956100m87043j837P76247K940029
7257f855899M802646L896951R26641q09766j37546N01333p58277k124585j146201
7248a704703J245288K145542R07754n72263j186108j668979k244992j565477J111406
7239c532532M181377N215810L620942J109097k73591k34019j81436j021680j611707
7230G272261m70751J340296J044607j569362k938933m26725L587482M564108J589354
7221A3992337k098845l652493l157772j892615o48970k34383j420329l504123
7213b617193m484941l441695j522920p6822R05924J871081K442783J983930P37289
$$ plain form
7275 -8639490 -6738884 -6759364 -8035532 -8330546 -7111977 -5851135 -5460552 -5011699 -3501459
7266 -3501459 -1850514 -2099036 -4791947 -8127195 -10083295 -10570338 -10572175 -9795928 -6855899
7257 -6855899 -2053253 1843698 2770339 1960573 1823027 2324360 1566083 -558502 -1704703
7248 -1704703 -459415 1686127 2593881 2021618 835510 -833469 -3078461 -4643938 -3532532
7239 -3532532 648845 5864655 9485597 10594694 10321103 10087084 9905648 8883968 7272261
7230 7272261 6801510 8141806 9186413 7617051 4678118 4251393 7838875 12402983 13992337
7221 13992337 11893492 8240999 5083227 3190612 2541642 2307259 886930 -2617193
7213 -2617193 -7102134 -10543829 -12066749 -12143571 -11237647 -9366566 -6923783 -4939853 -4202564
7204d202564k98480l66376L97350J073636Q62746J67163K76442J485721K337137
7195A732775J597712P4426p73021j075315j716596k052077o87908J656213K414400
7186A170609P59771j120967j119533J53408P92040K23573p59285j579926k214833
7177c695143k363606j388614O59030K429297K300819L98048r38997J74742K258354
7168a66070K076481n16764j901033j77993J561587R6958k396388j563275K036752
7159i49745L630232J523028j025792j676061k064526l543438m154636k197116
7151a0458054N46776J632948J347911J085964Q39044M21540P17621J514122N64398
7142a787730k789551n430498m499374j447905N79204J217563J814783K018730
$$ plain form
7204 -4202564 -4501044 -4867420 -4470070 -3396434 -2533688 -2366525 -2090083 -604362 1732775
7195 1732775 3330487 3404913 2631892 1556577 -160019 -2212096 -2900004 -1243791 1170609
7186 1170609 1930380 809413 -310120 -156712 635328 858901 99616 -1480310 -3695143
7177 -3695143 -6058749 -7447363 -6788333 -4359036 -2058217 -1660169 -2599166 -2424424 -166070
7168 -166070 1910411 1393647 -507386 -685379 876208 973166 -1423222 -2986497 -949745
7159 -949745 2680487 4203515 3177723 1501662 -562864 -4106302 -8260938 -10458054
7151 -10458054 -9911278 -8278330 -6930419 -5844455 -5005411 -4583871 -3866250 -2352128 -1787730
7142 -1787730 -4577281 -10007779 -14507153 -15955058 -15375854 -14158291 -12343508 -10324778
7134a0324778Q56005l79791J72137J499768J297572r1212o34547l91688p31550
7125h728084q14234J082214L400949K947612N37669J92258K220815K329435q77776
7116B290858k899668o79322K044238Q76464j871453j279347J538302J086782l161399
7107b054545n388947k378027J773966K269405L24718j29514J066223J297663M42284
7098b776774O26421J668312J213164n55691p01886J069129J112811k112193m711657
7089e168364l047659O44063K118124J786458K824486M530310L172315r14875k834755
7080C110103q18721R21462q00629l107799k204973M17217Q33511j104113k456029
7071e209971k217149j787279j577561o62971P59473J453471J225098O77698k21786
$$ plain form
7134 -10324778 -9468773 -9848564 -9676427 -8176659 -6879087 -6970299 -7604846 -7996534 -8728084
7125 -8728084 -9542318 -8460104 -5059155 -2111543 -1573874 -1381616 839199 3168634 2290858
7116 2290858 -608810 -1288132 756106 1632570 -238883 -1518230 20072 1106854 -2054545
7107 -2054545 -7443492 -9821519 -8047553 -5778148 -5453430 -5582944 -4516721 -3219058 -2776774
7098 -2776774 -2150353 -482041 731123 175432 -526454 542675 1655486 -456707 -5168364
7089 -5168364 -8216023 -7571960 -5453836 -3667378 -842892 3687418 6859733 5944858 3110103
7080 3110103 2291382 3212844 2412215 -695584 -2900557 -2483340 -1649829 -2753942 -5209971
7071 -5209971 -7427120 -9214399 -10791960 -11454931 -10695458 -9241987 -8016889 -7339191 -7560977
7062g560977j206794o92362J853968L934696L076752M43674j289422j843827j961602
7053e245894l56301L650879O270099L335715k523631m438408j108113J693101
7045A277447K33176k534652l265000l198749l821213k945984Q33156M185108L919875
7036e316836K161257K145717K258006n47129m047721l379947R42986L459190K028108
7027b96369K04098O47999J313223m9320j944968k180992j540933j689052j870332
7018g406646n66426J198043J129935m32418n51853K115500N116097N012693J355590
7009F970515k967067m840050l637198j011839J127079J969416J802170J582648
7001I95674K283653L661605L797204J165346k698541m226346k168374P38472J521604
$$ plain form
7062 -7560977 -8767771 -9460133 -7606165 -3671469 -594717 -151043 -1440465 -3284292 -5245894
7053 -5245894 -5602195 -1951316 4318783 7654498 5130867 692459 -415654 1277447
7045 1277447 1510623 -1024029 -4289029 -7487778 -11308991 -14254975 -13421819 -9236711 -5316836
7036 -5316836 -3155579 -1009862 1248144 701015 -3346706 -6726653 -5783667 -2324477 -296369
7027 -296369 -92271 555728 1868951 1819631 -125337 -2306329 -3847262 -5536314 -7406646
7018 -7406646 -7973072 -6775029 -5645094 -6077512 -6629365 -4513865 602232 5614925 6970515
7009 6970515 4003448 -836602 -4473800 -5485639 -4358560 -2389144 -586974 995674
7001 995674 3279327 6940932 10738136 11903482 9204941 4978595 2810221 3548693 5070297
6992E070297O69831L89230P06938j67710k219142l069466j480222P07263J050967
6983A657986m93929k013203k146480j265565n87263p68671j348570j404749o95525
6974i065969J36752N47835O69712O79343M44490K57499Q79754K116855K496870
6965h36859J374243J08346j60993n10337k148712l655862k819494m00882Q45656
6956h204894O55759J578387M335586O033983M346603Q59362j424602j762774j116509
6947E300901P1545J450644J679983J4126k056915k717588k393350k471415k543563
6938c665632j278786O92995J376936O69448M33193J152609J108734m40499j681867
6929a632869r96297P14573J753121J943022J810950J049766n13481j662474j267108
$$ plain form
6992 5070297 5740128 6129358 6836296 6668586 4449444 1379978 -100244 607019 1657986
6983 1657986 1164057 -849146 -2995626 -4261191 -4848454 -5617125 -6965695 -8370444 -9065969
6974 -9065969 -8929217 -8381382 -7711670 -7032327 -6587837 -6330338 -5450584 -3333729 -836859
6965 -836859 537384 645730 484737 -25600 -2174312 -5830174 -8649668 -9050550 -8204894
6956 -8204894 -7549135 -5970748 -1635162 4398821 8745424 9604786 8180184 6417410 5300901
6947 5300901 5372446 6823090 8503073 8517199 6460284 3742696 1349346 -1122069 -3665632
6938 -3665632 -4944418 -4251423 -2874487 -2205039 -1771846 -619237 489497 48998 -1632869
6929 -1632869 -2629166 -1914593 -161472 1781550 3592500 4642266 4128785 2466311 1199203
6920A199203o7995O59469J206708K292893K780498R54943k264620l879908k745951
6911A35240o74796O80411J621166K426085K126695N81615m24757J81996Q68428
6902G522083N210j403394j506202o64443n03455j057576j179213r08467j081026
6893g76483j263980m39494Q38477J325477J442546K132960K100474n78428m373845
6884D07704n440753l139176p25624J20679J364859L782154M392392J426926j830963
6875C58198j625051O97901J377241J86297l48432j4157q23050k521889k419704
6866e132646K3977K040216J706322L06222k86796m3179L33921Q18461J350121
6857A116619J269553K41141j289345k669747l068111j505286J592293L634194
$$ plain form
6920 1199203 1131208 1790677 2997385 5290278 8070776 9025719 6761099 2881191 135240
6911 135240 -539556 140855 1762021 4188106 6314801 6896416 6471659 6653655 7522083
6902 7522083 7527293 6123899 4617697 3953254 3449799 2392223 1213010 304543 -776483
6893 -776483 -2040463 -2479957 -1641480 -316003 1126543 3259503 5359977 4781549 407704
6884 407704 -5033049 -8172225 -8897849 -8777170 -7412311 -3630157 762235 2189161 358198
6875 358198 -1266853 -568952 808289 994586 646154 631997 -191053 -2712942 -5132646
6866 -5132646 -5108669 -3068453 -1362131 -1055909 -1342705 -1385884 -1051963 -233502 1116619
6857 1116619 2386172 2627313 1337968 -1331779 -4399890 -5905176 -4312883 -678689
6849f78689K731892O55127M53778J667786R66189k340267m697106l209680N48313
6840c902657K909372K219888m75023k987924l362440j390403P11199Q35824J22717
6831e319447J156867L232189K834064n94858l242097k726583j441489j898132
6823g999486k495099r82273J156276J473905J068670K288596L989883L390595
6815A891067J218716N24090J168102J41524k674402l701344j447592J113608J359464
6806d06767M36092M3384o76426k507205l288497q32914K991488M166823J779278
6797A705256j152863j774636j80176J803739K672868J804117m17535k414695k468843
6788d22768o05043J288988J710493J197161J078270J223105K49285j945262l187914
$$ plain form
6849 -678689 2053203 2708330 3162108 4829894 5796083 3455816 -1241290 -4450970 -3902657
6840 -3902657 -993285 1226603 751580 -2236344 -5598784 -6989187 -6277988 -5442164 -5319447
6831 -5319447 -4162580 -930391 1903673 1308815 -1933282 -4659865 -6101354 -7999486
6823 -7999486 -10494585 -11476858 -10320582 -8846677 -7778007 -5489411 -1499528 1891067
6815 1891067 3109783 3633873 4801975 4943499 2269097 -1432247 -2879839 -1766231 -406767
6806 -406767 29325 72709 -603717 -3110922 -6399419 -7232333 -4240845 -74022 1705256
6797 1705256 552393 -1222243 -1402419 401320 3074188 4878305 4460770 2046075 -422768
6788 -422768 -1027811 261177 1971670 3168831 4247101 5470206 5719491 3774229 586315
6779E86315j608874J499687K879168J346981q72218j331229l25494L61983K74963
6770B811282K13916K72209j24015n63446N190J140933R64333j069678k951344
6761F99380k496942R6850K789344L901548L144265J279462m86303j298592j421746
6752F207266j821710k698908l010420j787803O10644K849718L704663K654560
6744F708010R0768k726192m390203m240464k369043O49648L218233K877897r94752
6735a176098m951358m503935M2927L498806K780607J034268K343725N059731M297520
6726H426193l60929m205479m430046l259081k811599j309759K780103O337814
6718A167217N253463N84600k831161k918982j776578j037017J24017J780350J878276
$$ plain form
6779 586315 -1022559 477128 3356296 4703277 3831059 2499830 2174336 2536319 2811282
6770 2811282 3025198 3297407 3173392 2609946 2615136 3756069 4720402 3650724 699380
6761 699380 -1797562 -1700712 1088632 4990180 8134445 9413907 8927604 7629012 6207266
6752 6207266 4385556 1686648 -1323772 -3111575 -2500931 348787 4053450 6708010
6744 6708010 6798778 4072586 -317617 -4558081 -6927124 -6277476 -3059243 -181346 -1176098
6735 -1176098 -6127456 -10631391 -10588464 -7089658 -4309051 -3274783 -931058 4128673 8426193
6726 8426193 8065264 3859785 -570261 -3829342 -6640941 -7950700 -5170597 1167217
6718 1167217 6420680 7005280 4174119 1255137 -521441 -1558458 -1434441 345909 2224185
6709B224185l64196k648772k927941k049819j417653n99351P06912R32273n25719
6700f670081j102439J118638L410467K004017j735759k978496o04905J764479
6692d794079J962782J798911K469477K220594N92853N81186L552142N661368L001479
6683A7046713k365546n309710m562268k914271j985707q82888N10313P95030r4779
6674B36887m21935M79059J364284J477793J501890J737861J380341K5781j673989
6665F107972k905308k898984r31832K061951K889850l28673m714529n676489k940853
6656i336895l03404L75601J078205L010673M156295L073701J648513J850084K491027
6647H043800J533549n26943j778468j714791j123357o55309q71382k018100k719401
$$ plain form
6709 2224185 1859989 -788783 -3716724 -5766543 -7184196 -7783547 -7076635 -6144362 -6670081
6700 -6670081 -7772520 -6653882 -3243415 -1239398 -2975157 -5953653 -6558558 -4794079
6692 -4794079 -2831297 -1032386 1437091 3657685 4250538 4831724 8383866 14045234 17046713
6683 17046713 14681167 9371457 4809189 1894918 -90789 -973677 -463364 331666 236887
6674 236887 -185048 294011 1658295 3136088 4637978 6375839 7756180 7781961 6107972
6665 6107972 3202664 303680 -628152 1433799 4323649 3994976 -719553 -6396042 -9336895
6656 -9336895 -9640299 -9264698 -8186493 -5175820 -1019525 2054176 3702689 5552773 8043800
6647 8043800 9577349 9050406 7271938 5557147 4433790 3778481 2907099 888999 -1830402
6638a830402j133369J480972J272235k383840m823249k516332J550377K455049
6630e928559O67462L93796K254810K528916m74600l702544l853854j280549J452610
6621g942512K284861M79852k711416l925335r27280L678773M841204J683068j342485
6612c881270q66112J056904P96956j440942k532215j017692J608959L292931L261652
6603B79171K025769Q18645O03915R97999R02832L78243M61463R01829J91146j391172
6593F169840j268781J331916L206085J445599k050789l145353j147219J103651
6585E644949J872253J876316J338943o39508l098043l027200K69524L312507K811421
6576A0361162k32948k691709l585061l900189l767679k583345j072919n27750
$$ plain form
6638 -1830402 -2963771 -1482799 -210564 -2594404 -7417653 -9933985 -8383608 -5928559
6630 -5928559 -5261097 -4867301 -2612491 -83575 -558175 -4260719 -8114573 -9395122 -7942512
6621 -7942512 -5657651 -5177799 -7889215 -11814550 -12741830 -9063057 -4221853 -2538785 -3881270
6612 -3881270 -4747382 -3690478 -2893522 -4334464 -6866679 -7884371 -6275412 -2982481 279171
6603 279171 2304940 3123585 3727500 4725499 5628331 6006574 6468037 7369866 7561012 6169840
6593 6169840 4901059 6232975 9439060 10884659 8833870 5688517 4541298 5644949
6585 5644949 7517202 9393518 10732461 10092953 6994910 3967710 4237234 7549741 10361162
6576 10361162 10128214 7436505 3851444 -48745 -3816424 -6399769 -7472688 -8000438
6568h000438m25265N62848J543744M55599j687733j162826K598167N022172K694862
6559A601130j317291j818953R38411K109601k56919k908259k822466q86380R75740
6550d385386K603928L696474K493998j023707l311058j610667J896623L332775
6542C692980K656329K391305K278742l26233m782471o461626l209917J167550
6534b593341K151936M30998k10715J027349J362470n39209k110309o10742K607264
6525A515701L451443L62778l448726l901251j129241J011929L26839j114639p43612
6516c668779M68171K6883j646258j862562j05125J403861J623263J886181K506807
6507F32442J570946j366189l398690k234940L84641J573350J472813J883709K497556
$$ plain form
6568 -8000438 -8425703 -7862855 -6319111 -5863512 -7551245 -8714071 -6115904 -1093732 1601130
6559 1601130 283839 -1535114 -596703 1512898 1255979 -1652280 -4474746 -5361126 -4385386
6550 -4385386 -1781458 1915016 4409014 3385307 74249 -1536418 360205 3692980
6542 3692980 6349309 8740614 11019356 10693123 5910652 -550974 -3760891 -2593341
6534 -2593341 -441405 -10407 -221122 806227 2168697 1629488 -480821 -1091563 1515701
6525 1515701 4967144 5329922 1881196 -2020055 -3149296 -2137367 -1810528 -2925167 -3668779
6516 -3668779 -3200608 -3173725 -4819983 -6682545 -6787670 -5383809 -3760546 -1874365 632442
6507 632442 2203388 837199 -2561491 -4796431 -4411790 -2838440 -1365627 518082 3015638
6498C015638J614980l54573j223962n88965k78007j114919j740818j178593m24883
6489b274102o10933j110811m35253J769839M111616M472043J906881j880075l604360
6480B344845j884740J029046K016989O08980j485178l007798l434883j999077
6472e811816R74800K762915J310965j043528m04921K377023K378272j733349n115330
6463d304969l724268J85388K310852K480123K995270L606432K372081p2994j185396
6454D662519n91218J20886Q46743K411757L203138O52323l741039n189505k350880
6445B4724P91767J129938L75247P40756Q05227j082724k675780j187699J490964
6436D12420J283070j633668l202014j869293l45657n55246q44286M03332J704085
$$ plain form
6498 3015638 4630618 4276045 3052083 2463118 2185111 1070192 -670626 -1849219 -2274102
6489 -2274102 -2885035 -3995846 -4431099 -2661260 1450356 5922399 7829280 5949205 2344845
6480 2344845 460105 1489151 3506140 4115120 2629942 -377856 -3812739 -5811816
6472 -5811816 -4837016 -2074101 -763136 -1806664 -2211585 165438 2543710 810361 -4304969
6463 -4304969 -8029237 -7843849 -5532997 -3052874 -57604 3548828 5920909 5847915 4662519
6454 4662519 4071301 4192187 5038930 7450687 10653825 11306148 7565109 2375604 24724
6445 24724 816491 1946429 2321676 3062432 3867659 2784935 109155 -1078544 412420
6436 412420 1695490 61822 -3140192 -5009485 -5355142 -5910388 -6754674 -6351342 -4647257
6427d647257J039518q62512j822880j170700K80371J858322L097027L335196K659413
6418C766498K224369K416104J855825m29203l017195l836359k912852j760566
6410a693379r70847k56174j00554j148172k217584j214292J649395L562200K733187
6401C43780O19499l80176n8037q338r79220j936416j656131l69942N11905J25367
6391c787709p45103p16256J46188L26151o14565p95078J381466M406262N331399
6382D932755L716376J777619P73479l24957k159351l508912l534967l228019l208185
6373d764162k219191L22667K171057J037708j731466k798064j398823K30655N88289
6364h561330M62077O61435P26204N36815R89333K077302K165502L52496j984065
$$ plain form
6427 -4647257 -3607739 -4470251 -6293131 -7463831 -7183460 -5325138 -2228111 1107085 3766498
6418 3766498 5990867 8406971 10262796 9833593 6816398 2980039 67187 -1693379
6410 -1693379 -2664226 -2920400 -3020954 -4169126 -6386710 -7601002 -5951607 -2389407 343780
6401 343780 963279 583103 525066 516728 -462492 -2398908 -4055039 -4424981 -3913076 -3787709
6391 -3787709 -4532812 -5249068 -5102880 -4776729 -5391294 -6186372 -4804906 -398644 4932755
6382 4932755 8649131 10426750 11200229 10875272 8715921 5207009 1672042 -1555977 -4764162
6373 -4764162 -6983353 -6660686 -4489629 -3451921 -5183387 -7981451 -9380274 -9149619 -8561330
6364 -8561330 -8099253 -7437818 -6711614 -6174799 -5185466 -3108164 -942662 -590166 -2574231
6355b574231l203278l473949l381569j955685J664545N300512N175146R30146
6347a518363k953905k237534J918512M712655L880297J740522P95606K0423k472454
6338C885759n017491m006947K78990K955119J005414k414573k478543O46645K652152
6329b493475J396040r60794j882331j286942M0692J848238L140872K228088l97159
6320A633229j605088N1719J722109L33640k524679k802642o9666J915277P46639
6311e99462j612231k251649j169105j60022L09890J235944K938090M377903M358634
6302G427992K463252q21977m053421n288873l617610k95316K233492K484606Q77972
6293A410117j072001k001525j474898j83982P12835Q97760J304603K668790L941117
$$ plain form
6355 -2574231 -5777509 -9251458 -12633027 -14588712 -12924167 -7623655 -2448509 -1518363
6347 -1518363 -4472268 -6709802 -4791290 -78635 3801662 5542184 6337790 6358213 3885759
6338 3885759 -1131732 -5138679 -4859689 -1904570 -899156 -3313729 -5792272 -5145627 -2493475
6329 -2493475 -1097435 -2058229 -3940560 -5227502 -5186810 -3338572 -197700 2030388 1633229
6320 1633229 28141 79860 1801969 2135609 -389070 -3191712 -3261378 -1346101 -599462
6311 -599462 -2211693 -4463342 -5632447 -5792469 -5482579 -4246635 -1308545 3069358 7427992
6302 7427992 9891244 9069267 5015846 -273027 -3890637 -4185953 -1952461 532145 1410117
6293 1410117 338116 -1663409 -3138307 -3322289 -2609454 -1711694 -407091 2261699 6202816
6284F202816L032204o40046m956963o845668n046829j101281K100096K676878
6276d578793J058296p48354j154122k61818P57354J154477J152522J280643J611664
6267B71869J625179O43450j333142l061152k938918r57528R20183J113397M05488
6258c311174M29649R69494N60270o13792p18092N06099R17070n49841j777235
6249c587552n57901J909240K698716J245476l51172n27328J53979M06657k58794
6240A131321j270362j327654L33559K233644J651167j392779l107394j019472
6232b767970J962977J656071j016756j816419l06867k94961k927033m354896j845622
6223a1711476K112796L952941L608504K732222J748139J065598K012936M031430
$$ plain form
6284 6202816 9235020 8594974 3638011 -3207657 -8254486 -9355767 -7255671 -4578793
6276 -4578793 -3520497 -4268851 -5422973 -5684791 -4927437 -3772960 -2620438 -1339795 271869
6267 271869 1897048 2540498 1207356 -1853796 -4792714 -5750242 -4830059 -3716662 -3311174
6258 -3311174 -2881525 -1912031 -1351761 -1965553 -2683645 -2177546 -1260476 -1810317 -3587552
6249 -3587552 -4145453 -2236213 462503 1707979 1356807 829479 983458 1390115 1131321
6240 1131321 -139041 -1466695 -1133136 1100508 2751675 1358896 -1748498 -2767970
6232 -2767970 -804993 851078 -165678 -1982097 -2288964 -2583925 -5510958 -9865854 -11711476
6223 -11711476 -9598680 -5645739 -2037235 694987 2443126 3508724 5521660 9553090
6215I553090M010298R86574j652759j381878n03164j675819l086031k123584n24140
6206C602587j101574k268155j083134P43378k56020k391867j262092K068179K251357
6197C02659j143706k685021j98444K085088J260394l2068L16135j06642k741440
6188b943045m234435k062290Q71615J281524O52562J202194J089791j566971l746522
6179i455577j876858J820023K591883M51848q86070m32502j64032k66257Q17067
6170g400475K405148K292124R20891O92942J686635J969311J417805J320300J107832
6161F412513l88569j434192K98629K711384J535212k667371m828916k928467k44170
6152a533947M39837j13554j109599l169087m977677l495289P71775L413889K772815
$$ plain form
6215 9553090 13563388 14549962 12897203 11515325 11012161 9336342 6250311 4126727 3602587
6206 3602587 2501013 232858 -850276 -106898 -362918 -2754785 -4016877 -1948698 302659
6197 302659 -841047 -3526068 -3724512 -1639424 -379030 -411098 -94963 -201605 -2943045
6188 -2943045 -7177480 -9239770 -8368155 -7086631 -6434069 -5231875 -4142084 -5709055 -9455577
6179 -9455577 -11332435 -9512412 -6920529 -6468681 -7354751 -7787253 -7951285 -8217542 -7400475
6170 -7400475 -4995327 -2703203 -1782312 -1089370 597265 2566576 3984381 5304681 6412513
6161 6412513 6023944 4589752 4888381 7599765 9134977 6467606 1638690 -1289777 -1533947
6152 -1533947 -1094110 -1207664 -2317263 -5486350 -10464027 -13959316 -13187541 -9773652 -7000837
6143g000837K140292L426681L939395K164509J310507L298075M262233Q10907
6135A4351762l504302l431174m09999J58843k247007l278542j451960R8583l38138
6126e1934o83462K93307O16019j010141k595017j960895J93630J830805K135092
6117a232596J442709L68799j95402K79712R40673O19377j83913j62195L12074
6108B189238j45327j053646o58309N20629m5324k351601k982594l45562K351155
6099b521341J622847j387819l184586k935668k174906j162614R22105K985882
6091g836100K898907J390747J528723L659404M392712K029979m68246l26418L82619
6082G652327j533697m328380l635675L0474J293464j733666m172182j897047K073717
$$ plain form
6143 -7000837 -4860545 -1433864 2505531 4670040 5980547 9278622 13540855 14351762
6135 14351762 10847460 7416286 7006287 7165130 4918123 1639581 187621 286204 -51934
6126 -51934 -735396 -442089 173930 -836211 -3431228 -5392123 -5198493 -3367688 -1232596
6117 -1232596 210113 578912 383510 663222 1603895 2223272 2039359 1877164 2189238
6108 2189238 2043911 990265 331956 852585 807261 -1544340 -4526934 -4872496 -2521341
6099 -2521341 -898494 -2286313 -5470899 -8406567 -10581473 -11744087 -10821982 -7836100
6091 -7836100 -4937193 -3546446 -2017723 1641681 6034393 8064372 7596126 7269708 7652327
6082 7652327 6118630 1790250 -1845425 -1814951 -521487 -2255153 -6427335 -8324382 -6250665
6073f250665K498308j35724j336659k18835l8564j679159j946797P35774L591811
6064d780510M089468L290223K685588J469750o02277j165272Q40892K155702l07247
6055G676317m168721m659075j584936O73673m11098k653897k889585p03140K035314
6046f685148L323858K498564R83272J133585L046404L784023J537764j264074
6038H358248j637853q55136j848694l402274j805550K125034L138570k80278l113630
6029F78437j520466J394009R97091j515008j652977P98598J548307j428908n002004
6020e702921n418115k780891R2551J374875J584752K114802L276834L860590K726427
6011A128904O65567k54219N31067J206180K31507j366461j509055N5481J597522
$$ plain form
6073 -6250665 -3752357 -3888081 -5224740 -5443575 -5482139 -7161298 -9108095 -8372321 -4780510
6064 -4780510 -691042 2599181 5284769 6754519 6152242 4986970 5827862 7983564 7676317
6055 7676317 3507596 -1151479 -2736415 -2062742 -2473840 -5127737 -8017322 -8720462 -6685148
6046 -6685148 -3361290 -862726 120546 1254131 4300535 8084558 9622322 8358248
6038 8358248 6720395 5865259 4016565 614291 -1191259 933775 4072345 3792067 678437
6029 678437 -842029 551980 1549071 34063 -1618914 -820316 727991 -700917 -5702921
6020 -5702921 -11121036 -13901927 -13809376 -12434501 -10849749 -8734947 -5458113 -1597523 1128904
6011 1128904 1794471 1540252 2071319 3277499 3509006 2142545 633490 688971 2286493
6002B286493J519307l02663k606473l425611j643251J264523K173477Q8079k236081
5993b882200j815516O03993J839324N84560j507798k471231j777232K39912K719973
5984d466215M013229K897325L12438j589783k165649k452186k650480j505166
5976g606487J200539L505961L805762L013812K805881K858775J536223j180850
5968I939616l137996k616165l49897J539098J905756J320017Q58765Q63267R65487
5959A1287948P80780J74750q09244j742294j821513r26228m93330k013399m300776
5950A36694l927760L13793M733672M614454K26774l355121k678874J92586J237305
5941A493523k02468j603157j469742q81192q85394n82814J187027L560853M379710
$$ plain form
6002 2286493 3805800 3503137 896664 -2528947 -4172198 -2907675 -734198 -646119 -2882200
5993 -2882200 -4697716 -4093723 -2254399 -1669839 -3177637 -5648868 -7426100 -7186188 -4466215
5984 -4466215 -452986 2444339 2756777 1166994 -998655 -3450841 -6101321 -7606487
5976 -7606487 -6405948 -2899987 905775 3919587 6725468 9584243 11120466 9939616
5968 9939616 6801620 4185455 3835558 5374656 7280412 8600429 9459194 10322461 11287948
5959 11287948 12068728 12243478 11434234 9691940 7870427 6944199 6450869 4437470 136694
5950 136694 -3791066 -3477273 1256399 5870853 6097627 2742506 63632 256218 1493523
5941 1493523 1291055 -312102 -1781844 -2663036 -3548430 -4131244 -2944217 616636 4996346
5932D996346K815519K53780j453294j825654j586956j313104r24389l67251o0936
5923E34061l30759q76547j293230j728647k284706k046522L6120K909903L461902
5914a618425J79615l997348m397960l46413L713427L679543O45067j286954o49995
5905d079443L22966j96141j200519j144251k38170Q56273K556506M723672N174652
5896F775545K291407j777893l154579j286330N58530J64646p96321J37788K413358
5887E326151L412627J933292q58362l150370l771095k347345L99332K642098K848395
5878F434723J334769j96156o36905m73885q56384k104848l228568k842971o49078
5869c219303K108736L896279M259336L442510J303643k103127n124350n426402
$$ plain form
5932 4996346 7811865 8065645 6612351 4786697 3199741 1886637 962248 594997 534061
5923 534061 203302 -673245 -1966475 -3695122 -5979828 -8026350 -7990230 -5080327 -1618425
5914 -1618425 -1438810 -5436158 -9834118 -10180531 -6467104 -2787561 -2142494 -3429448 -4079443
5905 -4079443 -3756477 -3952618 -5153137 -6297388 -6535558 -5679285 -3122779 1600893 6775545
5896 6775545 9066952 7289059 4134480 2848150 3406680 3571326 2775005 2912793 5326151
5887 5326151 8738778 10672070 9813708 6663338 2892243 544898 944230 3586328 6434723
5878 6434723 7769492 7573336 6936431 6462546 5606162 3501314 272746 -2570225 -3219303
5869 -3219303 -1110567 2785712 7045048 10487558 11791201 9688074 4563724 -862678
5861h62678k808288L17516J816849J795975J083710m56237k796208m394849l707184
5852a0011394j273490J112410K618496L447044L463766K289438L55272j423307
5844E78235k664211l200340k472654n08832J223024J402726P15519O86866J320914
5835b918753J472200Q59415j02040j747017m204935n482172l180192J665251N031584
5826h606659M818982K965239J923376J549538P93013J09344K62335M82112j13424
5817D183856n84006K24187J166031K40919j939641k542509n81798J536083J318626
5808C021748n76465j511383k54571J946734L159568K600855Q48712q81074j511093
5799F843031p99836M10092R67729N85145j60575j020002k360357l698842l093361
$$ plain form
5861 -862678 -3670966 -3353450 -1536601 259374 1343084 886847 -1909361 -6304210 -10011394
5852 -10011394 -11284884 -10172474 -7553978 -4106934 -643168 1646270 2001542 578235
5844 578235 -2085976 -5286316 -7758970 -8267802 -7044778 -5642052 -4926533 -4239667 -2918753
5835 -2918753 -1446553 -587138 -689178 -2436195 -6641130 -12123302 -15303494 -13638243 -8606659
5826 -8606659 -3787677 -822438 1100938 2650476 3443489 3552833 3815168 4297280 4183856
5817 4183856 3599850 3824037 4990068 5230987 3291346 748837 167039 1703122 3021748
5808 3021748 2445283 933900 679329 2626063 5785631 8386486 9235198 8354124 6843031
5799 6843031 6043195 6453287 7421016 8006161 7845586 6825584 4465227 766385 -2326976
5790b326976L97671M128475L925469o41968m943260m488848o5321L701727L730787
5781C417756Q90332j961956k599542p74672J404230J064779j937687m058501k433988
5772f989249R53932K018016M75968k94090J031430K020833J201922N73189J632382
5763B624333K316648M62257k294193k912931j384461j8223K47723J13536l76586
5754a221897j634258k678619k034915j47660J309099K142064L424918M844801
5746D003533M610551K223060n94588j998350j525382L56834K441385K701328J07827
5737A2326198l262274l945407j341577J620364K501479J998315J765185J638204
5729A3300487N14167j374868k684367k798604k210249j458565o81649n9704K4344
$$ plain form
5790 -2326976 -1929305 2199170 6124639 5482671 539411 -3949437 -4014758 -313031 3417756
5781 3417756 4308088 2346132 -253410 -1028082 376148 1440927 -496760 -4555261 -6989249
5772 -6989249 -6035317 -4017301 -3541333 -3835423 -2803993 -783160 418762 991951 2624333
5763 2624333 4940981 5403238 3109045 196114 -1188347 -1206570 -958847 -845311 -1221897
5754 -1221897 -2856155 -5534774 -7569689 -7717349 -6408250 -4266186 -841268 4003533
5746 4003533 8614084 10837144 10242556 8244206 6718824 7075658 9517043 12218371 12326198
5737 12326198 9063924 5118517 3776940 5397304 7898783 9897098 11662283 13300487
5729 13300487 13814654 12439786 9755419 6956815 4746566 3288001 2606352 2546648 2570992
5720B570992o21983j622012k080855j333494P5345P73163N43176R84468K932299
5711B221099M242021K307580j675591l668901k322873o66587j192597k207307
5703b963156j183190P67443Q10506p29427q27949J286604K919769K212499Q34424
5694C127523J071335K315944K218437J93166j891100k181793q61424L15840m3720
5685D264208j498556k181018j038382N22621J80885j993671l102601j087061K289035
5676c644540L445099J403268j245320j767259l48668P54553K10979j024067j101748
5667c317703M95729K319876K566001J115165n65145j600580k716500m273002m499335
5658a0475494j599530K768625M529616K393197k16809J03684K040717J892851
$$ plain form
5720 2570992 1949009 326997 -1753858 -3087352 -3012007 -2238844 -1695668 -711200 2221099
5711 2221099 6463120 8770700 7095109 3426208 1103335 436748 -755849 -2963156
5703 -2963156 -4146346 -3378903 -2568397 -3297824 -4125773 -2839169 80600 2293099 3127523
5694 3127523 4198858 6514802 8733239 8926405 7035305 4853512 3992088 4307928 4264208
5685 4264208 2765652 584634 -453748 68873 249758 -1743913 -4846514 -5933575 -3644540
5676 -3644540 -199441 1203827 -41493 -1808752 -2157420 -1402867 -1191888 -2215955 -3317703
5667 -3317703 -2821974 -502098 2063903 3179068 2613923 1013343 -1703157 -5976159 -10475494
5658 -10475494 -12075024 -9306399 -4776783 -2383586 -2600395 -2496711 -455994 1436857
5650A436857o82894k211177n95559K085436K898157J864356R26465P35648L66639
5641F823928n12343r50455k23000J058070J536468M02172j708696k919358j946133
5632A560653j23375m64330l718039o509549n103314l84113K983701K382384K6547
5623i349435q00868r8266L0033o22521q3528K289582M403650M270170K452022
5614B490839O09326q27677k036059k222158q37267L93176p11449k938183k540115
5605h619567J181764M076849K757626n94403j694820l19028M09296m55456q17907
5596d075646J06515N51005j47940l35969N45254Q68347L75727J084165K873238
5587A844696K211543j902675m627129j923197K623609K613061j510793l159076
$$ plain form
5650 1436857 753963 -1457214 -2052773 32663 2930820 4795176 5721641 6457289 6823928
5641 6823928 6311585 5361130 5138130 6196200 7732668 8134840 6426144 3506786 1560653
5632 1560653 1437278 972948 -2745091 -9254640 -14357954 -14742067 -11758366 -9375982 -9349435
5623 -9349435 -10150303 -10248569 -10218536 -10841057 -10924585 -8635003 -4231353 38817 2490839
5614 2490839 3100165 2272488 236429 -1985729 -2822996 -2429820 -3141269 -6079452 -8619567
5605 -8619567 -7437803 -3360954 -603328 -1197731 -2892551 -3211579 -2802283 -3257739 -4075646
5596 -4075646 -3969131 -3418126 -3566066 -3902035 -3356781 -2488434 -2112707 -1028542 1844696
5587 1844696 4056239 2153564 -2473565 -4396762 -1773153 839908 -670885 -3829961
5579c829961N16186M877701M920624J522393j280185j753721j084051r28752k059533
5570I00701l712888l478700J09366M442094N047871J701936q51665L58111K457466
5561F974292J626189j105087k110519q53197K88405L94969M95251L62531j458447
5552D614387m157540m557693j683758J095913J71809l541006n572351l079343
5544a6709582K110174N643217N202839K538922R07340J102031J119842l14880
5536A599903j715684j347255r7404N2397o37993j81854J607983K466476R41068
5527B687637j660129l242936l162136j744787O92877L146213L665981J434705
5519A817425j640369k904091k103233j185717j267254j386868m62744J024712
$$ plain form
5579 -3829961 -3313775 1563926 6484550 8006943 6726758 4973037 3888986 2960234 900701
5570 900701 -2812187 -6290887 -6181521 -1739427 3308444 5010380 4158715 4516826 6974292
5561 6974292 8600481 7495394 5384875 4531678 4820083 5215052 5710303 6072834 4614387
5552 4614387 456847 -4100846 -5784604 -4688691 -4516882 -8057888 -13630239 -16709582
5544 -16709582 -14599408 -8956191 -3753352 -1214430 -307090 794941 1914783 1599903
5536 1599903 -115781 -1463036 -1560440 -1508043 -2146036 -2327890 -719907 1746569 2687637
5527 2687637 1027508 -2215428 -5377564 -7122351 -6429474 -3283261 382720 1817425
5519 1817425 177056 -2727035 -4830268 -6015985 -7283239 -8670107 -9132851 -8108139
5511h108139J934810J833048O76562j630734m116698m273972p56603L683188M237773
5502f520765j46290m800228m528648M66958N320634O153303L294709m11425k454763
5493c626515j840785O57051K868275L062767J697643L22878r31231l010348n130059
5484e930324m736638j279776K078203K196068n2163j340588m34859Q53533Q60424
5475g786120J68964P4334M78124L69997j95314K24125K357000M463679L895392
5466D050181O69797j931999j470431L25750L50083q53225O4928L426286N155803
5457I787173K662090j096566j832055J66351J205174l34290k722441m232048m800937
5448a197549m497920k929699n70059J213397J815622J691438J048820k90822j783201
$$ plain form
5511 -8108139 -6173329 -4340281 -3663719 -5294453 -9411151 -13685123 -14441726 -10758538 -6520765
5502 -6520765 -6667055 -11467283 -15995931 -15528973 -10208339 -4055036 -760327 -1171752 -3626515
5493 -3626515 -5467300 -4810249 -1941974 1120793 2818436 3141314 2210083 -800265 -5930324
5484 -5930324 -10666962 -11946738 -9868535 -7672467 -7724630 -9065218 -9500077 -8646544 -7786120
5475 -7786120 -7617156 -7542822 -7064698 -6694701 -6890015 -6665890 -4308890 154789 4050181
5466 4050181 4719978 2787979 1317548 1643298 1993381 1140156 1205084 4631370 9787173
5457 9787173 12449263 11352697 9520642 9686993 10892167 10557877 7835436 3603388 -1197549
5448 -1197549 -5695469 -8625168 -9195227 -7981830 -6166208 -4474770 -3425950 -3716772 -5499973
5439e499973k337751j646514k76780J212226K168183J651571j41025j093985K92146
5430e671902K314489K231805M28184k07725J133454K150074J396101L16418K49645
5421D340543J36775j091236k064620j018186J186712K167049J286515k0945o99254
5412D223353j153015j917711k599168k541614j838797j184494q12502K2914J980887
5403e820147M070668M204095J961520l77703q02882l54712j092529k439316k250533
5394b901539r22476j078252k799549k682146R56706M994042N615370L043932M6338
5385D272426k018088l194261k916590q83584J189297J318424J6488q31204q33356
5376c880448n98816L44882K319495L247859J072304k001897j497762K605595M951838
$$ plain form
5439 -5499973 -7837724 -9484238 -9761018 -8548792 -6380609 -4729038 -4870063 -5964048 -5671902
5430 -5671902 -3357413 -1125608 -697424 -905149 228305 2378379 3774480 4090898 4340543
5421 4340543 4477318 3386082 1321462 303276 1489988 3657037 4943552 4922607 4223353
5412 4223353 3070338 1152627 -1446541 -3988155 -5826952 -7011446 -7823948 -7801034 -5820147
5403 -5820147 -1749479 2454616 4416136 4038433 3235551 2880839 1788310 -651006 -2901539
5394 -2901539 -3824015 -4902267 -7701816 -10383962 -9427256 -4433214 1182156 4226088 4272426
5385 4272426 2254338 -939923 -3856513 -4740097 -3550800 -2232376 -2215888 -3047092 -3880448
5376 -3880448 -4479264 -4134382 -1814887 1432972 2505276 503379 -994383 1611212 6563050
5367F563050K072171k872110m891631l813440k979127l209679j908701J982300
5359i057167N519176N457252K347628n14421j054155M3364J082056J169237K50314
5350E243284j400761l049940l551811k373578l71467J101534J688559J974316
5342g39864K229175K193715J949840J717781P98601j554370l889012l494357p52188
5333a540679N2658l359984o839105m814299J665072O144325N621362L459226K719523
5324C108099J760197j050731k965568j269139J374525P48451k003119k341249
5316b638534J10506J316631j43714j205618k38851L88510o22352p63444J376699
5307b420167K845008J189798j218949j430558j044659k757659m657182l056783
$$ plain form
5367 6563050 8635221 5763111 871480 -2941960 -5921087 -9130766 -11039467 -9057167
5359 -9057167 -3537991 1919261 4266889 3752468 2698313 2741677 3823733 4992970 5243284
5350 5243284 3842523 792583 -2759228 -5132806 -5504273 -4402739 -2714180 -739864
5342 -739864 1489311 3683026 5632866 7350647 8149248 6594878 2705866 -788491 -1540679
5333 -1540679 -1488021 -4848005 -11687110 -16501409 -14836337 -8692012 -3070650 388576 3108099
5324 3108099 4868296 3817565 851997 -417142 957383 1705834 -297285 -2638534
5316 -2638534 -2528028 -1211397 -1355111 -2560729 -2799580 -2411070 -3033422 -3796866 -2420167
5307 -2420167 424841 1614639 395690 -1034868 -2079527 -4837186 -9494368 -12551151
5299a2551151Q39625K481426J219030N30143J212174J59363l036521l979981m31827
5290a3557719L445670L158641M62502Q1687K524373M150774K918685M25187j183107
5281B426693j363922m28996R39381J315986m41397l409023m925098l028366J589563
5272g325179N707143N927984K101143j866440k324814n96396q16394l403238m527137
5263g123328k742270j478759k755384l116518M96985M863202N155763K434368
5255d265941J271785K131666J704678m13611j095105M62349J472674N28630q07696
5246I89429j742474l032286l618478j234919K779431M024485J672324p3596J216832
5237I80748K555147R51538j782228k465358j278351k18613K40267L33513m75588
$$ plain form
5299 -12551151 -11711526 -9230100 -8011070 -7480927 -6268753 -6109390 -9145911 -13125892 -13557719
5290 -13557719 -10112049 -6953408 -6490906 -6409219 -3884846 265928 3184613 3609800 2426693
5281 2426693 1062771 633775 1573156 2889142 2447745 -961278 -5886376 -8914742 -7325179
5272 -7325179 -1618036 4309948 6411091 4544651 2219837 1623441 807047 -2596191 -7123328
5263 -7123328 -9865598 -11344357 -14099741 -17216259 -16719274 -11856072 -6700309 -4265941
5255 -4265941 -2994156 -862490 842188 428577 -666528 -204179 1268495 1797125 989429
5246 989429 -753045 -3785331 -7403809 -8638728 -5859297 -1834812 -162488 -236084 980748
5237 980748 3535895 4487433 2705205 239847 -1038504 -1257117 -1016850 -683337 -1158925
5228a158925j737539j346226J039547K398247M87725k745887m063856k947134
5220a0074048p57111J607938L181061K623304N60390l06317O76216Q08480j134112
5211b814199k255823m08748J858665J585516K79254O09406J267058m13373l123206
5202c415450l535833j759292k81839Q66520L103121M758177K739569j676039l644506
5193b845572j588732J141335J836410J510516J731680K184291K371253K540315
5185H881496K111865R4616k364438k721220q49001O46015L30236n97811j114412
5176D417346j780168k747982k944941j856725k1762K260185M453268M540521J227668
5167G547410k893981l665144q60387J859859K385519J897830J141459p91132l120631
$$ plain form
5228 -1158925 -2896464 -4242690 -3203143 -804896 -317171 -3063058 -7126914 -10074048
5220 -10074048 -10831159 -9223221 -6042160 -3418856 -2858466 -3164783 -2488567 -1680087 -2814199
5211 -2814199 -5070022 -5478770 -3620105 -2034589 -1755335 -1145929 121129 -292244 -3415450
5202 -3415450 -6951283 -8710575 -8992414 -8125894 -5022773 -264596 2474973 798934 -2845572
5193 -2845572 -4434304 -3292969 -1456559 53957 1785637 3969928 6341181 8881496
5185 8881496 10993361 11087977 8723539 6002319 5153318 5799333 6129569 5531758 4417346
5176 4417346 2637178 -110804 -3055745 -4912470 -4934232 -2674047 1779221 6319742 7547410
5167 7547410 4653429 988285 127898 1987757 4373276 6271106 7412565 6621433 3500802
5158C500802l072500m69385J139703k50236k120254j603462N85174K367868L340753
5149C418463L462560J725017j404942k847652q17319K257833L065234J660164
5141A0519358J82821o47088j370829j835039j697529j526627j566621r51019K61902
5132A369329K83395j316407j983532k1803K156361J591004k45146M26720L540046
5123E799967M842920J902096k569158m255494k116803J134437K213125L37663
5115G288753k248033k727683r07410P06969L66237p10331n43643N91458R21529
5106B737846q6186j497666k760398l960310m485817l182407j62674K704323L600643
5097g092646K574691J356367J499666K669427L000815J555541k01480m83289p0414
$$ plain form
5158 3500802 428302 -41083 1098620 848384 -1271870 -2875332 -2290158 77710 3418463
5149 3418463 6881023 8606040 7201098 4353446 3536127 5793960 8859194 10519358
5141 10519358 10702179 10055091 8684262 6849223 5151694 3625067 2058446 1107427 1369329
5132 1369329 1652724 336317 -1647215 -1669018 487343 2078347 1833201 2259921 5799967
5123 5799967 10642887 12544983 9975825 5720331 3603528 4737965 6951090 7288753
5115 7288753 5040720 2313037 1405627 2112596 2478833 1768502 1224859 1816317 2737846
5106 2737846 2651660 1153994 -1606404 -5566714 -10052531 -13234938 -13397612 -10693289 -7092646
5097 -7092646 -4517955 -3161588 -1661922 1007505 4008320 5563861 5362381 4879092 4808678
5088D808678j151878l456945m117302k043335K53924O11714L60625J324010J997302
5079a413207o9621l321563l317089R13465M803408L978524r4722k203074r7993
5070h21872L138900L655085J674198K29552K91956k33373k380047l723235j813454
5061A7710J939036M041136L278642J059335j381586l511830m185683k683401n48276
5052a974917L10411O38487K058205L336940K199921N7809L42181K293806J604060
5043A0866903k041182l626908q18443K170152J495662o48702q65954l79149j633805
5034D518574k937762j369961J774041L139460K655624K287875J601641p85444
5026A0884048l105500k633162p48643j012242k987890k842944J10596K249931
$$ plain form
5088 4808678 3656800 199855 -3917447 -5960782 -5706858 -5095144 -4734519 -3410509 -1413207
5079 -1413207 -1482828 -4804391 -8121480 -7208015 -2404607 1573917 1479195 -723879 -821872
5070 -821872 2317028 5972113 7646311 7875863 8167819 7934446 5554399 1831164 17710
5061 17710 1956746 5997882 9276524 10335859 8954273 5442443 1256760 -1426641 -1974917
5052 -1974917 -1664506 -1026019 1032186 4369126 6569047 6626856 6969037 9262843 10866903
5043 10866903 8825721 5198813 4380370 6550522 8046184 7397482 6531528 6152379 4518574
5034 4518574 1580812 210851 1984892 5124352 7779976 10067851 11669492 10884048
5026 10884048 7778548 5145386 4396743 3384501 396611 -2446333 -2335737 -85806
5018h5806J476426j48810n15714k63528j88448O08884K275546K816719J131171
5009G106440p19585k84835J653905K128763r21k633312l089796j264125M36315
5000C332849P3179j715765l091862l518147l534150k885548j066358O59636M93688
4991a1252478n50448L85191L161107M239900K264866L53637R74580K163402J350969
4982C090726l56765o82772j29752l51016r58380q66660o79082j156434j507580
4973c597715j403675k048004l169436k282628O91780K003451J73873r11681J276567
4964i267468K900900M02002k422776k10919M676754N509100J394749k658090m125942
4955c801690m568124l927755k14733M951045O627139L308075j224992l160324
$$ plain form
5018 -85806 1390620 1241810 726096 462568 274120 883004 3158550 5975269 7106440
5009 7106440 6386855 6102020 7755925 9884688 9883767 7250455 4160659 2896534 3332849
5000 3332849 3406028 1690263 -1401599 -4919746 -8453896 -11339444 -12405802 -11746166 -11252478
4991 -11252478 -11802926 -11417735 -8256628 -4016728 -1751862 -1398225 -423645 1739757 3090726
4982 3090726 2733961 2051189 1921437 1570421 612041 -254619 -933701 -2090135 -3597715
4973 -3597715 -5001390 -7049394 -10218830 -12501458 -11809678 -9806227 -9632354 -10544035 -9267468
4964 -9267468 -6366568 -5964566 -8387342 -8598261 -3921507 1587593 2982342 324252 -3801690
4955 -3801690 -8369814 -12297569 -12512302 -7561257 -934118 2373957 1148965 -2011359
4947b011359j896466J378214M386504M058588R4180l190626k400141q0770J14536
4938D52660o8451K374893M364342Q77425n654201p836691m196991j64012J148273
4929h702753J720739K439889J494021o08018r83467L35526R02983J071672K701757
4920C72349L967874K108485k63339J032836L359353Q72973m927428p029005m207913
4911d713815j466861j87027K526894N320611L545126j233826k574566l8399R68677
4902B146814m17434n36756l45864l262384n489249j071878N111531L489162k770629
4893c146687k341390L586111L268757l218003l689198K718196L550400k549838
4885a821652k685459M480601M715496l755890n200921K754018L148536n383709
$$ plain form
4947 -2011359 -3907825 -2529611 1856893 5915481 6009661 2819035 418894 338124 452660
4938 452660 384209 2759102 7123444 8000869 2346668 -5490023 -9687014 -9851026 -8702753
4929 -8702753 -6982014 -4542125 -3048104 -3656122 -4639589 -4304063 -3401080 -2329408 372349
4920 372349 4340223 6448708 6185369 7218205 10577558 11450531 6523103 -505902 -4713815
4911 -4713815 -6180676 -6367703 -3840809 1479802 5024928 3791102 1216536 1178137 2146814
4902 2146814 1729380 1192624 846760 -2415624 -7904873 -8976751 -3865220 -376058 -3146687
4893 -3146687 -5488077 -1901966 1366791 -1851212 -5540410 -2822214 728186 -1821652
4885 -1821652 -4507111 -26510 4688986 933096 -4267825 -1513807 1634729 -3748980
4877c748980k209525J2958643J2760533j18780K3151551R4432078J35364558P0336560
4869C42926638n4872407j19024172q1268758j9140865n472927k1321161j7814222
4862B4012126J078664L264082q757289r709687k18235K89097o665656m008635
4854g15533O243718P095936j551882m409300O53808J842230k160002j188715M774428
4845A0584688M992531j456473m224680r60815j01744l860075m950774j361363
4837a338705O35822n64367L49231L806811M033664M73407j339815q50484k771027
4828B434537n929732l713767L248018O368825K892567l59479P64154J927141l98196
4819G234068k964269k478461q12159m96765j089681j880188k788366k011602J660686
$$ plain form
4877 -3748980 -5958505 7000138 19760671 19641891 42793442 137225520 272590078 342926638
4869 342926638 288054231 169030059 87761301 68620436 63147509 41826348 24012126
4862 24012126 25090790 28354872 19597583 9887896 9669661 9958758 3293102 -715533
4854 -715533 5528185 12624121 11072239 6662939 7316747 9158977 6998975 5810260 10584688
4845 10584688 15577219 14120746 9896066 8935251 8833507 4973432 22658 -1338705
4837 -1338705 -702883 -1267250 -918019 2888792 6922456 7395863 6056048 5205564 2434537
4828 2434537 -3495195 -7208962 -3960944 2407881 5300448 4940969 5705123 7632264 7234068
4819 7234068 4269799 1791338 979179 482414 -607267 -2487455 -5275821 -7287423 -5626737
4810e626737M600024K557032j764242k165491J077625K325281Q17587J294139
4802C115218M233926M338406K64823k408202l77867K462311K030928k60533j476366
4793A1922644j409905o29988R02177J572056r35952n140811o637539m309622j312000
4784e978940M36298J969783L274167K668895P47688J05877O38735k92141k787698
4775G82664m060847l117431j353325R11620L749878M592056J358332k460412j863644
4766a461109J532554K016206m55334m88166K807297M073462J079671j766901j276974
4757F060706R5873J4337N8548J229989J393794k95003j467680j018958p40159
4748E331447j173549p94891j85945j652967m028014l608107p50309P32325R76636
$$ plain form
4810 -5626737 -1026713 1530319 -233923 -2399414 -1321789 1003492 1821079 3115218
4802 3115218 7349144 11687550 11952373 9544171 9166304 11628615 13659543 13399010 11922644
4793 11922644 10512739 9882751 10784928 12356984 11421032 6280221 -357318 -4666940 -5978940
4784 -5978940 -5542642 -3572859 -298692 2370203 3117891 3223768 3862503 3570362 782664
4775 782664 -3278183 -6395614 -7748939 -6837319 -3087441 1504615 2862947 402535 -1461109
4766 -1461109 71445 2087651 1632317 1144151 3951448 8024910 9104581 7337680 6060706
4757 6060706 6156579 6170916 6229464 7459453 8853247 8558244 7090564 6071606 5331447
4748 5331447 4157898 3363007 3177062 1524095 -2503919 -6112026 -6862335 -6130010 -5153374
4739e153374L550580O933439N004128j993866n708707k201558K109140J202114
4731C741896j758653j486045P12723J079122L27639O33962O61756j012694j900482
4722I99224M6620K157693J549883j15485m16674m91265j645796j969012k57450
4713a42262R13432k59628j473578q46237p5317k0503J394179L640746K314552
4704E445384k652759m463576r8985L712043J264796k578467j089607K715086J976681
4695D230596j842438k211327Q80937K052200N99465L74564J452323N94588j234918
4686D895990j07362K899053K781839p57431l006083k167213q44026k81669K96007
4677C709105k84434k948505l737540R90678O188865L703670m331746p181054j386933
$$ plain form
4739 -5153374 -1602794 5330645 10334773 8340907 2632200 430642 2539782 3741896
4731 3741896 1983243 497198 1209921 2289043 2616682 3250644 3912400 2899706 999224
4722 999224 1045844 3203537 4753420 4637935 4221261 3729996 2084200 115188 -142262
4713 -142262 771170 511542 -962036 -1808273 -1883590 -1904093 -509914 3130832 5445384
4704 5445384 2792625 -1670951 -1769936 1942107 3206903 628436 -461171 2253915 4230596
4695 4230596 2388158 176831 1057768 3109968 3709433 4083997 5536320 6130908 4895990
4686 4895990 4788628 7687681 10469520 9712089 6706006 4538793 3694767 3413098 3709105
4677 3709105 3424671 476166 -3261374 -2270696 3918169 7621839 3290093 -3890961 -5277894
4668e277894M647117M154576P22354j80510J39759j492742l376003k624990o71305
4659c959638k51220q58343j083596j649819k640286j574935K251405N115316L994418
4650f56698J126308K51650J324426J952453J271966l25457k556502l976110k379817
4641c967781J227385K408837m30723l060473j631085J627267K335943M16679j188530
4632b262481j530914j385904k20877K398167M036890K190663j251153k322470
4624c48079j001451q61555k874901l711337j193822K050516K322502J2311j150981
4615f756797R08169M221234N470750L863680J540850N47772N29146j20830j863000
4606H340974l802226n055998n011491k984458O13860L279154K686083p2022j517740
$$ plain form
4668 -5277894 -630777 3523799 4246153 4065643 4205402 2712660 -663343 -3288333 -3959638
4659 -3959638 -4210858 -5069201 -6152797 -7802616 -10442902 -12017837 -9766432 -4651116 -656698
4650 -656698 469610 721260 2045686 3998139 5270105 4944648 2388146 -1587964 -3967781
4641 -3967781 -2740396 -331559 -762282 -3822755 -5453840 -3826573 -1490630 -1073951 -2262481
4632 -2262481 -3793395 -5179299 -5400176 -3002009 1034881 3225544 1974391 -348079
4624 -348079 -1349530 -2211085 -5085986 -8797323 -9991145 -7940629 -5618127 -5605816 -6756797
4615 -6756797 -5848628 -1627394 3843356 7707036 9247886 9795658 10324804 10203974 8340974
4606 8340974 4538748 -517250 -5528741 -8513199 -7899339 -4620185 -1934102 -2006124 -3523864
4597c523864j98252J855760K213549O22880j662822l115342k304203Q22334L727393
4588a562567L505141O56220j464956j136533K07624J120769J934276K706558K238147
4579H204679K73256j747388l064235m242169m718666k775067Q22809K426634O73962
4570d146185r44925Q94750M348430N221289K865567L63195k6753R39059J244258
4561A0758685k91991l168488n274706m635922j881555K74403N98130N52793J255073
4552a813578J629539Q96404M10715J196403J885750J157512J92056N24806J286379
4543G365986P96547p12226k009760k824118k947500j396782J306226K190542j15016
4534A653899k445999j363422J470311J797122o90513k292310j205936N02912J007909
$$ plain form
4597 -3523864 -3722116 -1866356 347193 970073 -692749 -3808091 -6112294 -5289960 -1562567
4588 -1562567 1942574 2598794 1133838 -2695 204929 1325698 3259974 5966532 8204679
4579 8204679 8477935 6730547 3666312 -575857 -5294523 -8069590 -7246781 -4820147 -4146185
4570 -4146185 -5091110 -4196360 152070 5373359 8238926 8602121 8575368 9514427 10758685
4561 10758685 10466694 7298206 2023500 -2612422 -4493977 -4219574 -3621444 -3068651 -1813578
4552 -1813578 -184039 712365 1123080 2319483 4205233 5362745 5554801 6079607 7365986
4543 7365986 8162533 7450307 5440547 2616429 -331071 -1727853 -421627 1768915 1653899
4534 1653899 -792100 -2155522 -685211 1111911 421398 -1870912 -3076848 -2573936 -1566027
4525a566027J093121J591064J588790M33365q15305j085970o89235k38074K28167
4516E39896N01029J38701m21834j91052N95625N37183p55691j998456k077330
4507c131929j191476O8635J361482K070628J581940M25255j50571L5102M6594
4498A115660l20771j98635N49366Q17125J30233n03673l86838l41136j122124
4489b60793j847964j234895M67706K008592K907756L294533K409883q77231n526147
4480A341440p919527n511371k56907L204094K744717M75837r97580j821237k992689
4471a1733223l376949j343629J743506K841605J797566J390370K494520K628327
4463c557907M43750j650071j205420P47178J993599K374512K494864J770419L46942
$$ plain form
4525 -1566027 -472906 1118158 2706948 3140313 2325008 1239038 549803 311729 539896
4516 539896 1040925 1179626 757792 566740 1162365 1699548 943857 -1054599 -3131929
4507 -3131929 -4323405 -4254770 -2893288 -822660 759280 1184535 1033964 1069066 1115660
4498 1115660 794889 596254 1145620 1962745 2092978 1589305 1202467 861331 -260793
4489 -260793 -2108757 -3343652 -2875946 -867354 2040402 5334935 7744818 6867587 1341440
4480 1341440 -6578087 -12089458 -12346365 -9142271 -6397554 -5921717 -6919297 -8740534 -11733223
4471 -11733223 -15110172 -16453801 -14710295 -11868690 -10071124 -8680754 -6186234 -3557907
4463 -3557907 -3114157 -4764228 -5969648 -5222470 -3228871 -854359 1640505 3410924 3757866
4454C757866M24532K596805L294478l86107n262810n717417j513831K386294L020507
4445B600317J863782M10443j678020l351692k000097J874416M065735K682292
4437F467176Q17731J028110J154751j284244m046935l402201l7571K209621K024013
4428D930451J272279R12283j19730k071466l465138l267810j777950M33314K387017
4419g66750K197974p05459l472233k940455m70772j66512k227789k295770J403129
4410i444637M671806L675874P82766L73649J858303J482868p74913j337485L81973
4401A670204P52966j756754l733262k202763J041876K782107K598334J308724
4393B461432j327371m255442l878125P76173M471853K230278k719412l134150
$$ plain form
4454 3757866 4182398 6779203 10073681 9687574 4424764 -1292653 -2806484 -420190 2600317
4445 2600317 4464099 4874542 3196522 -155170 -2155267 -280851 3784884 6467176
4437 6467176 7284907 8313017 9467768 8183524 4136589 734388 696817 2906438 4930451
4428 4930451 6202730 7115013 6995283 4923817 1458679 -1809131 -3587081 -3153767 -766750
4419 -766750 1431224 725765 -2746468 -5686923 -6157695 -6324207 -8551996 -10847766 -9444637
4410 -9444637 -4772831 -1096957 -314191 59458 1917761 3400629 2625716 1288231 1670204
4401 1670204 2423170 666416 -3066846 -5269609 -4227733 -1445626 1152708 2461432
4393 2461432 1134061 -3121381 -6999506 -6223333 -1751480 478798 -2240614 -5374764
4385e374764J147153K750838j906427p252704o996145k438848J266952K791172
4377a6012773M105024N268339M491853K092642M14427K87405N25797L95813N1314
4368A619841p57621j921565j676279J297807M937785N544626K422981j384189
4360A0083386k954299k128419l73914J044261J495545J077328N87967N64276N50578
4351I946709m927p99896j337452j558741j151297L05345J675626P68774k164831
4342E679310l738673k112321O5295j58056j419617q09234J000412J275405J91621
4333b5858Q1436Q93500P65076K56023J359491K810840J463360j608503j886774
4324D108591Q14274J149759l030452o332565l702873J949559M358256K698070
$$ plain form
4385 -5374764 -4227611 -1476773 -3383200 -10635904 -17632049 -20070897 -18803945 -16012773
4377 -16012773 -11907749 -6639410 -2147557 -54915 359512 646917 1172714 1568527 1619841
4368 1619841 862220 -1059345 -2735624 -1437817 3499968 9044594 11467575 10083386
4360 10083386 7129087 5000668 4626754 5671015 7166560 8243888 8831855 9396131 9946709
4351 9946709 9941782 9141886 7804434 6245693 5094396 5399741 7075367 7844141 5679310
4342 5679310 1940637 -171684 -106389 -264445 -1684062 -2493296 -1492884 -217479 -25858
4333 -25858 55578 949078 1714154 1970177 3329668 6140508 7603868 5995365 4108591
4324 4108591 4922865 6072624 3042172 -3290393 -6993266 -5043707 -685451 2012619
4316B012619J051271J326742J579368N42929n12114o82774q42902j511060j782117
4307A181962j044625J05199J177097K380695L311398K496783o86372m330029n322885
4298g30777k553829J742453M281834M040671K470584O95465j721216m492109n273726
4289a540650k750657M41507O41942j742572k987294j561391K76170O52537O22231
4280g948177J531633K621854K632253J676287L76203j015965j812053j103905
4272c041870N64500J670633K181653L243496M208995K917624m19886k749895k582114
4263E993136j708325j419651n50342J089462J092585j304548k799781q18508K198868
4254A772896K495530M42502j063406j405203j820904j886166k13647K222881K842173
$$ plain form
4316 2012619 3063890 4390632 5970000 6512929 6000815 5318041 4475139 2964079 1181962
4307 1181962 137337 242536 1419633 3800328 7111726 9608509 8922137 4592108 -730777
4298 -730777 -3284606 -1542153 2739681 6780352 9250936 9946401 8225185 3733076 -1540650
4289 -1540650 -4291307 -3849800 -3207858 -4950430 -7937724 -9499115 -9222945 -8570408 -7948177
4280 -7948177 -6416544 -3794690 -1162437 513850 890053 -125912 -1937965 -3041870
4272 -3041870 -2477370 -806737 1374916 4618412 8827407 11745031 11325145 8575250 5993136
4263 5993136 4284811 2865160 2314818 3404280 4496865 3192317 392536 -425972 1772896
4254 1772896 4268426 4710928 3647522 2242319 421415 -1464751 -1678398 544483 3386656
4245C386656J160621q98650j916724j942028j266538m21699o21194k141202l097717
4236g758475j786172P17120K164868K222315K002726J714582Q57061k04231p43199
4227h13405r07455j064202j094362j352296k487282l318355j495707K326562M130010
4218f076492K295189K51589Q73695K058041J188304N4502J038097K032279K71808
4209C987012j786549m3701L956686M947708J678602k325460m282697l891443j603955
4200F36203M58121j060806m773503l768492L161443O127908q52199p189348k375451
4191i636124J230615j6474143m5281584m6896952o086999M1774679N2150043K5319161
4183c901304j578111n980137P45216K246822K86043K226601M767121J750604l407536
$$ plain form
4245 3386656 4547277 3648627 1731903 -210125 -1476663 -1898362 -2519556 -4660758 -7758475
4236 -7758475 -9544647 -8827527 -6662659 -4440344 -2437618 -723036 134025 -70206 -813405
4227 -813405 -1720860 -2785062 -3879424 -5231720 -7719002 -11037357 -12533064 -10206502 -6076492
4218 -6076492 -3781303 -3529714 -2656019 -597978 590326 644828 1682925 3715204 3987012
4209 3987012 2200463 2156762 6113448 11061156 12739758 10414298 6131601 2240158 636203
4200 636203 1094324 33518 -4739985 -8508477 -5347034 780874 -71325 -7260673 -9636124
4191 -9636124 -8405509 -24879652 -70161236 -117058188 -123145187 -81370508 -29220465 -3901304
4183 -3901304 -5479415 -11459552 -10714336 -8467514 -8181471 -5954870 -1187749 562855 -2844681
4174b844681l873258o89942Q70199O64630J570934K461555O93876j561828l32437
4165c040952K952980L436484N73749j709221j641220j086666q49417L82027K104843
4156A122607J714795r24639k699228k183529j548489k051706j451652J695753
4148f326088M493304L699840Q99485M4681J372340J732278K86778m83702O9457
4139E788373q70864m169379n842602k921858R96888M83621l372731m399846o37816
4130a4946214L087743K936959J384250K192956M138568L489512K29501k142188
4122C71087j889353o69951k33765l53202j98210M13067J416066K565219L011955
4113D432913K110421N69416k94376k24348q654j91137o05960o82922K76849K151032
$$ plain form
4174 -2844681 -6717939 -7407881 -6537682 -5873052 -4302118 -1840563 -1146687 -2708515 -3040952
4165 -3040952 -87972 3348512 3922261 2213040 571820 -514846 -1364263 -982236 1122607
4156 1122607 2837402 1912763 -786465 -2969994 -4518483 -6570189 -8021841 -6326088
4148 -6326088 -1832784 1867056 2766541 2811222 4183562 5915840 6202618 5718916 5788373
4139 5788373 4917509 748130 -5094472 -8016330 -7019442 -6535821 -9908552 -14308398 -14946214
4130 -14946214 -11858471 -8921512 -7537262 -5344306 -1205738 2283774 2513275 371087
4122 371087 -1518266 -2188217 -2421982 -2775184 -2973394 -2560327 -1144261 1420958 4432913
4113 4432913 6543334 7112750 6818374 6594026 6585372 6394235 5788275 5105353 5382202 7533234
4103G533234K988295P25095l350173n196933l472629j665299k582552l691829
4095h712791j437950K310789K767246j92568k021464q22866M75989P9876M11818
4086g141921L194257N674760M586516Q54123k299392l470545k888159n53813K645286
4077F01112L902635J568615j864140k433900M07005L681218M741419L154498k92380
4068A3466082m055530n782648m135858p39665J411942J397247O71687K94590k17374
4059B310473j197772j882433j703280j092476l91663Q11095K468948L136360J335349
4050C794601k261817m771112l705129K98234L735147L728075J060200j031254
4042H46945q93836L1777j0234n47805k45713O88381J222288J622909K730033L527212
$$ plain form
4103 7533234 10521529 11246624 7896451 2699518 -773111 -2438410 -5020962 -8712791
4095 -8712791 -10150741 -7839952 -5072706 -5265274 -7286738 -8109604 -7633615 -7553739 -7141921
4086 -7141921 -3947664 1727096 6313612 7167735 4868343 1397798 -1490361 -2044174 601112
4077 601112 4503747 6072362 4208222 1774322 2181327 5862545 10603964 13758462 13466082
4068 13466082 9410552 3627904 -507954 -1247619 164323 1561570 2233257 2527847 2310473
4059 2310473 1112701 -769732 -2473012 -3565488 -3957151 -3146056 -677108 2459252 3794601
4050 3794601 1532784 -3238328 -6943457 -6645223 -2910076 817999 1878199 846945
4042 846945 -46891 -15114 -25348 -573153 -818866 -130485 1091803 2714712 5444745 8971957
4032H971957J849862j989911m436529k828004J094438L285273K158802k89789
4024G816099j674285j685998j018965L42997K314374L219559J193327k761156
4016G745952m928143k992180J239268M143435M124203K109684l68528j952510
4008I121181j548110K57133P58790j591873m321638m041698j608308o94770j602691
3999e271984r19140J969152K988837J77867k386161r28339J838089J271963j698782
3990b958498k667385r86766M12943Q35194J874222K603366N59923k597408k386979
3981e311388Q94684J869839j212838l483526j472338J689972K257258J581080
3973c187257J879546J362189j563943l534257j188712K477443K491173k4618j82073
$$ plain form
4032 8971957 10821819 8831908 4395379 1567375 2661813 5947086 8105888 7816099
4024 7816099 6141814 4455816 3436851 3779848 6094222 9313781 10507108 7745952
4016 7745952 2817809 -174371 1064897 5208332 9332535 11442219 11073691 9121181
4008 9121181 7573071 7830204 8588994 6997121 2675483 -1366215 -2974523 -3669293 -5271984
3999 -5271984 -6191124 -4221972 -1233135 -1055268 -3441429 -4369768 -2531679 -1259716 -2958498
3990 -2958498 -5625883 -6612649 -6199706 -5364512 -3490290 -886924 -327001 -2924409 -5311388
3981 -5311388 -4416704 -2546865 -3759703 -7243229 -8715567 -7025595 -4768337 -3187257
3973 -3187257 -1307711 54478 -1509465 -5043722 -6232434 -3754991 -1263818 -1288436 -1470509
3964a470509K218136K911373Q64367n80954j85392l90146j793653j732850M33049
3955B73421J818246J208888Q93420J806762J714183O465n74182Q56338J229530
3946I233071q23289k054603l97922J061471l92713k091260q01420J461958J242520
3937F437813l10033m01265m01564k861374n234206k999486K339822M777478K765556
3928D112741M38437r8205j310297m085864n156967k695168O34571K342305L236223
3919b582224L894799K759211J88471k56218K349383L499144o7556m756879n363174
3910c35043k703762j341813k011795j378086J608852L841923K891097J98879j323690
3901e53438o38202R16796J038285j347629m214212l913358L6999L330587K168367
$$ plain form
3964 -1470509 747627 3659000 4523367 3942413 3757021 3366875 1573222 -159628 273421
3955 273421 2091667 3300555 4193975 6000737 7714920 7721385 7147203 8003541 9233071
3946 9233071 8409782 6355179 5957257 7018728 6626015 4534755 3733335 5195293 6437813
3937 6437813 6127780 5726515 5324951 2463577 -2770629 -5770115 -3430293 1347185 4112741
3928 4112741 4551178 4452973 3142676 -943188 -6100155 -8795323 -8160752 -5818447 -2582224
3919 -2582224 1312575 4071786 4260257 4004039 6353422 9852566 9785010 5028131 -335043
3910 -335043 -3038805 -4380618 -6392413 -7770499 -6161647 -2319724 571373 770252 -553438
3901 -553438 -1191640 -274844 763441 -584188 -4798400 -8711758 -8674759 -5344172 -3175805
3892c175805j511795k864717q28043J322331J425060R07207J488778K453089K215094
3883A431199O01684j287406k218872j577790r0591M48284o59389j770510j202384
3874f325775J90136N42899N2146K78728J219846J518187R67278L87347k66603
3865a435811j086413n04640K359224M546400K493518j879366k964430N9479J614345
3856C202306j541489m942586l183496J883750M067095J527371j806680k307907
3848c101636k34224K316629L705669K972155M18732j891116k271626j754931k214996
3839b055344k809947j108385K321903L650377J112501k139172k259695K22038
3831c065724J749984R63645M9610Q43650J836734L74558l230520n494138l860941
$$ plain form
3892 -3175805 -4687600 -7552317 -8380360 -7058029 -5632969 -4725762 -3236984 -783895 1431199
3883 1431199 2032883 745477 -1473395 -3051185 -3141776 -2693492 -3352881 -5123391 -6325775
3874 -6325775 -6135639 -5592740 -5540594 -5261866 -4042020 -2523833 -1556555 -1169208 -1435811
3865 -1435811 -2522224 -3026864 -667640 3878760 6372278 4492912 1528482 1587961 3202306
3856 3202306 1660817 -3281769 -6465265 -4581515 -514420 1012951 -793729 -3101636
3848 -3101636 -3335860 -1019231 2686438 5658593 6077325 4186209 1914583 159652 -2055344
3839 -2055344 -4865291 -5973676 -3651773 -1396 1111105 -1028067 -3287762 -3065724
3831 -3065724 -1315740 -352095 -302485 541165 2377899 2752457 -478063 -5972201 -9833142
3822i833142K55690L359523L964467L523759L565108L518642K038281o92931l086697
3813F612700m112971m177770m089076l857319k836502q73667J048958J755139
3805a0530508J455383J584251K579081K850450J131856j032609r53072J385311
3797a529857L139827K366550M6552j935684k843711k616332j433253n04585j167205
3788f477698k305187j065232K583703M673146K621630p63145j392806K26230O69164
3779a230195m84197n05379J278059K387045J794017J620998K869639L063180L84841
3770A1178008k721949k946961j115278o11955j904720k110129j33268J134671
3762G68419p19150l475990l132686L07573K813627K144146O88071J110663J865220
$$ plain form
3822 -9833142 -9577452 -6217929 -2253462 1270297 4835405 8354047 10392328 9699397 6612700
3813 6612700 2499729 -1678041 -5767117 -9624436 -12460938 -13334605 -12285647 -10530508
3805 -10530508 -9075125 -7490874 -4911793 -2061343 -929487 -1962096 -2915168 -1529857
3797 -1529857 1609970 3976520 4023072 2087388 -756323 -3372655 -4805908 -5310493 -6477698
3788 -6477698 -8782885 -9848117 -7264414 -2591268 30362 -732783 -2125589 -1899359 -1230195
3779 -1230195 -1714392 -2219771 -941712 1445333 3239350 4860348 7729987 10793167 11178008
3770 11178008 8456059 5509098 4393820 3781865 1877145 -232984 -366252 768419
3762 768419 49269 -3426721 -6559407 -6251834 -3438207 -1294061 -605990 504673 2369893
3753B369893j04042l790439m997814k613714j35352M6690K7066J910397L568141
3744c719174K319178J34325Q12115L482965L700555O94417j331032m9161J438162
3735G482350O923k424195k302047j24141Q15603k20385q13065L93143J961791
3726D775977K356015J798239Q14204r00656l025336l667345j528109J655607K473495
3717D752091j09486l222326l349724m65138K125364J866838l49841j890330j517565
3708b160117j9882J241893J330035J23716j158727p48605J109035J600388q27181
3699D90555l389060k415672R88444K212590Q5535j342044Q47939M042111M325272
3690E845670K048079K67243r3020l39111q28200r08517j100483k272495l181251
$$ plain form
3753 2369893 2265851 -1524588 -6522402 -9136116 -9271468 -9224778 -9197712 -7287315 -3719174
3744 -3719174 -1399996 -1265671 -453556 3029409 6729964 7424381 6093349 6044188 7482350
3735 7482350 7489273 5065078 2763031 2638890 3454493 3234108 2421043 2814186 4775977
3726 4775977 7131992 8930231 9744435 8843779 5818443 2151098 622989 2278596 4752091
3717 4752091 4642605 1420279 -1929445 -2394583 -269219 1597619 1247778 -642552 -2160117
3708 -2160117 -2179999 -938106 391929 515645 -643082 -1391687 -282652 1317736 490555
3699 490555 -2898505 -5314177 -4325733 -2113143 -2027608 -3369652 -2521713 1520398 5845670
3690 5845670 7893749 8160992 8067972 7728861 6900661 5992144 4891661 2619166 -562085
3681e62085j816273R28162J744174o14716l695156m513463k364844J533357M966995
3672d393849N266134J494046l420152n162336l221850j133980r85666p55295J494796
3663a0818152L952464M053126K674634K330046K855774K123158O9724j279491
3655E961283j533806k454047m321207m719535k044056K016470M695679N055830
3647B656611L657072J229055r34371r88712J201379K971091J866522j069773k792564
3638G796310k299809j200708p18559m23546q8381n19891j763976k379236j546457
3629c144253l27250K59554P99367J715317J584520o67535l019005k411062P34901
3620d475446K695839J527804n88490j108204p50195j374653k079337l02464L585232
$$ plain form
3681 -562085 -2378358 -1450196 293978 -320738 -4015894 -8529357 -10894201 -9360844 -4393849
3672 -4393849 872285 2366331 -1053821 -6216157 -9438007 -10571987 -11557653 -12312948 -10818152
3663 -10818152 -6865688 -2812562 -137928 2192118 5047892 7171050 7240774 5961283
3655 5961283 4427477 1973430 -2347777 -7067312 -9111368 -7094898 -2399219 2656611
3647 2656611 6313683 7542738 6608367 5619655 6821034 9792125 11658647 10588874 7796310
3638 7796310 5496501 4295793 3577234 3153688 3065307 2545416 781440 -1597796 -3144253
3629 -3144253 -3471503 -3211949 -2412582 -697265 887255 219720 -2799285 -5210347 -4475446
3620 -4475446 -1779607 -251803 -840293 -1948497 -2698692 -4073345 -6152682 -6455146 -2869914
3611b869914N597308K977654k080604m912387l605549l94585J690512K001278
3603a596287J680483J200617r8728k156905l295089k044208P96812K913629L004951
3594D05275J650550l8795j372111j659184l76855J575382K053692J08340k598313
3585b52019l694393k642548o33099J004639J268911m06998k982016l763450j387315
3576a3488288J928372L116441K464711K558228L578843L000389L76967j192748
3568B342915N1293J480303L29516j789311j744610j13355J33163j122812j222649
3559a655547K73665O91729j019554k318391j209545P62225J445446J364025J940457
3550B74510K583539J950154O30810K54771R05174J428712J410693R74093l48749
$$ plain form
3611 -2869914 2727394 5705048 3624444 -1287943 -4893492 -5288077 -3597565 -1596287
3603 -1596287 84196 1284813 1186085 -970820 -4265909 -6310117 -5513305 -2599676 405275
3594 405275 2055825 2017030 644919 -1014265 -1391120 184262 2237954 2346294 -252019
3585 -252019 -3946412 -6588960 -7222059 -6217420 -4948509 -5355507 -8337523 -12100973 -13488288
3576 -13488288 -11559916 -8443475 -5978764 -3420536 158307 3158696 3535663 2342915
3568 2342915 2394208 3874511 4204027 2414716 670106 556751 689914 -432898 -1655547
3559 -1655547 -1381882 -690153 -1709707 -4028098 -5237643 -4475418 -3029972 -1665947 274510
3550 274510 2858049 4808203 5439013 5693784 6598958 8027670 9438363 10412456 10063707
3541A0063707k426247l185658j011556K025496K119909r56845l210205j830838
3533A587763J210406K298193R34877m34092k02003O93614O63803l16925q50660
3524E584976k4305J250926J156678o70173k333086j879486K76286K076548K413553
3515G851917J752704O23890q90931k216835k451853j704890r14011l08489M44147
3506B185649O99903n44815k336977k367784n04459O21709m58501j867401j461913
3497f034589J25750J149272J338642J000177l66179k367466k649459j42744K335278
3488e611318J618010j102838k246803j301344p16191j056643k56599K095917L560893
3479e016916K806878J381943M62383q39456k491761k227987O23780K920091K003762
$$ plain form
3541 10063707 7637460 4451802 3440246 5465742 7585651 6628806 3418601 1587763
3533 1587763 2798169 5096362 6031239 5597147 5395144 6088758 6752561 6435636 5584976
3524 5584976 5560671 6811597 7968275 7298102 4965016 3085530 3361816 5438364 7851917
3515 7851917 9604621 10228511 9337580 7120745 4668892 2964002 2049991 1741502 2185649
3506 2185649 2885552 2340737 3760 -2364024 -2868483 -2246774 -2705275 -4572676 -6034589
3497 -6034589 -5908839 -4759567 -3420925 -2420748 -2786927 -5154393 -7803852 -7946596 -5611318
3488 -5611318 -3993308 -5096146 -7342949 -8644293 -9360484 -10417127 -10673726 -8577809 -5016916
3479 -5016916 -2210038 -828095 -365712 -1205168 -3696929 -5924916 -5301136 -2381045 -377283
3470c77283j22169L6470J923264K035894l54941k246633j813332q83564j378742
3461c181036k092902j035480Q80685J036261o97977j536145N4518K046334K006396
3452b519346O78928K46729L10662j250775l566903k726670K017876N539274L358619
3443B088394j708308l326246m75221J994798J237627M265J198333L087847K339782
3434F441271j017516m038282m382293j737606K337228M597692K420347k422912
3426B197929m627864j846886K151198K998086J640123J552896K427963R52977
3418G446422l045404n623525m349876j355307L23778O58474J439528L111900M296560
3409B902550L539785P31795k579150m138207l105079j162059n25543j113473r77099
$$ plain form
3470 -377283 -499452 -462982 1460282 3496176 3141235 894602 -918730 -1802294 -3181036
3461 -3181036 -5273938 -6309418 -5428733 -4392472 -5090449 -6626594 -6572076 -4525742 -2519346
3452 -2519346 -1840418 -1593689 -1283027 -2533802 -6100705 -8827375 -6809499 -1270225 2088394
3443 2088394 380086 -2946160 -3421381 -1426583 -188956 -184691 1013642 4101489 6441271
3434 6441271 5423755 1385473 -2996820 -4734426 -2397198 2200494 4620841 2197929
3426 2197929 -2429935 -4276821 -2125623 872463 2512586 4065482 6493445 7446422
3418 7446422 4401018 -1222507 -5572383 -6927690 -6603912 -5945438 -4505910 -1394010 2902550
3409 2902550 6442335 7174130 4594980 456773 -2648306 -3810365 -4335908 -5449381 -6426480
3400f426480O31658K199272K223923J154320M44261N94178Q23092L77777k42676
3391A779325L34559K365428L792660K346146j134972l358122l108488k752446
3383B64090l902278m328467j756895J596051J843912n92017j679114J24166K321324
3374f109228K945377K825191K691835J727428J16776l67144K97211k48901k389250
3365A489295k935365k15572K374187J043342k514452l459335o36538K441119K880841
3356D67522J427522O1507n79609o18202R0663J346530K243185K221124J661711
3347H321953J011393J07549j225419k543626l145670k736796j591486l53851K99634
3338a856319J26181m58446p72041n02544R7857O06073R56289J416118J790583
$$ plain form
3400 -6426480 -5794822 -3595550 -1371627 -217307 226954 821132 1644224 2022001 1779325
3391 1779325 2113884 4479312 8271972 10618118 9483146 6125024 3016536 264090
3383 264090 -3638188 -7966655 -9723550 -8127499 -6283587 -6875604 -8554718 -8430552 -6109228
3374 -6109228 -3163851 -338660 2353175 4080603 4197379 3830235 4127446 3878545 1489295
3365 1489295 -1446070 -1661642 712545 1755887 -758565 -4217900 -4854438 -2413319 467522
3356 467522 1895044 1956551 1376942 758740 849403 2195933 4439118 6660242 8321953
3347 8321953 9333346 9440895 8215476 5671850 2526180 -210616 -1802102 -2155953 -1856319
3338 -1856319 -1730138 -2188584 -2960625 -3463169 -3365312 -2759239 -1802950 -386832 1403751
3329A403751J018803j386355l475645k286144J766405L931573R31461l769467
3321a865618l892097R56461M506287K571605j437127j956555J084837L287259
3313C255052K376153L27182k49283J088486L166106M253241K795982r20335m104543
3304A1988041m291109k461239j453825j769556j333880N51480J589305k40061
3296B579156l641562n496018m384174j680166K80922N00321P5412Q58002L186907
3287g721200N330705N620687M410995L044741J729393r6413j841171k065767p77421
3278G634549K77858K6548o56757o21698j40810k15679j046302j834288j647048
3269A776373l02310J112715Q91628j152707k551825p26939L268834N354120L364854
$$ plain form
3329 1403751 2422554 1036199 -2439446 -4725590 -2959185 972388 1903849 -1865618
3321 -1865618 -5757715 -4801254 -294967 2276638 839511 -1117044 -32207 3255052
3313 3255052 5631205 5958387 5709104 6797590 9963696 14216937 17012919 16092584 11988041
3304 11988041 7696932 5235693 3781868 2012312 678432 1229912 2819217 2579156
3296 2579156 -1062406 -6558424 -10942598 -12622764 -12341842 -11841521 -11766109 -10908107 -7721200
3287 -7721200 -2390495 3230192 7641187 10685928 12415321 12318908 10477737 8411970 7634549
3278 7634549 7912407 7938955 7282198 6660500 6519690 6304011 5257709 3423421 1776373
3269 1776373 1474063 2586778 3478406 2325699 -226126 -953065 2315769 7669889 11034743
3260A1034743l63078k374094k300733k008942j975867j042576N62301O40893j620741
3251E51906l764825l149956o63058O11500j44721o10587P53232K172886J369400
3242b874223p20056j115638R66727L138065L142239J375790k48512n25372L32762
3233C471782J021277N8521k352023l553205j301143K709587M457090K867549P31350
3224H110785j19124j075108k821176l028220o95189P50698j516907m482183l629044
3215h505468l55045K25876k283018l066472j00357L052630L590046L208410L494680
3206g38718K655471k29984k103466o38290J546536J164062l87417j30504O52884
3197A790574j485879n685020p205099m043742R44540M487816N690042M363986
$$ plain form
3260 11034743 10671665 8297571 5996838 3987896 2012029 969453 1531754 2172647 551906
3251 551906 -3212919 -6362875 -7025933 -6414433 -6559154 -7169741 -6416509 -4243623 -2874223
3242 -2874223 -3594279 -4709917 -3743190 -605125 2537114 3912904 3664392 3139020 3471782
3233 3471782 4493059 4551580 2199557 -1353648 -2654791 54796 4511886 7379435 8110785
3224 8110785 7991661 6916553 4095377 1067157 371968 1122666 -394241 -4876424 -8505468
3215 -8505468 -8860513 -8634637 -10917655 -13984127 -14084484 -11031854 -7441808 -4233398 -738718
3206 -738718 1916753 1686769 -416697 -1054987 491549 1655611 1268194 1137690 1790574
3197 1790574 304695 -5380325 -12585424 -16629166 -15684626 -11196810 -5506768 -1142782
3189a142782O45566k841389k216139K537567O557381N986019K449312j37246q78929
3180A0959360j585794k804831l061315j679651P9365J119505J981178L374994
3172H382811M403388L473904P21025j631230j811929o53259l19100j369313k397151
3163H799146k464806k156824j785788o15269R97763R24445j237999k101220J008263
3154A367711M981974M355280o11691l754749j835068R22466m96998m486373n669436
3145e226884k673181R56782K352380J922402P14526j054383k264243j021784K119637
3136d174748L654212J569440j596085k054962J61520J557716J39807k005040j652717
3127d400857J299002L628415K697928l64890k124296j161903L13077k06534j827247
$$ plain form
3189 -1142782 -497216 -3338605 -5554744 -3017177 3540204 9526223 11975535 11838289 10959360
3180 10959360 9373566 6568735 3507420 1827769 1907134 3026639 5007817 8382811
3172 8382811 12786199 16260103 16981128 15349898 13537969 12884710 12565610 11196297 8799146
3163 8799146 6334340 4177516 2391728 1776459 2774222 3698667 2460668 359448 1367711
3154 1367711 6349685 10704965 10093274 6338525 4503457 5425923 4928925 442552 -5226884
3145 -5226884 -7900065 -6943283 -4590903 -2668501 -1953975 -3008358 -5272601 -6294385 -4174748
3136 -4174748 -520536 1048904 -547181 -2602143 -2440623 -882907 -743100 -2748140 -4400857
3127 -4400857 -3101855 526560 3224488 2859598 735302 -426601 -113524 -320058 -2147305
3118b147305j493390J517281M241786L642768J03769l433708m682577l519559
3110e770935j279827L55247K91892j146770k406795k180457m86536J802252L769303
3101g052626M536646L608097J829771J010390J646899J988636N73840j245241
3093F896412j060988P81323J267661r74745l371045k650900P08169K827688J063292
3084E486867k914189n150328l861155j003407O12610P09868J051928K237516K836043
3075E753K066143J321056J697314J746837j64793k443708k029299O41884J449695
3066D290882j702706n528189n420181j233298K866728L411626P79567k212459
3058d748030l303082k251727l46971J090267J828308K310005K419013J538468
$$ plain form
3118 -2147305 -3640695 -2123414 2118372 5761140 5864909 2431201 -2251376 -5770935
3110 -5770935 -7050762 -6695515 -6403623 -7550393 -9957188 -12137645 -12624181 -10821929 -7052626
3101 -7052626 -2515980 1092117 2921888 3932278 5579177 7567813 8141653 6896412
3093 6896412 5835424 6616747 7884408 6909663 3538618 887718 1595887 4423575 5486867
3084 5486867 2572678 -2577650 -6438805 -7442212 -6829602 -6119734 -5067806 -2830290 5753
3075 5753 2071896 3392952 5090266 6837103 6672310 4228602 2199303 2841187 4290882
3066 4290882 2588176 -2940013 -8360194 -9593492 -6726764 -3315138 -2535571 -4748030
3058 -4748030 -8051112 -10302839 -10649810 -9559543 -7731235 -5421230 -3002217 -1463749
3050a463749j3505o94416M71957K553606L752038L224393J535647j0517k98321
3041I057133M46712L88628j718608m024961l326047M9850J660326r63772m022070
3032b452809k188178L741010P458120N277971K93807k439479j881920m06664M74130
3023G875988J139903J525802M69256k031632l730162k589923M41949K398234J798680
3014G298095j33828j895689l570989n134500m603079l54995N236203P256742L953296
3005H051256j194643l832552l050414n22055K215343M028176L799186J734569
2997A1228866l27852j362327k284588l399395l062682p63149J005188M88316k08311
2988A314066J135850K478939Q90507j724080j106427K241211L605557J582441
$$ plain form
3050 -1463749 -1477254 -2171670 -1699713 853893 4605931 7830324 9365971 9355454 9057133
3041 9057133 9503845 9892473 8173865 4148904 822857 872707 2533033 1569261 -2452809
3032 -2452809 -4640987 -899977 6558143 11836114 12129921 9690442 7808522 7401858 7875988
3023 7875988 9015891 10541693 11010949 8979317 5249155 2659232 3101181 5499415 7298095
3014 7298095 7164267 5268578 1697589 -3436911 -8039990 -8394985 -3158782 4097960 8051256
3005 8051256 6856613 3024061 -26353 -548408 1666935 5695111 9494297 11228866
2997 11228866 10901014 9538687 7254099 3854704 792022 28873 1034061 1522377 1314066
2988 1314066 2449916 4928855 5819362 4095282 2988855 5230066 8835623 10418064
2980A0418064j87780M09111O98961j708112m861324n681646l870397p79880K431917
2971c131086L927455J919210j836656k670387P44880M046600L360918M69284q66040
2962E964178m48418k98905o30606p31101j545953l722821m913732k686696J193362
2953g820692K776735J161018j317393k936847l524325k609114J06067K997306
2945a1167245L990859L166485J682108m64647k937837l209209J39752L687460
2937e112274K957244q29135k211145M47997K953016J998380n42954j576042j175245
2928c090158r31341r54892p90449j062696k108919k627426j440840O84921K299940
2919a0021860L116649L525410L483949K903262K163226J532490R55969P16922
$$ plain form
2980 10418064 10230284 10639395 11338356 9630244 4768920 -912726 -4783123 -5563003 -3131086
2971 -3131086 796369 2715579 878923 -1791464 -1046584 3000016 6360934 6830218 5964178
2962 5964178 5515760 5216855 4586249 3855148 2309195 -1413626 -6327358 -9014054 -7820692
2953 -7820692 -5043957 -3882939 -5200332 -8137179 -11661504 -14270618 -14164551 -11167245
2945 -11167245 -7176386 -4009901 -2327793 -2792440 -5730277 -8939486 -8799734 -5112274
2937 -5112274 -2155030 -2984165 -5195310 -4747313 -1794297 204083 -338871 -1914913 -3090158
2928 -3090158 -4021499 -4976391 -5766840 -6829536 -8938455 -11565881 -13006721 -12321800 -10021860
2919 -10021860 -6905211 -3379801 104148 3007410 5170636 6703126 7659095 8376017
2911H376017J188193J708328R37096j416673m226798o157889o214735l857356
2903i663817k10083J773219O13500j051330J25343K919438L171963M16899j327126
2894c231994n1585J416691Q22169L79275K369050M464649L214079k77354k074790
2885G030190j317186n83388j104545j289488j92167O96009L6500j150807r88867
2876A136251P36836K340230J995337m12368k844234k918972o80581J142068M37568
2867I32135j502551j640071Q79062L688843L975871J306557k317386m440252m051268
2858c169060k062061k77147N2354j102354k634737k774620m75860K785207L706814
2849e951464J123552j827168j558077R92657K073657J072632R49910K484678K511796
$$ plain form
2911 8376017 9564210 11272538 12209634 10792961 6566163 408274 -5806461 -9663817
2903 -9663817 -9873900 -8100681 -7487181 -8538511 -8413168 -5493730 -2321767 -1904868 -3231994
2894 -3231994 -3283579 -1866888 -1044719 -665444 1703606 6168255 9382334 9104980 7030190
2885 7030190 5713004 5129616 4025071 2735583 2543416 3239425 3275925 2125118 1136251
2876 1136251 1873087 4213317 6208654 5796286 2952052 33080 -647501 494567 932135
2867 932135 -570416 -2210487 -1331425 2357418 6333289 7639846 5322460 882208 -3169060
2858 -3169060 -5231121 -5508268 -5455914 -6558268 -9193005 -11967625 -12443485 -9658278 -5951464
2849 -5951464 -4827912 -6655080 -8213157 -7220500 -5146843 -4074211 -3124301 -639623 1872173
2840A872173l47249k345272p9276L840641M275468O74906k928693l693265k208275
2831i38842J33452K400133K964444N16829l194154m404434j995956J004572J446848
2822b067108j82428j026796L01779K162691J829326j313902m509663m167339q0127
2813i053567L863560M042724J193880r70223k95176J967089L134278J740936j165131
2804D458370k611865o86607K411011K178337k110798n460380l379083K149409
2796c051606N615279M858901J747212k073190n850733p268339m154750J158869
2788i018357L647320K456501J697018L430357M536270K559326J25485L35638J486862
2779A1256420L35408k104891k392656o43426k18701j968020l010248j714367j49284
$$ plain form
2840 1872173 1524924 -820348 -899624 2941017 7216485 7891391 4962698 1269433 -938842
2831 -938842 -805390 1594743 4559187 5076016 1881862 -2522572 -4518528 -3513956 -2067108
2822 -2067108 -2249536 -3276332 -2974553 -811862 1017464 -296438 -4806101 -8973440 -9053567
2813 -9053567 -5190007 -1147283 46597 -923626 -1218802 748287 3882565 5623501 4458370
2804 4458370 1846505 1159898 3570909 5749246 3638448 -1821932 -5201015 -3051606
2796 -3051606 2563673 7422574 9169786 7096596 1245863 -6022476 -10177226 -9018357
2788 -9018357 -5371037 -2914536 -1217518 2212839 6749109 9308435 9433920 9769558 11256420
2779 11256420 11591828 9486937 7094281 6450855 6232154 4264134 1253886 -460481 -609765
2770f09765k87827q37338K07486K011700K176651M51940r64026n47896Q40490
2761B441415J570417J242030N41508R35l42594m61705k05978L86249J000912J181171
2751G354360M21088j353994k994283k619885M8298K479560J996652o30483k171622
2742B529691j616313j436140l221300m636937k842973R33612K919652J881016
2734e489692O2794m39148L21971J661474L270220M299353L544196J177586j233239
2725G175515k717948l424831l210997j625473M96780J431134J041334R80352J848071
2716A993937K063006M25359j876498k813743j803517K15489J716900J199505j542282
2707d21844m251061m030692r81432J750440K195646J746300K119647K459871J286115
$$ plain form
2770 -609765 -897592 -1734930 -1527444 484256 2660907 3112847 2148821 1600925 2441415
2761 2441415 4011832 5253862 5795370 5796305 5453711 4992006 4786028 5172277 6173189 7354360
2751 7354360 7775448 6421454 3427171 807286 855584 3335144 5331796 4701313 2529691
2742 2529691 913378 -522762 -3744062 -8380999 -11223972 -10290360 -7370708 -5489692
2734 -5489692 -5426898 -5866046 -5544075 -3882601 -612381 3686972 7231168 8408754 7175515
2725 7175515 4457567 1032736 -2178261 -3803734 -3306954 -1875820 -834486 145866 1993937
2716 1993937 4056943 4482302 2605804 -207939 -2011456 -1795967 -79067 1120438 -421844
2707 -421844 -4672905 -8703597 -9685029 -7934589 -5738943 -3992643 -1872996 586875 1872990
2698A872990m78057o77874Q09538J957017J318743n10101j776480j000615J742396
2689C257557M147396L363944n65659m049158l962790j275109O73915L99853q97346
2680A092603j865226k369388k511395j974976o89898P45011J413225N46142j700278
2671g314180l440927k233492J783034M986247M098875K72691k280478j337484
2663e465714J318377K788615K251721Q83683n2913k77790k59601m58358p51100
2654b3080o75087k50762l6729j83904k19541r5338l80735q43298k03815J626407
2644a285882K506194R61687j037197m53268K202864L158064N70109k879934l566160
2635A76477j304863J162081J815399R22871m21957j662655k456062k244092r96107
$$ plain form
2698 1872990 1394933 717059 1526597 3483614 4802357 4292256 2515776 1515161 3257557
2689 3257557 7404953 10768897 10203238 6154080 2191290 916181 1590096 1989949 1092603
2680 1092603 -772623 -3142011 -5653406 -7628382 -8318280 -7573269 -6160044 -5613902 -7314180
2671 -7314180 -10755107 -12988599 -11205565 -6219318 -2120443 -1847752 -4128230 -5465714
2663 -5465714 -4147337 -1358722 892999 1776682 1723769 1445979 1186378 728020 -23080
2654 -23080 -698167 -948929 -985658 -1169562 -1389103 -1484441 -1865176 -2708474 -2912289 -1285882
2644 -1285882 1220312 2181999 1144802 691534 2894398 6052462 6622571 3742637 176477
2635 176477 -1128386 33695 1849094 2771965 2350008 687353 -1768709 -4012801 -5008908
2626e008908J44174p9754j282761j662081m28731R16068P30559j22447N57943
2617f235938K669097L352723R25593k452143l340530j109537J897674L454492
2609h38569L224028J871147p1364k127102l477424l160973q76897K165147L647857
2600C55850K438664L37182J13242J686897K069092l35135l397091m353125l247390
2591d331814j715476j73166J695789L038277K722986J314503J84885n18699j164199
2582A053086r97549N51520J951104J539623O03643J548350L472064K939617n33250
2573A2128208l144932k060397R04378K366459J679841L47218q27530j862144k224811
2564G306290j465878n44820p74239j792480k013655r08613L72300O48567K0292
$$ plain form
2626 -5008908 -4864734 -4944488 -6227249 -7889330 -8318061 -7401993 -6671434 -6793881 -6235938
2617 -6235938 -3566841 -214118 711475 -1740668 -5081198 -6190735 -4293061 -838569
2609 -838569 2385459 4256606 4185242 2058140 -1419284 -4580257 -5457154 -3292007 355850
2600 355850 2794514 3131696 3244938 4931835 7000927 6665792 3268701 -1084424 -4331814
2591 -4331814 -6047290 -6220456 -4524667 -1486390 1236596 2551099 2735984 2217285 1053086
2582 1053086 55537 607057 2558161 4097784 4701427 6249777 9721841 12661458 12128208
2573 12128208 8983276 6922879 7827257 10193716 11873557 12220775 11393245 9531101 7306290
2564 7306290 5840412 5295592 4521353 2728873 715218 -193395 178905 827472 847764
2555H47764o14103o62335k05850L38823N85261K54668p35349j861748j924771
2546c977640k77915J721729J727481m01529j757101j47478K428141K190651r64611
2537E41728k862657m75530M051206O019502L625202n08965k717028k036671l84561
2528E252226L04146K11438M98876R17003J56718j435828j606745L81439K067843
2519F747116J131329j306767k616979k285390j394167q1491J739534K425885N08934
2510D868004k265573k956234j806125j307090j574481n01733J709913K373802
2502a459517J045816K43450P03595K01252j784618k651594j521602j048178k317842
2493h589238k470207j8523J999717J417050R55973K900308M197853J837353r35892
$$ plain form
2555 847764 233661 -428674 -634524 -295701 289560 544228 -191121 -2052869 -3977640
2546 -3977640 -4255555 -2533826 -806345 -1207874 -2964975 -3112453 -684312 1506339 541728
2537 541728 -2320929 -2796459 1254747 7274249 10899451 10390486 7673458 5636787 5252226
2528 5252226 5556372 5767810 6266686 7183689 7340407 5904579 4297834 4679273 6747116
2519 6747116 7878445 6571678 3954699 1669309 275142 193651 1933185 4359070 4868004
2510 4868004 2602431 -353803 -2159928 -3467018 -5041499 -5543232 -3833319 -1459517
2502 -1459517 -413701 -170251 533344 734596 -1050022 -3701616 -5223218 -6271396 -8589238
2493 -8589238 -11059445 -11077968 -9078251 -7661201 -6705228 -3804920 392933 2230286 1294394
2484A294394J61486K250316n13140o259291o749205K15346P006785O814984J939509
2475F161184j458834j767772j349787j241157m77994J112689K508733K935977
2467F423039K032505j63134k318815k676064j748043j960407l622241m009100
2459h042260j960176k80956j138436j996733M26535M289390M771819J120872k468221
2450e278166k921698j407781J95316K119869M310044M519505J588852j509306
2442A616635j091784J787487K561234k54583k971493k276648J43201P83689r9986
2433A97752N75568L011353L465406j44072m548834n048123j346921K605810L611239
2424B379178K131310O99120J040995K625394L035623K62814m442732o924501m676448
$$ plain form
2484 1294394 1455880 3706196 3193056 -3066235 -9815440 -9600094 -2593309 4221675 6161184
2475 6161184 4702350 2934578 1584791 343634 -134360 978329 3487062 6423039
2467 6423039 8455544 8292410 5973595 3297531 1549488 -410919 -4033160 -8042260
2459 -8042260 -10002436 -10283392 -11421828 -13418561 -12992026 -8702636 -3930817 -2809945 -5278166
2450 -5278166 -8199864 -9607645 -9412329 -7292460 -2982416 1537089 3125941 1616635
2442 1616635 524851 2312338 4873572 4618989 1647496 -629152 -485951 297738 197752
2433 197752 773320 3784673 7250079 7106007 2557173 -2490950 -3837871 -1232061 2379178
2424 2379178 4510488 5209608 6250603 8875997 11911620 12174434 7731702 807201 -3869247
2415c869247j62750K071324Q31124j129069j330469l6246J435456K394559K209702
2406B414384K98057k225642k638734K67858M195266N629199L526790m0999k356819
2397I069360k491163j595317j253857j693363j939640j685113j803233k364121
2389e756447j795855L98110J777879L75721j366639M54503M805153O270677K621856
2380G784958k139533l737658k818395j994578j288541L14201J537903O89031r46036
2371b598648j036160j30250k26088o56755Q02829L379512L798815J389746j043878
2362C679123j869892k381066l004161j685188K007174M569697L064805n23420
2354C857072k246216j601171j012041j305137j019263K46165R60935M75203M7250
$$ plain form
2415 -3869247 -4031997 -1960673 -1129549 -2258618 -3589087 -3625333 -2189877 204682 2414384
2406 2414384 2712441 486799 -2151935 -1884077 2311189 7940388 11467178 11426179 9069360
2397 9069360 6578197 4982880 3729023 2035660 96020 -1589093 -3392326 -5756447
2389 -5756447 -7552302 -7154192 -5376313 -5000592 -6367231 -5912728 -1107575 5163102 7784958
2380 7784958 5645425 1907767 -910628 -2905206 -4193747 -3879546 -2341643 -1652612 -2598648
2371 -2598648 -3634808 -3765058 -3991146 -4647901 -3845072 -465560 3333255 4723001 3679123
2362 3679123 1809231 -571835 -3575996 -5261184 -3254010 1315687 4380492 3857072
2354 3857072 1610856 9685 -1002356 -2307493 -3326756 -3080591 -2119656 -1644453 -1597203
2345a597203L40950J82230j107736k025067r46273J374743K723409K025958j2029
2336I58982k044968k839128j757154K93823J148302o1639j344865l72186K120719
2327c898114L362959K469519R10649p80784l587814o410533n471105J31145N101309
2318h172769L880106j645011m342279j183559L718707N691310M786544L033423
2310E766472N77049k545812l910526j698744J558384J881722l83221j210369Q86080
2301I21035K761332J529314j434253k900939k125959r77527q52025j082413j71088
2292d332523K277341M863400N521596L636894P88176j204654k377251l613689
2284E559290m280115k969941n65652K3462j877242l169764j452245J118971J012758
$$ plain form
2345 -1597203 -1256253 -1074023 -2181759 -4206826 -5153099 -3778356 -1054947 971011 958982
2336 958982 -1085986 -3925114 -5682268 -5388445 -4240143 -4301782 -5646647 -6018833 -3898114
2327 -3898114 -535155 1934364 2845013 2064229 -1523585 -7934118 -13405223 -13274078 -8172769
2318 -8172769 -4292663 -5937674 -10279953 -11463512 -7744805 -2053495 2733049 5766472
2310 5766472 6343521 3797709 -112817 -1811561 -253177 1628545 1245324 34955 921035
2301 921035 3682367 5211681 3777428 876489 -1249470 -2226997 -3079022 -4161435 -4332523
2292 -4332523 -2055182 2808218 8329814 11966708 12754884 11550230 9172979 5559290
2284 5559290 1279175 -1690766 -2256418 -2232956 -4110198 -7279962 -8732207 -7613236 -6600478
2275f600478j080899j130652J967989M375587K716917j156981k843929j195457
2267d947903Q94749Q82305n13184j102897k15094R95748J292137N56689l33176
2258b490626k88999J018777K588673K813067J142451j256532k771125k857527
2250b101841j977137o49756P03170J379631Q33597m46257j209264p41661N87019
$$ plain form
2275 -6600478 -7681377 -8812029 -6844040 -2468453 248464 -908517 -3752446 -4947903
2267 -4947903 -4053154 -3170849 -3684033 -4786930 -5002024 -4006276 -2714139 -2157450 -2490626
2258 -2490626 -2779625 -1760848 827825 3640892 4783343 3526811 755686 -2101841
2250 -2101841 -4078978 -4728734 -4025564 -2645933 -1812336 -2258593 -3467857 -4209518 -3622499
$$ [...]
##END NTUPLES=NMR SPECTRUM
##END=
