##TITLE=31Pdec_DE-161rm_3h
 ,64 sc
 6.7.2026
##JCAMPDX= 6.0         $$ Bruker NMR JCAMP-DX V2.0
##DATA TYPE= NMR SPECTRUM
##DATA CLASS= NTUPLES
##ORIGIN= UXNMR, Bruker Analytische Messtechnik GmbH
##OWNER= root
$$ XWIN-NMR		Version 3.5
$$ Mon Jul  6 13:52:43 2026 Russian Standard Time (UT+4h)  she@DPX200
##.OBSERVE FREQUENCY= 81.013821
##.OBSERVE NUCLEUS= ^31P
##.ACQUISITION MODE= SIMULTANEOUS
##.ACQUISITION SCHEME= undefined
##.AVERAGES= 64
##.DIGITISER RES= 17
##SPECTROMETER/DATA SYSTEM= spect
##.PULSE SEQUENCE= zgpg30
##.SOLVENT NAME= DMSO
##.SHIFT REFERENCE= (INTERNAL, DMSO, 0, 197.392)
##AUDIT TRAIL= $$ (NUMBER, WHEN, WHO, WHERE, WHAT)
$$ ##TITLE= Audit trail, XWIN-NMR		Version 3.5
$$ ##JCAMPDX= 5.01
$$ ##ORIGIN= Bruker BioSpin GmbH
$$ ##OWNER= she
$$ F:/spectra/data/she/nmr/P31/2/pdata/1/auditp.txt
$$ ##AUDIT TRAIL=  $$ (NUMBER, WHEN, WHO, WHERE, WHAT)
(   1,<2026-07-06 13:51:28.65 +0400>,<she>,<DPX200>,
      <created by zg, POWCHK disabled, PULCHK disabled
       configuration hash MD5:
       00 E9 B6 7A A2 85 ED C7 34 08 36 98 17 FE 4E 26
       data hash MD5: 32K
       30 BB 20 14 DB B2 83 BD 7D 01 14 4C A5 97 A9 74>)
(   2,<2026-07-06 13:51:30.87 +0400>,<she>,<DPX200>,
      <Start of raw data processing
       efp BC_mod = 2 LB = 1.5 FT_mod = 6 PKNL = 1 PHC0 = 1876.882 PHC1 = -3.301208 SI = 64K 
       data hash MD5: 64K
       5C 88 0F 3B C0 AF 5C 83 31 78 D4 E8 FA BE F7 8A>)
(   3,<2026-07-06 13:52:06.98 +0400>,<she>,<DPX200>,
      <pk PHC0 = 58.14343 PHC1 = 148.6 
       data hash MD5: 64K
       6F 88 CA 18 DF F5 E4 6D D8 09 CC 66 EC AD 39 47>)
(   4,<2026-07-06 13:52:11.68 +0400>,<she>,<DPX200>,
      <abs ABSG = 5 
       data hash MD5: 64K
       32 A1 94 31 1A 89 05 8F 28 AC 32 4F 62 5F A4 EC>)
$$ ##END=
$$ 
$$ hash MD5
$$ 05 80 CD AF C0 D4 3B BD 9B 4A 6F 48 AB F6 0C DA
##$RELAX= 
##$RELAX= 
##$RELAX= 
##$RELAX= 
##$RELAX= 
##$RELAX= 
##$RELAX= 
##$RELAX= 
$$ Bruker specific parameters
$$ --------------------------
##$DU= <F:/spectra>
##$EXPNO= 2
##$NAME= <P31>
##$PROCNO= 1
##$TYPE= <nmr>
##$USER= <she>
##$AMP= (0..31)
100 100 100 100 100 100 100 100 100 100 100 100 100 100 100 100 100 100 
100 100 100 100 100 100 100 100 100 100 100 100 100 100 
##$AQSEQ= 0
##$AQ_mod= 1
##$AUNM= <au_zg>
##$AUTOPOS= <>
##$BF1= 81.014009
##$BF2= 200.13
##$BF3= 200.13
##$BF4= 200.13
##$BF5= 200.13
##$BF6= 200.13
##$BF7= 200.13
##$BF8= 200.13
##$BYTORDA= 1
##$CFDGTYP= 0
##$CFRGTYP= 5
##$CHEMSTR= <none>
##$CNST= (0..31)
1 1 145 1 1 1 1 1 1 1 1 1 1 1 1 1 1 1 1 1 1 1 1 1 1 1 1 1 1 1 1 1 
##$CPDPRG= <waltz16>
##$CPDPRG1= <>
##$CPDPRG2= <waltz16>
##$CPDPRG3= <>
##$CPDPRG4= <mlev>
##$CPDPRG5= <mlev>
##$CPDPRG6= <mlev>
##$CPDPRG7= <mlev>
##$CPDPRG8= <mlev>
##$CPDPRGB= <>
##$CPDPRGT= <>
##$D= (0..31)
0 1 0 0 0 0 0 0 0 0.06 0 0.03 2e-05 3e-06 0 0 0.0002 0 0 0 0 0 0 0 0 0 
0 0 0 0 0 0 
##$DATE= 1783331488
##$DBL= (0..7)
120 120 120 11 120 120 24 19 
##$DBP= (0..7)
150 150 150 150 150 150 150 150 
##$DBP07= 0
##$DBPNAM0= <>
##$DBPNAM1= <>
##$DBPNAM2= <>
$$ [...]
##$SUBNAM3= <"">
##$SUBNAM4= <"">
##$SUBNAM5= <"">
##$SUBNAM6= <"">
##$SUBNAM7= <"">
##$SUBNAM8= <"">
##$SUBNAM9= <"">
##$SW= 400.765351723535
##$SWIBOX= (0..15)
0 1 3 0 0 0 0 0 0 0 0 0 0 0 0 0 
##$SW_h= 32467.5324675325
##$TD= 32768
##$TD0= 1
##$TE= 0
##$TE2= 300
##$TE3= 300
##$TEG= 300
##$TL= (0..7)
0 120 53 12 22 120 120 120 
##$TP= (0..7)
150 150 150 150 150 150 150 150 
##$TP07= 0
##$TPNAME0= <>
##$TPNAME1= <>
##$TPNAME2= <>
##$TPNAME3= <>
##$TPNAME4= <>
##$TPNAME5= <>
##$TPNAME6= <>
##$TPNAME7= <>
##$TPOAL= (0..7)
0.5 0.5 0.5 0.5 0.5 0.5 0.5 0.5 
##$TPOFFS= (0..7)
0 0 0 0 0 0 0 0 
##$TUNHIN= 0
##$TUNHOUT= 0
##$TUNXOUT= 0
##$USERA1= <user>
##$USERA2= <user>
##$USERA3= <user>
##$USERA4= <user>
##$USERA5= <user>
##$V9= 5
##$VALIST= <valist>
##$VCLIST= <CCCCCCCCCCCCCCC>
##$VD= 0
##$VDLIST= <DDDDDDDDDDDDDDD>
##$VPLIST= <PPPPPPPPPPPPPPP>
##$VTLIST= <TTTTTTTTTTTTTTT>
##$WBST= 1024
##$WBSW= 4
##$XGAIN= (0..3)
0 0 0 0 
##$XL= 0
##$YL= 0
##$YMAX_a= 93274
##$YMIN_a= -83725
##$ZGOPTNS= <>
##$ZL1= 120
##$ZL2= 120
##$ZL3= 120
##$ZL4= 120
##$ABSF1= 197.3918
##$ABSF2= -203.3724
##$ABSG= 5
##$ABSL= 3
##$ALPHA= 0
##$AQORDER= 0
##$ASSFAC= 0
##$ASSFACI= 0
##$ASSFACX= 0
##$ASSWID= 0
##$AUNMP= <proc_1d>
##$AZFE= 0.1
##$AZFW= 0.5
##$BCFW= 0
##$BC_mod= 2
##$BYTORDP= 0
##$COROFFS= 0
##$CY= -3
##$DATMOD= 1
##$DC= 0
##$DFILT= <>
##$DTYPP= 0
##$F1P= 0
##$F2P= 0
##$FCOR= 1
##$FTSIZE= 65536
##$FT_mod= 6
##$GAMMA= 0
##$GB= 0
##$INTBC= 1
##$INTSCL= 9.790993e-09
##$ISEN= 30
##$LB= 1.5
##$LEV0= 0
##$LPBIN= 0
##$MAXI= 10000
##$MC2= 0
##$MEAN= 0
##$ME_mod= 0
##$MI= 50
##$NCOEF= 0
##$NC_proc= -6
##$NLEV= 6
##$NOISF1= 182.463
##$NOISF2= 159.3651
##$NSP= 0
##$NTH_PI= 0
##$NZP= 0
##$OFFSET= 197.3918
##$PC= 4
##$PHC0= 1935.025
##$PHC1= 145.2988
##$PH_mod= 1
##$PKNL= yes
##$PPARMOD= 0
##$PSCAL= 0
##$PSIGN= 0
##$REVERSE= no
##$SF= 81.014063255964
##$SI= 65536
##$SIGF1= 159.3651
##$SIGF2= -187.1042
##$SINO= 113.3802
##$SIOLD= 16384
##$SREGLST= <1H.CDCl3>
##$SSB= 0
##$STSI= 65536
##$STSR= 0
##$SW_p= 32467.5324675325
##$SYMM= 0
##$S_DEV= 0
##$TDeff= 32768
##$TDoff= 0
##$TI= <>
##$TILT= no
##$TM1= 0
##$TM2= 0
##$TOPLEV= 0
##$USERP1= <user>
##$USERP2= <user>
##$USERP3= <user>
##$USERP4= <user>
##$USERP5= <user>
##$WDW= 1
##$XDIM= 65536
##$YMAX_p= 336437144
##$YMIN_p= -43937949
$$ End of Bruker specific parameters
$$ ---------------------------------
##NTUPLES= NMR SPECTRUM
##VAR_NAME=  FREQUENCY,     SPECTRUM/REAL,   SPECTRUM/IMAG
##SYMBOL=    X,             R,               I
##VAR_TYPE=  INDEPENDENT,   DEPENDENT,       DEPENDENT
##VAR_FORM=  AFFN,          ASDF,            ASDF
##VAR_DIM=   65536,         65536,           65536
##UNITS=     HZ,            ARBITRARY UNITS, ARBITRARY UNITS
##FACTOR=    0.49542278885378, 1,            1
##FIRST=     15991.5117654749, 0,            0
##LAST=      -16476.0207020576, 0,           0
##MIN=       -16476.0207020576, -43937949,   0
##MAX=       15991.5117654749, 336437144,    0
$$ Real data points
##PAGE= N=1
##DATA TABLE= (X++(R..R)), XYDATA
$$ [...]
48098 457969 -704749 -1250596 -749016 -147299 -416507 -1290851 -1709593 -1172109 -261984
48089 -261984 114101 -246181 -679958 -481343 261980 826764 793936 516150 522501 783862
48079 783862 887259 759228 822934 1399218 2230990 2755710 2750139 2548080 2548896 2604337 2142236
48068 2142236 1001611 -162476 -635312 -572647 -697921 -1192327 -1477255 -1138885 -447340
48059 -447340 212936 796774 1178486 901274 -153246 -1280370 -1650026 -1193280 -394125
48050 -394125 425005 1121851 1400353 1084579 567636 449502 824955 1363401 1900894 2415526
48040 2415526 2559006 1865815 521196 -600809 -865177 -517985 -259702 -420352 -685315
48031 -685315 -517833 195990 918862 1013694 533206 148354 192027 237909 -74869 -294265
48021 -294265 246726 1414146 2389869 2566569 1876382 576798 -723350 -1183459 -594074
48012 -594074 118614 -38781 -809408 -1226418 -1175499 -1381869 -1954047 -2147042 -1779306 -1711851
48002 -1711851 -2444797 -3248036 -3290987 -2778409 -2309215 -1880230 -1262427 -704170 -465236 -191018
47992 -191018 434955 863805 361037 -806583 -1709408 -2063676 -2372876 -2891345 -3276654
47983 -3276654 -3266101 -2921863 -2147133 -738846 889266 1761002 1451577 601021 -1866
47974 -1866 -340920 -810791 -1409216 -1806861 -1942307 -2004402 -1909022 -1290212 -106053 1101342
47964 1101342 1713713 1578119 909685 -74202 -1117939 -1686558 -1249055 9457 1093041
47955 1093041 1127969 221392 -875609 -1724695 -2396918 -2895899 -3006588 -2793160 -2652495
47946 -2652495 -2652043 -2373673 -1741932 -1435661 -1935625 -2602972 -2411659 -1399531 -658874 -856137
47936 -856137 -1442910 -1579638 -1280014 -1169445 -1386400 -1291515 -401836 754829 1118324 417267
47926 417267 -403321 -347575 384177 837584 783952 956518 1660622 2024733 1232817 -112781
47916 -112781 -650784 14301 983699 1295683 764059 -347534 -1715937 -2843851 -3174491
47907 -3174491 -2643066 -1786701 -1149813 -871393 -881589 -1076969 -1192279 -935031 -442863 -232503
47897 -232503 -464805 -589199 -11786 1088109 1889213 1807067 1071516 440398 395750 634186
47887 634186 436095 -424500 -1354432 -1696237 -1539847 -1433382 -1494870 -1310173 -691633 -53849
47877 -53849 104897 -226233 -642050 -752215 -495835 -182723 -166731 -351148 -231209 377540
47867 377540 1011923 1306792 1611961 2281811 2777584 2303849 1099976 208929 86759
47858 86759 360014 848205 1715644 2531653 2393229 1337825 538777 668349 1134386 1390339
47848 1390339 1791802 2476571 2633309 1844986 1061424 1122820 1309936 611005 -500113
47839 -500113 -1005240 -1243468 -2145195 -3103764 -2559438 -628894 756448 625046 119258
47830 119258 355783 804978 648450 308401 497251 784690 285742 -896091 -1940393
47821 -1940393 -2521613 -2839782 -2855683 -2374907 -1649857 -1172123 -1056834 -1196662 -1719469 -2660032
47811 -2660032 -3445502 -3396139 -2620123 -1832984 -1405047 -1147690 -949192 -1018472 -1428482 -1899326
47801 -1899326 -2186463 -2376415 -2666878 -3025033 -3142375 -2707117 -1812031 -1090342 -1196837
47792 -1196837 -2063686 -2936681 -3225738 -2968646 -2374472 -1443308 -334087 402197 422302
47783 422302 84276 -68013 7763 49445 -26765 -289143 -999492 -2063777 -2638671 -2010027
47773 -2010027 -689235 49837 -341243 -1255567 -1903954 -2086314 -1983753 -1783232 -1637860
47764 -1637860 -1573852 -1364121 -808866 -63359 643947 1396924 2235372 2694925 2347132 1596843
47754 1596843 1201749 1125067 688094 -191489 -859018 -1122968 -1574845 -2371995 -2690246 -1979170
47744 -1979170 -957000 -646972 -1022970 -1309684 -1125454 -610557 150207 1030128 1437140
47735 1437140 797155 -547489 -1542775 -1578551 -984177 -380512 4561 301612 630329
47726 630329 889253 805652 277023 -267104 -155809 634276 1246971 1003998 375887 386452
47716 386452 1285378 2397505 3150220 3590906 3850339 3732897 3081368 2115791 1162328
47707 1162328 328434 -392743 -955761 -1348870 -1646059 -1867582 -1931009 -1757895 -1299632 -565818
47697 -565818 149919 246233 -590173 -1829259 -2551999 -2456126 -2016894 -1693231 -1494140 -1386997
47687 -1386997 -1527501 -1816824 -1746735 -1076128 -303602 -85901 -461724 -1007570 -1502816 -2025306
47677 -2025306 -2536147 -2773492 -2552140 -1931316 -1139216 -494208 -246245 -284653 -170535 305118
47667 305118 783340 837832 617891 625059 981544 1332054 1413474 1286556 981827 370176
47657 370176 -471079 -1157677 -1482199 -1681664 -1970074 -2075086 -1565343 -484814 660469
47648 660469 1476834 1937906 2079126 1776318 987992 9682 -737039 -1125851 -1399150 -1857097
47638 -1857097 -2607743 -3589638 -4620711 -5328215 -5250889 -4291516 -3032948 -2325074 -2458107
47629 -2458107 -2922812 -3056759 -2705806 -2138546 -1603393 -1246082 -1236007 -1574790 -1860620 -1652610
47619 -1652610 -1097998 -819331 -1093884 -1510259 -1570929 -1261413 -815319 -282572 360014 962304
47609 962304 1411442 1849913 2327673 2480731 1999224 1231752 812553 784902 645361 238298
47599 238298 -6636 151117 357714 289858 143448 154447 114047 -207332 -539216 -485856
47589 -485856 -138145 127422 198259 143737 -124120 -602425 -873249 -604632 -172106 -169297
47579 -169297 -488575 -589148 -511868 -741519 -1069693 -655501 459304 946850 -22222 -1431354
47569 -1431354 -1747922 -1022137 -636216 -1233779 -1954405 -1802557 -872833 86871 630814
47560 630814 709301 311330 -458055 -1153629 -1301699 -954975 -673441 -881146 -1377325 -1566386
47550 -1566386 -1112637 -266653 460728 800605 797557 574189 326128 451997 1239897 2325185
47540 2325185 2888273 2603198 2019147 1779825 1883326 2018920 2177079 2460684 2670041
47531 2670041 2624541 2610515 2933075 3256696 3009957 2278916 1661497 1357647 1073670 745358
47521 745358 613419 558877 132992 -603206 -991413 -731114 -224345 261073 1000019 1986192
47511 1986192 2442253 1761130 422627 -626622 -1107800 -1351169 -1470067 -1271237 -841857
47502 -841857 -616335 -812838 -1181418 -1330380 -1053418 -392749 395858 998710 1312543 1460254
47492 1460254 1480016 1219608 626246 -116131 -805277 -1272201 -1230610 -582928 53128 -195801
47482 -195801 -1178248 -1584601 -581125 1021395 1819820 1513944 873613 450128 101501
47473 101501 -425996 -1143889 -1934315 -2500534 -2427083 -1773315 -1259027 -1308221 -1366800 -879252
47463 -879252 -416291 -838111 -1729953 -1883752 -1205610 -863442 -1420751 -2101098 -2259120 -2353276
47453 -2353276 -2846619 -3206844 -2814026 -2075999 -1795967 -1980974 -2046879 -1788217 -1452011 -1181738
47443 -1181738 -1000604 -1052862 -1314230 -1354223 -908872 -410626 -448495 -970909 -1495142 -1806222
47433 -1806222 -1950109 -1844927 -1462307 -1153351 -1247791 -1550355 -1754529 -2062373 -2748889 -3362483
47423 -3362483 -3156278 -2275575 -1742525 -2124241 -2857985 -3071464 -2495043 -1365539 -9192
47414 -9192 1142149 1563741 1069617 28303 -1054887 -1930548 -2465925 -2507614 -2166374 -1923394
47404 -1923394 -2088478 -2330829 -2085186 -1318736 -580465 -327373 -478213 -642055 -537385
47395 -537385 -123798 462177 969499 1164960 1051785 902399 961683 1162271 1249867 1140986
47385 1140986 980150 838402 579864 132635 -314880 -560758 -653790 -703443 -624005 -376707
47375 -376707 -297003 -742534 -1453769 -1741847 -1403846 -1000132 -1051899 -1400494 -1619108 -1644950
47365 -1644950 -1627458 -1460519 -916175 -113549 508492 628920 220135 -571259 -1446306 -1992819
47355 -1992819 -2023030 -1826411 -1825702 -2012022 -1947315 -1315692 -296496 600204 954627 739447
47345 739447 290930 -61609 -326324 -685333 -1093900 -1348566 -1514621 -1839313 -2159863 -1921421
47335 -1921421 -1015366 -91024 290653 322741 391378 372960 15754 -427731 -553265 -426397
47325 -426397 -251290 192831 1069690 1782608 1609933 869519 564651 898392 1019729 366460
47315 366460 -563714 -1038202 -999495 -843699 -820669 -931477 -1037525 -935405 -663868 -668893
47305 -668893 -1184164 -1612106 -1218872 -332810 29470 -241250 -138537 814577 1725630 1615748
47295 1615748 646926 -509247 -1697169 -2952400 -3832451 -3883724 -3358396 -2817220 -2397992
47286 -2397992 -1996058 -1684249 -1403375 -774356 167261 621632 127028 -543655 -416809
47277 -416809 251783 513379 277337 283443 778607 1283469 1556255 1741919 1618551 814440
47267 814440 -117393 17880 1359556 2570157 2546306 1682147 971676 708962 666613 797958
47257 797958 1034922 950112 337515 -295440 -468644 -548494 -1117319 -1867817 -1937644 -1203203
47247 -1203203 -455776 -269939 -404980 -453497 -411779 -321716 89744 963201 1815101 1940799
47237 1940799 1219603 239978 -293401 -68573 749120 1591612 1700524 699033 -858467
47228 -858467 -1804371 -1500541 -501939 163145 191641 138272 482231 1050575 1444893 1575180
47218 1575180 1549553 1413170 1278245 1409349 1882058 2394172 2645949 2613223 2239489 1328744
47208 1328744 132211 -482622 -83334 516327 274095 -546653 -781638 -179118 238556
47199 238556 -225725 -1012358 -1362048 -1381813 -1490793 -1582092 -1424839 -1296297 -1484862 -1612083
47189 -1612083 -1148550 -253502 520138 964387 1012661 285312 -1268869 -2613531 -2557480
47180 -2557480 -1375935 -490233 -489411 -549542 -56874 360106 44360 -437149 -186421 527618
47170 527618 698045 176943 -192959 3501 188493 -115926 -453877 -165531 604791 1169670
47160 1169670 1241030 1087578 921165 652742 286195 114436 340872 779916 1141291 1435075
47150 1435075 1861323 2378143 2628813 2348553 1672966 956885 430373 170256 276994
47141 276994 794528 1400724 1459497 640491 -605591 -1445295 -1530604 -1226062 -946784 -608389
47131 -608389 49671 876911 1434530 1601998 1638959 1591969 1069867 -131293 -1459929 -2020182
47121 -2020182 -1500220 -466534 238719 229792 -242404 -655226 -727763 -636328 -686516 -785626
47111 -785626 -475658 362644 1118551 1120913 568664 377006 1078454 2253310 3124402 3325176
47101 3325176 2910275 2008633 831765 -184758 -633966 -500521 -29279 684104 1669756
47092 1669756 2674960 3154510 2866147 2260432 2021094 2274707 2473909 2087594 1211814
47083 1211814 388800 -24899 -111695 -87124 -9592 124811 223177 200100 89844 -121096
47073 -121096 -609995 -1402339 -2060159 -2066175 -1562751 -1323705 -1783365 -2402254 -2343271 -1615030
47063 -1615030 -1100723 -1376099 -1907342 -1751549 -848814 -156636 -427365 -1284704 -1817020
47054 -1817020 -1764146 -1631469 -1781626 -2029704 -2224927 -2595093 -3176531 -3431566 -2933553 -2074498
47044 -2074498 -1568367 -1530792 -1601824 -1714987 -2046320 -2313307 -1913126 -909150 -211662 -482861
47034 -482861 -1342730 -1942498 -1944976 -1684440 -1658929 -2067312 -2630978 -2818957 -2488812 -2179179
47024 -2179179 -2339736 -2462153 -1674291 -131526 1064659 1456602 1741327 2344642 2563800
47015 2563800 1830084 878794 703853 1042955 936799 270873 -330131 -759737 -1407631
47006 -1407631 -2056607 -1979215 -1181593 -490000 -275591 -115797 91354 -237304 -1206954 -1895065
46996 -1895065 -1555651 -610830 143059 619707 1083701 1345626 1118958 756450 791339 959310
46986 959310 494951 -614176 -1429653 -1315663 -774827 -656899 -954119 -927051 -325609 112544
46976 112544 -300923 -1055705 -942662 312550 1582032 1792612 1232541 880253 987403
46967 987403 1106033 1113879 1206261 1025017 -67573 -1682265 -2465014 -1874443 -936516 -722114
46957 -722114 -1013611 -1147412 -1253614 -1715256 -2110957 -1808766 -1193154 -1190388 -1775648 -2023240
46947 -2023240 -1610441 -1238642 -1401231 -1672279 -1557982 -1288781 -1312779 -1534819 -1503065 -1037733
46937 -1037733 -376671 70229 -29549 -642276 -1237158 -1260306 -791788 -366292 -126001 342214
46927 342214 1187931 1856086 1775556 1091861 403878 101767 242298 716212 1176866 1109836
46917 1109836 400622 -358200 -528443 -255115 -224851 -666604 -1029229 -751782 -43730 275556
46907 275556 -395267 -1805647 -2930849 -2735921 -1112433 862033 1795860 1273605 200910
46898 200910 -216721 302380 1067132 1408365 1319565 1026121 393724 -759011 -1961898
46889 -1961898 -2330753 -1626973 -551454 260076 987425 1925964 2550998 2047880 601241
46880 601241 -632146 -922243 -664263 -508694 -463705 -222066 161773 396172 411233 287180
46870 287180 24460 -232148 -63726 657689 1334321 1318423 879658 926168 1772019 2728764
46860 2728764 3028458 2667033 2142313 1783064 1628295 1661765 1813458 1861769 1622562 1198617
46850 1198617 842192 587517 195193 -482477 -1172361 -1325088 -664632 411706 1109083
46841 1109083 999727 390858 -193222 -691172 -1352836 -2037771 -2165512 -1511804 -628816
46832 -628816 -179554 -167817 -181902 -144057 -335980 -759227 -982099 -767512 -478521 -612172
46822 -612172 -1132423 -1494975 -1253061 -490537 306546 736301 874928 1165900 1798809 2254329
46812 2254329 1743682 204816 -1383952 -1881400 -1045450 389773 1471408 1661976 979505
46803 979505 -77254 -760992 -600427 150124 732216 622370 -33837 -671654 -814307
46794 -814307 -369494 337388 755327 503376 -320851 -1262493 -1908235 -2118537 -2012683 -1879231
46784 -1879231 -1939328 -1989986 -1508762 -456080 277463 -204246 -1516424 -2305227 -1946212
46775 -1946212 -1226795 -1055317 -1212588 -938105 -206116 298111 202162 -203365 -508138 -535759
46765 -535759 -267201 93333 99575 -388967 -787422 -502269 24440 -313694 -1763428 -3197099
46755 -3197099 -3374643 -2245796 -772190 95715 4902 -806034 -1712346 -2097729 -1806127
46746 -1806127 -1136729 -417322 151736 312961 -82521 -636370 -678469 -197349 60105 -247928
46736 -247928 -372264 486723 1868614 2501254 1941511 1110525 1078858 1801306 2296601 1826646
46726 1826646 666667 -232952 -214687 514506 1244637 1501133 1239519 530219 -469364
46717 -469364 -1246745 -1243103 -670318 -482259 -1168335 -2059677 -2273255 -1852833 -1382541 -924231
46707 -924231 -158668 653170 784121 192518 -266611 -39559 408970 439225 217442 369571
46697 369571 1025927 1695644 1912466 1627126 1060930 472653 43119 -187807 -249572 -77007
46687 -77007 420720 1081833 1525499 1577666 1418443 1181154 727792 74350 -276737 141663
46677 141663 1030873 1542992 1248459 546188 63064 1445 222144 603160 971172 895589
46667 895589 45120 -1161817 -1666716 -837422 741203 1823430 1769472 1011759 375284
46658 375284 320421 859924 1727404 2367419 2158141 1077206 -39530 -311674 194714
46649 194714 655901 622823 557959 1134265 2297994 3224739 3124054 2025122 786139
46640 786139 251686 376623 408404 31498 -93446 669967 1763712 1941911 867057
46631 867057 -474714 -1038612 -760228 -146618 495108 1001339 1044089 443536 -438321 -1040922
46621 -1040922 -1199430 -1122267 -1013437 -1029453 -1355023 -1916043 -2170220 -1584984 -287501 1024164
46611 1024164 1723115 1600613 816918 -121562 -523391 -134220 423375 264863 -654510
46602 -654510 -1445888 -1384409 -714565 -179805 -93006 -188607 -218590 -321960 -717193 -1232730
46592 -1232730 -1346840 -733702 327644 1184243 1408182 1074790 537855 145865 150793 590397
46582 590397 1153085 1409771 1284080 1028484 678012 -20876 -908203 -1168233 -301245 1033792
46572 1033792 1775941 1833419 1994898 2557488 2843756 2281845 1269129 565893 317666
46563 317666 116920 -288400 -774087 -1145500 -1318619 -1293509 -1178755 -1135275 -1133671 -928463
46553 -928463 -437625 43908 207990 134486 115546 224965 265510 24866 -564314 -1340658
46543 -1340658 -1834559 -1540555 -557867 267179 224591 -359059 -530124 -1035 419872 -137393
46533 -137393 -1474160 -2510095 -2469481 -1635647 -920520 -877126 -1301897 -1776596 -2298721 -3045106
46523 -3045106 -3638392 -3244112 -1704644 -103222 375048 -83141 -234702 469099 1163547
46514 1163547 832395 -342894 -1339707 -1555250 -1177354 -568017 130203 801298 1247444
46505 1247444 1384558 1292379 1066510 832928 794128 955549 952825 584208 396898 1124863
46495 1124863 2464661 3111903 2380763 1194891 904772 1534640 1889888 1213226 12584
46486 12584 -814436 -1054012 -1127135 -1386862 -1760553 -1900182 -1526780 -757186 -121492 -78036
46476 -78036 -522106 -974140 -1166354 -1152797 -972408 -666755 -593549 -1146376 -2025029 -2340515
46466 -2340515 -1709182 -768669 -316605 -385927 -495976 -379782 -96075 169927 64938 -693705
46456 -693705 -1620963 -1578851 -224071 1152136 1037786 -356594 -1406495 -1136786 -114645
46447 -114645 648924 806854 586586 377488 590144 1297222 1917036 1853751 1408314 1300228
46437 1300228 1360838 711389 -646979 -1568036 -1467413 -1181182 -1551095 -2225238 -2596138
46428 -2596138 -2867839 -3223194 -2913012 -1430793 120965 231364 -875100 -1676082 -1667073
46419 -1667073 -1770448 -2439109 -2871249 -2497244 -1926129 -1788272 -1689979 -1025712 -879
46410 -879 848053 1444508 1789614 1451384 266494 -900460 -973493 -59836 705233 636253
46400 636253 164712 -21144 74535 -81182 -733794 -1449145 -1526350 -733907 449773 1407501
46390 1407501 2028384 2496585 2609364 1902892 577943 -342938 -193043 467030 631150
46381 631150 132803 -392050 -551625 -570805 -683811 -753276 -627919 -454143 -425433 -449693
46371 -449693 -219453 470028 1478460 2317128 2483048 1937761 1160975 610116 287355
46362 287355 -12661 -277068 -383433 -433780 -613363 -811910 -737004 -357606 95193 531029
46352 531029 1045029 1537505 1650359 1210517 483444 -134054 -484470 -640872 -721282 -789726
46342 -789726 -780977 -492642 136488 692416 524612 -463735 -1463542 -1524559 -660828 116198
46332 116198 3913 -628177 -803002 -298879 94748 -179272 -557896 -236516 499453 607759
46322 607759 -189118 -1079279 -1444370 -1556817 -1674595 -1375529 -440659 366456 260279 -341162
46312 -341162 -432269 112961 595204 728676 837498 927349 569613 -209324 -838172 -1143623
46302 -1143623 -1507197 -1894469 -1643750 -564309 592705 1178735 1399260 1588235 1531426
46293 1531426 1104354 868316 1294619 1906866 1908059 1268062 537462 -43976 -579453 -971981
46283 -971981 -1043307 -1000556 -1177085 -1474229 -1578160 -1495924 -1354048 -979703 -307053 118330
46273 118330 -205075 -806569 -794399 -191954 168418 43379 67097 456860 445729 -497298
46263 -497298 -1688955 -2132039 -1856417 -1693404 -2034184 -2438433 -2366517 -1824957 -1283804 -1232831
46253 -1232831 -1784815 -2531419 -2856863 -2512001 -1778050 -1024613 -330539 351926 898750
46244 898750 1068802 748252 79082 -526632 -558150 131031 1053621 1615839 1885054 2378555
46234 2378555 3052782 3097738 2007912 356200 -858505 -1234835 -1003121 -471630 112817
46225 112817 495400 673729 954050 1333920 1199191 201905 -888149 -951095 -16417 761878
46215 761878 678625 288107 409528 971764 1267147 929968 207487 -531008 -1165371 -1740824
46205 -1740824 -2230834 -2415900 -2021089 -1107115 -267837 -159087 -776645 -1452771 -1625991
46196 -1625991 -1367496 -1124569 -1252502 -1821236 -2483927 -2472360 -1255518 554711 1509362
46187 1509362 981075 57844 191559 1303623 1982637 1436337 428282 113036 651877
46178 651877 1349555 1639734 1475160 1061914 654117 462959 448018 323530 -2095 -201494
46168 -201494 -6634 339862 478068 550714 941906 1507595 1642043 1203475 845746 1171258
46158 1171258 1940470 2431759 2313706 1841625 1375316 1032780 757371 467907 138895
46149 138895 -119978 -98123 278344 773429 990640 686955 -21905 -647420 -601827 237120
46139 237120 1244848 1672305 1549811 1485314 1489069 731452 -1095513 -2894201 -3431995 -3021762
46129 -3021762 -2971519 -3599546 -3896615 -3237394 -2318619 -1986407 -2077052 -2038269 -1945332 -2143083
46119 -2143083 -2406594 -2258401 -1806981 -1514303 -1310563 -676582 412509 1280213 1406900
46110 1406900 1019295 697830 760353 1137908 1565311 1786976 1735078 1500714 1058756 279735
46100 279735 -552297 -622485 474659 1909213 2410299 1864249 1428134 1906025 2699130
46091 2699130 2739877 1933801 1163355 1160556 1869159 2782908 3448599 3594796 3127191 2223555
46081 2223555 1353105 1016435 1314740 1748338 1608734 741819 -178203 -340660 314268
46072 314268 1124648 1514024 1436615 1068425 495649 -148784 -596414 -722309 -697327 -685593
46062 -685593 -575886 -173801 489994 1178021 1661957 1851567 1819960 1710569 1502858 972891
46052 972891 113755 -564617 -567826 -178955 -175933 -746227 -1249588 -1211549 -929918 -773450
46042 -773450 -485696 291559 1243955 1712403 1508177 880126 -51129 -1240459 -2289230
46033 -2289230 -2684825 -2423004 -1886192 -1182798 -156457 977438 1599217 1408971 726774
46024 726774 762 -523525 -611985 -118160 545329 581005 -188223 -924726 -799142 -89169
46014 -89169 167981 -589677 -1953649 -3124081 -3582198 -3257640 -2425364 -1520220 -823094
46005 -823094 -263512 354868 998365 1453595 1661891 1755187 1759186 1518325 995950 428506
45995 428506 40295 -235527 -579558 -940187 -1088286 -1010715 -1016688 -1320513 -1664221 -1566407
45985 -1566407 -930082 -201424 147132 111925 -19648 -206550 -733670 -1687135 -2568362 -2662282
45975 -2662282 -1811610 -700375 -275740 -890601 -2046445 -2952718 -3259938 -3227689 -3288526
45966 -3288526 -3567890 -3795122 -3572817 -2759821 -1712208 -1106322 -1322117 -1953867 -2122075
45957 -2122075 -1382443 -199098 574848 558403 93622 -219021 -101104 185379 72443
45948 72443 -776992 -2042612 -2914869 -2795960 -1816663 -635984 195253 653211 1116665
45939 1116665 1832055 2458101 2310536 1270904 225239 147221 859538 1300125 1022338
45930 1022338 682840 827194 1034353 779721 376843 318838 312714 -150437 -779780 -1057170
45920 -1057170 -1418044 -2637632 -4193417 -4591832 -3525730 -2408866 -2283661 -2384125 -1518935
45911 -1518935 98235 1315435 1625953 1340397 695388 -232686 -1022730 -1255977 -1274407
45902 -1274407 -1786354 -2715480 -3163194 -2611538 -1547278 -731986 -372531 -241794 -214039
45893 -214039 -351523 -601673 -653086 -190732 670533 1297178 1099912 178882 -863973 -1705547
45883 -1705547 -2433946 -2902487 -2672915 -1890031 -1445364 -1716569 -1847805 -1037887 85544
45874 85544 364555 -53214 70850 1154662 2244913 2480377 2053932 1469966 823744
45865 823744 208852 -23545 106203 46096 -338095 -339370 522922 1626214 2034830 1653384
45855 1653384 990171 264574 -528929 -1021727 -751019 28133 471930 159651 -481295
45846 -481295 -808422 -650369 -309546 -168298 -363019 -713916 -996378 -1298812 -1886365 -2634554
45836 -2634554 -2962117 -2551301 -1774722 -1113165 -533905 155192 715466 796386 608296 689042
45826 689042 1089053 1304816 984987 260498 -556852 -1154767 -1189213 -582875 168712 476822
45816 476822 412819 462011 583224 207345 -693577 -1264715 -874427 6875 502478 462985
45806 462985 366909 396195 241352 -197445 -430871 99561 1311723 2393601 2404549 1098295
45796 1098295 -712532 -1752397 -1458874 -507505 -15589 -352547 -969140 -1274384 -1281748
45787 -1281748 -1284032 -1246710 -862704 -114565 552064 722344 467488 146532 -69996 -212354
45777 -212354 -147897 389801 1268172 1783744 1313227 -4902 -1439622 -2362283 -2594016
45768 -2594016 -2293610 -1795839 -1406248 -1079869 -469975 445207 1067857 915349 369274
45759 369274 162678 373084 583261 814553 1410119 2015635 1703463 387389 -838913
45750 -838913 -1183362 -1032644 -833948 -176470 1112589 1914226 1143002 -429942 -1026032
45741 -1026032 -261122 641002 938684 1220947 1911666 2335361 1921338 1224966 960939
45732 960939 895833 541118 214665 459094 906956 716290 -105576 -713503 -690340 -524344
45722 -524344 -775421 -1397505 -1979021 -2151397 -1704417 -770110 37224 94440 -521440 -1133141
45712 -1133141 -1291447 -1157206 -1079015 -1206091 -1547502 -1977215 -2097547 -1550197 -630781 -161952
45702 -161952 -476324 -852199 -293762 1307772 3067114 4030055 3953174 3245069 2426510
45693 2426510 1762735 1297666 1048958 1036102 1152345 1192375 1088472 977615 970303 1062231
45683 1062231 1359045 2037092 2823468 2906780 1859485 398012 -373727 -366891 -511630 -1353291
45673 -1353291 -2336091 -2670400 -2268269 -1500766 -603254 237223 660950 540238 368136
45664 368136 793251 1883614 3133611 4012016 4247268 3827233 3054578 2426626 2177445
45655 2177445 2107293 2046697 2147006 2406158 2311394 1470770 343966 -226857 -102010 67242
45645 67242 -219768 -790636 -1211757 -1220982 -703131 247882 1075483 1034619 29396 -1092287
45635 -1092287 -1370480 -732756 36063 230348 -71254 -267184 -58180 195750 46238
45626 46238 -336324 -397152 -73270 101025 -70761 10210 846443 1968962 2492837 2196595
45616 2196595 1491047 653560 -236923 -856776 -886702 -598904 -487348 -404448 180992 1120985
45606 1120985 1628539 1461313 1234593 1398499 1738244 2100179 2701093 3334833 3174433
45597 3174433 1952883 603277 71855 97049 -175363 -893074 -1507780 -1678305 -1499721
45588 -1499721 -1123325 -698741 -415577 -166501 455586 1415929 2004608 1831836 1446681
45579 1446681 1331911 958481 -278368 -1765392 -2401669 -2244431 -2253601 -2581357 -2354190
45570 -2354190 -1228938 8448 672102 987274 1333006 1605512 1746184 2041495 2394938
45561 2394938 2063410 717583 -809469 -1400154 -854467 208671 1179303 1737124 1752408
45552 1752408 1409141 1127063 994288 615881 -155888 -774957 -702683 -180638 131441 -24116
45542 -24116 -429152 -795037 -846931 -371126 360847 545493 -273117 -1530861 -2304403 -2359487
45532 -2359487 -2064379 -1611082 -986010 -499587 -582192 -1034282 -1156049 -762075 -469215 -727984
45522 -727984 -1073839 -736249 276376 1089283 927646 -56938 -986392 -1188261 -807560
45513 -807560 -444522 -361373 -325232 -149090 78423 410863 1141403 2131511 2543807 1816826
45503 1816826 588862 4495 255921 471238 26783 -702085 -1058113 -994422 -939666 -1124506
45493 -1124506 -1336652 -1189375 -506708 422616 972928 750246 -21664 -898587 -1827698
45484 -1827698 -2968409 -4030697 -4348305 -3695344 -2558543 -1483591 -600634 89052 475800
45475 475800 632250 885807 1316305 1580425 1511506 1462383 1691222 1814843 1345501 487091
45465 487091 -93866 -119105 124177 330451 466986 563277 570002 426140 46478 -628078
45455 -628078 -1334912 -1497240 -913118 -215943 -161276 -615026 -820745 -585322 -508873 -927865
45445 -927865 -1326424 -1120056 -457113 171584 649779 1074043 1252533 951193 446049 257256
45435 257256 387873 347195 -39776 -344346 -202718 144512 230104 4225 -164791 3622
45425 3622 415285 786609 989032 1182623 1599369 2189088 2600449 2619337 2457808 2377308
45415 2377308 2180060 1439237 193778 -975158 -1598287 -1683342 -1411711 -937548 -590560
45406 -590560 -739208 -1195455 -1252685 -633891 100399 464680 781616 1427444 1910619 1537464
45396 1537464 647047 261512 664434 1241864 1650608 2125891 2557567 2375341 1674997
45387 1674997 1360752 1617085 1290503 -388635 -2355360 -3008746 -2326374 -1569135 -1311668
45378 -1311668 -994305 -292899 320371 602099 1056546 1984748 2809036 2842687 2153737 1222611
45368 1222611 264049 -613522 -992529 -485666 643865 1629662 1934302 1587606 907727
45359 907727 169322 -458815 -846039 -859625 -437338 213686 574200 237717 -551693 -1032821
45349 -1032821 -751136 -91947 141707 -434803 -1466489 -2239371 -2272476 -1647868 -902221
45340 -902221 -578869 -798926 -1211214 -1313174 -843175 2342 668837 689998 129849 -524142
45330 -524142 -916602 -1040318 -896658 -389945 241137 417661 82006 74477 1002680 2107886
45320 2107886 2084457 877165 -203034 -185566 579457 1291748 1689215 1828050 1662395
45311 1662395 1370943 1524368 2360199 3264696 3439721 2787641 1800032 946657 533427
45302 533427 740947 1316230 1526370 909838 -94108 -631968 -372614 337156 1006274
45293 1006274 1351077 1325581 1131927 1059072 1106964 985104 619349 302845 162513 -65849
45283 -65849 -461094 -644219 -479704 -494757 -1028387 -1451350 -968249 119620 745479 535280
45273 535280 150539 123505 75250 -605436 -1751940 -2467796 -2120555 -1133428 -649166 -1237588
45263 -1237588 -2079205 -1890835 -625631 469523 680365 789708 1654724 2731624 2960764
45254 2960764 2439059 2075021 2024973 1708150 1153129 1032612 1328721 1219415 532727 156032
45244 156032 608141 1246009 1378513 1224880 1194569 1075882 636239 335459 685101 1380132
45234 1380132 1760016 1768442 1810552 1912801 1626683 689930 -597202 -1573588 -1620729 -633952
45224 -633952 700960 1414086 1253255 855708 749641 649501 67313 -805300 -1280464
45215 -1280464 -1017043 -344805 91146 -175405 -1043976 -1787854 -1659446 -690734 397377
45206 397377 1111487 1568432 1910331 1926361 1480317 796942 101764 -527906 -825598 -497059
45196 -497059 106250 241781 -36852 163101 1036902 1544854 1101204 752114 1615310 2972744
45186 2972744 3202284 2099659 936973 463653 206061 -213457 -359809 58566 535375
45177 535375 546253 263884 85172 23994 -51714 -39695 187836 487697 584097 331406
45167 331406 -164069 -467036 -21215 1190796 2359095 2659365 2196081 1686120 1457583
45158 1457583 1353777 1373178 1642942 1889832 1745875 1519014 1791156 2230273 1767281 176254
45148 176254 -1430520 -2028991 -1790267 -1393527 -1059746 -774100 -726192 -912683 -882841 -467541
45138 -467541 -234443 -624815 -1143832 -1079754 -614682 -493426 -863096 -1170370 -1082174 -829456
45128 -829456 -631594 -355318 143276 728554 1111062 1001982 214003 -1054299 -2094672
45119 -2094672 -2242245 -1598284 -881326 -518406 -240155 276608 717351 459545 -486816
45110 -486816 -1279348 -1213904 -655182 -583317 -1224603 -1650487 -1022800 218723 933638 750165
45100 750165 297960 84989 -96130 -473372 -695274 -336170 403999 875915 622519 -357080
45090 -357080 -1684621 -2721221 -2889071 -2138441 -979253 6685 501153 401656 -133585
45081 -133585 -579565 -461858 25694 270395 155573 171886 515858 723950 426587 -184594
45071 -184594 -930661 -1981163 -3171003 -3653045 -2875584 -1482428 -662212 -897171 -1759866
45062 -1759866 -2544661 -2673677 -1930795 -799271 -176918 -295357 -349646 354951 1428534
45053 1428534 2117144 2403104 2651153 2662871 1957745 700535 -455587 -1232773 -1744182
45044 -1744182 -1960045 -1909770 -2075640 -2724292 -3141417 -2491288 -1238284 -691157 -1209835
45035 -1209835 -1888807 -2019211 -1795809 -1449194 -778194 111707 560713 280739 -234582
45026 -234582 -566577 -870505 -1186265 -1074488 -404561 226137 368498 380518 728924 1261152
45016 1261152 1693028 2209844 2962338 3461879 3150475 2265955 1567737 1421789 1605457
45007 1605457 1784592 1766065 1467704 978234 493945 21834 -583021 -1185897 -1425142 -1347025
44997 -1347025 -1414785 -1624875 -1282727 -116390 1016433 1156719 495677 -51160 -105418
44988 -105418 49987 291093 809851 1543084 2111180 2345279 2398183 2387045 2353285 2443854
44978 2443854 2662989 2592885 1901332 1036969 826546 1326914 1605602 833316 -763381
44969 -763381 -2174513 -2566657 -1887189 -728758 309193 1153385 2052224 2870418 3025944
44960 3025944 2394536 1791775 1994622 2598404 2537067 1611820 756218 694895 1056435 1137728
44950 1137728 981677 1182216 1885804 2514535 2535191 2163961 2073214 2484666 2832320 2488830
44940 2488830 1626334 1023192 1091922 1514857 1846179 1940592 1653326 778340 -316727 -620339
44930 -620339 305707 1450645 1415043 114579 -1254343 -1769105 -1568183 -1156075 -719965
44921 -719965 -331671 -199116 -377970 -572193 -458702 -36863 403964 528713 268516 44132
44911 44132 422614 1316523 1924350 1845992 1727082 2156433 2479133 1697234 214714 -520539
44901 -520539 -104145 319210 -111583 -819412 -979867 -819623 -977545 -1324255 -1203252 -386247
44891 -386247 795508 1840287 2155112 1314576 -220680 -1174489 -817804 195784 829521
44882 829521 891389 678806 110372 -899674 -1729150 -1733434 -1344050 -1472073 -1991738 -1877107
44872 -1877107 -863096 85875 212744 -58200 494 332035 439759 305325 382493 895800
44862 895800 1560152 1931703 1856421 1654471 1867878 2621894 3285973 3099365 2122713 1173000
44852 1173000 777326 644277 299944 -225280 -612057 -786455 -915019 -1074508 -1168793 -1040286
44842 -1040286 -562548 171712 701871 550027 -167649 -805842 -984765 -934890 -894664 -668702
44832 -668702 -137678 267141 151618 -85333 274800 1152504 1676758 1395299 899687 980686
44822 980686 1577720 1920016 1497373 576269 -170741 -316309 37682 478953 727171 845606
44812 845606 994451 1079635 846738 333123 -2877 271657 1124552 2154496 2970534 3364325
44802 3364325 3291205 2905206 2544396 2473603 2619976 2663429 2373820 1812794 1306026 1286530
44792 1286530 1974813 3028110 3682531 3507170 2877353 2400973 2059498 1394621 454591
44783 454591 -111217 -87412 -168997 -959303 -1984397 -2280872 -1642831 -667786 214848 1042493
44773 1042493 1688919 1723000 1178980 864701 1441606 2515807 3058176 2568023 1490259
44764 1490259 573793 124991 -76083 -333238 -644277 -749130 -503433 -91313 186723
44755 186723 212912 47450 -188832 -244119 231111 1253681 2242061 2530699 2061234 1242677
44745 1242677 320611 -625518 -1222734 -1029676 -275948 292040 463712 800881 1587258
44736 1587258 2246405 2207163 1700655 1177910 526131 -462676 -1274332 -1096817 74040
44727 74040 1338345 1835567 1394760 448478 -271743 -170542 620185 1247563 1101559 511816
44717 511816 110215 -93797 -442347 -816048 -808520 -475981 -181875 138789 798036 1522222
44707 1522222 1575307 749367 -437076 -1528344 -2449026 -3065837 -3173952 -2951337 -2712872
44698 -2712872 -2240720 -1177005 -43853 149184 -550894 -991283 -703729 -555902 -1072727
44689 -1072727 -1321077 -365588 1159587 2006255 2064865 2021525 1915665 1358613 797519 1120308
44679 1120308 2005321 2007171 589072 -1043523 -1558477 -988188 -107365 784875 1730909
44670 1730909 2396614 2338380 1739890 1215268 997540 860494 737601 836972 1088118 1017129
44660 1017129 423282 -196553 -251386 103680 106691 -639732 -1667640 -2238967 -2183226 -1926374
44650 -1926374 -1861732 -1971425 -1999559 -1723741 -1067746 -204903 445518 590104 450323 517330
44640 517330 926698 1407733 1847325 2434921 3106417 3341738 2832164 1969667 1327784 976054
44630 976054 663381 374851 286980 375900 447982 398119 160712 -326390 -807643 -749948
44620 -749948 -149657 117714 -591676 -1553839 -1482470 -348126 522791 293619 -333679 -300107
44610 -300107 330458 664731 277968 -402592 -793617 -733805 -456343 -333754 -562641 -843921
44600 -843921 -540675 536497 1668948 1974962 1579084 1569429 2616866 4033828 4583304
44591 4583304 4012472 3268880 3145437 3290935 2981400 2431006 2580580 3652972 4759205
44582 4759205 5222751 5520011 6341266 7349858 7674223 7260019 6867251 6883275 6989218
44573 6989218 6972989 7004314 6984844 6483016 5586137 5021399 5055310 5031948 4501289 4078862
44563 4078862 4475842 5210148 5113552 3880072 2377248 1514866 1432723 1774488 2167791
44554 2167791 2325818 2116693 1689647 1310408 1080318 1006850 1167744 1469813 1445325 776224
44544 776224 -62981 -219543 442843 1173905 1368789 1253136 1320219 1584960 1783313 1950720
44534 1950720 2310899 2734434 2764787 2220549 1471855 1058776 1227974 1829800 2424666 2473888
44524 2473888 1738944 659410 101060 491708 1343551 1850629 1803093 1604795 1533611 1480934
44514 1480934 1471267 1850961 2614332 3011590 2372214 1070046 107801 -125800 -105041 -238232
44504 -238232 -364863 -326018 -410651 -903501 -1613905 -2142058 -2264547 -1876812 -1018663 -194342
44494 -194342 -121499 -786283 -1268808 -949295 -328007 -77856 95334 778452 1509825 1246206
44484 1246206 62140 -764425 -551155 -42692 -71222 -383955 -421020 -418226 -900866 -1632550
44474 -1632550 -1936850 -1746229 -1513301 -1267286 -585409 486110 1220833 1098011 369838
44465 369838 -393982 -853974 -872517 -431414 202480 607257 691995 728450 794563 619595
44455 619595 171785 -62480 287698 911442 1198149 891665 120980 -824974 -1442969 -1213100
44445 -1213100 -318108 295736 168638 165619 1250395 2804548 3259198 2312833 1316423
44436 1316423 1226200 1405060 1032570 559021 809811 1485656 1679694 1382577 1349152 1735298
44426 1735298 1939931 1693714 1283812 708068 -347786 -1518463 -1746090 -647293 885358
44417 885358 1837174 2150733 2285413 2374331 2299241 2082931 1749267 1195959 547534 211193
44407 211193 287337 382885 277690 256851 509630 799236 1045630 1536786 2126621 1994803
44397 1994803 851494 -311286 -447988 143927 485974 434097 563548 937084 1038385
44388 1038385 745015 387857 -41863 -782730 -1467141 -1397942 -737375 -474145 -1034306 -1782349
44378 -1782349 -2079929 -1983966 -1672044 -1056555 -325059 -63071 -390328 -622607 -209611 551780
44368 551780 1081182 1226392 1096407 757672 415627 352291 428670 245561 -18553 282948
44358 282948 1040795 1227627 492044 -29994 720810 2147371 2895407 2693189 2297208
44349 2297208 2083426 1754713 1197797 655578 177590 -257132 -237809 592092 1680789
44340 1680789 2088582 1795600 1614761 1851162 1991974 1776306 1582021 1550811 1291378 775050
44330 775050 607874 962359 1079675 403218 -507568 -825044 -621886 -535323 -750565 -999749
44320 -999749 -1204332 -1444450 -1549688 -1346528 -1106869 -1158995 -1243456 -873242 -195086 168539
44310 168539 111071 234591 969176 2061717 3046146 3667893 3700147 2951263 1765463 970449
44300 970449 881065 780444 -80735 -1286526 -1686143 -892781 296382 1026825 1291291
44291 1291291 1460794 1503699 1188962 736103 657452 1004631 1291977 1259511 1252190 1612753
44281 1612753 2066739 2078964 1635924 1266390 1277459 1339500 1028938 549135 555058 1225352
44271 1225352 1852858 1669766 923566 667447 1386345 2320098 2470652 1819167 997797
44262 997797 162176 -930419 -1840054 -1544600 -1119 1346793 1300677 413949 -23576
44253 -23576 160865 244011 220916 844906 2030545 2567823 1924502 1236658 1735001 2976127
44243 2976127 3539401 2987496 2191323 1908811 1932244 1724352 1201013 659065 390387 556238
44233 556238 1081487 1515726 1331161 549038 -181323 -297827 91276 486096 628815 639190
44223 639190 668802 680584 565111 309860 23089 -133233 -47381 227575 473975 499738
44213 499738 337097 202784 256802 433695 497102 221950 -433960 -1234370 -1731454 -1563587
44203 -1563587 -799863 58744 525454 567544 529328 645102 740518 452967 -301888 -1096288
44193 -1096288 -1230953 -334115 1171228 2329203 2573980 2285156 2186654 2354752 2255595
44184 2255595 1708546 1210089 1115882 1102917 822423 530898 519018 391961 -336476 -1230677
44174 -1230677 -1367882 -708488 -172051 -240886 -322905 216297 1148117 1918858 2429997 2772878
44164 2772878 2748132 2255143 1748904 1684116 1791707 1518149 977277 839303 1351268 2040103
44154 2040103 2406152 2428936 2331678 2256287 2248641 2243186 2023090 1470185 826844 424110 235376
44143 235376 54012 13560 451230 1227775 1676012 1393629 708929 186119 -3609 -45880
44133 -45880 -121446 -270995 -385664 -201093 443120 1224322 1521895 1140933 546250 200104
44123 200104 32408 -137853 -19836 811210 2124728 3074369 3099559 2458665 1782381 1400640
44113 1400640 1284149 1410800 1850364 2435923 2614136 1931856 713055 -48593 256111
44104 256111 1070759 1308328 681455 -85716 -412582 -580505 -947393 -1085917 -443029 492898
44094 492898 630315 -70377 -314836 721322 2057103 2099356 750230 -509791 -548309
44085 -548309 230343 816091 961246 1086967 1302750 1266711 974072 1008914 1714447 2513215
44075 2513215 2466865 1396492 117706 -446559 -140880 485947 888860 1002045 1106761
44066 1106761 1417631 1859986 2192482 2280807 2218242 2176306 2187363 2151536 2061749 2111682 2471014
44055 2471014 2981259 3212552 2904852 2287291 1849343 1802021 1877922 1698132 1217314 722146
44045 722146 510919 725069 1383639 2310017 3014871 2980470 2264673 1609171 1682560 2327170
44035 2327170 2814748 2754031 2409435 2130067 1889586 1603822 1544026 2002885 2657663 2728044
44025 2728044 1916398 862151 383293 460046 353631 -272295 -788180 -434498 567676
44016 567676 1204126 924440 227842 -158623 -206748 -315943 -502237 -459564 -277709 -389490
44006 -389490 -675519 -329504 951117 2183389 2157457 1008695 40102 40485 505464 698272
43996 698272 752252 1196773 1859575 1962660 1253030 453362 434244 1315364 2544643 3541217
43986 3541217 4033153 4003942 3609585 3092339 2590769 2071962 1544333 1197262 1158664 1249163
43976 1249163 1219289 1147883 1324686 1774958 2239766 2678048 3388364 4396298 5055929 4671331
43966 4671331 3395679 2124390 1505052 1422231 1523920 1827291 2494575 3266852 3555120
43957 3555120 3123650 2384808 1896920 1766756 1703076 1518674 1338818 1295475 1232138 893166
43947 893166 352317 48066 281987 785005 952992 523170 -136542 -485514 -421620 -290597
43937 -290597 -371187 -561670 -602432 -412186 -88081 302602 794297 1440561 2229442 2980308
43927 2980308 3264453 2655765 1310717 138695 3653 732688 1285705 1019597 408612
43918 408612 287185 744832 1172102 1183386 1008390 989982 1147596 1384160 1789880 2495636
43908 2495636 3381744 4150336 4660168 5050382 5475714 5767234 5509461 4613376 3687907
43899 3687907 3448985 3686607 3337033 1926153 426365 49485 579656 799570 427251
43890 427251 513784 1618826 2677198 2442435 1313748 768259 1346588 2157538 2307553
43881 2307553 1959196 1807831 2180097 2929186 3748519 4290676 4286995 3815099 3279425 2975563
43871 2975563 2809220 2520661 2054341 1674810 1814114 2704403 3950467 4589104 3941769
43862 3941769 2455794 1381874 1491244 2330464 2840693 2496818 1694044 1165760 1206087
43853 1206087 1476510 1508380 1301744 1307585 1837004 2692246 3431633 3748618 3514587 2821041
43843 2821041 2189441 2305657 3148804 3758194 3377187 2513147 2243179 2710588 3056969
43834 3056969 2760550 2238024 2020449 2108848 2397544 3021802 3881174 4373830 4065219 3264605
43824 3264605 2601967 2367103 2512949 2875127 3047209 2459287 1038223 -457397 -1143014
43815 -1143014 -876904 -169092 529630 1155394 1847939 2695945 3519223 3800549 3130250
43806 3130250 1868079 1018598 1242639 2289736 3509853 4461636 4836264 4387237 3382664
43797 3382664 2684422 2888877 3672637 4330143 4584389 4516984 4167605 3691955 3511012 3781576
43787 3781576 4075255 4072712 4149820 4690123 5247763 5115835 4407671 3819570 3561358 3301571
43777 3301571 3007615 3034150 3420070 3828034 4170504 4630935 5115603 5364553 5529667 5898236
43767 5898236 6106245 5479572 4225211 3426235 3665280 4435747 5113949 5696838 6275996
43758 6275996 6570743 6410478 6054269 5675638 5143884 4620330 4650287 5239461 5560651 5131566
43748 5131566 4624580 4827947 5336611 5058669 3727657 2201925 1403616 1528141 2182345
43739 2182345 2775279 2807926 2210486 1439033 1007866 973647 1020306 889392 577600 299360
43729 299360 363600 853294 1373945 1441314 1143932 1007019 1211860 1513417 1903593 2532045
43719 2532045 2842686 1861722 -144866 -1342095 -470069 1534622 2967345 3562905 4122261
43710 4122261 4670022 4501884 3797349 3655243 4386904 5065249 5013080 4546174 3923957 2793214
43700 2793214 1248352 339496 708956 1545443 1771138 1647076 2233143 3584782 4455649
43691 4455649 3850039 2192317 754616 319249 613575 887574 850937 924475 1529794
43682 1529794 2364108 2719960 2423200 1997362 1874102 1939161 1988388 2120764 2432119 2754846
43672 2754846 2967109 3167682 3310041 3112372 2631867 2472660 3033428 3926356 4511595
43663 4511595 4616560 4359001 3757465 3052314 2920696 3624366 4274948 3812988 2586067
43654 2586067 2033901 2721413 3620758 3700130 3360963 3620420 4459944 4885657 4470532 3963155
43644 3963155 4117930 4567118 4367865 3349087 2305019 1858378 1748566 1573844 1735512
43635 1735512 2959510 4990527 6513498 6647892 5953179 5528991 5580114 5471452 4931350
43626 4931350 4470947 4559400 4986785 5264486 5240213 5103301 5140432 5716209 7136169 9161945
43616 9161945 10868840 11396749 10856909 10239229 10378470 11176491 11871484 11922399 11543034
43607 11543034 11416811 11947292 12821245 13339732 13151688 12565921 12137124 12106985 12357566
43598 12357566 12746694 13225352 13626866 13622219 13072175 12289758 11731677 11459175 11123785 10522393
43588 10522393 9919777 9669222 9734924 9866117 10103751 10719117 11611287 12169896 11963011
43579 11963011 11276519 10680450 10268565 9693863 8869353 8221216 8139504 8470039 8727500
43570 8727500 8640808 8325458 8039801 7960721 8166648 8656356 9293637 9814436 10020004 9986467
43560 9986467 9967470 10011837 9819372 9165883 8348693 7875321 7728107 7392889 6781120 6605733
43550 6605733 7401200 8558839 8956117 8370336 7619451 7341842 7334579 7231312 7127932 7179963
43540 7179963 7140557 6747316 6162266 5616482 5012892 4328074 4000327 4336564 4830881 4713996
43530 4713996 4001577 3359682 3063041 2791276 2432239 2334392 2620904 2939400 3101521 3320168
43520 3320168 3578902 3479382 3070152 3067703 3684795 3938558 2923392 1273679 451860 874204
43510 874204 1679061 2197046 2609266 3046208 3089686 2611059 2273921 2623995 3303069 3774025
43500 3774025 4282953 5344214 6601169 7046974 6378909 5427188 5046736 5110322 4893693
43491 4893693 4105328 3168322 2594181 2383275 2147872 1720255 1457145 1809574 2678322
43482 2678322 3465470 3824243 4031644 4390657 4582609 4070741 3044689 2444304 2878136
43473 2878136 3880931 4505601 4420191 4098892 4024183 4090039 3958779 3724851 3830335 4324913
43463 4324913 4645091 4405967 4079333 4401545 5267149 5820223 5686159 5436681 5560757
43454 5560757 5647287 5127830 4316875 4028317 4483229 5311474 6392491 7856475 9303129
43445 9303129 9916304 9573995 9084164 8997651 8875185 8159409 7153152 6549534 6423591
43436 6423591 6320053 6109353 6174465 6802550 7799251 8672572 8946045 8448637 7569674 7024200
43426 7024200 7060860 7135887 6719140 6136613 6125089 6773479 7503499 8002161 8510722 9114733
43416 9114733 9406930 9146705 8770299 8889400 9590634 10519193 11378189 12041541 12388314
43407 12388314 12353860 12073209 11778159 11627677 11728487 12126495 12629702 12853881 12637545
43398 12637545 12210955 11759225 11087204 10045256 9062575 8780278 9161157 9374347 8680819
43389 8680819 7182763 5660386 4932050 5365032 6619078 7728451 7808080 6946468 6162449
43380 6162449 6258037 6969067 7489773 7509770 7315364 7106396 6785421 6420651 6386144 6862333
43370 6862333 7543256 7979299 7926936 7323698 6334381 5540068 5588971 6376708 6998895 6854858
43360 6854858 6378920 6260486 6385272 6161309 5557785 5049333 4670625 3984732 3108063
43351 3108063 2943965 4017795 5684081 6917685 7416032 7489656 7322778 6919581 6505483
43342 6505483 6371817 6392996 6206205 5888242 6003611 6842145 7922254 8446271 8120397
43333 8120397 7409803 7037871 7295937 7868758 8345685 8767114 9437974 10267648 10708672
43324 10708672 10517702 10191976 10332071 10870112 11323298 11569752 11858527 12136870 11941388
43315 11941388 11119338 10224888 9908999 10148107 10350973 10120711 9662955 9428925 9542112
43306 9542112 9705906 9621092 9317402 8982608 8632594 8199974 7886299 8081327 8824079 9635046
43296 9635046 10058465 10131349 10130269 10103681 9913458 9562392 9228083 9100817 9384761 10292567
43286 10292567 11814277 13620598 15358463 16878012 18083909 18916872 19701961 21105058
43278 21105058 23365292 25900429 28049858 29811008 31358938 32316559 32274944 31741120 31644238
43269 31644238 31942978 31655283 30440765 29261840 29071055 29553041 29679418 28999942 27874293
43260 27874293 26800427 26020683 25583965 25381107 25194067 24921922 24634435 24316385 23819673
43251 23819673 23184205 22699587 22488185 22299997 21840432 21019273 19838874 18449421 17384030
43242 17384030 17201695 17681432 17887407 17316409 16487890 16105123 16200405 16524954 17186973
43233 17186973 18270692 19254610 19515152 19160305 18718713 18212598 17236150 15873752 14836963
43224 14836963 14568125 14742909 14838610 14811394 15034904 15796978 16942006 17880274 18023556
43215 18023556 17386022 16634095 16374593 16589868 16929811 17187977 17174643 16562636 15401053
43206 15401053 14449557 14367269 14800931 14949457 14841326 15270483 16519969 17966716 19036530
43197 19036530 19750687 20151580 20020707 19529531 19429349 20102004 21000268 21505615 21789963
43188 21789963 22297673 22907929 23286528 23676481 24577047 25827311 26754038 27215148 27828701
43179 27828701 29064636 30698574 32351566 34023515 35765146 37270961 38299680 39297860
43171 39297860 41058963 43670871 46220777 47827811 48740748 50053876 52411304 55418934
43163 55418934 58445345 61535933 65155755 69369050 73860821 78684419 84359153 91073950
43155 91073950 98349678 105822521 113947241 123485140 134526305 146477432 158988267 172532166
43147 172532166 187942151 205474895 224357132 243239258 261166202 278084270 294243261
43140 294243261 309166886 321551074 330261467 335093349 336437144 334652849 330090937 323320637
43132 323320637 314830134 304674628 292843240 279834070 266458970 253192816 240102523
43125 240102523 227262485 214747484 202298414 189572118 176816540 164800410 153910642
43118 153910642 143742905 133760145 123952210 114637248 106012365 98199199 91414218 85730751
43110 85730751 80816935 76158453 71448057 66669323 62032490 57944796 54736397 52220265
43102 52220265 49805816 47212354 44695357 42361671 39801515 36872924 34366333 33172053
43094 33172053 33031061 32858014 32199313 31578370 31336290 30963985 29926629 28515199 27435945
43085 27435945 26958106 26810058 26572667 25922043 24873473 24020929 24075357 24884293 25413119
43076 25413119 25026458 24202011 23539021 22768444 21489836 20276521 20010196 20408607 20297923
43067 20297923 19320926 18356774 18114757 18289293 18404800 18590377 19032957 19369842 19162593
43058 19162593 18502130 17777036 17317885 17513115 18609925 20011410 20463057 19488424 18071686
43049 18071686 17388550 17473974 17753650 18196973 19042985 19883817 20069546 19816599 19934803
43040 19934803 20506098 20746754 20246328 19502090 19051101 18804602 18480366 18098656 17826132
43031 17826132 17807213 18264010 19268368 20355468 20914088 21014330 21240018 21644051 21613595
43022 21613595 20988657 20554652 21014105 22083811 23054571 23700275 24145600 24320917 24133333
43013 24133333 23887510 24034913 24692474 25744606 27122132 28605521 29694873 30177283 30602578
43004 30602578 31702435 33490131 35415986 37289287 39484871 42185078 44951358 47337878
42996 47337878 49640047 52678334 56842239 61567290 65883321 69375655 72385464 75265137
42988 75265137 77810325 79705275 81210183 82898457 84815290 86416715 87359743 87873402
42980 87873402 88309721 88819318 89521190 90460580 91332964 91854930 92512623 94225328 97032517
42971 97032517 99879812 102082542 104226390 107113743 110637485 114460017 119109618 125418090
42963 125418090 133277285 141926509 151245871 161836766 173932323 187130328 201210162
42956 201210162 216344938 232356985 248515391 264271026 279519611 293890573 306389678
42949 306389678 316103926 322857967 326910863 328366510 327158669 323388593 317479497 310094748
42941 310094748 301865289 292983820 283148897 272167088 260478659 248787566 237374908
42934 237374908 226175013 215284167 204845581 194621135 184336367 174369792 165416906
42927 165416906 157494996 150008557 142825954 136458921 130994346 125725389 120252226 115182971
42919 115182971 111192788 108004945 104921865 101884578 99335936 97342459 95505872 93607526
42911 93607526 91777502 90037102 88096500 85660974 82709268 79496692 76426080 73787526
42903 73787526 71476684 69124875 66615152 64222021 62093508 59916650 57380168 54735599
42895 54735599 52583524 51217533 50402746 49693592 48792350 47680311 46491526 45185180
42887 45185180 43446545 41206957 39143220 38109526 37991741 37741762 36788943 35764055
42879 35764055 35400011 35360165 34824524 33766017 32839615 32247617 31546493 30561746 29726572
42870 29726572 29334658 29067573 28542295 27899199 27565003 27713527 28186829 28753113 29266296
42861 29266296 29689013 30053154 30335119 30419290 30318553 30313236 30626472 31058312 31267376 31378886
42851 31378886 31927791 33123861 34548955 35755298 36818526 38007316 39168705 39884769
42843 39884769 40233675 40987050 42810678 45460125 48058774 50133813 52074843 54487139
42835 54487139 57427377 60552359 63752632 67167682 70619237 73513377 75454384 76614359
42827 76614359 77357471 77825415 78044877 78107729 78047677 77834060 77639725 77741209 77963032 77697695
42817 77697695 76833347 76203305 76595411 77655869 78384101 78520058 78809287 79935527 81766948
42808 81766948 83716711 85359767 86597723 87639346 88943307 90838631 93094486 95127919
42800 95127919 96639979 97736797 98469418 98695163 98477572 98219197 98242857 98528087 98910630
42791 98910630 99180314 98930416 97779333 95933774 94099318 92571991 90841272 88462291
42783 88462291 85939038 84195100 83326550 82444388 80814007 78674996 76710542 75055045
42775 75055045 73212439 70890596 68586625 67199842 67182596 68171062 69347615 70027890 69982925
42766 69982925 69447294 68926094 68863872 69362007 70190856 71014082 71512363 71424687 70757968 69946443
42756 69946443 69474370 69270646 68820817 67986161 67294433 67186902 67390680 67385278 67143192 67014268
42746 67014268 67184286 67667370 68530792 69663087 70638202 71365667 72563962 74898250 77889456
42737 77889456 80512502 82790111 85859140 90304527 95330522 99947059 104212133 108846759
42729 108846759 114295828 120719128 128348063 137202869 146797890 156672718 166929812 177780543
42721 177780543 188905446 199803453 210442268 220899400 230562908 238415665 244088781
42714 244088781 247945649 250041776 249721971 246569979 241179483 234512005 226886646 218152173
42706 218152173 208600244 198995666 189611602 179890589 169462489 159039822 149698889 141473940
42698 141473940 133360356 124765227 116250477 108578464 101745762 95493449 90109261 85853250
42690 85853250 81947558 77138869 71269568 65453017 60625162 56736006 53450511 50670644
42682 50670644 48035210 44882747 41313952 38475900 37057153 36186492 34686708 32875714
42674 32875714 32084262 32605832 33140284 32381105 30406198 28320744 27077410 26801321 26842946
42665 26842946 26366654 25178480 23956395 23395629 23318291 23035478 22346024 21584132 20840169
42656 20840169 19873971 18837333 18329886 18493578 18677105 18332531 17743964 17500917 17646645
42647 17646645 17736182 17472617 16948696 16424600 16099242 15968924 15808149 15484162 15300284
42638 15300284 15671905 16402466 16760427 16470437 16103597 16130591 16119178 15465701 14556492 14430347
42628 14430347 15327163 16270871 16266850 15369707 14329333 13681694 13568184 14045060 14991959
42619 14991959 15829329 15897914 15265749 14755325 14946113 15463109 15536448 14992344 14285281 13726600
42609 13726600 13227569 12839608 12950313 13622116 14180167 13932269 13077102 12455150 12534875
42600 12534875 13078557 13705306 14265674 14618542 14560647 14191116 13940558 13968194 13863432 13282984
42590 13282984 12639672 12737350 13768286 15019798 15634563 15412142 14776454 14193529 13838180
42581 13838180 13740645 13994142 14689480 15752109 16992923 18305886 19709744 21227737 22877174
42572 22877174 24763707 26979890 29380860 31730037 34188321 37343566 41456178 45875414
42564 45875414 49563102 52118819 53961352 55553590 56838668 57531870 57641802 57487733
42556 57487733 57326469 57094536 56486341 55280264 53625940 51920543 50318736 48537016
42548 48537016 46329250 43970531 41975547 40453967 39050565 37416402 35414408 33011745
42540 33011745 30428188 28309817 27188290 26683108 25779306 24072986 22238212 21034717
42532 21034717 20380122 19763052 19104067 18709192 18664989 18774705 18930016 19122004 19214321 19115121
42522 19115121 19096798 19559518 20488291 21448491 22096425 22432283 22619186 22859185 23402693
42513 23402693 24340200 25353398 25981225 26218718 26608760 27644120 29264640 31021564 32575869
42504 32575869 33962470 35487814 37407944 39602700 41579476 42932620 43758717 44434385
42496 44434385 45042635 45322039 45230656 45195028 45556327 46031947 46082867 45699346 45419414 45523590
42486 45523590 45608889 45184102 44385943 43764158 43539721 43498105 43559812 43945547 44608989 44967812
42476 44967812 44558279 43672965 42974945 42686056 42544804 42394966 42357310 42476160 42626290
42467 42626290 42763415 42881490 42770743 42273579 41753089 41757954 42154537 42196058 41638503 41138337
42457 41138337 41164309 41107828 40064571 38145066 36405658 35635726 35706771 36010899 36065885
42448 36065885 35686561 34949085 34094465 33306894 32596846 31967517 31514187 31222165 30879184
42439 30879184 30340454 29652721 28824291 27845870 27082015 27109814 27829350 28269967 27772301
42430 27772301 26872149 26417260 26294325 25819940 25042272 24723484 25135231 25757899 26214766
42421 26214766 26691774 27308099 27811112 28068837 28220428 28218305 27875975 27456558 27481159 27831223
42411 27831223 27856373 27583049 27923641 29304544 30951770 32052593 32809074 33699689 34449239
42402 34449239 34530534 34128804 33807325 33657370 33544711 33771466 34639800 35649431 35984136
42393 35984136 35655229 35435957 35829862 36810589 38348525 40342709 42150135 43102852 43560448
42384 43560448 44615825 46626331 48832202 50619436 52367740 54718832 57668682 60755485
42376 60755485 63627867 66132450 68332480 70702933 73836897 77743748 81908110 86159979
42368 86159979 90870861 96137504 101539155 107027324 113267823 120623598 128547019 136559887
42360 136559887 145102305 154693717 164931490 175174759 185628390 196752988 208043308
42353 208043308 218474950 227870987 236670248 244454753 249907238 252342535 252171913 249681155
42345 249681155 244568516 237151434 228872075 220804017 212438942 202713448 191614460 180059847
42337 180059847 168785034 158127340 148408363 139659181 131269937 122724440 114490693 107449760
42329 107449760 101609069 96116865 90460819 84953819 80067459 75922599 72400941 69146013
42321 69146013 65535863 61341073 57352986 54592493 52877166 51002094 48443716 45946729
42313 45946729 44119535 42436974 40270558 38115238 36950186 36845261 37001400 36891429
42305 36891429 36614088 36269314 35698876 34877070 34007022 33154235 32203064 31224300 30517826
42296 30517826 30229555 30213789 30301799 30456332 30659752 30875701 31104293 31281189 31190318 30705094
42286 30705094 30081022 29815857 30231116 31267407 32559714 33635452 34259468 34690612 35318639
42277 35318639 35969510 36042145 35545884 35381132 36114853 37095197 37515649 37838545 39158636
42268 39158636 41392986 43208563 43823450 43855615 44118281 44517068 44587015 44324704 43927762
42259 43927762 43323629 42525445 41966703 41916028 41917332 41314560 40071158 38703813 37706632
42250 37706632 37330375 37505005 37621334 36861927 35207271 33669963 33028733 32792063 32026093
42241 32026093 30769195 29851254 29585679 29467904 29076793 28498314 27843975 27078137 26426424
42232 26426424 26294794 26613445 26829044 26712049 26624010 26789943 26843370 26376494 25512140 24649661
42222 24649661 23996209 23590026 23450145 23451933 23331316 23019167 22720618 22533125 22306924 22023959
42212 22023959 21929142 22068122 22087665 21803751 21622420 22005720 22750779 23193597 23005717 22461163
42202 22461163 22009615 21893660 22147375 22706355 23483265 24454280 25638655 26945829 28188548
42193 28188548 29316445 30417324 31375313 31834942 31773670 31869620 32939309 35100065 37772358
42184 37772358 40413138 42945729 45541918 48348583 51509504 55176437 59307180 63506674
42176 63506674 67144729 69684034 71015745 71517984 71630613 71304564 70086083 67851499
42168 67851499 65139924 62493676 59778069 56573836 53025813 49762768 47021075 44395678
42160 44395678 41556090 38694330 36048855 33459083 30767787 28352514 26809199 26198179
42152 26198179 25953709 25542933 24944214 24406847 23942207 23239943 22121540 20981316 20566414
42143 20566414 21152282 22072149 22378328 21976445 21745009 22392690 23564484 24377870 24550000
42134 24550000 24544669 24714554 24805321 24458327 23848355 23545422 23864626 24541422 25010282 24901735
42124 24901735 24307982 23644146 23234998 23011472 22660785 22084506 21588106 21505047 21695931
42115 21695931 21589577 20782967 19492148 18299597 17521605 16992872 16479332 16064945 15952021
42106 15952021 16049312 16063793 15979324 16110501 16553941 16867725 16534436 15584976 14540471 13863142
42096 13863142 13700364 14047443 14822587 15739050 16365835 16425848 15910302 14913782 13578031
42087 13578031 12237007 11356592 11158428 11417730 11733013 11895233 11953344 12087465 12491722
42078 12491722 13182544 13792592 13754347 12892354 11700962 10829863 10405350 10079545 9636307
42069 9636307 9234468 9045830 8963537 8794489 8515432 8175463 7713088 7079003 6468668 6234654
42059 6234654 6547980 7247846 7994624 8444700 8338443 7680466 6924667 6714472 7189045
42050 7189045 7711279 7601594 7040915 6828379 7241487 7685392 7708128 7781207 8512696 9473092
42040 9473092 9560803 8460976 7034789 6179199 5953978 5992226 6091205 6098726 5875074 5793928
42030 5793928 6644515 8440713 9866276 9660983 8233647 7146243 7209291 7845834 8205798
42021 8205798 8081311 7667167 7191854 6991898 7331585 7943145 8268287 8267953 8405319 8717619
42011 8717619 8617923 7884279 7144044 6974322 7142942 7209428 7309033 7784507 8501887 9111849
42001 9111849 9619771 10133667 10384957 10094881 9556918 9281352 9283724 9275564 9316304 9657232
41991 9657232 10129601 10357941 10477816 10951343 11674442 11956033 11503237 10812791 10396534
41982 10396534 10161110 9801307 9356102 9085262 9098472 9326059 9634128 9855223 9916648 9942693
41972 9942693 9962698 9618874 8624462 7496692 7246691 8141253 9274432 9653073 9293562
41963 9293562 8934377 9039408 9469880 9879454 10034392 9867480 9532518 9338601 9391293 9349147
41953 9349147 8730046 7452200 5973946 4925688 4637029 4953611 5476285 5977338 6480515
41944 6480515 6908962 6962026 6609559 6410829 6869777 7638190 7898658 7458507 6873278 6509832
41934 6509832 6181511 5827452 5804220 6187073 6451738 6284433 6147797 6568943 7352342 7992285
41924 7992285 8420953 8815358 9052489 8918876 8544353 8091759 7343779 6193512 5256500
41915 5256500 5314436 6291971 7409461 8246096 9021935 9859895 10404602 10298522 9586876
41906 9586876 8579453 7677391 7300151 7559101 8016025 8156513 8040092 8075527 8295901
41897 8295901 8402382 8437893 8759925 9275876 9346970 8653340 7625532 6813991 6327555 6110747
41887 6110747 6263136 6760688 7259702 7498945 7589130 7660627 7569259 7233645 6946513 7028683
41877 7028683 7406420 7813982 8205172 8689412 9228199 9648879 9848638 9816791 9596783 9364542
41867 9364542 9358871 9554584 9550410 8960490 7851014 6715127 6095410 6198400 6688190 6881123
41857 6881123 6397725 5637372 5358100 5798839 6496982 6911001 6838303 6274664 5396234 4771976
41847 4771976 5036172 6109918 7183364 7661594 7670646 7467389 6952528 6103228 5322190
41838 5322190 4920770 4737252 4689264 5162701 6297138 7376653 7599174 7094965 6546385
41829 6546385 6176919 5852753 5833582 6494231 7422227 7742141 7443203 7531313 8602768 9978421
41819 9978421 10597596 10232997 9500885 9096757 9279412 9737259 9786554 9093607 8315061 8513056
41809 8513056 9738291 10761979 10579910 9686699 9346043 9908977 10423681 9875290 8408695
41800 8408695 7204911 7268323 8385635 9348367 9298585 8670759 8493810 8968567 9327206
41791 9327206 9078172 8635006 8449279 8265411 7756081 7287950 7370985 7780768 8002082 8272956
41781 8272956 9308172 10971444 12046393 11613607 10072738 8466490 7261132 6236432
41773 6236432 5298435 4860910 5319476 6419090 7351512 7482114 6886024 6122025 5608324
41764 5608324 5413109 5553411 6091330 6804930 7177075 7022715 6809921 6988804 7295259
41755 7295259 7191325 6762705 6595354 6854609 7098345 7039490 6910848 6966437 7192804 7668476
41745 7668476 8578696 9573178 9748162 8796286 7709224 7701871 8692382 9460676 9180667 8194867
41735 8194867 7295000 6846721 6787579 6981809 7270134 7477266 7670241 8227215 9375449
41726 9375449 10732876 11528992 11320312 10423113 9644388 9583852 10120495 10559303 10355022
41717 10355022 9691683 9241174 9354515 9672402 9617222 9090162 8507203 8267279 8424934
41708 8424934 8849095 9395929 9793834 9635270 8799041 7783058 7270438 7326662 7353236 6938025
41698 6938025 6375678 6111288 6066133 5944279 5880493 6166536 6508992 6322292 5803945 5884516
41688 5884516 6817649 7649984 7623838 7314098 7556707 7918220 7385210 6252833 5982157
41679 5982157 7016471 7997730 7697371 6682706 6262102 6566727 6688972 6280088 5930641
41670 5930641 6017325 6110502 5746524 5106586 4638928 4503612 4667776 5127227 5707385 5967842
41660 5967842 5684766 5269210 5365748 6067271 6782242 6917675 6522583 6176736 6331633 6862434
41650 6862434 7267480 7202635 6720170 6060187 5430410 5036656 5050589 5320506 5309084 4647297
41640 4647297 3699903 3274938 3749548 4742157 5654827 6211139 6370056 6101446 5563893
41631 5563893 5274602 5688444 6600513 7280094 7292550 6941379 6738641 6656034 6200870 5178383
41621 5178383 4038515 3347411 3205836 3424266 4008378 5045952 6189999 6739835 6386713
41612 6386713 5544482 4810887 4443969 4488624 4928905 5387743 5147566 4005474 2804671
41603 2804671 2526990 3058689 3497342 3548863 3824863 4638933 5321950 5168593 4481409 4119935
41593 4119935 4353393 4692870 4680258 4365055 4068142 4086541 4638964 5730542 6941147
41584 6941147 7593402 7339711 6552660 6023269 6213757 6823477 7174099 7036571 6905220
41575 6905220 7332682 8215594 9012827 9475157 9740799 9821689 9546903 9082570 8946788 9289407
41565 9289407 9650694 9710984 9790548 10218806 10640842 10452313 9643736 8733218 8073096 7693915
41555 7693915 7667433 8111003 8839404 9390297 9423222 8908132 8090623 7514927 7801403 8998206
41545 8998206 10354414 11129816 11393395 11583726 11607342 11033348 9976827 9016997 8300988
41536 8300988 7567142 7133008 7902014 9966170 11987622 12584443 11821545 10776726 10108467
41527 10108467 9708603 9423984 9351909 9457252 9488392 9332987 9048256 8571307 7850334 7261040
41517 7261040 7372406 8128507 8703049 8463015 7786754 7587872 8176591 8934124 9107335
41508 9107335 8621766 7979591 7578453 7403826 7353675 7536072 8010932 8386626 8020734 6749509
41498 6749509 5244160 4478384 4875235 6035323 7215063 7956965 8288623 8464215 8654327
41489 8654327 8919934 9356366 10030248 10696094 10794989 9993024 8693650 7822446 8069492
41480 8069492 9399073 11166147 12524992 12873282 12247288 11313880 10707552 10350596 9682553
41471 9682553 8525399 7323094 6447734 5744628 5048289 4731819 5243243 6258878 6821908
41462 6821908 6426824 5609296 5248247 5488130 5647145 5203026 4573938 4625757 5486491 6295176
41452 6295176 6343305 6030697 6180453 6692631 6636781 5705656 4749944 4508776 4532670 3996184
41442 3996184 3077453 2738864 3330241 4170192 4561547 4602725 4827134 5509208 6521314
41433 6521314 7518222 8080458 7956680 7319719 6579013 5904711 5218729 4661454 4637550 5234541
41423 5234541 6001503 6570528 7134733 7942937 8615875 8478667 7523070 6593982 6507059 7248568
41413 7248568 8129521 8501067 8225112 7633944 7150061 6859662 6459831 5774552 5250536
41404 5250536 5585107 6749811 7776079 7836341 7257999 7020433 7403417 7694059 7296650
41395 7296650 6574378 6285858 6571569 6890658 6764280 6239844 5726425 5629292 6042905 6614837
41385 6614837 6896392 7019846 7706798 9238021 10737967 11051549 10164427 9119311 8581512
41376 8581512 8212470 7587114 6955110 6674945 6493720 5970354 5285065 5081459 5630495
41367 5630495 6538206 7194582 7244165 6742061 6081698 5649532 5415714 5084321 4741938 4954089
41357 4954089 5977507 7318907 8439056 9432648 10489388 11122653 10697159 9528638 8659408
41348 8659408 8524142 8575255 8360672 8233882 8657966 9407461 9929505 10090235 10081131 9866326
41338 9866326 9246437 8380362 7776470 7699378 7923507 8185454 8580641 9271833 9978138 10112671
41328 10112671 9528939 8889611 9066598 10257461 11886785 13293626 14250142 14826818 15072901
41319 15072901 14945394 14348382 13211574 11767356 10681532 10455467 10633526 10144516 8647274
41310 8647274 6991068 6027795 5569952 5031212 4540897 4717304 5697750 7097920 8636437
41301 8636437 10075055 10846197 10641391 10243500 10821678 12326604 13464516 13410784 12683312
41292 12683312 12101008 11794882 11646783 11815105 12194402 12046917 10903610 9378920 8423500
41283 8423500 8119256 7850993 7380252 7062775 7110766 7243355 7099553 6578115 5768387 4891936
41273 4891936 4281237 4076061 3940025 3378902 2380492 1516055 1362211 1955061 2800704
41264 2800704 3300028 3183305 2641566 2079227 1778222 1836039 2278066 3009579 3743618 4249243
41254 4249243 4614568 4986843 5198037 5103082 5197084 6253541 8194794 9904398 10432113
41245 10432113 9908298 9033757 8223608 7618030 7398701 7556850 7672503 7398936 6940446
41236 6940446 6692529 6677204 6682840 6679386 6730885 6752575 6693028 6711167 6888824 7057747 7160253
41225 7160253 7401829 7777932 7936415 7886443 8314079 9666114 11372716 12560922 13153956
41216 13153956 13680500 14372060 15066950 15654685 15983755 15692503 14803072 14098081 14147931
41207 14147931 14329651 13663037 12298731 11226002 10745605 10265042 9466089 8572946 7494564
41198 7494564 5889193 4232915 3617160 4117157 4478883 3924840 3222409 3326364 3936341
41189 3936341 4220177 4177672 4342155 4657214 4593584 4108974 3677296 3488126 3285909 2966645
41179 2966645 2813265 3119402 3886945 4805359 5311119 4902631 3686532 2405665 1689554
41170 1689554 1517743 1580618 1755591 1957720 1987850 1917545 2169892 2748783 2858831 1942758
41160 1942758 762788 679254 1929848 3307013 3604221 2810216 1744296 1031231 728142
41151 728142 664489 809134 1267978 2003051 2663874 2856952 2568009 2082982 1505479 748560
41141 748560 79589 98124 825627 1354687 961896 171886 43443 648318 1015019 539838
41131 539838 -287320 -716676 -665157 -520039 -492571 -538487 -646942 -848373 -1009304 -857941
41121 -857941 -274442 473880 833547 446926 -383181 -900050 -747780 -432167 -664571 -1405232
41111 -1405232 -1894929 -1561443 -569771 480664 1075972 1024803 531549 119258 230358
41102 230358 817073 1451073 1766299 1606386 901868 -227411 -1294663 -1769089 -1646243
41093 -1646243 -1390550 -1278083 -1139717 -827402 -557071 -593393 -864948 -1099096 -1159868 -1099326
41083 -1099326 -1028931 -1055162 -1197179 -1298565 -1192368 -987173 -935403 -949093 -596468 198784
41073 198784 797572 599120 -25880 -79766 716922 1419413 1011513 -255917 -1119168 -767986
41063 -767986 418878 1614861 2453991 2925965 2894984 2290254 1510790 1048420 850089
41054 850089 656041 816312 1925945 3547207 4239367 3321860 1830421 1113541 1162294
41045 1162294 1092354 690110 489756 630754 697029 667379 1038970 1809089 2185969 1676342
41035 1676342 831743 540789 1042986 1931944 2693239 2944292 2537235 1747148 1095300
41026 1095300 790106 626955 549347 881266 1770638 2808331 3528617 3986294 4498845
41017 4498845 5037033 5219649 4830140 4090849 3427453 3048002 2727875 2063885 1064625
41008 1064625 345323 460633 1174296 1767830 1958274 2021762 2088916 1971753 1790337 2076299
40998 2076299 2938703 3688594 3661247 2969437 2150726 1565301 1451899 1984016 2794079 2992487
40988 2992487 2263727 1501544 1700826 2589627 3079936 2777701 2210999 1680484 791505
40979 791505 -671489 -2117940 -2751946 -2381070 -1392968 -298351 486214 740656 608062
40970 608062 497866 672531 1064754 1535295 2060801 2546706 2670752 2116214 934004
40961 934004 -386656 -1216448 -1255383 -812214 -513029 -587517 -568911 97098 1266296 2188003
40951 2188003 2341559 1933948 1571608 1652726 2085157 2417392 2249464 1664265 1201740 1232720
40941 1232720 1422507 1031810 -246497 -1892163 -2970647 -2858405 -1694865 -276344 612581
40932 612581 914071 1230361 1966634 2807353 3209811 3067148 2590915 1921900 1293303 1185995
40922 1185995 1667315 1828212 690348 -1314626 -2546787 -2037623 -519971 660404 1024043
40913 1024043 986446 991727 1164375 1493941 1846905 1928934 1597660 1111530 821330 762581
40903 762581 765200 766001 759486 616194 215451 -365752 -999295 -1677960 -2332706 -2669078 -2453323
40892 -2453323 -1835752 -1161256 -592625 -129633 196553 441826 881822 1643053 2290344
40883 2290344 2213099 1469928 847378 915494 1361162 1525698 1362385 1474694 2233426 3230559
40873 3230559 3784535 3731530 3425153 3096886 2636027 2062917 1763581 1948890 2223067 2137061
40863 2137061 1956769 2323285 3183665 3654121 3127980 2042701 1289084 1242105 1640125
40854 1640125 2045942 2085345 1555380 728685 360170 963303 2139115 2945275 2880597 2252254
40844 2252254 1679576 1530164 1752413 1932940 1551332 499795 -626527 -1030300 -536927
40835 -536927 315039 1002017 1528003 2126354 2760548 3159880 3205555 3042009 2831770 2607658
40825 2607658 2432949 2510928 2895598 3144916 2615514 1291255 8356 -497244 -512846
40816 -512846 -810850 -1378696 -1435546 -767132 -153595 -82706 72618 851401 1427575 641345
40806 641345 -1040894 -1825572 -952672 316937 441232 -552341 -1470175 -1510443 -790221
40797 -790221 201984 998243 1210872 771093 65612 -508229 -989332 -1513733 -1712056 -961442
40787 -961442 666340 2099282 2215917 1070462 -16077 253080 1753958 3029345 2912419
40778 2912419 1814228 1067085 1240890 1712156 1844064 1805602 1918435 1898405 1327914 447792
40768 447792 -119101 -173100 41656 355484 660152 600346 -91525 -1028010 -1515858 -1454434
40758 -1454434 -1332846 -1330512 -1036230 -220404 653341 955502 566732 -159919 -769754 -883840
40748 -883840 -377118 396674 835662 721732 383374 157102 40480 493 207909 718493
40738 718493 1255446 1544128 1543660 1150301 115238 -1371706 -2405849 -2200775 -1040052
40729 -1040052 21051 281265 -137708 -778143 -1346683 -1750153 -2004631 -2153385 -2067389
40720 -2067389 -1437176 -249208 851710 1053691 250178 -823720 -1290652 -787642 382197
40711 382197 1434945 1605834 835576 -144762 -691642 -926995 -1124552 -857607 422920
40702 422920 2162374 3061498 2779244 2304038 2346985 2394003 1902555 1431763 1687802 2215621
40692 2215621 2136562 1706278 1958422 2994092 3798739 3812702 3566619 3487302 3122106 2086620
40682 2086620 961832 572860 904612 1336148 1539459 1583361 1492370 1269664 1108122 1067079
40672 1067079 786015 56748 -548480 -259684 751205 1431819 1113291 199306 -468792
40663 -468792 -411692 422671 1791539 3042634 3354933 2548305 1398341 783779 751620
40654 751620 779945 688525 743809 949109 851981 263620 -295470 -221992 364361 811680
40644 811680 788372 549408 367855 132353 -283083 -565611 -250728 617049 1447249 1778396
40634 1778396 1715711 1592158 1481292 1293545 1151260 1296009 1637576 1745437 1412225 960055
40624 960055 810820 968632 1158935 1309885 1579143 1948806 2125292 1943325 1637759 1572500
40614 1572500 1842090 2241655 2475063 2278316 1529072 460647 -329373 -332575 392634 1340284
40604 1340284 2102304 2606865 2884597 2918583 2810874 2793183 2864829 2652141 1921785 1105840
40594 1105840 958576 1643371 2450176 2566599 1934085 1163220 760497 714332 814449 1040365
40584 1040365 1427026 1756565 1724168 1401651 1216078 1371218 1610454 1752037 2105155 2942565
40574 2942565 3802248 3897080 3208991 2589208 2622327 2953550 3006485 2793000 2569508 2210544
40564 2210544 1559253 1043739 1204998 1781101 2017975 1853181 1994464 2689930 3226046
40555 3226046 3008309 2461546 2354657 2742559 3123004 3251044 3217883 2997349 2527908 2136484
40545 2136484 2324799 3095490 3865840 4054944 3486848 2355472 1177947 671780 1210504
40536 1210504 2372064 3376183 3916499 4162678 4061931 3283358 1991909 1037288 976728
40527 976728 1326931 1215462 504171 -139761 -98592 659804 1750360 2641500 2787012 1930583
40517 1930583 463205 -747884 -1058337 -511903 391469 1216282 1810362 2178713 2331306
40508 2331306 2271661 2052988 1783414 1534922 1233017 695840 -134404 -1011570 -1532279 -1499649
40498 -1499649 -1077257 -545435 11370 678553 1430685 2053366 2419149 2707036 3194543
40489 3194543 3884420 4489519 4749232 4570511 3883105 2667506 1268323 380482 403652
40480 403652 933502 1192711 898921 409435 71243 -170828 -444366 -639998 -662580 -662090
40470 -662090 -682391 -317938 837059 2449719 3598173 3771404 3353941 2921056 2427506
40461 2427506 1508641 356727 -309242 -229197 39011 82567 410882 1633192 3211698
40452 3211698 3945823 3729904 3854102 5140076 6664288 7089463 6581645 6391198 6933030
40443 6933030 7464489 7591630 7830816 8375489 8514115 7933638 7584940 8313542 9355768
40434 9355768 9280379 8000474 6731125 6126048 5608429 4689878 3893031 3897489 4492959 4888605
40424 4888605 4617323 3794776 2917763 2696528 3607571 5247554 6541417 6939319 6995378
40415 6995378 7424543 8111588 8573547 8905274 9526652 10291999 10686601 10840387 11508081
40406 11508081 12860800 14006960 14065091 13215315 12319374 11850502 11543251 10858835 9502420
40397 9502420 7638118 5797432 4460730 3666619 3217104 3191178 3804987 4707400 5021096
40388 5021096 4409123 3578088 3278580 3281087 2922625 2277414 2048308 2472879 3067951 3422988
40378 3422988 3554247 3445254 2975449 2491416 2731621 3795747 4729357 4588036 3568277
40369 3568277 2699353 2677167 3311954 3894199 3857087 3296796 2982613 3542415 4540070 4828375
40359 4828375 3989672 2840330 2212641 1943623 1603313 1486575 2002504 2598916 2378186
40350 2378186 1575778 1315067 1844778 2121540 1472867 688811 863601 1863749 2644053
40341 2644053 2654988 2266095 1992860 1886294 1710089 1361266 1001765 857611 907357 866203
40331 866203 630300 559956 972581 1509562 1532377 1098517 914317 1252938 1629300 1754528
40321 1754528 2038557 2726257 3257027 3090301 2604447 2510923 2822876 3085855 3237107 3478587
40311 3478587 3581263 3127315 2332420 1884533 1995312 2280235 2541239 2943996 3346237
40302 3346237 3178343 2254732 1174772 661895 884976 1558837 2295177 2731425 2737462 2631966
40292 2631966 2814429 3126798 3042129 2545532 2250341 2452687 2663364 2400953 1915158 1700132
40282 1700132 1734257 1692645 1575858 1596069 1646066 1403916 888099 459562 283962 183611
40272 183611 63147 131321 571648 1223968 1727864 1847828 1562977 957535 174655 -524226
40262 -524226 -792391 -440556 324517 1021997 1343021 1396203 1455944 1617835 1799063 1864747
40252 1864747 1590233 797955 -146681 -290774 910815 2695031 3669642 3354534 2450528
40243 2450528 1613772 763328 -191095 -794979 -755442 -542742 -638891 -696249 -181273 512266
40233 512266 439647 -519751 -1463958 -1720294 -1576183 -1520717 -1385479 -715801 328380 965872
40223 965872 711534 -24143 -435146 -296220 -168877 -529762 -984466 -740380 250808 1151098
40213 1151098 1320111 979428 566736 55147 -603325 -908089 -404232 453008 780043
40204 780043 507989 444912 1077542 1946756 2336775 2064428 1448502 922700 771333 882529
40194 882529 783216 327090 199392 1107895 2552973 3228544 2778246 2260475 2511815 2954062
40184 2954062 2675402 1936897 1712153 2192331 2695606 2862243 3029068 3394704 3616758
40175 3616758 3421883 2975147 2425943 1660422 793993 408106 895370 1884726 2687848
40166 2687848 3099271 3414476 3823101 4164460 4269981 4243040 4306986 4542032 4873527 5270432
40156 5270432 5902970 7062539 8836805 10842741 12431810 13301726 13814894 14517047 15363746
40147 15363746 15673783 14978226 13720701 12846093 12715903 12709872 12032859 10687894 9382268
40138 9382268 8584701 8052079 7379766 6648184 6201320 5989893 5589255 4925692 4576294
40129 4576294 5070803 6112751 6823635 6705800 6076385 5551853 5435492 5745300 6521416
40120 6521416 7773668 9248574 10583460 11711125 12864151 14143866 15315693 16089634
40112 16089634 16387417 16267093 15815421 15213548 14674834 14185329 13524409 12663285 11869984
40103 11869984 11252269 10532942 9572919 8794465 8649050 8871284 8743605 8002392 7016120
40094 7016120 6131270 5342428 4606621 3949387 3168348 1965418 570729 -234283 28294
40085 28294 1010910 2032078 2665323 2692193 2066314 1311451 1422575 2790832 4517902
40076 4517902 5308610 4834383 3807189 3022077 2848587 3364729 4305637 4976815 4855933
40067 4855933 4279259 3992047 4093960 4075956 3876334 4092097 4891110 5437194 4855662 3298441
40057 3298441 1644637 538639 94296 150660 377043 419058 340720 640662 1457358 2118575
40047 2118575 1979911 1377279 1103708 1179768 954858 411676 431542 1364107 2111491 1392703
40037 1392703 -439433 -1662348 -1288587 -196838 160105 -365777 -652751 -43843 719379
40028 719379 639065 -12283 -13787 1059986 2159615 2112421 1108161 367441 665679 1705036
40018 1705036 2755845 3356481 3401025 3052376 2677057 2496440 2266181 1686135 1095897
40009 1095897 1196564 1965430 2492377 2222951 1753759 1870916 2313474 2216594 1499072 1012364
39999 1012364 1335037 2136871 2855133 3342638 3593877 3408595 2739378 2015214 1731166
39990 1731166 1911616 2215293 2330747 2066852 1383251 638028 497573 1200997 2123556
39981 2123556 2465071 2187647 1851728 1719838 1585576 1420908 1522804 1840202 1773933 1042919
39971 1042919 291678 296103 805494 777237 -211893 -1317217 -1432863 -507043 491036 762695
39961 762695 455756 210457 288331 415453 322557 119897 133177 619361 1662772 3058111
39951 3058111 4199388 4406042 3591184 2389919 1426693 719153 50453 -433121 -469796
39942 -469796 -279086 -317272 -523917 -427576 -16519 156386 -115132 -345751 -209374 -79351
39932 -79351 -283791 -421073 -4651 689697 1095567 1294002 1705581 2096223 1786341 855101
39922 855101 260029 516757 1005398 971886 606693 625270 1194867 1815254 2052891 1933688
39912 1933688 1692434 1486940 1346919 1180810 859705 436893 215564 484473 1244019
39903 1244019 2191161 2795695 2439269 898365 -1107424 -2215594 -1640828 33190 1487466
39894 1487466 1907463 1437265 740926 451072 791408 1345381 1356494 593267 -283461 -558963
39884 -558963 -387016 -406170 -730177 -972363 -1090492 -1421468 -1883525 -1976856 -1726261 -1759378
39874 -1759378 -2137277 -2011004 -994582 -30767 -82072 -645489 -574009 95300 291252 -307581
39864 -307581 -865149 -896188 -1011232 -1717258 -2461237 -2496538 -1936254 -1265885 -466643 589851
39854 589851 1391492 1332272 734845 477448 761246 1080333 1299268 1791743 2408362 2340200
39844 2340200 1441225 786762 1230913 2086184 2082931 1205906 610886 835837 1073119 460072
39834 460072 -698094 -1449924 -1383517 -746948 221833 1398670 2310199 2278654 1302573 349730
39824 349730 378832 1259576 2009052 2000778 1560398 1306617 1266089 919437 -15004 -1144051
39814 -1144051 -1823757 -1881629 -1789657 -2103511 -2797350 -3257234 -2960754 -2031969 -1012207 -245234
39804 -245234 252681 437241 197474 -236774 -312673 131463 543855 440606 198824 561217
39794 561217 1542219 2422420 2798520 3009570 3361520 3515807 3024116 2095552 1400354 1258897
39784 1258897 1357933 1235604 827314 501340 631959 1162155 1651998 1810142 1806310 1879797
39774 1879797 1867119 1467685 799729 241676 -148747 -534702 -749775 -523010 -212128 -495933
39764 -495933 -1223137 -1464238 -963906 -545631 -628633 -464337 358381 746693 -342092 -1982202
39754 -1982202 -2361061 -1330993 -384097 -283995 -324858 -94696 -348862 -1501115 -2567539
39745 -2567539 -2489011 -1575022 -792694 -372142 29776 375572 362450 167385 305535 891229
39735 891229 1582125 2088904 2302714 2123795 1572250 900770 309791 -224356 -652366 -769461
39725 -769461 -664258 -783565 -1244342 -1572861 -1461421 -1220893 -1076904 -674305 128092 608378
39715 608378 120093 -777220 -955873 -179770 830762 1472810 1599039 1095000 45914
39706 45914 -826072 -809616 -261349 -189263 -822695 -1440776 -1583217 -1488377 -1256194 -580706
39696 -580706 415319 1005076 917864 799316 1199551 1784491 1950027 1585855 868138 -46519
39686 -46519 -733322 -595898 266989 905043 707674 157087 -69957 -68146 -182427 -216149
39676 -216149 67826 230503 -181515 -696123 -576476 -111332 -225887 -912828 -1099334 -252725
39666 -252725 783004 923664 159419 -680731 -1029377 -1040927 -1176036 -1601016 -1949061 -1682353
39656 -1682353 -809257 -47620 38156 -151049 224008 1245730 2153815 2415053 2230659
39647 2230659 1888088 1297864 466483 -153302 -192419 149838 475820 655443 621577 168936
39637 168936 -594958 -1005649 -624080 -14849 -148041 -1138139 -2143522 -2479909 -2251200
39628 -2251200 -1808639 -1203721 -476437 -9973 -144349 -645307 -932456 -736911 -238789
39619 -238789 351459 1009849 1684222 2165898 2288149 2064912 1557335 804974 4813 -440905
39609 -440905 -253690 437764 1280184 2034128 2574356 2742524 2507672 2187347 2150468 2287034
39599 2287034 2140587 1645777 1316624 1481802 1733145 1517893 995528 821187 1201868
39590 1201868 1678869 1877941 1983336 2274813 2592424 2579238 2222116 1810926 1457710 985856
39580 985856 333593 -207833 -324330 -106463 54977 -29477 -164852 -160137 -168990 -414656
39570 -414656 -727797 -707514 -327470 8301 111796 288554 736148 1100146 1043844 902266
39560 902266 1195116 1701335 1705413 1158795 880748 1372783 2047611 2031419 1281834 456227
39550 456227 -9279 -196476 -260654 -181754 37184 272230 424861 447547 250020 -193212
39540 -193212 -663198 -851158 -711202 -486122 -375466 -326112 -156323 220357 669300 867517
39530 867517 583153 36149 -197881 150896 652040 718072 388006 205476 420126 773011
39520 773011 1081004 1483831 1902523 1785977 840230 -332853 -851644 -649977 -439162
39511 -439162 -631251 -863768 -719478 -373545 -198601 -144302 38068 228691 141069 -19500
39501 -19500 284549 974968 1142581 146765 -1458639 -2551847 -2755671 -2620743 -2602501 -2425689
39491 -2425689 -1620068 -266738 1042858 1754535 1691757 1099333 539617 516690 971555
39482 971555 1305644 1089324 570553 293488 430010 746503 1026283 1188457 1131204 833139
39472 833139 536473 447430 297124 -359263 -1346952 -1829115 -1257337 -5759 1171980
39463 1171980 1990594 2645625 3256022 3676774 3745771 3391461 2573735 1423933 385404
39454 385404 -122870 -204903 -329440 -595656 -496431 363154 1561682 2216752 1983930 1373870
39444 1373870 995324 793691 317029 -438707 -898813 -744356 -467114 -704719 -1245396
39435 -1245396 -1234252 -405426 440654 464095 -151966 -588032 -518182 -306730 -228007 -126743
39425 -126743 38617 -115242 -848454 -1804673 -2400561 -2462059 -2165491 -1578500 -656953 404533
39415 404533 1225555 1677887 1943639 2060092 1731240 806967 -245764 -631519 -6615
39406 -6615 1158161 2023118 2123679 1662834 1146297 833701 605802 307525 47850 50618
39396 50618 312439 604728 835044 1208071 1866276 2462828 2347525 1312105 11693
39387 11693 -596612 -259481 351559 523979 342566 378833 771152 1086672 1082718 1079713 1379456
39376 1379456 1774502 1960272 2036720 2171910 2104910 1542811 851962 728783 1226813 1720171
39366 1720171 1864189 1927720 2000569 1596841 521774 -391879 -52299 1575285 3416865
39357 3416865 4470592 4648561 4493394 4428093 4384492 4031095 3332947 2830798 3123389 4039560
39347 4039560 4713537 4667039 4378898 4452495 4681249 4482356 3921230 3629016 3822447 4042932
39337 4042932 3882962 3443802 3056669 3026391 3604308 4665417 5442529 5224672 4397243
39328 4397243 4138068 4935048 6067198 6747968 7040025 7284712 7370217 7118695 6794947
39319 6794947 6612307 6249692 5531861 5116159 5679379 6705805 6954803 6073250 4963595
39310 4963595 4500065 4594388 4694410 4580777 4390186 4281739 4340977 4562892 4827213 5093670
39300 5093670 5526896 6100332 6264386 5538654 4318735 3449618 3030185 2401240 1421067
39291 1421067 877710 1268357 1981473 2256695 2276805 2623991 3213474 3560092 3697952 3984468
39281 3984468 4253220 4061952 3680144 3893469 4717819 5189209 4710063 3810466 3172372
39272 3172372 2644723 1827122 1037733 921828 1408445 1841902 2056589 2549498 3444919
39263 3444919 3984039 3456074 2217591 1313969 1280869 1769681 2318202 3012182 4129127
39254 4129127 5397349 6028501 5570388 4457558 3493120 2914926 2270823 1231731 189989
39245 189989 -174973 284203 1096827 1798479 2291586 2588111 2612210 2471935 2605218 3295562
39235 3295562 4173935 4554173 4252468 3774041 3658555 3941362 4342716 4653550 4718566 4330653
39225 4330653 3513116 2789330 2770710 3405449 3932160 3711275 2882507 2052698 1552039 1256296
39215 1256296 1030064 1005855 1318754 1793966 2112442 2213565 2317784 2511044 2507193 1998743
39205 1998743 1165700 622491 802164 1523237 2223224 2501270 2383312 2233181 2533609
39196 2533609 3558085 4984628 5913722 5595875 4226987 2809775 2163261 2291826 2794435
39187 2794435 3546117 4661218 5971743 6962081 7294655 7131262 6817314 6454757 5959259
39178 5959259 5409067 5102004 5223791 5589780 5812681 5718552 5557599 5776497 6555855 7568119
39168 7568119 8243515 8330544 8156904 8235232 8616213 8809981 8485380 8100765 8535098 10018558
39158 10018558 11687597 12419676 11984866 11134359 10609154 10368227 9917592 9156352 8586372
39149 8586372 8663535 9204156 9665924 9927292 10432401 11379931 12087468 11633769 10077494
39140 10077494 8509062 7755057 7587288 7528605 7796347 8725632 9670184 9481730 8121838
39131 8121838 6867581 6613758 6798563 6515585 5964198 6051300 7005818 8179057 8988881
39122 8988881 9321262 9128979 8413237 7660212 7575263 8168027 8673590 8607253 8354294 8425358
39112 8425358 8655361 8574334 8184155 7872194 7784155 7762216 7792829 8054823 8489111 8674460
39102 8674460 8257131 7337485 6389103 5905566 6071678 6604601 6932046 6678806 5967240
39093 5967240 5139596 4311442 3445614 2806326 2967107 4160203 5800885 6920741 7095416
39084 7095416 6797473 6759672 7078114 7101150 6266422 4909365 4021357 4178989 4924889 5333822
39074 5333822 5009139 4315609 3769372 3508349 3372586 3210475 2973798 2711256 2617896 2926748
39064 2926748 3566310 4049458 3937316 3370760 2897413 2750928 2583210 2070554 1539563
39055 1539563 1650113 2483811 3287617 3292068 2574919 1872239 1632040 1557030 1166608 558732
39045 558732 340377 811073 1460451 1476393 711924 -59108 43028 1062966 2238759
39036 2238759 2858551 2828193 2422566 1867787 1372234 1232518 1512992 1775053 1559211 1121554
39026 1121554 1254052 2251820 3453859 4053809 4069635 4195206 4876278 5871648 6644132
39017 6644132 6834420 6313557 5116442 3572071 2361695 2140859 2950685 4080297 4671546
39008 4671546 4512756 4152012 4198353 4656003 5040487 4960841 4373592 3429629 2408233 1740117
38998 1740117 1707823 2061480 2255944 2113132 1892536 1685975 1258429 661169 430183 811395
38988 811395 1304374 1454263 1606041 2226987 2883488 2732182 1869200 1313692 1582193 2091988
38978 2091988 2194783 2051106 2114299 2371585 2541385 2536782 2289985 1539365 274007 -921354
38968 -921354 -1426641 -1282158 -981751 -841483 -921592 -1249040 -1666397 -1725269 -1213812 -582436
38958 -582436 -377794 -485090 -461433 -374381 -614587 -985278 -776570 131197 979978 1219726
38948 1219726 1209425 1432425 1615506 1224516 450807 24356 154842 261873 -147563 -788278
38938 -788278 -1002442 -595381 -20498 190370 -11968 -243425 -167955 224101 794787 1463266
38928 1463266 2063034 2225314 1758628 1061867 752331 846123 729371 77820 -637009 -840613
38918 -840613 -675445 -713968 -1071406 -1250463 -834274 1997 698974 817392 338582 -377610
38908 -377610 -950771 -1357598 -1820033 -2292558 -2410345 -2151166 -2115233 -2690120 -3285902 -3053052
38898 -3053052 -2190007 -1771428 -2226765 -2783899 -2695870 -2242627 -1983829 -1686074 -819478 226818
38888 226818 378150 -604639 -1626880 -1590542 -652315 219201 463685 201360 -368404 -1146706
38878 -1146706 -1718031 -1416768 -150005 1220033 1715466 1299428 751575 604939 609467
38869 609467 274215 -469503 -1336618 -2099493 -2634324 -2748010 -2312378 -1565310 -1015091 -962698
38859 -962698 -1239400 -1440283 -1318541 -948093 -584527 -365314 -110765 501986 1495601 2423812
38849 2423812 2762022 2407386 1735276 1286660 1441308 2140323 2763303 2565012 1521713
38840 1521713 494113 199692 287484 -78892 -923058 -1371445 -833185 375819 1658795
38831 1658795 2722171 3343064 3238716 2552706 1927763 1682619 1399778 741379 139065
38822 139065 120802 433538 520764 509253 934059 1669092 1948111 1473616 796955 477705
38812 477705 468408 480711 420843 284301 79532 5707 278873 683756 764587 546774 523396
38801 523396 787057 809829 375550 95787 535165 1355879 1904451 2233816 2868985 3788057
38791 3788057 4341673 4192632 3765289 3644194 3946906 4418462 4797478 4918186 4683017
38782 4683017 4096932 3233433 2148129 967577 46118 -190678 329830 1154329 1636879
38773 1636879 1459926 888838 558705 909914 1722651 2264198 1986963 1044968 110798
38764 110798 -189134 344933 1394961 2250221 2265503 1467362 597340 351724 695529 1088823
38754 1088823 1164357 891163 276010 -659777 -1633172 -2222597 -2316559 -2172625 -2016536 -1875532
38744 -1875532 -1807978 -1908635 -1969002 -1537137 -599707 90934 -226146 -1319033 -2085126 -1747367
38734 -1747367 -663103 198537 360523 148273 -2459 -140845 -505676 -929645 -923112 -286171
38724 -286171 692382 1603732 2121129 1887614 758998 -670651 -1344772 -905825 -140252
38715 -140252 109555 -14147 59912 256997 113436 -226137 -190552 129855 13465 -669344
38705 -669344 -1162866 -1002262 -608961 -330055 232874 1310391 2137648 1886663 948842
38696 948842 408466 509505 538504 163141 -17933 488303 1166580 1071510 -6891 -1301173
38686 -1301173 -1878592 -1513009 -791784 -436835 -570386 -764693 -768190 -822600 -1100208 -1263567
38676 -1263567 -974363 -462553 -62501 462722 1386978 2030398 1303959 -577075 -1891084
38667 -1891084 -1439801 -25497 763339 603291 381608 499765 367081 -316980 -818772
38658 -818772 -439047 367923 634926 266208 56674 435936 894124 808997 266638 -256255
38648 -256255 -575793 -722793 -501972 283088 1240957 1621794 1280844 923768 1142103 1633783
38638 1633783 1743151 1413070 1094878 908913 473405 -401354 -1345153 -1907710 -2018540
38629 -2018540 -1775376 -1120597 -22367 1224764 2164277 2559132 2442534 1935511 1226550
38620 1226550 593139 152791 -359992 -1255383 -2272869 -2625708 -1884335 -614090 195569
38611 195569 316461 560369 1711390 3437168 4577706 4427608 3387169 2318367 1648915
38602 1648915 1310679 1184664 1168074 950631 210844 -883109 -1732085 -2024682 -2128726
38593 -2128726 -2567741 -3291674 -3690174 -3264998 -2142001 -950788 -285790 -252717 -495204
38584 -495204 -674693 -843068 -1196532 -1557963 -1453291 -820332 -299445 -509608 -1225234 -1623773
38574 -1623773 -1266420 -459160 356535 1114180 1805927 2065629 1562898 708933 439634
38565 439634 1110259 1995811 2208203 1815696 1582746 1744281 1672494 933203 74203 -114873
38555 -114873 240593 279718 -394947 -1295103 -1846190 -2011015 -1910286 -1370648 -274907 969996
38545 969996 1786513 2110291 2319594 2554872 2525998 2067423 1531146 1425613 1857846 2528958
38535 2528958 3150267 3608717 3723027 3140289 1751770 140494 -727402 -444427 387851
38526 387851 852954 707918 432948 471393 820993 1320451 1848164 2121550 1788181 994749
38516 994749 469897 690068 1281556 1627434 1736291 1977442 2182661 1715200 509088
38507 509088 -586275 -786713 -253445 353620 847362 1548366 2470236 2998169 2596481
38498 2596481 1562846 770865 697376 959646 912742 493055 234182 544787 1278223 2048934
38488 2048934 2653234 3026159 3077518 2837792 2582723 2554578 2706278 2952128 3453131 4286108
38478 4286108 4972733 4804555 3687169 2301888 1354779 980308 957563 1163129 1615337
38469 1615337 2287056 3037200 3606503 3668785 3126386 2405312 2169624 2598629 3158495 3215496
38459 3215496 2694803 2053316 1807297 2152450 2815498 3218954 3055766 2739306 2931407
38450 2931407 3557295 3773853 3147441 2349811 2248693 2722214 2961764 2709358 2535114
38441 2535114 2901350 3543684 3931545 3893736 3574903 3095105 2496525 1863681 1323289 980646
38431 980646 880483 946979 1012257 1019868 1075300 1104725 654132 -598612 -2193569 -3160245
38421 -3160245 -3005500 -2110019 -1115353 -304861 304413 665908 749785 644997 453500 295129
38411 295129 450981 1114927 1879033 1942455 1117401 179487 -169196 -243955 -743296 -1538472
38401 -1538472 -1824975 -1344757 -687818 -295954 98547 768456 1379091 1537064 1479321 1676699
38391 1676699 2048836 2131345 1863003 1629998 1531243 1158636 283159 -687050 -1206468 -1221326
38381 -1221326 -994682 -592494 16874 483309 229890 -751123 -1631136 -1552880 -529101
38372 -529101 657562 1252966 1007193 105382 -963280 -1567099 -1438335 -1089750 -1304070
38363 -1304070 -2086120 -2569445 -2170535 -1335704 -769113 -423041 132307 703983 663005 49908
38353 49908 -354561 -223996 -160967 -629788 -1128095 -963080 -308442 146249 212816 196922
38343 196922 136054 -224998 -768963 -998264 -762497 -421502 -181086 189319 800988 1290473
38333 1290473 1258692 719592 -33828 -647257 -702446 10638 1019085 1467865 1187438 970645
38323 970645 1422960 2066930 2141423 1836759 1970342 2630290 2952152 2334188 1205607 356720
38313 356720 23099 -76662 -189806 -350256 -509972 -565483 -396491 -83262 32578 -322320
38303 -322320 -1027097 -1657084 -1820245 -1386899 -556297 226212 571154 470985 244970 145319
38293 145319 163984 243752 463974 899996 1438448 1846234 1957657 1777402 1507182 1446089
38283 1446089 1686579 1913671 1714929 1103005 505378 231371 232350 416337 830904 1391372
$$ [...]
##END NTUPLES=NMR SPECTRUM
##END=
