##TITLE=31Pdec_DE-161_oil_TFA
 DMSO-d6+CCl4, 64 sc
 8.7.2026
##JCAMPDX= 6.0         $$ Bruker NMR JCAMP-DX V2.0
##DATA TYPE= NMR SPECTRUM
##DATA CLASS= NTUPLES
##ORIGIN= UXNMR, Bruker Analytische Messtechnik GmbH
##OWNER= root
$$ XWIN-NMR		Version 3.5
$$ Wed Jul  8 13:14:43 2026 Russian Standard Time (UT+4h)  she@DPX200
##.OBSERVE FREQUENCY= 81.013821
##.OBSERVE NUCLEUS= ^31P
##.ACQUISITION MODE= SIMULTANEOUS
##.ACQUISITION SCHEME= undefined
##.AVERAGES= 64
##.DIGITISER RES= 17
##SPECTROMETER/DATA SYSTEM= spect
##.PULSE SEQUENCE= zgpg30
##.SOLVENT NAME= DMSO
##.SHIFT REFERENCE= (INTERNAL, DMSO, 0, 197.392)
##AUDIT TRAIL= $$ (NUMBER, WHEN, WHO, WHERE, WHAT)
$$ ##TITLE= Audit trail, XWIN-NMR		Version 3.5
$$ ##JCAMPDX= 5.01
$$ ##ORIGIN= Bruker BioSpin GmbH
$$ ##OWNER= she
$$ F:/spectra/data/she/nmr/P31/2/pdata/1/auditp.txt
$$ ##AUDIT TRAIL=  $$ (NUMBER, WHEN, WHO, WHERE, WHAT)
(   1,<2026-07-08 13:13:37.82 +0400>,<she>,<DPX200>,
      <created by zg, POWCHK disabled, PULCHK disabled
       configuration hash MD5:
       00 E9 B6 7A A2 85 ED C7 34 08 36 98 17 FE 4E 26
       data hash MD5: 32K
       11 64 75 79 7A B9 D5 67 A1 98 2A 64 79 FC 7B 98>)
(   2,<2026-07-08 13:13:39.93 +0400>,<she>,<DPX200>,
      <Start of raw data processing
       efp BC_mod = 2 LB = 1.5 FT_mod = 6 PKNL = 1 PHC0 = 1934.546 PHC1 = 162.8988 SI = 64K 
       data hash MD5: 64K
       F1 90 B5 58 DB 47 F6 A2 BC A7 2B 00 C2 A1 D4 89>)
(   3,<2026-07-08 13:14:07.03 +0400>,<she>,<DPX200>,
      <pk PHC0 = 75.65451 PHC1 = -202.6006 
       data hash MD5: 64K
       67 9C B5 59 23 BD 7E 1A 56 AC 71 51 A5 17 68 31>)
$$ ##END=
$$ 
$$ hash MD5
$$ D1 17 01 E9 88 2A 13 88 48 A7 98 20 67 3D CE 05
##$RELAX= 
##$RELAX= 
##$RELAX= 
##$RELAX= 
##$RELAX= 
##$RELAX= 
##$RELAX= 
##$RELAX= 
$$ Bruker specific parameters
$$ --------------------------
##$DU= <F:/spectra>
##$EXPNO= 2
##$NAME= <P31>
##$PROCNO= 1
##$TYPE= <nmr>
##$USER= <she>
##$AMP= (0..31)
100 100 100 100 100 100 100 100 100 100 100 100 100 100 100 100 100 100 
100 100 100 100 100 100 100 100 100 100 100 100 100 100 
##$AQSEQ= 0
##$AQ_mod= 1
##$AUNM= <au_zg>
##$AUTOPOS= <>
##$BF1= 81.014009
##$BF2= 200.13
##$BF3= 200.13
##$BF4= 200.13
##$BF5= 200.13
##$BF6= 200.13
##$BF7= 200.13
##$BF8= 200.13
##$BYTORDA= 1
##$CFDGTYP= 0
##$CFRGTYP= 5
##$CHEMSTR= <none>
##$CNST= (0..31)
1 1 145 1 1 1 1 1 1 1 1 1 1 1 1 1 1 1 1 1 1 1 1 1 1 1 1 1 1 1 1 1 
##$CPDPRG= <waltz16>
##$CPDPRG1= <>
##$CPDPRG2= <waltz16>
##$CPDPRG3= <>
##$CPDPRG4= <mlev>
##$CPDPRG5= <mlev>
##$CPDPRG6= <mlev>
##$CPDPRG7= <mlev>
##$CPDPRG8= <mlev>
##$CPDPRGB= <>
##$CPDPRGT= <>
##$D= (0..31)
0 1 0 0 0 0 0 0 0 0.06 0 0.03 2e-05 3e-06 0 0 0.0002 0 0 0 0 0 0 0 0 0 
0 0 0 0 0 0 
##$DATE= 1783502017
##$DBL= (0..7)
120 120 120 11 120 120 24 19 
##$DBP= (0..7)
150 150 150 150 150 150 150 150 
##$DBP07= 0
##$DBPNAM0= <>
##$DBPNAM1= <>
##$DBPNAM2= <>
##$DBPNAM3= <>
##$DBPNAM4= <>
##$DBPNAM5= <>
##$DBPNAM6= <>
##$DBPNAM7= <>
##$DBPOAL= (0..7)
0.5 0.5 0.5 0.5 0.5 0.5 0.5 0.5 
$$ [...]
##$SUBNAM2= <"">
##$SUBNAM3= <"">
##$SUBNAM4= <"">
##$SUBNAM5= <"">
##$SUBNAM6= <"">
##$SUBNAM7= <"">
##$SUBNAM8= <"">
##$SUBNAM9= <"">
##$SW= 400.765351723535
##$SWIBOX= (0..15)
0 1 3 0 0 0 0 0 0 0 0 0 0 0 0 0 
##$SW_h= 32467.5324675325
##$TD= 32768
##$TD0= 1
##$TE= 0
##$TE2= 300
##$TE3= 300
##$TEG= 300
##$TL= (0..7)
0 120 53 12 22 120 120 120 
##$TP= (0..7)
150 150 150 150 150 150 150 150 
##$TP07= 0
##$TPNAME0= <>
##$TPNAME1= <>
##$TPNAME2= <>
##$TPNAME3= <>
##$TPNAME4= <>
##$TPNAME5= <>
##$TPNAME6= <>
##$TPNAME7= <>
##$TPOAL= (0..7)
0.5 0.5 0.5 0.5 0.5 0.5 0.5 0.5 
##$TPOFFS= (0..7)
0 0 0 0 0 0 0 0 
##$TUNHIN= 0
##$TUNHOUT= 0
##$TUNXOUT= 0
##$USERA1= <user>
##$USERA2= <user>
##$USERA3= <user>
##$USERA4= <user>
##$USERA5= <user>
##$V9= 5
##$VALIST= <valist>
##$VCLIST= <CCCCCCCCCCCCCCC>
##$VD= 0
##$VDLIST= <DDDDDDDDDDDDDDD>
##$VPLIST= <PPPPPPPPPPPPPPP>
##$VTLIST= <TTTTTTTTTTTTTTT>
##$WBST= 1024
##$WBSW= 4
##$XGAIN= (0..3)
0 0 0 0 
##$XL= 0
##$YL= 0
##$YMAX_a= 7102
##$YMIN_a= -12368
##$ZGOPTNS= <>
##$ZL1= 120
##$ZL2= 120
##$ZL3= 120
##$ZL4= 120
##$ABSF1= 0
##$ABSF2= 0
##$ABSG= 0
##$ABSL= 0
##$ALPHA= 0
##$AQORDER= 0
##$ASSFAC= 0
##$ASSFACI= 0
##$ASSFACX= 0
##$ASSWID= 0
##$AUNMP= <proc_1d>
##$AZFE= 0.1
##$AZFW= 0.5
##$BCFW= 0
##$BC_mod= 2
##$BYTORDP= 0
##$COROFFS= 0
##$CY= -3
##$DATMOD= 1
##$DC= 0
##$DFILT= <>
##$DTYPP= 0
##$F1P= 0
##$F2P= 0
##$FCOR= 1
##$FTSIZE= 65536
##$FT_mod= 6
##$GAMMA= 0
##$GB= 0
##$INTBC= 1
##$INTSCL= 9.790993e-09
##$ISEN= 30
##$LB= 1.5
##$LEV0= 0
##$LPBIN= 0
##$MAXI= 10000
##$MC2= 0
##$MEAN= 0
##$ME_mod= 0
##$MI= 50
##$NCOEF= 0
##$NC_proc= -8
##$NLEV= 6
##$NOISF1= 182.463
##$NOISF2= 159.3651
##$NSP= 0
##$NTH_PI= 0
##$NZP= 0
##$OFFSET= 197.3918
##$PC= 4
##$PHC0= 2010.201
##$PHC1= -39.7018
##$PH_mod= 1
##$PKNL= yes
##$PPARMOD= 0
##$PSCAL= 0
##$PSIGN= 0
##$REVERSE= no
##$SF= 81.014063255964
##$SI= 65536
##$SIGF1= 159.3651
##$SIGF2= -187.1042
##$SINO= 113.3802
##$SIOLD= 16384
##$SREGLST= <1H.CDCl3>
##$SSB= 0
##$STSI= 65536
##$STSR= 0
##$SW_p= 32467.5324675325
##$SYMM= 0
##$S_DEV= 0
##$TDeff= 32768
##$TDoff= 0
##$TI= <>
##$TILT= no
##$TM1= 0
##$TM2= 0
##$TOPLEV= 0
##$USERP1= <user>
##$USERP2= <user>
##$USERP3= <user>
##$USERP4= <user>
##$USERP5= <user>
##$WDW= 1
##$XDIM= 65536
##$YMAX_p= 358033745
##$YMIN_p= -263406150
$$ End of Bruker specific parameters
$$ ---------------------------------
##NTUPLES= NMR SPECTRUM
##VAR_NAME=  FREQUENCY,     SPECTRUM/REAL,   SPECTRUM/IMAG
##SYMBOL=    X,             R,               I
##VAR_TYPE=  INDEPENDENT,   DEPENDENT,       DEPENDENT
##VAR_FORM=  AFFN,          ASDF,            ASDF
##VAR_DIM=   65536,         65536,           65536
##UNITS=     HZ,            ARBITRARY UNITS, ARBITRARY UNITS
##FACTOR=    0.49542278885378, 1,            1
##FIRST=     15991.5117654749, 0,            0
##LAST=      -16476.0207020576, 0,           0
##MIN=       -16476.0207020576, -263406150,  0
##MAX=       15991.5117654749, 358033745,    0
$$ Real data points
##PAGE= N=1
##DATA TABLE= (X++(R..R)), XYDATA
$$ [...]
$$ plain form
43655 -4296398 -5265594 -4923657 -4486626 -5520035 -6784439 -5908751 -3461144 -2545202 -4351009
43646 -4351009 -6643977 -7106630 -5965078 -4584028 -3369753 -2084007 -883937 -81526
43638 -81526 295146 157024 -681493 -1935679 -2984801 -3564467 -3535887 -2352778 2405
43629 2405 1903979 1482726 -975122 -3649707 -6047647 -9217728 -12906025 -14757553 -13282001
43620 -13282001 -9874519 -6919820 -5313872 -4593140 -3955280 -2356811 754866 3877752
43612 3877752 4339387 1918476 -75943 1212194 4553983 6513485 5658055 3233801
43604 3233801 792586 -927023 -1412158 -516382 943385 1937550 2272346 2039870 842315
43595 842315 -1261994 -2878131 -2766315 -1612200 -959147 -995581 -854089 -559091 -1059323
$$ packed form
43655d296398r69196L41937M37031j033409j264404Q75688K447607R15942j805807
43646d351009k292968m62653J141552J381050J214275J285746J200070Q02411
43638h1526L76672j38122q38517j254186j049122n79666K8580J183109K355183
43629B405J901574m21253k457848k674585k397940l170081l688297j851528J475552
43620a3282001L407482K954699J605948P20732O37860J598469L111677L122886
43612C877752M61635k420911j994419J288137L341789J959502q55430k424254
43604C233801k441215j719609m85135Q95776J459767R94165L34796k32476j197555
43595H42315k104309j616137J11816J154115O53053l6434J41492K94998n00232
$$ plain form
43586 -1059323 -2548508 -4187266 -5342947 -5806714 -4976809 -2224728 1810605 5333661
43578 5333661 6894267 6198002 3894754 1378384 184709 603732 1451102 1972506 2859051
43569 2859051 4271574 4435190 2201448 -269380 41171 2604625 4119195 3300745 1934240
43560 1934240 1077167 -568625 -3610473 -6195772 -6738004 -6132066 -5765674 -5258556 -3664304
43551 -3664304 -1295065 942226 2499041 2513697 155582 -3159829 -4143911 -1937763 136760
43542 136760 -749522 -2645163 -1960028 858056 2160240 676501 -1277117 -2034711 -2564134
43533 -2564134 -3570942 -3772058 -2501689 -1677858 -3401764 -7029370 -10064549 -10915840 -9658772
43524 -9658772 -7099370 -4292912 -2344590 -1682607 -1838214 -2351068 -3249950 -4354982 -5088094
$$ packed form
43586a059323j489185j638758j155681m63767Q29905K752081M035333L523056
43578E333661J560606o96265k303248k516370j193675M19023Q47370N21404Q86545
43569B859051J412523J63616k233742k470828L10551K563454J514570q18450j366505
43560A934240q57073j645792l041848k585299n42232O05938L66392N07118J594252
43551c664304K369239K237291J556815J4656k358115l315411r84082K206148K074523
43542A36760q86282j895641O85135K818084J302184j483739j953618p57594n29423
43533b564134j006808k01116J270369Q23831j723906l627606l035179q51291J257068
43524i658772K559402K806458J948322O61983j55607n12854q98882j105032p33112
$$ plain form
43515 -5088094 -5425282 -5877399 -5867409 -3553363 1376782 5813629 6053256 2380369 -826461
43506 -826461 41718 4084627 7582615 8373206 7513245 7019114 7191543 6716879 4788276
43497 4788276 2173629 54845 -1316545 -2125091 -1799476 420449 3613049 5120688
43489 5120688 3232301 -615658 -3128769 -2499130 85676 2160423 2639570 2563170 3451249
43480 3451249 5277037 6415405 5645938 3638169 1920689 923656 43480 -701750 -601051
43471 -601051 -82648 -962987 -3927817 -7105767 -8422106 -8301932 -8534982 -9346038 -9482709
43462 -9482709 -8774910 -8451150 -8629005 -7486986 -3884896 534400 2904817 2038330 -861016
43453 -861016 -3543516 -4176543 -2394535 243817 1404462 222025 -2097899 -4219853
$$ packed form
43515e088094l37188m52117R990K314046M930145M436847K39627l672887l206830
43506h26461Q68179M042909L497988P90591q59961m94131J72429m74664j928603
43497D788276k614647k118784j371390q08546L25615K219925L192600J507639
43489E120688j888387l847959k513111O29639K584806K074747M79147p6400Q88079
43480C451249J825788J138368p69467k007769j717480r97033q80176p45230J00699
43471f01051N18403q80339k964830l177950j316339J20174k33050q11056j36671
43462i482709P07799L23760j77855J142019L602090M419296K370417q66487k899346
43453h61016k682500o33027J782008K638352J160645j182437k319924k121954
$$ plain form
43445 -4219853 -6241051 -8642475 -10714448 -11196384 -9984528 -8186764 -6749116 -5759625
43437 -5759625 -4775364 -3240026 -1009639 1110702 2094795 2355217 3431882 5289449 5630392
43428 5630392 3387903 1083674 1241597 1858235 -1183873 -7600076 -12305337 -12184648 -9715219
43419 -9715219 -8366712 -7748179 -5779706 -3040788 -1838632 -2460565 -3240532 -3374955 -3081094
43410 -3081094 -1889187 432689 1840652 -192316 -4909597 -8877993 -10264929 -9851751
43402 -9851751 -7994961 -4032378 620063 2478842 945245 88776 2894014 6252118
43394 6252118 4961254 -797204 -5520585 -5573534 -3081253 -2038929 -3174895 -4142442 -3358382
43385 -3358382 -2013290 -2323910 -4502757 -5981280 -4155020 189965 3289916 2687797
$$ packed form
43445d219853k021198k401424k071973m81936J211856J797764J437648R89491
43437e759625R84261J535338K230387K120341R84093K60422J076665J857567L40943
43428E630392k242489k304229J57923O16638l042108o416203m705261J20689K469429
43419i715219J348507O18533J968473K738918J202156o21933p79967j34423K93861
43410c081094J191907K321876J407963k032968m717281l968396j386936M13178
43402i851751J856790L962583M652441J858779j533597q56469K805238L358104
43394F252118j290864n758458m723381n2949K492281J042324j135966r67547P84060
43385c358382J345092l10620k178847j478523J826260M344985L099951o02119
$$ plain form
43377 2687797 -247709 -2957951 -5084250 -7370300 -8728316 -7288614 -3905107 -1640945
43369 -1640945 -1462966 -1234899 276603 1216973 -73854 -2004206 -1956911 124070 2374838
43360 2374838 3950119 5355341 6801589 8041111 9034477 9198912 7097686 2775213
43352 2775213 -787758 -1020047 301950 -621872 -3740301 -5004056 -2614400 111325
43344 111325 -214910 -2196215 -2448093 -1085978 -1185466 -3648116 -5790661 -5388208 -3639561
43335 -3639561 -3080137 -4146043 -5080366 -4534176 -3144445 -2474479 -2950650 -3322995 -2346299
43326 -2346299 -552937 432505 170331 -283548 -633557 -2196231 -5273936 -7189513 -5043429
43317 -5043429 173764 4372071 5272520 4549008 4678120 5560779 5299103 3036855 -161359
$$ packed form
43377B687797k935506k710242k126299k286050j358016J439702L383507K264162
43369a640945J77979K28067J511502R40370j290827j930352M7295K080981K250768
43360B374838J575281J405222J446248J239522R93366J64435k101226m322473
43352B775213l562971k32289J321997r23822l118429j263755K389656K725725
43344A11325l26235j981305k51878J362115r9488k462650k142545M02453J748647
43335c639561N59424j065906r34323N46190J389731O69966m76171l72345R76696
43326b346299J793362R85442k62174m53879l50009j562674l077705j915577K146084
43317e043429N217193M198307R00449p23512J29112Q82659k61676k262248l198214
$$ plain form
43308 -161359 -2642425 -3508332 -2919175 -1564053 161483 2206101 3808942 3310700 287607
43299 287607 -2811007 -3046120 -794721 968325 1226607 2074323 4565924 6405448 5615718
43290 5615718 3896336 3691702 3902426 1712043 -2432518 -4986718 -4177164 -1748197 184689
43281 184689 1198896 1220175 22645 -1146567 -166464 2515843 3446345 686446 -3257427
43272 -3257427 -4683259 -3154039 -1019775 -50350 -417918 -1747033 -3177417 -3285508 -1804416
43263 -1804416 -616729 -1184236 -1819912 253005 4462256 6749451 4126077 -2291706
43255 -2291706 -8875530 -12518588 -12197056 -9519473 -8105437 -10517903 -15047400 -17011620
43247 -17011620 -13881597 -7765684 -2472979 69930 -70741 -1943127 -3459338 -2151801
$$ packed form
43308a61359k481066q65907N89157J355122J725536K044618J602841m98242l023093
43299B87607l098614k35113K251399J763046K58282Q47716K491601J839524p89730
43290E615718j719382k04634K10724k190383m144561k554200Q09554K428967J932886
43281A84689J014207K1279j197530j169212R80103K682307R30502k759899l943873
43272c257427j425832J529220K134264R69425l67568j329115j430384j08091J481092
43263a804416J187687n67507o35676K072917M209251K287195k623374o417783
43255b291706o583824l643058L21532K677583J414036k412466m529497j964220
43247a7011620L130023O115913N292705K542909j40671j872386j516211J307537
$$ plain form
43239 -2151801 1651838 3885443 1299170 -4183211 -8128442 -9480743 -10539744 -11623914
43231 -11623914 -10010165 -5368444 -2154126 -3709904 -6934364 -6571310 -3018947 -1490187
43223 -1490187 -3755667 -5353316 -2501034 2068512 3056736 42989 -2302280 -575178
43215 -575178 3693282 6776153 6884148 5059053 3582313 4116657 6355115 8097400 7407391
43206 7407391 4684932 1806325 -350579 -2207691 -3742284 -4354408 -4600130 -5999646
43198 -5999646 -8442398 -9662539 -8258047 -5525799 -3247342 -1462786 170981 654917
43190 654917 -805625 -3043681 -4839030 -7179820 -11089350 -14390132 -13818373 -9946207
43182 -9946207 -6653321 -5457800 -3830809 -167013 3009939 2885968 689947 -443976
$$ packed form
43239b151801L803639K233605k586273n482381l945231j352301j059001j084170
43231a1623914J613749M641721L214318j555778l224460L63054L552363J528760
43223a490187k265480j597649K852282M569546R88224l013747k345269J727102
43215e75178M268460L082871J07995j825095j476740N34344K238458J742285o90009
43206G407391k722459k878607k156904j857112j534593o12124k45722j399516
43198e999646k442752j220141J404492K732248K278457J784556J633767M83936
43190F54917j460542k238056j795349k340790l909530l300782N71759L872166
43182i946207L292886J195521J626991L663796L176952j23971k196021j133923
$$ plain form
43174 -443976 -66213 -52030 -854250 -1079635 -505273 -846522 -3037471 -5606051 -6323963
43165 -6323963 -4268351 -128477 4224086 6346528 4843399 943073 -2348876 -2863340
43157 -2863340 -435144 3966560 8750231 11491553 10205362 5681796 1242406 -717359
43149 -717359 -993831 -1772085 -3741666 -5963069 -7572380 -8323868 -8002983 -6638542 -5274155
43140 -5274155 -5524874 -8073125 -11988183 -15497694 -17114879 -16255767 -13333528 -9416173
43132 -9416173 -5659511 -3015860 -2218453 -3476264 -6035886 -8497934 -9766708 -9477552
43124 -9477552 -7816556 -5700448 -4890534 -6607590 -9648729 -11040962 -9210587 -5630553
43116 -5630553 -2870009 -2066506 -2818427 -4215333 -5067382 -4378067 -2677795 -1729860 -1881486
$$ packed form
43174d43976L77763J4183q02220k25385N74362l41249k190949k568580p17912
43165f323963K055612M139874M352563K122442j503129l900326l291949n14464
43157b863340K428196M401704M783671K741322j286191m523566m439390j959765
43149g17359k76472p78254j969581k221403j609311p51488L20885J364441J364387
43140e274155k50719k548251l915058l509511j617185Q59112K922239L917355
43132i416173L756662K643651P97407j257811k559622k462048j268774K89156
43124i477552J660996K116108Q09914j717056l041139j392233J830375L580034
43116e630553K760544Q03503p51921j396906q52049O89315J700272R47935j51626
$$ plain form
43107 -1881486 -1180715 1477371 3982427 3811038 1776940 509064 282415 -772994 -2958542
43098 -2958542 -4631154 -5431952 -6741305 -8575003 -9094920 -7849890 -6520569 -5694699 -4080897
43089 -4080897 -1944892 -1806722 -4019321 -5152557 -3123379 -638842 -661010 -1583871 -523630
43080 -523630 1240138 355470 -2815905 -4774265 -4152489 -2394141 -146424 2850570 5071368
43071 5071368 4908381 4588455 7447923 11277969 9963052 2915629 -2814601 -2273566 854213
43062 854213 935837 -1075024 -497858 3006472 5416645 4638046 2078359 -1082888 -4744376
43053 -4744376 -7254212 -6091589 -1843180 1689605 2142802 860271 23418 -37 320351
43044 320351 1053566 1999260 1967228 13788 -3202034 -5733935 -5732979 -2969097 352193
$$ packed form
43107a881486P00771K658086K505056j71389k034098j267876k26649j055409k185548
43098b958542j672612q00798j309353j833698n19917J245030J329321Q25870J613802
43089d080897K136005J38170k212599j133236K029178K484537k2168r22861J060241
43080e23630J763768q84668l171375j958360O21776J758348K247717K996994K220798
43071E071368j62987l19926K859468L830046j314917p047423n730230N41035L127779
43062H54213Q1624k010861N77166L504330K410173p78599k559687l161247l661488
43053d744376k509836J162623M248409L532785M53197j282531q36853k3455L20388
43044C20351P33215R45694l2032j953440l215822k531901R56K763882L321290
$$ plain form
43035 352193 1100425 -1396996 -4415616 -5536849 -5996517 -8394233 -12250538 -14494662 -13839447
43026 -13839447 -11883328 -9926131 -7556261 -4871300 -3325057 -3300727 -3134002 -1825281
43018 -1825281 -829569 -1718805 -3453222 -3388325 -292779 4383840 7626040 7145854 3655268
43009 3655268 791128 1330880 3625424 3722460 1026314 -711865 1227101 4778137 6186316
43000 6186316 4654426 2032160 -409654 -2745949 -4946231 -6593467 -7594069 -7848220
42992 -7848220 -6773285 -4277179 -1632326 -432652 -1180935 -3353070 -5847805 -6987053
42984 -6987053 -5695380 -3517730 -3610081 -6376317 -7979690 -5106840 382293 3890996
42976 3890996 3989929 3222041 3538155 3698572 1637743 -2668581 -7391073 -10493818 -10713568
$$ packed form
43035C52193P48232k497421l018620j121233m59668k397716l856305k244124O55215
43026a3839447J956119J957197K369870K684961J546243K4330J66725J308721
43018a825281R95712q89236j734417O4897L095546M676619L242200m80186l490586
43009C655268k864140N39752K294544R7036k696146j738179J938966L551036J408179
43000F186316j531890k622266k441814k336295k200282j647236j000602k54151
42992g848220J074935K496106K644853J199674p48283k172135k494735j139248
42984f987053J291673K177650r2351k766236j603373K872850N489133L508703
42976C890996R8933p67888L16114J60417k060829m306324m722492l102745k19750
$$ plain form
42967 -10713568 -8093308 -4088113 -438817 2273582 4495347 6422133 7574693 7369084
42959 7369084 5481656 2126092 -1404720 -3236014 -2811313 -1526977 -675977 70465 1033444
42950 1033444 979573 -814793 -2247543 -778614 2473798 3882615 2606179 1819400 3825336
42941 3825336 6576239 6713825 4270887 2335187 2718808 3635705 1939172 -3016701 -8188174
42932 -8188174 -9796276 -7447107 -4492277 -3864690 -4859340 -5256921 -5179324 -6504485 -9131390
42923 -9131390 -10567573 -9470369 -7165408 -5073565 -2929527 -463015 1278933 1586981
42915 1586981 1447140 1994471 2890534 3237333 2823971 1594791 -630823 -2805553 -2520331
42906 -2520331 1241308 6132601 8567138 7225697 3577901 -232063 -2999575 -4623376
$$ packed form
42967a0713568K620260M005195L649296K712399K221765J926786J152560k05609
42959G369084j887428l355564l530812j831294M24701J284336Q51000P46442R62979
42950A033444n3871j794366j432750J468929L252412J408817j276436p86779K005936
42941C825336K750903J37586k442938j935700L83621R16897j696533m955873n171473
42932h188174j608102K349169K954830O27587r94650l97581P7597j325161k626905
42923i131390j436183J097204K304961K091843K144038K466512J741948L08048
42915A586981j39841N47331Q96063L46799m13362j229180k225614k174730K85222
42906b520331L761639M891293K434537j341441l647796l809964k767512j623801
$$ plain form
42898 -4623376 -5613648 -6214388 -5875873 -4270081 -2545329 -2137020 -2509059 -2103414 -1573253
42889 -1573253 -3309270 -6976209 -8671641 -6298991 -2800544 -1549276 -1319665 772601
42881 772601 3575409 3434016 418028 -1396763 -69295 1737989 1388389 -40905 -268664
42872 -268664 605806 843220 -300292 -2129141 -3500753 -3377395 -1646200 -24986 -723902
42863 -723902 -3565056 -5901269 -6004195 -4931251 -4343652 -4257929 -4011170 -3840396 -4250506
42854 -4250506 -5074369 -6154014 -7584023 -8428104 -7088968 -4336003 -3891706 -7766173 -12597725
42845 -12597725 -13393756 -9983531 -6756649 -6327099 -6792170 -5924251 -4704522 -4703982 -4593687
42836 -4593687 -2371663 148000 -1384486 -7543140 -13050682 -12841268 -8354191 -5368944
$$ packed form
42898d623376r90272o00740L38515J605792J724752M08309l72039M05645N30161
42889a573253j736017l666939j695432K372650L498447J251268K29611K092266
42881G72601K802808j41393l015988j814791J327468J807284l49600j429294k27759
42872b68664Q74470K37414j143512j828849j371612J23358J731195J621214o98916
42863g23902k841154k336213j02926J072944N87599Q5723K46759J70774m10110
42854d250506q23863j079645j430009q44081J339136K752965M44297l874467m831552
42845a2597725p96031L410225L226882M29550m65071Q67919J219729N40J10295
42836d593687K222024K519663j532486o158654n507542K09414M487077K985247
$$ plain form
42828 -5368944 -6420196 -8240329 -7196776 -4421495 -3572439 -5358352 -7067371 -6961371
42820 -6961371 -6273633 -6304196 -6086546 -4480911 -2885016 -3799512 -7175197 -9847105 -8903172
42811 -8903172 -4888892 -1483149 -2153271 -6827676 -11702080 -12787624 -9741683 -5574099
42803 -5574099 -2769337 -1120954 306798 1081204 738986 674318 2448578 4810097 4710231
42794 4710231 1498425 -1907429 -2760585 -1741589 -1314895 -1998735 -1898130 212728 2794904
42785 2794904 3338023 1671053 311382 1098520 2544984 1953313 -237120 -382449 3256948
42776 3256948 7445005 8017491 5642976 4859701 7719541 11222934 11692159 9130504 5916134
42767 5916134 3390702 1810773 2140580 5174961 9101397 10337029 7551907 3354355
$$ packed form
42828e368944j051252j820133J043553K775281Q49056j785913j709019J06000
42820f961371O87738l0563K17650J605635J595895r14496l375685k671908R43933
42811h903172M014280L405743o70122m674405m874404j085544L045941M167584
42803e574099K804762J648383J427752P74406l42218o4668J774260K361519r9866
42794D710231l211806l405854q53156J018996M26694o83840J00605K110858K582176
42785B794904N43119j666970j359671P87138J446464n91671k190433j45329L639397
42776C256948M188057N72486k374515p83275K859840L503393M69225k561655l214370
42767E916134k525432j579929L29807L034381L926436J235632k785122m197552
$$ plain form
42759 3354355 1103140 1121916 1109180 -403012 -2321998 -2760591 -1429696 333152 1320248
42750 1320248 1459740 1259786 1006158 590443 -463013 -2781200 -6137000 -8640167 -8213009
42741 -8213009 -5422274 -3476236 -4411520 -6712497 -8189721 -9551218 -12458661 -15070525
42733 -15070525 -13206750 -6472671 242433 2841554 2487969 1949185 644924 -3181622
42725 -3181622 -7498146 -8158974 -5229676 -3533013 -6026998 -10040060 -11518988 -10078940
42717 -10078940 -7847092 -5739229 -3533996 -2114365 -2707067 -4322628 -4505787 -2821139
42709 -2821139 -1433370 -1694335 -2168129 -1150671 501853 778943 -167086 -150799 1598861
42700 1598861 3121287 2790746 2117951 3697495 7020672 8498835 6135460 2336503
$$ packed form
42759C354355k251215J8776j2736j512192j918986m38593J330895J762848R87096
42750A320248J39492j99954k53628m15715j053456k318187l355800k503167M27158
42741h213009K790735J946038r35284k300977j477224j361497k907443k611864
42733a5070525J863775O734079O715104K599121l53585n38784j304261l826546
42725c181622m316524o60828K929298J696663k493985m013062j478928J440048
42717a0078940K231848K107863K205233J419631n92702j615561j83159J684648
42709b821139J387769k60965m73794J017458J652524K77090r46029J6287J749660
42700A598861J522426l30541o72795J579544L323177J478163k363375l798957
$$ plain form
42692 2336503 813812 1938080 2878063 1804418 12215 -520010 -108850 -815745 -3612070
42683 -3612070 -7166702 -9436225 -9723516 -8830508 -7616515 -6144527 -4441044 -3287447
42675 -3287447 -3321451 -3703167 -2888730 -772170 1192581 2071212 1979794 252956 -4491420
42666 -4491420 -11096077 -15099671 -13656937 -9502642 -7318706 -7673533 -7738574 -6625764 -5860224
42657 -5860224 -5068783 -1949315 2741817 4832117 3047205 1385400 2881867 5101870
42649 5101870 4879127 3750488 4800509 7143053 7826891 6877371 6029346 4478356 792283
42640 792283 -2377282 -895458 3903150 6117760 3549058 107159 -861942 -621504 -820762
42631 -820762 -128599 2247959 3701224 2047488 -721202 -1434917 -137986 1049405 1229313
$$ packed form
42692B336503j522691J124268R39983j073645j792203n32225M11160p06895k796325
42683c612070l554632k269523k87291Q93008J213993J471988J703483J153597
42675c287447l4004l81716Q14437K116560J964751Q78631r1418j726838m744376
42666d491420o604657m003594J442734M154295K183936l54827o5041J112810P65540
42657e860224P91441L119468M691132K090300j784912j661805J496467K220003
42649E101870k22743j128639J050021K342544O83838r49520q48025j550990l686073
42640G92283l169565J481824M798608K214610k568702l441899r69101K40438j99258
42631h20762O92163K376558J453265j653736k768690p13715J296931J187391J79908
$$ plain form
42622 1229313 565930 -858000 -1700401 603467 5731874 8827622 6178239 608489
42614 608489 -2120275 -624136 1918932 3503703 5174224 7515056 9000752 8420803
42606 8420803 6366490 3963658 2061903 1379614 1516558 589377 -1994523 -3607104 -1970544
42597 -1970544 705141 652369 -1527352 -2130653 -934187 -1470114 -4260597 -5137899 -2104277
42588 -2104277 1155918 1402412 952289 2982236 5522823 4699365 1403696 -82207 1206296
42579 1206296 2098747 675437 -1650150 -3539812 -5504614 -7650121 -8837887 -9001076
42571 -9001076 -9610292 -10880528 -10950872 -8957370 -6756798 -6280324 -6913362 -6789868 -5229686
42562 -5229686 -2669363 492074 3616237 5375962 4913027 2943782 901707 -394917
$$ packed form
42622A229313o63383j423930q42401K303868N128407L095748k649383n569750
42614F08489k728764J496139K543068J584771J670521K340832J485696n79949
42606H420803k054313k402832j901755o82289J36944r27181k583900j612581J636560
42597a970544K675685n2772k179721o03301J196466n35927k790483q77302L033622
42588b104277L260195K46494m50123K029947K540587q23458l295669j485903J288503
42579A206296Q92451j423310k325587j889662j964802k145507j187766j63189
42571i001076o09216j270236p0344J993502K200572M76474o33038J23494J560182
42562e229686K560323L161437L124163J759725m62935j969245k042075j296624
$$ plain form
42554 -394917 -667349 192020 1520593 1883672 767214 -491653 -552544 -48796 -378763
42545 -378763 -1197693 -841473 889592 2123761 1459438 -423736 -2352035 -4416961 -7023640
42536 -7023640 -9263825 -9763605 -8741147 -7774850 -7545804 -7175657 -6082990 -5109055 -5011840
42527 -5011840 -4951455 -3635511 -1319556 557478 1372800 1716239 2011465 2194772 2865321
42518 2865321 5055133 8091923 9232732 6814303 2783996 517552 680768 946512
42510 946512 -392975 -2449041 -3780235 -4558352 -5564442 -6399077 -6259688 -5730572 -6055006
42501 -6055006 -6810002 -6102462 -3542549 -1368306 -1452449 -2369448 -1155103 2379890 4931229
42492 4931229 3790121 169519 -2603151 -3203437 -3199155 -4232018 -5860971 -6527389 -5463668
$$ packed form
42554c94917k72432Q59369J328573L63079j116458j258867o0891N03748l29967
42545c78763q18930L56220J731065J234169o64323j883174j928299k064926k606679
42536g023640k240185m99780J022458R66297K29046L70147J092667R73935R7215
42527e011840O0385J315944K315955J877034Q15322L43439K95226J83307O70549
42518B865321K189812L036790J140809k418429m030307k266444J63216K65744
42510I46512j339487k056066j331194p78117j006090q34635J39389N29116l24434
42501f055006p54996P07540K559913K174243q4143r16999J214345L534993K551339
42492D931229j141108l620602k772670o00286M282j032863j628953o66418J063721
$$ plain form
42483 -5463668 -2997668 158448 3078241 4652631 4467488 3580703 3604282 4819353 5793964
42474 5793964 5185126 3483800 2470680 3045897 4115449 3895846 2018010 -128608 -1040778
42465 -1040778 -422536 1336192 4121428 7655071 10618195 11529017 10661192 9942124 10477658
42456 10477658 11213906 10751590 9437876 8430413 7342114 4490981 -252666 -4243790
42448 -4243790 -4604595 -1434202 2319682 4017719 3664681 2996889 2956372 2832971 1830179
42439 1830179 480602 -295616 -978973 -2973837 -6164237 -8283724 -7548284 -4881782 -2336301
42430 -2336301 -124566 3007624 6566214 7531563 3936179 -1954130 -5540649 -4746401
42422 -4746401 -1808435 -99685 -240323 -122177 1715713 3889502 3902900 1527282 -568744
$$ packed form
42483e463668K466000L156116K919793J574390j85143q86785K3579J215071R74611
42474E793964o08838j701326j013120N75217J069552k19603j877836k146618r12170
42465a040778O18242J758728K785236L533643K963124R10822q67825p19068N35534
42456A0477658P36248m62316j313714j007463j088299k851133m743647l991124
42448d243790l60805L170393L753884J698037l53038o67792m0517j23401j002792
42439A830179j349577p76218o83357j994864l190400k119487P35440K666502K545481
42430b336301K211735L132190L558590R65349l595384n890309l586519P94248
42422d746401K937966J708750j40638J18146J837890K173789J3398k375618k096026
$$ plain form
42413 -568744 127141 3074161 5588852 6127257 5444171 4460982 2563634 -835384 -4098029
42404 -4098029 -4704753 -2960427 -2444972 -5555503 -9932608 -11225946 -8883449 -6892558
42396 -6892558 -8299725 -11269458 -12069115 -10163526 -8084412 -7296425 -6929494 -6451372 -6701657
42387 -6701657 -7472780 -6699571 -3619165 -662310 -304731 -1700768 -2530695 -2674300 -3446112
42378 -3446112 -4243918 -3050214 -55371 2245349 2885413 3376337 4075962 2749983 -1608636
42369 -1608636 -6282193 -8372642 -8582508 -8949056 -8944016 -7139762 -5235595 -6298145 -9234203
42360 -9234203 -9259591 -4880517 -516471 -154853 -1758127 -952799 2229731 3998577 2860404
42351 2860404 1098581 316333 -726320 -2805991 -3974362 -2549625 -221699 -6415
$$ packed form
42413e68744O95885K947020K514691N38405o83086r83189j897348l399018l262645
42404d098029o06724J744326N15455l110531m377105j293338K342497J990891
42396f892558j407167k969733p99657J905589K079114P87987L66931M78122k50285
42387f701657p71123P73209L080406K956855L57579j396037q29927j43605p71812
42378c446112p97806J193704K994843K300720O40064M90924O99625j325979m358619
42369a608636m673557k090449k09866l66548N040J804254J904167j062550k936058
42360i234203k5388M379074M364046L61618j603274Q05328L182530J768846j138173
42351B860404j761823p82248j042653k079671j168371J424737K327926K15284
$$ plain form
42343 -6415 -2319850 -4928920 -5927220 -5110565 -3187294 -1403708 -1501393 -4255661 -8032008
42334 -8032008 -10139917 -9587711 -7395153 -4617666 -1620955 945690 2336708 3060554
42326 3060554 4232690 5221255 3922675 208126 -2865481 -2708384 -558622 452281
42318 452281 -565843 -1966700 -2744823 -3866831 -6101356 -8072019 -7436831 -3686155 691584
42309 691584 2159159 -288517 -3635834 -3917113 -921678 1522949 520496 -2287282
42301 -2287282 -3295024 -1571193 876670 2325019 2669259 2117845 675599 -1174300
42293 -1174300 -2889323 -4529584 -5371330 -2954601 3688937 10376921 10914132 4626274
42285 4626274 -2487535 -5349858 -5255792 -5794189 -6708995 -5283386 -1770550 513472 -49114
$$ packed form
42343f415k313435k609070r98300Q16655J923271J783586r7685k754268l776347
42334h032008k107909N52206K192558K777487K996711K566645J391018P23846
42326C060554J172136R88565j298580l714549l073607J57097K149762J010903
42318D52281j018124j400857p78123j122008k234525j970663O35188L750676M377739
42309F91584J467575k447676l347317k81279K995435K444627j002453k807778
42301b287282j007742J723831K447863J448349L44240n51414j442246j849899
42293a174300j715023j640261q41746K416729O643538O687984N37211o287858
42285D626274p113809k862323R4066n38397r14806J425609L512836K284022n62586
$$ plain form
42276 -49114 -1881729 -3459773 -5023328 -6608439 -7113008 -6251541 -5229431 -4460401 -2568740
42267 -2568740 1193046 5277205 7859884 8952840 9099935 7550851 3727604 -474167
42259 -474167 -2060771 -404445 2442838 4688117 6114240 6436274 4750556 1734805
42251 1734805 423789 2837584 6766161 7859225 4680807 -21133 -3123211 -4377553
42243 -4377553 -5138974 -5472511 -4187450 -1302051 1098878 1039382 -946339 -2146761 -327245
42234 -327245 4183886 8990607 11830471 11979227 9851361 6283668 2708215 939124
42226 939124 1425495 2178332 992320 -1359469 -1890082 420025 3260951 4642475 5702792
42217 5702792 8165452 10847143 11178732 9210962 7503017 7368990 7763522 8022413 9198087
$$ packed form
42276d9114j832615j578044j563555j585111n04569Q61467J022110P69030J891661
42267b568740L761786M084159K582679J092956J47095j549084l823247m201771
42259d74167j586604J656326K847283K245279J426123L22034j685718l015751
42251A734805j311016K413795L928577J093064l178418m701940l102078j254342
42243d377553p61421l33537J285061K885399K400929n9496j985721j200422J819516
42234c27245M511131M806721K839864J48756k127866l567693l575453j769091
42226I39124M86371P52837j186012k351789n30613K310107K840926J381524J060317
42217E702792K462660K681691L31589j967770j707945j34027L94532K58891J175674
$$ plain form
42208 9198087 11827303 14282682 14424732 11778735 7631685 4199611 3751525 6706080
42200 6706080 10195137 10600180 8275518 7446887 10077537 12254535 9060729 1378009
42192 1378009 -5070886 -6772199 -5568970 -4607987 -4066593 -2418780 -105267 269922 -2753690
42183 -2753690 -7482366 -10911250 -11823742 -11295551 -10470174 -9055784 -6578750 -4019469 -2818727
42174 -2818727 -2676375 -1887015 64819 1733225 1840554 711885 -883334 -2757249 -4396168
42165 -4396168 -4580072 -3104140 -1719070 -2139252 -3975933 -5579984 -5912685 -4691618 -2035785
42156 -2035785 748482 1372806 -726595 -2838113 -1858425 2006026 6017890 8472283
42148 8472283 9502834 9082546 6746275 3433126 1333295 1178805 1378642 688713 365014
$$ packed form
42208I198087K629216K455379J42050k645997m147050l432074m48086K954555
42200F706080L489057M05043k324662q28631K630650K176998l193806p682720
42192A378009o448895j701313J203229R60983N41394J647813K313513L75189l023612
42183b753690m728676l428884r12492N28191Q25377J414390K477034K559281J200742
42174b818727J42352P89360J951834J668406J07329j128669j595219j873915j638919
42165d396168j83904J475932J385070m20182j836681j604051l32701J221067K655833
42156b035785K784267O24324k099401k111518R79688L864451M011864K454393
42148H472283J030551m20288k336271l313149k099831j54490J99837o89929l23699
$$ plain form
42139 365014 2477992 6684877 9758575 8643114 3789864 -971563 -2321054 -813127
42131 -813127 544840 492512 327559 553181 -414820 -3005958 -4917154 -4971404 -5780662
42122 -5780662 -9424948 -12830712 -11540109 -6678865 -3689432 -4617020 -6206604 -5909503
42114 -5909503 -5146658 -5445255 -5655294 -4913172 -4662245 -5499543 -5225699 -2407945 921755
42105 921755 2457695 2806737 3075447 2115947 -739928 -2613282 -441014 3955265 5660272
42096 5660272 2962849 -949128 -2165621 396177 5038256 8729223 9152785 7199798
42088 7199798 6404098 8023921 8391719 3918118 -2874146 -5932972 -3437842 830661
42080 830661 3476153 4624578 4685861 2480247 -1606860 -4285881 -3632726 -1960519 -1977048
$$ packed form
42139C65014K112978M206885L073698j115461m853250m761427j349491J507927
42131h13127J357967n2328j64953K25622r68001k591138j911196n4250q09258
42122e780662l644286l405764J290603M861244K989433r27588j589584K97101
42114e909503P62845k98597k10039P42122K50927q37298K73844K817754L329700
42105I21755J535940L49042K68710r59500k855875j873354K172268M396279J705007
42096E660272k697423l911977j216493K561798M642079L690967M23562j952987
42088G199798p95700J619823L67798m473601o792264l058826K495130M268503
42080H30661K645492J148425O1283k205614m087107k679021O53155J672207j6529
$$ plain form
42071 -1977048 -2483308 -794108 2297485 3305142 1322861 -396219 1335078 5724465
42063 5724465 9064878 8690193 5343598 2155867 1608625 3421459 5486433 6617191
42055 6617191 7545586 9097646 10566745 10629815 9015110 6438077 3586622 1003905 -681838
42046 -681838 -1360502 -1785394 -2391257 -2195043 79979 3927092 7055485 7630792 6003665
42037 6003665 4189079 3945840 5175288 5923417 4313449 759463 -2306512 -3287682 -3139671
42028 -3139671 -3487176 -4057848 -3503621 -2273689 -2749868 -6088414 -10403829 -12887139 -12746767
42019 -12746767 -11318905 -10120710 -9629493 -9348561 -8233295 -5488918 -1672473 1415012
42011 1415012 2586368 2476543 2157766 1316714 -924369 -3873716 -5587323 -5344895 -4252604
$$ packed form
42071a977048n06260J689200L091593J007657j982281j719080J731297M389387
42063E724465L340413l74685l346595l187731n47242J812834K064974J130758
42055F617191R28395J552060J469099O3070j614705k577033k851455k582717j685743
42046f81838o78664m24892o05863J96214K275022L847113L128393N75307j627127
42037F003665j814586k43239J229448P48129j609968l553986l065975r81170J48011
42028c139671l47505n70672N54227J229932m76179l338546m315415k483310J40372
42019a2746767J427862J198195M91217K80932J115266K744377L816445L087485
42011A415012J171356j09825l18777q41052k241083k949347j713607K42428J092291
$$ plain form
42002 -4252604 -3181936 -1882967 -750150 -1454656 -4333308 -6691178 -5678822 -1999871
41994 -1999871 1152783 2197986 2134478 1850716 932197 -554896 -1381566 -974189 103993
41985 103993 2238255 6998217 13809739 18496012 17379919 11663559 5717678 2073507
41977 2073507 305176 -68441 1477057 4378277 6394951 6198132 4981977 4600306 5291403
41968 5291403 5949689 5583382 3959728 1919084 1471411 4087911 8067112 9232919 5848654
41959 5848654 1754358 2643287 9500148 17488181 21413620 20591118 17851550 15574948
41951 15574948 14221099 13861741 15181664 18375810 22012753 23868530 22905018 20144837
41943 20144837 17509029 15855281 14358649 12044712 9597928 8700946 9316853 8957798
$$ packed form
42002d252604J070668J298969J132817p04506k878652k357870J012356L678951
41994a999871L152654J045203o3508k83762r18519j487093q26670M07377J078182
41985A03993K134262M759962O811522M686273j116093n716360n945881l644171
41977B073507j768331l73617J545498K901220K016674j96819j216155l81671O91097
41968E291403O58286l66307j623654k040644m47673K616500L979201J165807l384265
41959E848654m094296Q88929O856861P988033L925439q22502k739568k276602
41951A5574948j353849l59358J319923L194146L636943J855777r63512k760181
41943B0144837k635808j653748j496632k313937k446784q96982O15907l59055
$$ plain form
41935 8957798 5944381 2409987 1968094 4625232 6554221 5577408 4182457 5486894
41927 5486894 8751583 11378751 13075858 14533150 13659880 7846668 -145487 -3495497
41919 -3495497 27529 4986627 5961139 4250432 3886490 4719662 3866066 1633791 1091508
41910 1091508 2612815 3370543 2270569 1384058 2027243 3115086 4196492 6551067 9971971
41901 9971971 11791938 10977665 10317919 12201003 14506526 13466699 9253185 5967414
41893 5967414 6492440 9549521 11879871 11608770 9132016 6000334 3631898 2592437
41885 2592437 2553083 2824728 3030652 3545437 5400652 9239145 13987388 17372549 18573945
41876 18573945 19408388 21574613 23829432 24102813 23683024 26113193 31347067 34197137
$$ packed form
41935H957798l013417l534394m41893K657138J928989r76813j394951J304437
41927E486894L264689K627168J697107J457292q73270n813212p992155l350010
41919c495497L523026M959098R74512j710707l63942Q33172q53596k232275n42283
41910A091508J521307P57728j099974q86511O43185J087843J081406K354575L420904
41901I971971J819967q14273o59746J883084K305523j039827m213514l285771
41893E967414N25026L057081K330350k71101k476754l131682k368436j039461
41885B592437l9354K71645K05924N14785J855215L838493M748243L385161J201396
41876A8573945Q34443K166225K254819K73381m19789K430169N233874K850070
$$ plain form
41868 34197137 30495846 22566596 16291211 14211224 13927925 12486394 9769253 7340605
41860 7340605 5935373 5033158 4008531 2902186 2223776 2293339 2787642 2870406 1643603
41851 1643603 -1440659 -5934084 -9755939 -10222563 -6976586 -3271626 -2762278 -5300371
41843 -5300371 -7551497 -7481467 -6158789 -5068672 -4051989 -2615532 -1094734 469540
41835 469540 2611561 4553373 4112578 903304 -2213632 -2458702 -359543 1811459 3177624
41826 3177624 4117676 4463050 3824146 2830796 2445603 2747852 3394552 4063102 3505577
41817 3505577 31590 -5543106 -9331906 -8762803 -5908397 -4313309 -4061831 -2455342
41809 -2455342 1604315 6421249 9891013 10951593 9567490 7228973 6300611 6954344
$$ packed form
41868C4197137l701291p929250o275385k079987k83299j441531k717141k428648
41860G340605j405232r02215j024627j106345o78410O9563M94303Q2764j226803
41851A643603l084262m493425l821855m66624L245977L704960N09348k538093
41843e300371k251126P0030J322678J090117J016683J436457J520798J564274
41835D69540K142021J941812m40795l209274l116936k45070K099159K171002J366165
41826C177624R40052L45374o38904r93350l85193L02249O46700O68550n57525
41817C505577l473987n574696l788800N69103K854406J595088K51478J606489
41809b455342M059657M816934L469764J060580j384103k338517r28362O53733
$$ plain form
41801 6954344 6401226 3403702 1310747 3343366 6987146 7381446 4877034 4255288 6901882
41792 6901882 9048198 8373443 7093021 6863107 5513282 1431487 -2890389 -4752652
41784 -4752652 -5422423 -7236662 -9206449 -8848138 -6438747 -4209613 -2668295 -715808
41776 -715808 1505050 2579501 2066900 594271 -1592067 -4054622 -4892758 -2404477 2218343
41767 2218343 5915407 7379541 7755249 7769501 6323331 2735301 -1207588 -2836049 -1798566
41758 -1798566 -542358 -1222109 -2771579 -2072776 1840811 6078438 7383338 6124854
41750 6124854 5146338 5608591 6252175 6220546 5845273 4633189 1545297 -2077140 -2982808
41741 -2982808 -655781 1397001 553955 -1508269 -2117044 -1521244 -1267053 -1270275 -1054739
$$ packed form
41801F954344n53118k997524k092955K032619L643780L94300k504412o21746K646594
41792F901882K146316o74755j280422k29914j349825m081795m321876j862263
41784d752652o69771j814239j969787L58311K409391K229134J541318J952487
41776g15808K220858J074451n12601j472629k186338k462555q38136K488281M622820
41767B218343L697064J464134L75708J4252j446170l588030l942889j628461J037483
41758a798566J256208o79751j549470O98803L913587M237627J304900j258484
41750F124854r78516M62253O43584l1629l75273j212084l087892l622437r05668
41741b982808K327027K052782q43046k062224o08775N95800K54191l222K15536
$$ plain form
41732 -1054739 -1468536 -2380012 -1095427 3630707 8154467 8218552 4947313 2685361 2408968
41723 2408968 1679061 9547 -725816 -953999 -3193389 -6524582 -6579620 -2767850 -462978
41714 -462978 -3182967 -6990713 -6393412 -2352593 -42068 -897127 -1589961 -79675 1721264
41705 1721264 1778079 957166 1076474 2337837 3936320 5607028 7448052 9217625 10607630
41696 10607630 11537687 11771334 10960698 9385636 7903095 6785616 5241381 2510237
41688 2510237 -941163 -3524492 -3530758 -247962 5029239 9011335 8727129 4833195 1851699
41679 1851699 3719201 9186756 12952262 11614914 7144801 3766739 2863850 2448679
41671 2448679 682139 -2111760 -4672181 -5976256 -5003761 -1463407 2585948 4005506
$$ packed form
41732a054739m13797r11476J284585M726134M523760O4085l271239k261952k76393
41723B408968p29907j669514p35363k28183k239390l331193n5038L811770K304872
41714d62978k719989l807746N97301M040819K310525q55059o92834J510286J800939
41705A721264N6815q20913J19308J261363J598483J670708J841024J769573J390005
41696A0607630R30057K33647q10636j575062j482541j117479j544235k731144
41688B510237l451400k583329o266L282796N277201L982096k84206l893934k981496
41679A851699J867502N467555L765506j337348m470113l378062r02889m15171
41671B448679j766540k793899k560421j304075R72495L540354M049355J419558
$$ plain form
41663 4005506 2690733 2426509 5939728 10834244 12590345 10279276 6879189 4832282
41655 4832282 3933725 3241986 2412154 967486 -1405005 -3524657 -3840177 -3124599 -3738189
41646 -3738189 -5827926 -6850765 -5687689 -4461830 -4734453 -4494192 -1315615 3284266
41638 3284266 5405483 3952102 1888986 2432166 5751781 9448067 10878402 9028557
41630 9028557 5340773 2798424 3259190 5679469 7599737 7902921 7126999 5639092 3159911
41621 3159911 326613 -793672 1227266 5185582 8227550 8797646 7993526 7760118 8345615
41612 8345615 8490451 8119707 9310520 13254026 17265316 17080175 12322585 7511264 6637718
41603 6637718 8543750 9125995 6679833 3190754 1206445 1472951 3463634 6376407
$$ packed form
41663D005506j314773k64224L513219M894516J756101k311069l400087k046907
41655D832282q98557o91739q29832j444668k372491k119652l15520P15578o13590
41646c738189k089737j022839J163076J225859k72623K40261L178577M599881
41638C284266K121217j453381k063116N43180L319615L696286J430335j849845
41630I028557l687784k542349M60766K420279J920268L03184p75922j487907k479181
41621C159911k833298j120285K020938L958316L041968N70096q04120k33408N85497
41612H345615J44836l70744J190813L943506M011290j85141m757590m811321q73546
41603F637718J906032N82245k446162l489079j984309K66506J990683K912773
$$ plain form
41595 6376407 9247395 11448641 13563627 16730418 20573001 22628878 20674513 15481988
41587 15481988 10737365 9917217 13141301 17223906 19010233 18397692 17614560 17961974 18417056
41578 18417056 17554326 15583843 13890068 13474777 14397691 15934907 16981066 17358772 18887839
41569 18887839 23486614 29700344 33248847 32213862 29448123 28033099 26726557 22757612
41561 22757612 17184199 13596460 12282816 9863234 5109680 1133491 371162 832695
41553 832695 -510691 -3241324 -4850881 -4668215 -3866775 -2746251 -489130 2829476 5952811
41544 5952811 8004354 8951185 8852862 7936696 7066264 6892358 6784127 5658094 3587669
41535 3587669 1666406 653521 617610 1389486 2397196 2579713 1473464 -83178 -1141761
$$ packed form
41595F376407K870988K201246K114986L166791L842583K055877j954365n192525
41587A5481988m744623q20148L224084M082605J786327o12541p83132L47414M55082
41578A8417056q62730j970483j693775m15291R22914J537216J046159L77706J529067
41569A8887839M598775O213730L548503j034985k765739j415024j306542l968945
41561B2757612n573413l587739j313644k419582m753554l976189p62329M61533
41553H32695j343386k730633j609557J82666Q01440J120524K257121L318606L123335
41544E952811K051543R46831r8323r16166q70432j73906j08231j126033k070425
41535C587669j921263j012885l5911P71876J007710J82517j106249j556642j058583
$$ plain form
41526 -1141761 -1742937 -1910062 -790682 1636936 3194390 2024401 -279555 -519527 1580231
41517 1580231 3444708 4069977 5004914 6274780 5150537 1104972 -1327901 1982937
41509 1982937 8477218 11770925 9883700 7020995 7289695 10091243 12419348 12623220
41501 12623220 10523506 6293562 1078923 -2832440 -4083057 -3521684 -2498162 -1247068
41493 -1247068 79577 480682 -287335 -615328 750524 2634007 3312250 3202727 3544409
41484 3544409 3502019 1230287 -2620758 -5133027 -4953139 -3534129 -2359053 -1303991 -160665
41475 -160665 614826 1337411 3005608 5126802 6084717 6431982 8859917 13450932 16113741
41466 16113741 14166541 10716089 10320392 12431471 12799308 9943287 6230142 3203470
$$ packed form
41526a141761o01176j67125J119380K427618J557454j169989k303956k39972K099758
41517A580231J864477O25269R34937J269866j124243m045565k432873L310838
41509A982937O494281L293707j887225k862705K68700K801548K328105K03872
41501A2623220k099714m229944n214639l911363j250617N61373J023522J251094
41493a247068J326645M01105p68017l27993J365852J883483O78243j09523L41682
41484C544409m2390k271732l851045k512269J79888J419010J175076J055062J143326
41475a60665P75491P22585J668197K121194R57915L47265K427935M591015K662809
41466A6113741j947200l450452l95697K111079L67837k856021l713145l026672
$$ plain form
41458 3203470 80380 -2810491 -3218031 -922344 904779 76425 -1631770 -1801448 -1211494
41449 -1211494 -1999733 -3778535 -4140119 -2139352 805525 2846576 2771769 -161818 -5400124
41440 -5400124 -10132553 -10950104 -7129862 -1576370 1695295 691930 -3441403 -7546902
41432 -7546902 -8767733 -6452360 -2115142 2174164 4834654 4655993 1260138 -3626363
41424 -3626363 -6645256 -5694674 -1787242 2442943 5023181 4936226 1911394 -2544574 -5238282
41415 -5238282 -4422596 -2242315 -2276693 -5068318 -7827938 -8284098 -7016477 -5965089 -6301098
41406 -6301098 -7960258 -9806268 -10060265 -7954409 -5117190 -3917579 -4314756 -3954659 -1739957
41397 -1739957 405098 109896 -2514251 -5446346 -7120706 -7237285 -6082503 -4096543
$$ packed form
41458C203470l123090k890871m07540K295687J827123q28354j708195j69678N89954
41449a211494p88239j778802l61584K000767K944877K041051p4807k933587n238306
41440e400124m732429q17551L820242N553492L271665j003365m133333m105499
41432g546902j220831K315373M337218M289306K660490j78661l395855m886501
41424c626363l018893R50582L907432M230185K580238q6955l024832m455968k693708
41415e238282Q15686K180281l4378k791625k759620m56160J267621J051388l36009
41406f301098j659160j846010k53997K105856K837219J199611l97177L60097K214702
41397a739957K145055k95202k624147k932095j674360j16579J154782J985960
$$ plain form
41389 -4096543 -1798252 410606 2192366 3195958 3745485 5164470 7946803 9825737
41381 9825737 7853224 2950838 -47209 1640444 4911282 5096845 2358088 818857
41373 818857 2170660 3567471 2433371 342728 438445 2972219 5514250 6660459 7464131
41364 7464131 9196853 11364662 12647772 12832551 12816347 12970673 12496454 10759250 8507486
41355 8507486 6932723 5899285 4286501 2242624 1771876 4221039 8143891 10852334
41347 10852334 11522074 11459733 11580174 11121353 9158971 6166309 3432663 1673049 740889
41338 740889 209183 -107746 212919 2093247 5735454 9376133 10288398 7662559 3763446
41329 3763446 1518005 1493696 1952041 1390208 174217 -187553 1241487 3768034 5418720
$$ packed form
41389d096543K298291K208858J781760J003592N49527J418985K782333J878934
41381I825737j972513m902386k998047J687653L270838J85563k738757j539231
41373H18857J351803J396811j134100k090643R5717K533774K542031J146209Q03672
41364G464131J732722K167809J283110J84779j6204J54326m74219j737204k251764
41355H507486j574763j033438j612784k043877m70748K449163L922852K708443
41347A0852334O69740o2341J20441m58821j962382k992662k733646j759614r32160
41338G40889n31706l16929L20665J880328L642207L640679R12265k625839l899113
41329C763446k245441k4309M58345n61833j215991l61770J429040K526547J650686
$$ plain form
41320 5418720 4754491 2732933 2102468 4198843 6989553 7370216 4880142 1726217 -561359
41311 -561359 -2520445 -4367731 -4419316 -1615917 1691763 1742010 -2028882 -6327296 -8307144
41302 -8307144 -8756056 -10041800 -12306575 -13278074 -11366104 -7530512 -4024280 -2329270
41294 -2329270 -2516709 -3707120 -4671599 -4513132 -3213596 -1362022 612427 2515259 3922337
41285 3922337 4580507 5358598 7536625 10496508 11430583 8716218 4688275 3217603 4811836
41276 4811836 6136255 4671044 1631497 -819762 -3063307 -6413835 -9249160 -7823131
41268 -7823131 -1478203 5316017 7573868 5170158 2196746 1752252 3016623 3517936
41260 3517936 2764687 2508977 3742101 4637412 2439774 -2761204 -7365688 -8191276 -6202602
$$ packed form
41320E418720o64229k021558o30465K096375K790710L80663k490074l153925k287576
41311e61359j959086j847286n1585K803399L307680N0247l770892m298414j979848
41302h307144m48912j285744k264775r71499J911970L835592L506232J695010
41294b329270j87439j190411r64479J58467J299536J851574J974449J902832J407078
41285C922337O58170P78091K178027K959883R34075k714365m027943j470672J594233
41276D811836J324419j465211l039547k451259k243545l350528k835325J426029
41268g823131O344928O794220K257851k403710k973412m44494J264371N01313
41260C517936p53249k55710J233124Q95311k197638n200978m604484q25588J988674
$$ plain form
41251 -6202602 -4912957 -5487497 -5392519 -2361757 2272312 5492754 6343518 6100107 5809067
41242 5809067 5659435 6213187 8085429 10369521 11341647 11023928 11173740 12235041 12266755
41233 12266755 9887105 6548202 4549566 4193444 4414919 5034663 6536710 8298857
41225 8298857 8997281 8694492 8826675 9801436 10000519 7854751 4106426 1308927 1275902
41216 1275902 3331956 5119390 5126683 4132772 3690704 3678830 2739563 1178903 1421044
41207 1421044 4565441 8447417 10901534 13207907 17667624 22809649 24227414 20319100
41199 20319100 14337256 10020071 7715659 5981152 4795133 5424591 8324472 12585406
41191 12585406 16774172 19571136 20439869 20221018 20152203 20069195 18850327 16805024 15884455
$$ packed form
41251f202602J289645n74540R4978L030762M634069L220442Q50764k43411k91040
41242E809067j49632N53752J872242K284092R72126l17719J49812J061301L1714
41233A2266755k379650l338903j998636l56122K21475O19744J502047J762147
41225H298857O98424l02789J32183R74761J99083k145768l748325k797499l3025
41216A275902K056054J787434P293r93911m42068j1874r39267j560660K42141
41207A421044L144397L881976K454117K306373M459717N142025J417765l908314
41199B0319100n981844m317185k304412j734507j186019O29458K899881M260934
41191A2585406M188766K796964Q68733k18851o8815q3008j218868k045303r20569
$$ plain form
41182 15884455 17024966 19073700 20912297 22584683 23522516 22053766 18122303 14335297
41174 14335297 12622359 11870942 10629873 9900651 10913857 12222265 11862965 10806297
41166 10806297 11242149 12712006 13066402 12235998 11788294 11564379 10291183 9076764 10508305
41157 10508305 14132902 16550522 16577134 16691374 18386078 19679615 18828700 17334005 17315689
41148 17315689 18586731 20373588 23563117 28911833 34690662 38208685 38599841 36793924
41140 36793924 34142383 32257637 32567632 34660246 36441934 36898490 37112893 37963298 39149194
41131 39149194 41357898 46417104 53615990 58870786 59948984 59914893 62696345 67653186
41123 67653186 71610364 74122822 77213684 81436895 85752927 90301219 96047962 102590671
$$ packed form
41182A5884455J140511K048734J838597J672386R37833j468750l931463l787006
41174A4335297j712938p51417j241069p29222J013206J308408l59300j056668
41166A0806297M35852J469857L54396q30404m47704k23915j273196j214419J431541
41157A0508305L624597K417620K6612J14240J694704J293537q50915j494695j8316
41148A7315689J271042J786857L189529N348716N778829L518023L91156j805917
41140C6793924k651541j884746L09995K092614J781688M56556K14403Q50405J185896
41131C9149194K208704N059206P198886N254796J078198l4091K781452M956841
41123F7653186L957178K512458L090862M223211M316032M548292N746743O542709
$$ plain form
41115 102590671 109359479 117865079 129450788 141996879 152659726 163004463 177157052
41108 177157052 195109699 212301999 226359411 240001762 256139639 273918583 291148391
41101 291148391 307328700 322532669 335922367 346758240 354624457 358033745 355556909
41094 355556909 348657464 339858422 327617220 307672495 281177933 256520273 239788163
41087 239788163 227601530 213290735 196367739 180914704 167535593 153032279 137165736
41080 137165736 123898587 115188600 108276894 100481234 92688352 86260677 79904895 72237510
41072 72237510 65272272 62524138 64366093 67332490 67953016 65902952 63160551 61053047
41064 61053047 58953593 55911375 52753729 51426253 52111881 52322850 49808412 45495662
$$ packed form
41115A02590671O768808Q505600J1585709J2546091J0662847J0344737J4152589
41108A77157052J7952647J7192300J4057412J3642351J6137877J7778944J7229808
41101B91148391J6180309J5203969J3389698J0835873P866217L409288k476836
41094C55556909o899445q799042j2241202j9944725k6494562k4657660j6732110
41087B39788163j2186633j4310795j6922996j5453035j3379111j4503314j5866543
41080A37165736j3267149q709987o911706p795660p792882o427675o355782p667385
41072G2237510o965238k748134J841955K966397O20526k050064k742401k107504
41064F1053047k099454l042218l157646j327476O85628K10969k514438m312750
$$ plain form
41056 45495662 42351814 41738617 41932225 40108465 35165040 28877057 24613401 24220561
41048 24220561 25803734 25625475 22702929 20074401 20536240 22717818 22990822 20040958
41040 20040958 15720932 12299245 10784121 11319797 13291388 15306969 16620336 18109774
41032 18109774 20398431 21885062 20672808 17885054 16783860 18620628 21323601 22311990
41024 22311990 20781323 17286417 13068277 9960286 9050480 9091147 7840992 5115550
41016 5115550 2875016 2329213 2867254 3970743 6126234 9381489 12789303 15681882
41008 15681882 17845866 18379416 16469424 13570541 12507872 13791034 14998861 14465739
41000 14465739 13252396 12657851 12334433 12102159 13041931 15044405 15680554 13757097 12035684
$$ packed form
41056D5495662l143848o13197J93608j823760m943425o287983m263656l92840
41048B4220561J583173j78259k922546k628528M61839K181578K73004k949864
41040B0040958m320026l421687j515124N35676J971591K015581J313367J489438
41032A8109774K288657J486631j212254k787754j101194J836768K702973R88389
41024B2311990j530667l494906m218140l107991r09806M0667j250155k725442
41016E115550k240534n45803N38041J103489K155491L255255L407814K892579
41008A5681882K163984N33550j909992k898883j062669J283162J207827n33122
41000A4465739j213343n94545l23418k32274R39772K002474O36149j923457j721413
$$ plain form
40991 12035684 13849903 18362966 21726692 22055369 20824430 19937475 19886126 20804952 23124449
40982 23124449 26478926 29205971 29560469 27177617 23659765 21901561 23651361 26946573
40974 26946573 27364701 23127340 17569122 14834093 14601428 13575419 11145504 10221370
40966 10221370 12211974 14396348 13710783 10850155 8802431 8834459 9820147 10625000 11186268
40957 11186268 11402685 10699745 9247923 8522066 9830062 12707298 15464104 17241054
40949 17241054 18861153 21314330 23864160 24451862 22221059 19093840 18186662 20580627
40941 20580627 24025439 25074692 22346057 17415465 12695913 9212530 6885373 6015801
40933 6015801 6970374 8618738 9095662 8823151 10746032 16000817 21112356 21834662 18642475
$$ packed form
40991A2035684J814219M513063L363726L28677j230939q86955n1349R18826K319497
40982B3124449L354477K727045L54498k382852l517852j758204J749800L295212
40974B6946573M18128m237361n558218k735029k32665j026009k429915r24134
40966A0221370J990604K184374o85565k860628k047724L2028R85688Q04853N61268
40957A1186268K16417p02940j451822p25857J307996K877236K756806J776950
40949A7241054J620099K453177K549830N87702k230803l127219r07178K393965
40941B0580627L444812J049253k728635m930592m719552l483383k327157q69572
40933F015801R54573J648364M76924k72511J922881N254785N111539P22306l192187
$$ plain form
40924 18642475 15691595 14942553 14459859 12751091 11507091 12673315 15266594 16796739
40916 16796739 16275341 14624131 13574316 14927053 18949570 22507851 21023331 13851210
40908 13851210 5809576 1754997 1509677 1848404 1363670 931394 975877 1002819 1008532 1107773
40898 1107773 562886 -780352 -1044460 1494266 5526278 8077034 7986313 6112490 3254641
40889 3254641 328153 -424814 2612562 7544781 10664286 10884025 10057789 9279366 7746192
40880 7746192 5380897 3630252 2951715 1933292 -320167 -2955680 -5022613 -6290597
40872 -6290597 -5997752 -3055977 1709529 5546069 6909234 6990387 7497957 8570935 9434874
40863 9434874 9439612 7923120 4735796 1376932 -139618 -42392 -637029 -2860793 -4844299
$$ packed form
40924A8642475k950880p49042m82694j708768j244000J166224K593279J530145
40916A6796739n21398j651210j049815J352737M022517L558281j484520p172121
40908A3851210q041634m054579k45320L38727m84734m32276M4483K6942N713R9241
40898A107773n44887j343238k64108K538726M032012K550756r0721j873823k857849
40889C254641k926488p52967L037376M932219L119505K19739q26236p78423j533174
40880G746192k365295j750645o78537j018423k253459k635513k066933j267984
40872f290597K92845K941775M765506L836540J363165Q1153N07570J072978Q63939
40863I434874M738j516492l187324l358864j516550R7226n94637k223764j983506
$$ plain form
40854 -4844299 -4599582 -2458941 -153520 1032680 727116 -355211 -384072 1784900 4586809
40845 4586809 5312888 3761398 2294375 2250637 2662758 2617402 2201170 854921 -2212323
40836 -2212323 -5448843 -5989834 -3989722 -2493144 -2073611 381597 5870413 10501409
40828 10501409 11127444 9791902 9321882 8324817 4752781 1148740 1160662 2878005 1130413
40819 1130413 -4324394 -8157358 -7314638 -4792415 -4387607 -5584613 -5486424 -3076905 247771
40810 247771 2637111 3007738 1610778 118573 2710 539454 -309126 -2925824 -5368288
40801 -5368288 -5868311 -4683029 -3178792 -2148417 -1335402 -30961 1800085 2796258 1437726
40792 1437726 -1623378 -3809758 -3778446 -2535337 -638934 3044508 8052932 10704683
$$ packed form
40854d844299K44717K140641K305421J186200l05564j082327k8861K168972K801909
40845D586809P26079j551490j467023m3738M12121m5356m16232j346249l067244
40836b212323l236520n40991K000112J496578M19533K455208N488816M630996
40828A0501409O26035j335542m70020r97065l572036l604041J1922J717343j747592
40819A130413n454807l832964Q42720K522223M04808j197006R8189K409519L324676
40810B47771K389340L70627j396960j492205j15863N36744q48580k616698k442464
40801e368288n00023J185282J504237J030375Q13015J304441J831046R96173j358532
40792A437726l061104k186380L1312J243109J896403L683442N008424K651751
$$ plain form
40784 10704683 8622287 4443541 1703926 -600701 -5166681 -10066343 -10454487 -5925490
40776 -5925490 -1060936 1426444 3055728 4575568 4013258 1459473 846543 4219973
40768 4219973 8102007 8353777 5416032 2061793 -932821 -3888924 -5698824 -5458584
40760 -5458584 -4728504 -5279774 -6225387 -6030327 -5706364 -7136466 -9466742 -10053675 -8360925
40751 -8360925 -6450825 -5924837 -6311870 -6248041 -4867834 -2441747 -524742 -590799 -1870112
40742 -1870112 -2001326 -483544 638932 515611 1192214 3845439 6220981 6367131 6140168
40733 6140168 7691267 8930023 6595205 2128154 -84096 528222 456242 -1387500 -1722701
40724 -1722701 1409080 5269488 6671560 6197458 5975055 6008638 5115324 3427486 1639631
$$ packed form
40784A0704683k082396m178746k739615k304627m565980m899662l88144M528997
40776e925490M864554K487380J629284J519840n62310k553785o12930L373430
40768D219973L882034K51770k937745l354239k994614k956103j809900K40240
40760e458584P30080n51270r45613J95060L23963j430102k330276n86933J692750
40751h360925J910100N25988l87033O3829J380207K426087J917005o6057j279313
40742a870112j31214J517782J122476j23321O76603K653225K375542J46150k26963
40733F140168J551099J238756k334818m467051k212250O12318p1980j843742l35201
40724a722701L131781L860408J402072m74102k22403L3583q93314j687838j787855
$$ plain form
40715 1639631 -588538 -3190080 -3982710 -931512 4365411 7650986 6654889 3334113
40707 3334113 1314870 2239857 4893249 6950298 6951526 4963758 2095471 -184107 -547524
40698 -547524 1435841 4554521 6641471 6736791 6068435 6198236 6929986 7050966 6304341
40689 6304341 5168538 3416427 855064 -863328 459242 4106569 6563991 5917458
40681 5917458 4021708 3127184 2523848 506301 -1990300 -2410847 -727785 91634 -1609911
40672 -1609911 -3411568 -1710668 3601626 8827281 10682665 9534603 7875742 6667733
40664 6667733 4726686 1653937 -511843 194830 2683389 4051966 3285119 1901606
40656 1901606 1105039 388669 -563776 -684223 560543 1596005 552900 -2328865 -5379320
$$ packed form
40715A639631k228169k601542p92630L051198N296923L285575r96097l320776
40707C334113k019243R24987K653392K057049J228j987768k868287k279578l63417
40698e47524J983365L118680K086950R5320o68356J29801P31750J20980p46625
40689F304341j135803j752111k561363j718392J322570L647327K457422o46533
40681E917458j895750q94524o03336k017547k496601m20547J683062Q19419j701545
40672a609911j801657J700900N312294N225655J855384j148062j658861j208009
40664F667733j941047l072749k165780P06673K488559J368577p66847j383513
40656A901606p96567p16370r52445j20447J244766J035462j043105k881765l050455
$$ plain form
40647 -5379320 -7629938 -8872662 -8497494 -6114873 -3035050 -1316345 -1146289 -724650 825888
40638 825888 1913775 704946 -2205631 -4498514 -4943934 -4357782 -3856385 -3249944 -1671966
40629 -1671966 711104 2251870 1234079 -2326256 -6306069 -8030826 -6478876 -3070944
40621 -3070944 -239147 660579 -142935 -1945956 -4244188 -6178893 -6516466 -5070406 -3247972
40612 -3247972 -1976926 57696 4237881 8464081 8292845 2387855 -5286827 -9938209
40604 -9938209 -10780100 -10045827 -9222242 -8463703 -8214885 -8726242 -8689614 -6815656 -4215562
40595 -4215562 -2820650 -2104276 -205926 2141557 2175356 -224635 -1945250 -1476518 -761703
40586 -761703 -976654 -298902 1937002 2552786 -770071 -4997665 -5679617 -3243951 -1471180
$$ packed form
40647e379320k250618j242724L75168K382621L079823J718705J70056M21639J550538
40638H25888J087887j208829k910577k292883m45420N86152N01397O06441J577978
40629a671966K383070J540766j017791l560335l979813j724757J551950L407932
40621c070944K831797Q99726q03514j803021k298232j934705l37573J446060J822434
40612c247972J271046K034622M180185M226200j71236n904990p674682m651382
40604i938209q41891P34273Q23585P58539K48818n11357L6628J873958K600094
40595d215562J394912P16374J898350K347483L3799k399991j720615M68732P14815
40586g61703k14951O77752K235904O15784l322857m227594o81952K435666J772771
$$ plain form
40577 -1471180 -1358907 -798501 583387 814493 -199892 -167760 1241547 1582248 198431
40568 198431 -392594 688729 385817 -3321354 -7517874 -8507007 -7164918 -6672071 -6976021
40559 -6976021 -5512675 -2416160 -879004 -2073121 -3194857 -1548790 2040727 4956418
40551 4956418 5774138 4470955 1663630 -959129 -1037240 1945062 5411571 6383553 4887742
40542 4887742 3505214 3950821 5347745 5949572 5600545 5950868 8358928 11824182 13433002
40533 13433002 11376059 7283406 4633895 4728114 5334076 3837274 637985 -1540660
40525 -1540660 -956355 1646024 4333097 5595227 4815241 2250003 -1200932 -4764116
40517 -4764116 -8256813 -11297255 -12545927 -10791608 -6700941 -2495403 143265 1009883
$$ packed form
40577a471180J12273N60406J381888K31106j014385L2132J409307L40701j383817
40568A98431n91025J081323l02912l707171m196520r89133J342089M92847l03950
40559f976021J463346L096515J537156j194117j121736J646067L589517K915691
40551D956418Q17720j303183k807325k622759p8111K982302L466509R71982j495811
40542D887742j382528M45607J396924O01827l49027L50323K408060L465254J608820
40533A3433002k056943m092653k649511R4219O05962j496802l199289k178645
40525a540660N84305K602379K687073J262130p79986k565238l450935l563184
40517d764116l492697l040442j248672J754319M090667M205538K638668Q66618
$$ plain form
40509 1009883 507778 -781136 -1563029 -444672 2249108 4509493 5202903 5353637 6009054
40500 6009054 6202364 4466373 1401490 -894271 -1409585 -718593 591331 2219392 3052808
40491 3052808 1721403 -1261286 -3432509 -3099852 -979897 1303293 3057866 4274666
40483 4274666 4872982 5091279 5571864 6207900 5971629 4761130 4091048 4567155 3951266
40474 3951266 -90155 -5768968 -8102871 -4660638 1408162 5079683 4910422 3569256
40466 3569256 3717208 4839486 4374775 1163764 -2769116 -3917917 -811884 4208801
40458 4208801 7034058 5770414 2472686 783103 2202055 5031750 6711424 6533353
40450 6533353 5825363 5959912 6899558 7840904 8615594 9688280 10881661 10995365 9174396
$$ packed form
40509A009883n02105j288914p81893J118357K693780K260385O93410J50734O55417
40500F009054J93310j735991l064883k295761n15314O90992J309924J628061Q33416
40491C052808j331405k982689k171223L32657K119955K283190J754573J216800
40483D274666N98316K18297M80585O36036k36271j210499o70082M76107o15889
40474C951266m041421n678813k333903L442233O068800L671521j69261j341166
40466C569256J47952J122278m64711l211011l932880j148801L106033N020685
40458D208801K825257j263644l297728j689583J418952K829695J679674j78071
40450F533353p07990J34549R39646R41346P74690J072686J193381J13704j820969
$$ plain form
40441 9174396 6157298 3595310 2376202 2090991 1920164 1522235 1196423 1663720 3518823
40432 3518823 6329271 8426684 8312026 6318536 4196685 2923688 1670796 -710456
40424 -710456 -3844135 -6050964 -6079819 -4159336 -1574301 361426 1023340 544474 -717035
40415 -717035 -2668438 -5129303 -7041279 -6720051 -3424540 1559056 5777455 7481586
40407 7481586 6680887 4922430 4274495 5775053 8252371 9345176 8540355 8454711 11617746
40398 11617746 16250730 17189122 11725736 2992983 -3569824 -5761181 -5110485 -3120814
40390 -3120814 351182 4902943 8430734 9601531 9913404 11703251 15073977 18306169
40382 18306169 20446121 21630064 21402252 19114046 16373185 16716808 21401323 27044371
$$ packed form
40441I174396l017098k561988j219108k85211j70827l97929l25812M67297J855103
40432C518823K810448K097413j14658j993490k121851j272997j252892k381252
40424g10456l133679k206829k8855J920483K585035J935727O61914m78866j261509
40415g17035j951403k460865j911976L21228L295511M983596M218399J704131
40407G481586q00699j758457o47935J500558K477318J092805q04821q5644L163035
40398A1617746M632984R38392n463386q732753o562807k191357O50696J989671
40390c120814L471996M551761L527791J170797L11873J789847L370726L232192
40382A8306169K139952J183943k27812k288206k740861L43623M684515N643048
$$ plain form
40374 27044371 29152504 27136850 24240811 23125387 23335142 23049126 21564882 19509566
40366 19509566 17852509 17345375 17994843 18483158 16938683 12999360 8559050 5824343
40358 5824343 4991428 4313333 2141020 -1425817 -4541057 -5058457 -2529881 977369 2675461
40349 2675461 1956391 833665 1314036 3395350 6131535 9251226 12485756 14410019
40341 14410019 13701920 11166543 9009270 8318264 8565235 9123068 9562120 8751420 5848963
40332 5848963 2517050 1985457 5009995 8557275 9511981 7987849 5854492 3900650
40324 3900650 2227227 1871656 3731295 6605564 8339700 8515629 8395454 8909373 10567027
40315 10567027 14551467 21363968 28498871 32019312 30934421 27915401 25305064 22754276
$$ packed form
40374B7044371K108133k015654k896039j115424K09755k86016j484244k055316
40366A9509566j657057n07134O49468M88315j544475l939323m440310k734707
40358E824343q32915o78095k172313l566837l115240n17400K528576L507250J698092
40349B675461p19070j122726M80371K081314K736185L119691L234530J924263
40341A4410019p08099k535377k157273o91006K46971N57833M39052q10700k902457
40332E848963l331913n31593L024538L547280R54706j524132k133357j953842
40324C900650j673423l55571J859639K874269J734136J75929j20175N13919J657654
40315A0567027L984440O812501P134903L520441j084891l019020k610337k550788
$$ plain form
40307 22754276 19497716 16400721 14221452 11857516 8191885 4363120 2488376 3016006
40299 3016006 4649505 5993364 6210023 5194815 4224871 5113370 7445721 8172716 5576111
40290 5576111 2055932 845756 1353527 406506 -2797838 -5932968 -7394607 -7881604 -7845174
40281 -7845174 -6323597 -3399882 -1491515 -2724248 -6368573 -9777289 -10695460 -8288173
40273 -8288173 -3515315 942977 2760219 2586607 3069451 4954793 6267482 5958187 5734571
40264 5734571 6811495 7376425 5590156 3206740 3462193 6419346 9037157 9319353 7969171
40255 7969171 6205188 4366803 2897336 2513219 2750750 2082773 314738 -411045 2082479
40246 2082479 7321707 12251301 13589140 10276975 4482377 204645 -33244 2638602
$$ packed form
40307B2754276l256560l096995k179269k363936l665631l828765j874744N27630
40299C016006J633499J343859K16659j015208r69944Q88499K332351P26995k596605
40290E576111l520179j210176N07771r47021l204344l135130j461639m86997L6430
40281g845174J521577K923715J908367j232733l644325l408716r18171K407287
40273h288173M772858M458292J817242j73612M82844J885342J312689l09295k23616
40264E734571J076924N64930j786269k383416K55453K957153K617811K82196j350182
40255G969171j763983j838385j469467l84117K37531o67977j768035p25783K493524
40246B082479N239228M929594J337839l312165n794598m277732k37889K671846
$$ plain form
40238 2638602 5069660 5678175 5591084 6450463 8272892 9746353 9785361 8461011 6855353
40229 6855353 5945586 5194211 2755971 -2038606 -6984810 -9121773 -8233479 -6724031 -6188677
40220 -6188677 -5979961 -5406925 -5221885 -5956870 -6635731 -6519233 -6585360 -7611780 -8109337
40211 -8109337 -6268861 -3130374 -1394289 -1273312 -127521 3136492 5794877 5018303
40203 5018303 2050480 570208 1879635 3959658 4909003 4926064 4556708 3346804 1384156
40194 1384156 281392 1025658 2239818 2299123 1947845 2725304 3748986 2694089 -214845
40185 -214845 -1860176 -381628 2592419 4468623 4229571 1790476 -2642022 -7331278
40177 -7331278 -9576131 -9144629 -8846572 -9917223 -9539221 -5639958 -1529081 -1855147 -5572648
$$ packed form
40238B638602K431058O08515q7091Q59379J822429J473461L9008j324350j605658
40229F855353r09767p51375k438240m794577m946204k136963Q88294J509448N35354
40220f188677K08716N73036J85040p34985o78861J16498o6127j026420m97557
40211h109337J840476L138487J736085J20977J145791L264013K658385p76574
40203E018303k967823j480272J309427K080023R49345J7061l69356j209904j962648
40194A384156j102764P44266J214160N9305l51278P77459J023682j054897k908934
40185b14845j645331J478548K974047J876204k39052k439095m432498m689256
40177g331278k244853M31502K98057j070651L78002L899263M110877l26066l717501
$$ plain form
40168 -5572648 -7408325 -5793387 -4637187 -6556427 -8912062 -8568052 -6912958 -7386684
40160 -7386684 -10499445 -14072409 -16695769 -18235692 -17986125 -14974401 -9961335 -5303246
40152 -5303246 -2768507 -2543217 -3964536 -6078571 -7806893 -8609872 -8838408 -8852303 -8271856
40143 -8271856 -6626228 -4063618 -902850 2676880 6019411 8202491 9463131 10931281
40135 10931281 12005016 9879192 3604126 -2872705 -4408589 -969415 2376351 2020012
40127 2020012 -82417 133150 3261404 6029501 5575184 2450963 -637647 -1867677
40119 -1867677 -1476082 -476607 846604 2761957 4960557 6503088 6943782 6653509 5750117
40110 5750117 3654020 357040 -2665671 -3721704 -2624869 -403024 2142491 4583736
$$ packed form
40168e572648j835677J614938J156200j919240k355635L44010J655094m73726
40160g386684l112761l572964k623360j539923K49567L011724N013066M658089
40152e303246K534739K25290j421319k114035j728322q02979k28536j3895N80447
40143h271856J645628K562610L160768L579730L342531K183080J260640J468150
40135A0931281J073735k125824o275066o476831j535884L439174L345766l56339
40127B020012k102429K15567L128254K768097m54317l124221l088610j230030
40119a867677L91595R99475J323211J915353K198600J542531M40694k90273r03392
40110E750117k096097l296980l022711j056033J096835K221845K545515K441245
$$ plain form
40102 4583736 6002409 5292728 2532713 -847778 -3530189 -5242445 -6036300 -5487366 -3360794
40093 -3360794 -792820 27471 -2164968 -6251558 -9722439 -11134018 -10990110 -10078967 -8084059
40084 -8084059 -4839656 -1991212 -1615639 -3369426 -4798281 -4649213 -4030106 -3898609 -3577714
40075 -3577714 -2785782 -2955256 -4776083 -6189379 -5027316 -2411885 -1105774 -1238846 -288688
40066 -288688 2791515 5951625 7054490 6364467 5193331 3906328 2496506 1768816 2419199
40057 2419199 3535328 3343477 1354753 -1211831 -3222269 -4868113 -6496017 -6901941
40049 -6901941 -4197433 1219280 5891635 6830944 5037908 3801272 4004906 3504101 1329507
40040 1329507 -407995 -155624 243192 -1320445 -3278189 -2475131 957248 3797640 4338950
$$ packed form
40102D583736J418673p09681k760015l380491k682411j712256p93855N48934K126572
40093c360794K567974Q20291k192439m086590l470881j411579J43908R11143J994908
40084h084059L244403K848444L75573j753787j428855J49068O19107J31497L20895
40075c577714P91932j69474j820827j413296J162063K615431J306111j33072R50158
40066b88688L080203L160110J102865o90023j171136j287003j409822p27690O50383
40057B419199J116129j91851j988724k566584k010438j645844j627904m05924
40049f901941K704508N416713M672355R39309j793036j236636K03634n00805k174594
40040A329507j737502K52371L98816j563637j957744Q03058L432379K840392N41310
$$ plain form
40031 4338950 3977003 4158427 4336599 3528387 1916583 303670 -624519 -406892 385457
40022 385457 -228812 -3339961 -6737713 -7024266 -4154249 -1523617 -1271765 -1960834 -1549378
40013 -1549378 -241256 627550 421630 -1090630 -3854773 -6348016 -6358284 -4127344 -2712787
40004 -2712787 -3995230 -6445429 -8233386 -10081699 -12887734 -14766175 -13396481 -9930892
39996 -9930892 -7506084 -6547658 -4555090 -511745 3299984 4502679 3422971 1865818
39988 1865818 895495 775231 1563433 2521539 1966921 -925774 -4621764 -6675510 -6547004
39979 -6547004 -5923567 -6126406 -6394444 -5521971 -4156152 -3819513 -3949302 -2129965 1885944
39970 1885944 4579093 3023763 -755350 -2379965 -1109497 -198406 -1552979 -3431599
$$ packed form
40031D338950l61947J81424J78172q08212j611804j612913r28189K17627P92349
40022C85457o14269l111149l397752k86553K870017K630632K51852o89069M11456
40013a549378J308122Q68806k05920j512260k764143k493243j0268K230940J414557
40004b712787j282443k450199j787957j848313k806035j878441J369694L465589
39996i930892K424808R58426J992568M043345L811729J202695j079708j557153
39988A865818r70323j20264P88202R58106n54618k892695l695990k053746J28506
39979f547004O23437k02839k68038Q72473J365819L36639j29789J819337M015909
39970A885944K693149j555330l779113j624615J270468R11091j354573j878620
$$ plain form
39962 -3431599 -4106793 -4439602 -5262393 -5137314 -2875609 -810 1603809 2624891 4490570
39953 4490570 6175531 5434981 2279912 -1045175 -2753364 -2239766 744672 5326508
39945 5326508 8841064 9385363 8387670 8311910 8669587 7140655 4065958 2444163 3183026
39936 3183026 3675215 2169868 644641 1603662 4178473 5400861 4071821 1640843
39928 1640843 -14130 -285431 337703 1163804 1985524 3024247 4002245 3802772 2014728
39919 2014728 263425 365688 1287621 -90869 -4714776 -9728850 -11979872 -11536620 -10647959
39910 -10647959 -10564675 -10659699 -9773989 -7363900 -4055876 -1794403 -2403874 -5129227 -6752315
39901 -6752315 -5320966 -2756854 -2411347 -4878955 -7786600 -9155070 -9227643 -9064241 -8994015
$$ packed form
39962c431599o75194l32809q22791J25079K261705K874799J604619J021082J865679
39953D490570J684961p40550l155069l325087j708189N13598K984438M581836
39945E326508L514556N44299r97693p5760L57677j528932l074697j621795P38863
39936C183026M92189j505347j525227R59021K574811J222388j329040k430978
39928A640843j654973k71301O23134Q26101Q21720J038723R77998j99473j788044
39919B014728j751303J02263R21933j378490m623907n014074k251022M43252Q88661
39910a0647959Q3284r5024Q85710K410089L308024K261473o09471k725353j623088
39901f752315J431349K564112L45507k467608k907645j368470p2573J63402P0226
$$ plain form
39892 -8994015 -8859852 -8530911 -7617767 -5590239 -2708802 -163688 1119323 1195855 364334
39883 364334 -1391971 -3603585 -4830028 -4087794 -2347465 -1371556 -1130232 231085 3410286
39874 3410286 6315673 6461834 4017927 1143420 -1038082 -3190682 -5746265 -7905077
39866 -7905077 -8977012 -9204576 -8740474 -7213756 -4995316 -3609614 -4073891 -5865627 -8067370
39857 -8067370 -10160760 -11024793 -8913682 -3780345 1723183 4884827 5321215 3675207
39849 3675207 -84693 -5131711 -8451904 -7894861 -5586805 -5550725 -8486513 -11493726 -12414643
39840 -12414643 -11611962 -9712797 -6658734 -3293019 -1055238 449869 3021310 6541096
39832 6541096 8686049 8419651 6994816 4950076 1331360 -3014438 -4762868 -2592189
$$ packed form
39892h994015J34163L28941R13144K027528K881437K545114J283011P6532q31521
39883C64334j756305k211614j226443P42234J740329R75909K41324J361317L179201
39874C410286K905387J46161k443907k874507k181502k152600k555583k158812
39866g905077j071935k27564M64102J526718K218440J385702m64277j791736k201743
39857h067370k093390q64033K111111N133337N503528L161644M36388j646008
39849C675207l759900n047018l320193N57043K308056L6080k935788l007213r20917
39840a2414643Q02681J899165L054063L365715K237781J505107K571441L519786
39832F541096K144953k66398j424835k044740l618716m345798j748430K170679
$$ plain form
39824 -2592189 613327 2132924 3121514 5409194 7314705 6074450 2765067 1308130
39816 1308130 3245399 6352056 7987348 7342237 4788256 1400242 -1033011 -1589313
39808 -1589313 -1674745 -3192665 -5672954 -6969018 -6229296 -4273669 -1682511 1263263 3236996
39799 3236996 2971181 1636138 1648589 2908781 2695494 -148234 -3318248 -4276744 -3271435
39790 -3271435 -1926526 -628197 1169572 3269464 4862533 5657252 5754882 4916922 2868042
39781 2868042 -17225 -2934042 -5203504 -6299702 -5949034 -4644300 -3492169 -3121851
39773 -3121851 -3226502 -3406584 -3714803 -3964266 -3355557 -1580513 239544 574793 -799574
39764 -799574 -2876087 -5020519 -7502667 -10123403 -11354558 -9994266 -7349843 -6242954
$$ packed form
39824b592189L205516J519597R88590K287680J905511j240255l309383j456937
39816A308130J937269L106657J635292o45111k553981l388014k433253n56302
39808a589313q5432j517920k480289j296064P39722J955627K591158K945774J973733
39799C236996k65815j335043J2451J260192k13287k843728l170014r58496J005309
39790c271435J344909J298329J797769K099892J593069P94719R7630q37960k048880
39781B868042k885267k916817k269462j096198L50668J304734J152131L70318
39773c121851j04651j80082l08219k49463O08709J775044J820057L35249j374367
39764g99574k076513k144432k482148k620736j231155J360292K644423J106889
$$ plain form
39756 -6242954 -7219862 -7128795 -2935480 3829219 8318456 7932502 4696968 1860552 330620
39747 330620 -588700 -1100282 -1310112 -2229672 -4509108 -7132105 -8946001 -10414974 -12128113
39738 -12128113 -12666708 -10081449 -4852273 587345 4664811 7082643 7289918 5045875
39730 5045875 2067841 444783 -520735 -3184422 -7180140 -9227410 -8070032 -6545547
39722 -6545547 -7220931 -8641821 -8018963 -5580086 -3756348 -3240949 -2349672 -39614 2384302
39713 2384302 2950795 1443187 -154559 535287 3753935 6996463 7785287 6953784 7736264
39704 7736264 11273930 14715587 14690630 11228543 7119467 4655368 4293982 5482792 7270130
39695 7270130 8565858 8948612 8952112 8972231 8600088 7673596 7044775 7378289 7937673 7451810
$$ packed form
39756f242954r76908R1067M193315O764699M489237l85954l235534k836416j529932
39747C30620r19320n11582k09830r19560k279436k622997j813896j468973j713139
39738a2128113n38595K585259N229176N439618M077466K417832K07275k244043
39730E045875k978034j623058r65518k663687l995718k047270J157378J524485
39722f545547o75384j420890O22858K438877J823738N15399Q91277K310058K423916
39713B384302N66493j507608j597746O89846L218648L242528P88824q31503P82480
39704G736264L537666L441657k4957l462087m109076k464099l61386J188810J787338
39695G270130J295728L82754L500K0119l72143r26492o28821L33514N59384m85863
$$ plain form
39685 7451810 5618897 3224365 1574739 2093912 5035520 7957695 7315141 2907110
39677 2907110 -938563 -417879 2895005 4361810 2431243 68734 404635 3223689
39669 3223689 5974729 6507806 4526580 1686781 416503 1545856 3213274 3131375 1459407
39660 1459407 170190 224465 1035611 2187332 3683254 4739835 4463783 3766010 4456302
39651 4456302 6244017 6911301 5862222 4962230 4969589 3861629 492817 -2389493 -1316265
39642 -1316265 3043781 6747370 7672460 7310785 7477568 7504767 5556678 1354403 -3388334
39633 -3388334 -6670396 -7776449 -7465151 -6928412 -6547545 -5805431 -4455606 -3162464 -2482677
39624 -2482677 -1801589 -93602 2628030 5453578 7787238 9369768 9405420 7158318 3699266
$$ packed form
39685G451810j832913k394532j649626N19173K941608K922175o42554m408031
39677B907110l845673N20684L312884J466805j930567k362509L35901K819054
39669C223689K751040N33077j981226k839799j270278J129353J667418q1899j671968
39660A459407j289217N4275Q11146J151721J495922J056581k76052o97773O90292
39651D456302J787715O67284j049079q99992P359j107960l368812k882310J073228
39642a316265M360046L703589R25090l61675J66783K7199j948089m202275m742737
39633c388334l282062j106053L11298N36739L80867P42114J349825J293142O79787
39624b482677O81088J707987K721632K825548K333660J582530L5652k247102l459052
$$ plain form
39615 3699266 1543601 1629817 1806424 -378359 -4114989 -6159472 -5067775 -2888896 -2090990
39606 -2090990 -2371850 -1808132 -134354 938219 510260 -191898 125327 881879 781846
39597 781846 -79192 -566441 -462286 -721526 -1831912 -3118745 -3863160 -4013484 -3407544
39588 -3407544 -1374051 2103615 5560044 7348859 7474197 7278075 7422722 7075213 5346563
39579 5346563 2826965 1104996 993565 1704519 1761369 387446 -2053354 -4646129 -6683347
39570 -6683347 -7900280 -8126736 -6849241 -3450129 1693178 6488122 8374802 6864525
39562 6864525 4280946 3212710 3628636 3459732 1704881 -443991 -1756525 -2670744 -3906711
39553 -3906711 -4567559 -3102799 200498 2998749 3363644 1730850 182154 190171 1188083
$$ packed form
39615C699266k155665Q6216J76607k184783l736630k044483J091697K178879P97906
39606b090990k80860N63718J673778J072573m27959p02158L17225P56552j00033
39597G81846q61038m87249J04155k59240j110386j286833p44415j50324O05940
39588c407544K033493L477666L456429J788815J25338j96122J44647l47509j728650
39579E346563k519598j721969j11431P10954N6850j373923k440800k592775k037218
39570f683347j216933k26456J277495L399112N143307M794944J886680j510277
39562F864525k583579j068236M15926j68904j754851k148872j312534r14219j235967
39553c906711o60848J464760L303297K798251L64895j632794j548696Q017R97912
$$ plain form
39544 1188083 1277247 -539516 -3020082 -4167485 -3804205 -3384913 -3096525 -1074444 3299571
39535 3299571 7114996 7059148 3787786 855959 -130681 -746348 -2201510 -3356770 -3127133
39526 -3127133 -2551315 -3100340 -4484124 -5332238 -4866834 -3137827 -1000292 -501874 -3430889
39517 -3430889 -8409423 -11361259 -10323362 -7926939 -7412945 -8244092 -8030370 -6891316 -6723443
39508 -6723443 -7337041 -6848067 -5381740 -4738730 -4470110 -2354360 498397 -547511 -6614581
39499 -6614581 -11979469 -10967006 -5210418 -374231 1987768 4833751 9097930 11654508
39491 11654508 10355968 7074695 4456683 2866735 1962130 2357599 3937710 4957331
39483 4957331 4663265 4634997 5728716 6042523 4163378 2117214 2214870 2989576 1826253
$$ packed form
39544A188083Q9164j816763k480566j147403L63280M19292K88388K022081M374015
39535C299571L815425n5848l271362k931827r86640o15667j455162j155260K29637
39526c127133N75818n49025j383784q48114M65404J729007K137535M98418k929015
39517c430889m978534k951836J037897K396423N13994q31147K13722J139054J67873
39508f723443o13598M88974J466327O43010K68620K115750K852757j045908o067070
39499f614581n364888J012463N756588M836187K361999K845983M264179K556578
39491A1654508j298540l281273k618012j589948r04605L95469J580111J019621
39483D957331k94066k8268J093719L13807j879145k046164R7656P74706j163323
$$ plain form
39474 1826253 175143 1897554 6774778 10035490 9067830 6531989 5320377 4285131
39466 4285131 1457736 -1625049 -2077450 -283461 738535 -475840 -2962662 -5816307
39458 -5816307 -8884348 -11307383 -11803866 -10595867 -9280598 -8711609 -8393921 -7692287 -6190839
39449 -6190839 -3312093 800402 4476160 6296698 7159355 8695562 10267915 9884218
39441 9884218 7689171 5797669 4660904 2699102 151124 -98788 2812758 5261863
39433 5261863 3901059 737967 449346 3791626 6793113 6435682 4420882 4338613 6776351
39424 6776351 8584252 6593389 1213755 -3990010 -6180190 -6087468 -6352648 -7619999 -7718843
39415 -7718843 -4805429 241988 5046094 7838963 7767484 4929337 1326005 161323
$$ packed form
39474A826253j651110J722411M877224L260712r67660k535841j211612j035246
39466D285131k827395l082785m52401J793989J021996j214375k486822k853645
39458e816307l068041k423035m96483J207999J315269N68989L17688P01634J501448
39449f190839K878746M112495L675758J820538Q62657J536207J572353l83697
39441I884218k195047j891502j136765j961802k547978k49912K911546K449105
39433E261863j360804l163092k88621L342280L001487l57431k014800q2269K437738
39424F776351J807901j990863n379634n203765k190180R2722k65180j267351r8844
39415g718843K913414N047417M804106K792869p1479k838147l603332j164682
$$ plain form
39407 161323 2522795 5827562 7001605 6002219 4589769 3070013 723601 -1356079
39399 -1356079 -822084 2174225 4254318 2857152 -637175 -2860622 -2350490 -481377
39391 -481377 692472 499120 -237526 -488149 -214515 -261101 -1164705 -2528913 -3709692
39382 -3709692 -4418339 -4291268 -2774337 -136119 2239954 3338882 3415767 2784669 1165859
39373 1165859 -641081 -331498 2517276 4248563 1279811 -4502579 -7922663 -7739654
39365 -7739654 -7702174 -9677398 -10070227 -5590463 769878 3127252 361870 -3115933 -3629964
39356 -3629964 -2086033 -1275497 -1972174 -2851304 -2835124 -2364996 -2711700 -4402636 -6284164
39347 -6284164 -6602916 -5418306 -5027402 -6901865 -8999396 -7837731 -3100589 1607045
$$ packed form
39407A61323K361472L304767J174043r99386j412450j519756k346412k079680
39399a356079N33995K996309K080093j397166l494327k223447N10132J869113
39391d81377J173849j93352p36646k50623K73634m6586r03604j364208j180779
39382c709692p08647J27071J516931K638218K376073J098928P6885o31098j618810
39373A165859j806940L09583K848774J731287k968752n782390l420084J83009
39365g739654L7480j975224l92829M479764O360341K357374k765382l477803n14031
39356c629964J543931Q10536o96677q79130J6180M70128l46704j690936j881528
39347f284164l18752J184610L90904j874463k097531J161665M737142M707634
$$ plain form
39339 1607045 3007884 1514955 -490483 -2180721 -4433845 -7264521 -9191984 -9565975
39331 -9565975 -9837735 -11367062 -13033777 -12605310 -10059774 -7751196 -7013368 -6419473 -4321718
39322 -4321718 -1433906 625536 1945211 3383147 3995580 2072812 -1380989 -2986473
39314 -2986473 -1530816 280276 -205912 -2052533 -2750755 -1861729 -599350 840735 3218227
39305 3218227 6146236 8085219 8187386 6593570 3436146 -632018 -3364316 -2645458
39297 -2645458 408555 2059096 342056 -2734746 -4133868 -3435141 -2547751 -3062309 -5175831
39288 -5175831 -8359482 -11622637 -13489667 -13154178 -11768039 -11356944 -12016469 -11269867 -7127382
39279 -7127382 -1096651 3159694 4132114 4039796 5463325 7655372 7605123 4197466 -330671
$$ packed form
39339A607045J400839j492929k005438j690238k253124k830676j927463l73991
39331i565975k71760j529327j666715M28467K545536K308578P37828N93895K097755
39322d321718K887812K059442J319675J437936O12433j922768l453801j605484
39314b986473J455657J811092m86188j846621o98222Q89026J262379J440085K377492
39305C218227K928009J938983J02167j593816l157424m068164k732298P18858
39297b645458L054013J650541j717040l076802j399122O98727Q87390n14558k113522
39288e175831l183651l263155j867030L35489J386139M11095o59525P46602M142485
39279g127382O030731M256345R72420r2318J423529K192047n0249l407657m528137
$$ plain form
39270 -330671 -3162712 -3627189 -2699379 -1178177 687684 2570695 3946774 4254034 2895636
39261 2895636 -192948 -3721111 -5739329 -5555858 -4066316 -2097350 103233 1499323
39253 1499323 590906 -1791122 -2247639 743715 4055331 4008223 1724826 1452195 4411391
39244 4411391 7488729 7916511 6186239 3886711 1531626 -503711 -1330886 -1063109 -1075825
39235 -1075825 -1706392 -1508068 169399 1729324 1778723 1361885 2159626 3681777 3876716
39226 3876716 1863465 -1178225 -3372452 -3602583 -2155646 -475015 247906 284934 305094
39217 305094 -462330 -3173638 -6647538 -8263363 -8055425 -8890453 -11276444 -11336596 -6552888
39208 -6552888 -705686 575255 -2444499 -4205527 -1628841 2425947 3780416 1777802
$$ packed form
39270c30671k832041m64477R27810J521202J865861J883011J376079L07260j358398
39261B895636l088584l528163k018218J83471J489542J968966K200583J396090
39253A499323r08417k382028m56517K991354L311616m7108k283397k72631K959196
39244D411391L077338M27782j730272k299528k355085k035337q27175K67777j2716
39235a075825o30567J98324J677467J559925M9399m16838P97741J522151J94939
39226C876716k013251l041690k194227k30131J446937J680631P22921L7028K0160
39217C05094p67424k711308l473900j615825K07938q35028k385991o0152M783708
39208f552888N847202J280941l019754j761028K576686M054788J354469k002614
$$ plain form
39200 1777802 -1437051 -3948692 -5101850 -5068547 -4362432 -3038957 -552342 2462397 3174062
39191 3174062 -406031 -5820628 -8404021 -7298439 -6249319 -7649819 -9008725 -7173419
39183 -7173419 -3393374 -1542466 -2826091 -4840763 -5266538 -4355612 -3787417 -4482458 -5732044
39174 -5732044 -5957484 -4578608 -3064722 -2993203 -3144742 -707948 3925093 6313528 3820215
39165 3820215 -246273 -1265074 -60832 -1159430 -5259537 -7894147 -6148547 -2585555
39157 -2585555 -805873 -586877 68637 720582 -571806 -3599503 -6225817 -7494465 -7929752
39148 -7929752 -7287604 -4725056 -1207050 911637 1264957 2046511 4307655 6002894 5226785
39139 5226785 3398820 3074935 3908951 3364702 1055617 -252773 1335723 3816151 3591731
$$ packed form
39200A777802l214853k511641j153158L3303P06115J323475K486615L014739P11665
39191C174062l580093n414597k583393J105582J049120j400500j358906J835306
39183g173419L780045J850908j283625k014672m25775R10926N68195o95041j249586
39174e732044k25440J378876J513886P1519j51539K436794M633041K388435k493313
39165C820215m066488j018801J204242j098598m100107k634610J745600L562992
39157b585555J779682K18996O55514O51945j292388l027697k626314j268648m35287
39148g929752O42148K562548L518006K118687L53320P81554K261144J695239p76109
39139E226785j827965l23885Q34016n44249k309085j308390J588496K480428k24420
$$ plain form
39130 3591731 -231470 -5093835 -8026491 -8376243 -7560164 -6928260 -6293033 -4545354 -1546701
39121 -1546701 1100766 1725105 728871 141964 970311 2011732 1683483 19773 -1783340
39112 -1783340 -2895960 -3108361 -2388776 -1206296 -636040 -1021382 -1082512 377329 2326097
39103 2326097 2621092 1224767 658796 2755193 6288390 8582162 8472363 6857575 5036088
39094 5036088 3397078 1536742 -831246 -3018680 -3504397 -1489903 1759756 4001202
39086 4001202 4539626 4642152 5192079 5254627 3721600 1147612 -1221913 -3300740 -5573543
39077 -5573543 -7233841 -6638796 -3743223 -584949 1212621 2219049 3544798 4236627
39069 4236627 1812033 -4256407 -10579287 -12452005 -8542819 -2355883 1299221 863740
$$ packed form
39130C591731l823201m862365k932656l49752Q16079O31904O35227J747679K998653
39121a546701K647467O24339r96234n86907Q28347J041421l28249j663710j803113
39112a783340j112620k12401P19585J182480N70256l85342o1130J459841J948768
39103B326097K94995j396325n65971K096397L533197K293772j09799j614788j821487
39094E036088j639010j860336k367988k187434m85717K014494L249659K241446
39086D001202N38424J02526N49927O2548j533027k573988k369525k078827k272803
39077e573543j660298N95045K895573L158274J797570J006428J325749O91829
39069D236627k424594o068440o322880j872718L909186O186936L655104m35481
$$ plain form
39061 863740 -1178681 -1326117 1807772 6679520 9986217 9001530 4068767 -1196472 -3286475
39052 -3286475 -2270192 -727032 187000 1428550 2944852 2915723 1273861 995226 3666144
39043 3666144 6272824 5323677 2161743 626445 882999 -91072 -2319659 -2081426 1434303
39034 1434303 3356402 -210570 -6177461 -8521974 -6029769 -2429346 -422552 436937
39026 436937 463946 -1411265 -4710579 -6558859 -5452327 -3529004 -3332134 -4276923 -4422646
39017 -4422646 -4192823 -5620952 -8443649 -9767444 -8216823 -6114648 -6230221 -7963498
39009 -7963498 -8373325 -5963495 -1721585 2889977 6885562 8809516 7182816 2810372
39001 2810372 -1129401 -2554082 -2721349 -3796292 -5604155 -6509759 -6317378 -6048299 -5470564
$$ packed form
39061H63740k042421j47436L133889M871748L306697r84687m932763n265239k090003
39052c286475J016283J543160R14032J241550J516302k9129j641862k78635K670918
39043C666144K606680r49147l161934j535298K56554r74071k228587K38233L515729
39034A434303J922099l566972n966891k344513K492205L600423K006794Q59489
39026D36937K7009j875211l299314j848280J106532J923323J96870r44789j45723
39017d422646K29823j428129k822697j323795J550621K102175j15573j733277
39009g963498m09827K409830M241910M611562L995585J923954j626700m372444
39001B810372l939773j424681j67267j074943j807863r05604J92381K69079N77735
$$ plain form
38992 -5470564 -3353603 -218705 1609596 1309835 781745 1656892 2983279 3002442 1592501
38983 1592501 -218745 -1594246 -1495117 1310231 6052659 9215205 8192338 4877490
38975 4877490 3445159 5072603 7051169 6893324 4940011 2542239 -31077 -2745861
38967 -2745861 -4511031 -4224681 -2470915 -1154264 -1636407 -3591880 -5352951 -5300316 -3479945
38958 -3479945 -1847491 -2184764 -3842199 -4559065 -3583579 -2656730 -3338428 -4590015 -4106800
38949 -4106800 -1435487 1321443 1879207 254757 -1203444 -143621 3290549 6324744
38941 6324744 6195481 2756077 -1870189 -5553176 -7038918 -5302946 -179892 5870728
38933 5870728 8670777 6425532 1781294 -1399956 -2186955 -2210915 -2473374 -2591222 -2597001
$$ packed form
38992e470564K116961L134898J828301k99761n28090Q75147J326387J9163j409941
38983A592501j811246j375501R9129K805348M742428L162546j022867l314848
38975D877490j432331J627444J978566j57845j953313k397772k573316k714784
38967b745861j765170K86350J753766J316651m82143j955473j761071N2635J820371
38958c479945J632454l37273j657435p16866R75486R26849o81698j251587M83215
38949d106800K671313K756930N57764j624450j458201J059823L434170L034195
38941F324744j29263l439404m626266l682987j485742J735972N123054O050620
38933E870728K800049k245245m644238l181250p86999k3960k62459j17848n779
$$ plain form
38924 -2597001 -3153062 -3684287 -2248353 1868436 6643824 9231495 8693062 6422885 4588752
38915 4588752 4464370 5544327 5959967 4377032 1595128 -446115 -1152634 -1660325 -2668507
38906 -2668507 -3285527 -2537031 -764943 1092469 2394792 2389340 444359 -2328855 -3316437
38897 -3316437 -1761991 -450502 -2151866 -5544119 -6865320 -4791514 -1319963 1547536
38889 1547536 3315988 3575584 2241975 1521971 4269517 9275392 11441307 8415184
38881 8415184 4055143 3026546 4852256 6307911 7012915 8512419 9496102 6806906
38873 6806906 1157933 -2649598 -2251101 -749151 -1803100 -4962271 -7696811 -9201419
38865 -9201419 -9922786 -9511526 -7608992 -5117351 -2658659 750314 5476041 9179326
$$ packed form
38924b597001n56061n31225J435934M116789M775388K587671n38433k270177j834133
38915D588752j24382J079957M15640j582935k781904k041243p06519n07691j008182
38906b668507o17020P48496J772088J857412J302323n452j944981k773214r87582
38897c316437J554446J311489j701364l392253j321201K073806L471551K867499
38889A547536J768452K59596j333609p20004K747546N005875K165915l026123
38881H415184m360041j028597J825710J455655P05004J499504R83683k689196
38873F806906n648973l807531L98497J501950j053949l159171k734540j504608
38865i201419p21367M11260J902534K491641K458692L408973M725727L703285
$$ plain form
38857 9179326 9238480 6244283 2945690 701858 -739067 -885819 1181330 4216834 5271996
38848 5271996 3452801 1163201 775147 1737712 1957151 716145 -935893 -1940758 -2283053
38839 -2283053 -2406477 -2268874 -1375296 131356 785723 -933608 -4499601 -7533113 -8527360
38830 -8527360 -8167486 -7347514 -5572924 -2641566 -173362 608840 1282267 3879033 7034134
38821 7034134 7414504 4838973 3017290 4560375 7679408 8746485 6301694 1886999
38813 1886999 -1390242 -768297 3727984 8282396 8704189 5325706 2453174 2636318 4076000
38804 4076000 4385943 3833093 3233791 1521519 -2122473 -5726899 -6665223 -5056840 -2948860
38795 -2948860 -1307600 226159 1734505 3052523 4330218 4946994 3313775 -335014
$$ packed form
38857I179326N9154k994197l298593k243832j440925j46752K067149L035504J055162
38848E271996j819195k289600l88054R62565K19439j241006j652038j004865l42295
38839b283053j23424J37603Q93578J506652O54367j719331l565993l033512r94247
38830h527360L59874Q19972J774590K931358K468204P82202O73427K596766L155101
38821G034134L80370k575531j821683J543085L119033J067077k444791m414695
38813A886999l277241O21945M496281M554412M21793l378483k872532J83144J439682
38804D076000L09943n52850n99302j712272l643992l604426r38324J608383K107980
38795b948860J641260J533759J508346J318018J277695O16776j633219l648789
$$ plain form
38787 -335014 -2547749 -540275 3630727 5282570 2687571 -1892562 -5835707 -8201282
38779 -8201282 -8801986 -8036132 -7523636 -8500246 -9708156 -9045014 -6816988 -4909124 -3389091
38770 -3389091 -1025948 1096606 91979 -3986868 -7279818 -7171864 -5336838 -4530107
38762 -4530107 -5185750 -6667343 -9056710 -11655609 -12079424 -9192983 -5293194 -3323674
38754 -3323674 -3362452 -3667795 -3621776 -3652923 -3680100 -3689524 -4529419 -6034778 -5756507 -2053348
38744 -2053348 2658620 4555756 3671967 3534958 5602495 7146004 5517903 1901472
38736 1901472 -692263 -1344130 -1460987 -2197415 -3329628 -4369049 -5449581 -6815857 -8099520
38727 -8099520 -8538107 -7802228 -6271268 -4297825 -1607544 1808928 4369470 3812789 72072
$$ packed form
38787c35014k212735K007474M171002J651843k594999m580133l943145k365575
38779h201282o00704P65854N12496r76610j207910O63142K228026J907864J520033
38770c389091K363143K122554j004627m078847l292950J07954J835026Q06731
38762d530107o55643j481593k389367k598899m23815K886441L899789J969520
38754c323674l8778l05343M6019l1147k7177r424q39895j505359K78271L703159
38744b053348M711968J897136q83789j37009K067537J543509j628101l616431
38736A901472k593735o51867j16857p36428j132213j039421j080532j366276j283663
38727h099520m38587P35879J530960J973443K690281L416472K560542n56681l740717
$$ plain form
38718 72072 -3979340 -5715024 -5626258 -5646025 -5670376 -3869198 -169143 2863950 3206128
38709 3206128 1687071 362170 102517 765178 2378875 4797305 7008027 8087784
38701 8087784 8302811 8094044 6590148 2744086 -2151744 -4884739 -3961857 -1450812 -135429
38692 -135429 -32752 599616 1550281 447581 -3104899 -5514828 -3271243 2170609 5756614
38683 5756614 4659868 662706 -3109648 -5376253 -6057368 -5012005 -3063784 -2517199
38675 -2517199 -4711594 -8070708 -10114368 -10255648 -8965865 -5663567 -61131 5167019
38667 5167019 6184307 2896133 -467607 -445925 2131626 4540990 5779870 6282728 5896860
38658 5896860 4192891 1851026 -56431 -1670815 -3781595 -6062878 -7281712 -7139586
$$ packed form
38718G2072m051412j735684Q8766j9767k4351J801178L700055L033093L42178
38709C206128j519057j324901k59653O62661J613697K418430K210722J079757
38701H087784K15027k08767j503896l846062m895830k732995R22882K511045J315383
38692a35429J02677O32368R50665j102700l552480k409929K243585N441852L586005
38683E756614j096746l997162l772354k266605o81115J045363J948221N46585
38675b517199k194395l359114k043660j41280J289783L302298N602436N228150
38667E167019J017288l288174l363740K1682K577551K409364J238880N02858l85868
38658E896860j703969k341865j907457j614384k110780k281283j218834J42126
$$ plain form
38650 -7139586 -6729251 -7123626 -8371196 -9836146 -10785569 -10742369 -9910662 -9076078 -8528668
38641 -8528668 -7479120 -5216857 -2309064 260610 2555788 5005733 6661700 5819143
38633 5819143 2611898 -533761 -1609616 -948539 131697 1209878 2227752 2208452 20299
38624 20299 -3903292 -7681701 -9630342 -9130921 -6555022 -3417939 -1983132 -3179033 -5057177
38615 -5057177 -4835668 -2525942 -882437 -1399186 -2230702 -1184134 756888 566057 -2861963
38606 -2861963 -7340447 -9720229 -8553157 -4798216 -929720 861587 405023 -749416
38598 -749416 -1773095 -3648189 -6846941 -9367324 -9119924 -7368479 -7212352 -8882820 -9436473
38589 -9436473 -7698287 -6604811 -9089995 -13878084 -17257850 -17408091 -15089916 -11469570
$$ packed form
38650g139586M10335l94375j247570j464950r49423M3200Q31707Q34584N47410
38641h528668J049548K262263K907793K569674K295178K449945J655967q42557
38633E819143l207245l145659j075855O61077J080236J078181J017874j9300k188153
38624B0299l923591l778409j948641M99421K575899L137083J434807j195901j878144
38615e057177K21509K309726J643505n16749q31516J046568J941022j90831l428020
38606b861963m478484k379782J167072L754941L868496J791307m56564j154439
38598g49416j023679j875094l198752k520383K47400J751445J56127j670468n53653
38589i436473J738186J093476k485184m788089l379766j50241K318175L620346
$$ plain form
38581 -11469570 -7456655 -4439100 -3581044 -4441277 -5485598 -5561886 -4028165 -596280 3467782
38572 3467782 5113724 2465423 -2544821 -6210407 -7054454 -6042282 -3782223 -114693
38564 -114693 3785885 5720367 5535341 5706325 7989412 11117213 12524630 11021866 7357445
38555 7357445 3486551 1502662 1893315 2843045 2757552 2970757 5575617 8862699 8236636
38546 8236636 2558185 -3570264 -5440871 -3484381 -1152966 -228593 -423086 -1206897 -1442342
38537 -1442342 711413 4724129 6450585 3171261 -1687340 -2483521 994278 3659865
38529 3659865 2492941 -279069 -1741007 -2029291 -2237248 -2082563 -1500769 -1659153 -2316117
38520 -2316117 -756716 4157530 8991952 9698388 7192655 5872561 7151483 7676639
$$ packed form
38581a1469570M012915L017555Q58056q60233j044321p6288J533721L431885M064062
38572C467782J645942k648301n010244l665586q44047J012172K260059L667530
38564a14693L900578J934482j85026J70984K283087L127801J407417j502764l664421
38555G357445l870894j983889L90653R49730q5493K13205K604860L287082o26063
38546H236636n678451o128449j870607J956490K331415R24373j94493p83811k35445
38537a442342K153755M012716J726456l279324m858601p96181L477799K665587
38529C659865j166924k772010j461938k88284k07957J54685N81794j58384o56964
38520b316117J559401M914246M834422P06436k505733j320094J278922N25156
$$ [...]
##END NTUPLES=NMR SPECTRUM
##END=
